lucene-dev mailing list archives

Site index · List index
Message view « Date » · « Thread »
Top « Date » · « Thread »
From Policeman Jenkins Server <jenk...@thetaphi.de>
Subject [JENKINS] Lucene-Solr-7.x-Windows (64bit/jdk1.8.0_144) - Build # 381 - Still Unstable!
Date Thu, 04 Jan 2018 20:46:02 GMT
Build: https://jenkins.thetaphi.de/job/Lucene-Solr-7.x-Windows/381/
Java: 64bit/jdk1.8.0_144 -XX:+UseCompressedOops -XX:+UseG1GC

3 tests failed.
FAILED:  junit.framework.TestSuite.org.apache.lucene.index.TestBackwardsCompatibility

Error Message:
Could not remove the following files (in the order of attempts):    C:\Users\jenkins\workspace\Lucene-Solr-7.x-Windows\lucene\build\backward-codecs\test\J0\temp\lucene.index.TestBackwardsCompatibility_572A867B4BAE81D0-001\4.5.0-nocfs-001: java.nio.file.DirectoryNotEmptyException: C:\Users\jenkins\workspace\Lucene-Solr-7.x-Windows\lucene\build\backward-codecs\test\J0\temp\lucene.index.TestBackwardsCompatibility_572A867B4BAE81D0-001\4.5.0-nocfs-001    C:\Users\jenkins\workspace\Lucene-Solr-7.x-Windows\lucene\build\backward-codecs\test\J0\temp\lucene.index.TestBackwardsCompatibility_572A867B4BAE81D0-001\4.2.0-nocfs-001: java.nio.file.DirectoryNotEmptyException: C:\Users\jenkins\workspace\Lucene-Solr-7.x-Windows\lucene\build\backward-codecs\test\J0\temp\lucene.index.TestBackwardsCompatibility_572A867B4BAE81D0-001\4.2.0-nocfs-001 

Stack Trace:
java.io.IOException: Could not remove the following files (in the order of attempts):
   C:\Users\jenkins\workspace\Lucene-Solr-7.x-Windows\lucene\build\backward-codecs\test\J0\temp\lucene.index.TestBackwardsCompatibility_572A867B4BAE81D0-001\4.5.0-nocfs-001: java.nio.file.DirectoryNotEmptyException: C:\Users\jenkins\workspace\Lucene-Solr-7.x-Windows\lucene\build\backward-codecs\test\J0\temp\lucene.index.TestBackwardsCompatibility_572A867B4BAE81D0-001\4.5.0-nocfs-001
   C:\Users\jenkins\workspace\Lucene-Solr-7.x-Windows\lucene\build\backward-codecs\test\J0\temp\lucene.index.TestBackwardsCompatibility_572A867B4BAE81D0-001\4.2.0-nocfs-001: java.nio.file.DirectoryNotEmptyException: C:\Users\jenkins\workspace\Lucene-Solr-7.x-Windows\lucene\build\backward-codecs\test\J0\temp\lucene.index.TestBackwardsCompatibility_572A867B4BAE81D0-001\4.2.0-nocfs-001

	at __randomizedtesting.SeedInfo.seed([572A867B4BAE81D0]:0)
	at org.apache.lucene.util.IOUtils.rm(IOUtils.java:329)
	at org.apache.lucene.util.TestRuleTemporaryFilesCleanup.afterAlways(TestRuleTemporaryFilesCleanup.java:216)
	at com.carrotsearch.randomizedtesting.rules.TestRuleAdapter$1.afterAlways(TestRuleAdapter.java:31)
	at com.carrotsearch.randomizedtesting.rules.StatementAdapter.evaluate(StatementAdapter.java:43)
	at com.carrotsearch.randomizedtesting.rules.StatementAdapter.evaluate(StatementAdapter.java:36)
	at org.apache.lucene.util.TestRuleAssertionsRequired$1.evaluate(TestRuleAssertionsRequired.java:53)
	at org.apache.lucene.util.TestRuleMarkFailure$1.evaluate(TestRuleMarkFailure.java:47)
	at org.apache.lucene.util.TestRuleIgnoreAfterMaxFailures$1.evaluate(TestRuleIgnoreAfterMaxFailures.java:64)
	at org.apache.lucene.util.TestRuleIgnoreTestSuites$1.evaluate(TestRuleIgnoreTestSuites.java:54)
	at com.carrotsearch.randomizedtesting.rules.StatementAdapter.evaluate(StatementAdapter.java:36)
	at com.carrotsearch.randomizedtesting.ThreadLeakControl$StatementRunner.run(ThreadLeakControl.java:368)
	at java.lang.Thread.run(Thread.java:748)


FAILED:  junit.framework.TestSuite.org.apache.solr.handler.component.TermVectorComponentTest

Error Message:
Could not remove the following files (in the order of attempts):    C:\Users\jenkins\workspace\Lucene-Solr-7.x-Windows\solr\build\solr-core\test\J1\temp\solr.handler.component.TermVectorComponentTest_615A0EE3216D0837-001\init-core-data-001\spellcheckerMultipleFields: java.nio.file.DirectoryNotEmptyException: C:\Users\jenkins\workspace\Lucene-Solr-7.x-Windows\solr\build\solr-core\test\J1\temp\solr.handler.component.TermVectorComponentTest_615A0EE3216D0837-001\init-core-data-001\spellcheckerMultipleFields    C:\Users\jenkins\workspace\Lucene-Solr-7.x-Windows\solr\build\solr-core\test\J1\temp\solr.handler.component.TermVectorComponentTest_615A0EE3216D0837-001\init-core-data-001: java.nio.file.DirectoryNotEmptyException: C:\Users\jenkins\workspace\Lucene-Solr-7.x-Windows\solr\build\solr-core\test\J1\temp\solr.handler.component.TermVectorComponentTest_615A0EE3216D0837-001\init-core-data-001 

Stack Trace:
java.io.IOException: Could not remove the following files (in the order of attempts):
   C:\Users\jenkins\workspace\Lucene-Solr-7.x-Windows\solr\build\solr-core\test\J1\temp\solr.handler.component.TermVectorComponentTest_615A0EE3216D0837-001\init-core-data-001\spellcheckerMultipleFields: java.nio.file.DirectoryNotEmptyException: C:\Users\jenkins\workspace\Lucene-Solr-7.x-Windows\solr\build\solr-core\test\J1\temp\solr.handler.component.TermVectorComponentTest_615A0EE3216D0837-001\init-core-data-001\spellcheckerMultipleFields
   C:\Users\jenkins\workspace\Lucene-Solr-7.x-Windows\solr\build\solr-core\test\J1\temp\solr.handler.component.TermVectorComponentTest_615A0EE3216D0837-001\init-core-data-001: java.nio.file.DirectoryNotEmptyException: C:\Users\jenkins\workspace\Lucene-Solr-7.x-Windows\solr\build\solr-core\test\J1\temp\solr.handler.component.TermVectorComponentTest_615A0EE3216D0837-001\init-core-data-001

	at __randomizedtesting.SeedInfo.seed([615A0EE3216D0837]:0)
	at org.apache.lucene.util.IOUtils.rm(IOUtils.java:329)
	at org.apache.lucene.util.TestRuleTemporaryFilesCleanup.afterAlways(TestRuleTemporaryFilesCleanup.java:216)
	at com.carrotsearch.randomizedtesting.rules.TestRuleAdapter$1.afterAlways(TestRuleAdapter.java:31)
	at com.carrotsearch.randomizedtesting.rules.StatementAdapter.evaluate(StatementAdapter.java:43)
	at com.carrotsearch.randomizedtesting.rules.StatementAdapter.evaluate(StatementAdapter.java:36)
	at org.apache.lucene.util.TestRuleAssertionsRequired$1.evaluate(TestRuleAssertionsRequired.java:53)
	at org.apache.lucene.util.TestRuleMarkFailure$1.evaluate(TestRuleMarkFailure.java:47)
	at org.apache.lucene.util.TestRuleIgnoreAfterMaxFailures$1.evaluate(TestRuleIgnoreAfterMaxFailures.java:64)
	at org.apache.lucene.util.TestRuleIgnoreTestSuites$1.evaluate(TestRuleIgnoreTestSuites.java:54)
	at com.carrotsearch.randomizedtesting.rules.StatementAdapter.evaluate(StatementAdapter.java:36)
	at com.carrotsearch.randomizedtesting.ThreadLeakControl$StatementRunner.run(ThreadLeakControl.java:368)
	at java.lang.Thread.run(Thread.java:748)


FAILED:  junit.framework.TestSuite.org.apache.solr.update.processor.TestOpenNLPExtractNamedEntitiesUpdateProcessorFactory

Error Message:
Could not remove the following files (in the order of attempts):    C:\Users\jenkins\workspace\Lucene-Solr-7.x-Windows\solr\build\contrib\solr-analysis-extras\test\J1\temp\solr.update.processor.TestOpenNLPExtractNamedEntitiesUpdateProcessorFactory_7F8153C4CB428F05-001\tempDir-001\collection1\conf: java.nio.file.DirectoryNotEmptyException: C:\Users\jenkins\workspace\Lucene-Solr-7.x-Windows\solr\build\contrib\solr-analysis-extras\test\J1\temp\solr.update.processor.TestOpenNLPExtractNamedEntitiesUpdateProcessorFactory_7F8153C4CB428F05-001\tempDir-001\collection1\conf    C:\Users\jenkins\workspace\Lucene-Solr-7.x-Windows\solr\build\contrib\solr-analysis-extras\test\J1\temp\solr.update.processor.TestOpenNLPExtractNamedEntitiesUpdateProcessorFactory_7F8153C4CB428F05-001\tempDir-001\collection1: java.nio.file.DirectoryNotEmptyException: C:\Users\jenkins\workspace\Lucene-Solr-7.x-Windows\solr\build\contrib\solr-analysis-extras\test\J1\temp\solr.update.processor.TestOpenNLPExtractNamedEntitiesUpdateProcessorFactory_7F8153C4CB428F05-001\tempDir-001\collection1    C:\Users\jenkins\workspace\Lucene-Solr-7.x-Windows\solr\build\contrib\solr-analysis-extras\test\J1\temp\solr.update.processor.TestOpenNLPExtractNamedEntitiesUpdateProcessorFactory_7F8153C4CB428F05-001\tempDir-001: java.nio.file.DirectoryNotEmptyException: C:\Users\jenkins\workspace\Lucene-Solr-7.x-Windows\solr\build\contrib\solr-analysis-extras\test\J1\temp\solr.update.processor.TestOpenNLPExtractNamedEntitiesUpdateProcessorFactory_7F8153C4CB428F05-001\tempDir-001    C:\Users\jenkins\workspace\Lucene-Solr-7.x-Windows\solr\build\contrib\solr-analysis-extras\test\J1\temp\solr.update.processor.TestOpenNLPExtractNamedEntitiesUpdateProcessorFactory_7F8153C4CB428F05-001\tempDir-001\collection1\conf\en-test-ner-person.bin: java.nio.file.AccessDeniedException: C:\Users\jenkins\workspace\Lucene-Solr-7.x-Windows\solr\build\contrib\solr-analysis-extras\test\J1\temp\solr.update.processor.TestOpenNLPExtractNamedEntitiesUpdateProcessorFactory_7F8153C4CB428F05-001\tempDir-001\collection1\conf\en-test-ner-person.bin    C:\Users\jenkins\workspace\Lucene-Solr-7.x-Windows\solr\build\contrib\solr-analysis-extras\test\J1\temp\solr.update.processor.TestOpenNLPExtractNamedEntitiesUpdateProcessorFactory_7F8153C4CB428F05-001\tempDir-001\collection1\conf\en-test-sent.bin: java.nio.file.AccessDeniedException: C:\Users\jenkins\workspace\Lucene-Solr-7.x-Windows\solr\build\contrib\solr-analysis-extras\test\J1\temp\solr.update.processor.TestOpenNLPExtractNamedEntitiesUpdateProcessorFactory_7F8153C4CB428F05-001\tempDir-001\collection1\conf\en-test-sent.bin    C:\Users\jenkins\workspace\Lucene-Solr-7.x-Windows\solr\build\contrib\solr-analysis-extras\test\J1\temp\solr.update.processor.TestOpenNLPExtractNamedEntitiesUpdateProcessorFactory_7F8153C4CB428F05-001\tempDir-001\collection1\conf\en-test-tokenizer.bin: java.nio.file.AccessDeniedException: C:\Users\jenkins\workspace\Lucene-Solr-7.x-Windows\solr\build\contrib\solr-analysis-extras\test\J1\temp\solr.update.processor.TestOpenNLPExtractNamedEntitiesUpdateProcessorFactory_7F8153C4CB428F05-001\tempDir-001\collection1\conf\en-test-tokenizer.bin    C:\Users\jenkins\workspace\Lucene-Solr-7.x-Windows\solr\build\contrib\solr-analysis-extras\test\J1\temp\solr.update.processor.TestOpenNLPExtractNamedEntitiesUpdateProcessorFactory_7F8153C4CB428F05-001: java.nio.file.DirectoryNotEmptyException: C:\Users\jenkins\workspace\Lucene-Solr-7.x-Windows\solr\build\contrib\solr-analysis-extras\test\J1\temp\solr.update.processor.TestOpenNLPExtractNamedEntitiesUpdateProcessorFactory_7F8153C4CB428F05-001 

Stack Trace:
java.io.IOException: Could not remove the following files (in the order of attempts):
   C:\Users\jenkins\workspace\Lucene-Solr-7.x-Windows\solr\build\contrib\solr-analysis-extras\test\J1\temp\solr.update.processor.TestOpenNLPExtractNamedEntitiesUpdateProcessorFactory_7F8153C4CB428F05-001\tempDir-001\collection1\conf: java.nio.file.DirectoryNotEmptyException: C:\Users\jenkins\workspace\Lucene-Solr-7.x-Windows\solr\build\contrib\solr-analysis-extras\test\J1\temp\solr.update.processor.TestOpenNLPExtractNamedEntitiesUpdateProcessorFactory_7F8153C4CB428F05-001\tempDir-001\collection1\conf
   C:\Users\jenkins\workspace\Lucene-Solr-7.x-Windows\solr\build\contrib\solr-analysis-extras\test\J1\temp\solr.update.processor.TestOpenNLPExtractNamedEntitiesUpdateProcessorFactory_7F8153C4CB428F05-001\tempDir-001\collection1: java.nio.file.DirectoryNotEmptyException: C:\Users\jenkins\workspace\Lucene-Solr-7.x-Windows\solr\build\contrib\solr-analysis-extras\test\J1\temp\solr.update.processor.TestOpenNLPExtractNamedEntitiesUpdateProcessorFactory_7F8153C4CB428F05-001\tempDir-001\collection1
   C:\Users\jenkins\workspace\Lucene-Solr-7.x-Windows\solr\build\contrib\solr-analysis-extras\test\J1\temp\solr.update.processor.TestOpenNLPExtractNamedEntitiesUpdateProcessorFactory_7F8153C4CB428F05-001\tempDir-001: java.nio.file.DirectoryNotEmptyException: C:\Users\jenkins\workspace\Lucene-Solr-7.x-Windows\solr\build\contrib\solr-analysis-extras\test\J1\temp\solr.update.processor.TestOpenNLPExtractNamedEntitiesUpdateProcessorFactory_7F8153C4CB428F05-001\tempDir-001
   C:\Users\jenkins\workspace\Lucene-Solr-7.x-Windows\solr\build\contrib\solr-analysis-extras\test\J1\temp\solr.update.processor.TestOpenNLPExtractNamedEntitiesUpdateProcessorFactory_7F8153C4CB428F05-001\tempDir-001\collection1\conf\en-test-ner-person.bin: java.nio.file.AccessDeniedException: C:\Users\jenkins\workspace\Lucene-Solr-7.x-Windows\solr\build\contrib\solr-analysis-extras\test\J1\temp\solr.update.processor.TestOpenNLPExtractNamedEntitiesUpdateProcessorFactory_7F8153C4CB428F05-001\tempDir-001\collection1\conf\en-test-ner-person.bin
   C:\Users\jenkins\workspace\Lucene-Solr-7.x-Windows\solr\build\contrib\solr-analysis-extras\test\J1\temp\solr.update.processor.TestOpenNLPExtractNamedEntitiesUpdateProcessorFactory_7F8153C4CB428F05-001\tempDir-001\collection1\conf\en-test-sent.bin: java.nio.file.AccessDeniedException: C:\Users\jenkins\workspace\Lucene-Solr-7.x-Windows\solr\build\contrib\solr-analysis-extras\test\J1\temp\solr.update.processor.TestOpenNLPExtractNamedEntitiesUpdateProcessorFactory_7F8153C4CB428F05-001\tempDir-001\collection1\conf\en-test-sent.bin
   C:\Users\jenkins\workspace\Lucene-Solr-7.x-Windows\solr\build\contrib\solr-analysis-extras\test\J1\temp\solr.update.processor.TestOpenNLPExtractNamedEntitiesUpdateProcessorFactory_7F8153C4CB428F05-001\tempDir-001\collection1\conf\en-test-tokenizer.bin: java.nio.file.AccessDeniedException: C:\Users\jenkins\workspace\Lucene-Solr-7.x-Windows\solr\build\contrib\solr-analysis-extras\test\J1\temp\solr.update.processor.TestOpenNLPExtractNamedEntitiesUpdateProcessorFactory_7F8153C4CB428F05-001\tempDir-001\collection1\conf\en-test-tokenizer.bin
   C:\Users\jenkins\workspace\Lucene-Solr-7.x-Windows\solr\build\contrib\solr-analysis-extras\test\J1\temp\solr.update.processor.TestOpenNLPExtractNamedEntitiesUpdateProcessorFactory_7F8153C4CB428F05-001: java.nio.file.DirectoryNotEmptyException: C:\Users\jenkins\workspace\Lucene-Solr-7.x-Windows\solr\build\contrib\solr-analysis-extras\test\J1\temp\solr.update.processor.TestOpenNLPExtractNamedEntitiesUpdateProcessorFactory_7F8153C4CB428F05-001

	at __randomizedtesting.SeedInfo.seed([7F8153C4CB428F05]:0)
	at org.apache.lucene.util.IOUtils.rm(IOUtils.java:329)
	at org.apache.lucene.util.TestRuleTemporaryFilesCleanup.afterAlways(TestRuleTemporaryFilesCleanup.java:216)
	at com.carrotsearch.randomizedtesting.rules.TestRuleAdapter$1.afterAlways(TestRuleAdapter.java:31)
	at com.carrotsearch.randomizedtesting.rules.StatementAdapter.evaluate(StatementAdapter.java:43)
	at com.carrotsearch.randomizedtesting.rules.StatementAdapter.evaluate(StatementAdapter.java:36)
	at org.apache.lucene.util.TestRuleAssertionsRequired$1.evaluate(TestRuleAssertionsRequired.java:53)
	at org.apache.lucene.util.TestRuleMarkFailure$1.evaluate(TestRuleMarkFailure.java:47)
	at org.apache.lucene.util.TestRuleIgnoreAfterMaxFailures$1.evaluate(TestRuleIgnoreAfterMaxFailures.java:64)
	at org.apache.lucene.util.TestRuleIgnoreTestSuites$1.evaluate(TestRuleIgnoreTestSuites.java:54)
	at com.carrotsearch.randomizedtesting.rules.StatementAdapter.evaluate(StatementAdapter.java:36)
	at com.carrotsearch.randomizedtesting.ThreadLeakControl$StatementRunner.run(ThreadLeakControl.java:368)
	at java.lang.Thread.run(Thread.java:748)




Build Log:
[...truncated 4749 lines...]
   [junit4] Suite: org.apache.lucene.index.TestBackwardsCompatibility
   [junit4] IGNOR/A 0.01s J0 | TestBackwardsCompatibility.testCreateSortedIndex
   [junit4]    > Assumption #1: backcompat creation tests must be run with -Dtests.bwcdir=/path/to/write/indexes
   [junit4] IGNOR/A 0.00s J0 | TestBackwardsCompatibility.testCreateSingleSegmentNoCFS
   [junit4]    > Assumption #1: backcompat creation tests must be run with -Dtests.bwcdir=/path/to/write/indexes
   [junit4] IGNOR/A 0.00s J0 | TestBackwardsCompatibility.testCreateIndexWithDocValuesUpdates
   [junit4]    > Assumption #1: backcompat creation tests must be run with -Dtests.bwcdir=/path/to/write/indexes
   [junit4] IGNOR/A 0.00s J0 | TestBackwardsCompatibility.testCreateEmptyIndex
   [junit4]    > Assumption #1: backcompat creation tests must be run with -Dtests.bwcdir=/path/to/write/indexes
   [junit4] IGNOR/A 0.00s J0 | TestBackwardsCompatibility.testCreateSingleSegmentCFS
   [junit4]    > Assumption #1: backcompat creation tests must be run with -Dtests.bwcdir=/path/to/write/indexes
   [junit4] IGNOR/A 0.00s J0 | TestBackwardsCompatibility.testCreateNoCFS
   [junit4]    > Assumption #1: backcompat creation tests must be run with -Dtests.bwcdir=/path/to/write/indexes
   [junit4] IGNOR/A 0.00s J0 | TestBackwardsCompatibility.testCreateMoreTermsIndex
   [junit4]    > Assumption #1: backcompat creation tests must be run with -Dtests.bwcdir=/path/to/write/indexes
   [junit4] IGNOR/A 0.00s J0 | TestBackwardsCompatibility.testCreateCFS
   [junit4]    > Assumption #1: backcompat creation tests must be run with -Dtests.bwcdir=/path/to/write/indexes
   [junit4]   2> NOTE: test params are: codec=Asserting(Lucene70): {content6=FSTOrd50, content5=PostingsFormat(name=LuceneVarGapDocFreqInterval), content4=TestBloomFilteredLucenePostings(BloomFilteringPostingsFormat(Lucene50(blocksize=128))), trieInt=FSTOrd50, content3=BlockTreeOrds(blocksize=128), content2=FSTOrd50, fie?ld=FSTOrd50, utf8=FSTOrd50, trieLong=PostingsFormat(name=LuceneVarGapDocFreqInterval), id=TestBloomFilteredLucenePostings(BloomFilteringPostingsFormat(Lucene50(blocksize=128))), content=FSTOrd50, autf8=PostingsFormat(name=LuceneVarGapDocFreqInterval)}, docValues:{dvShort=DocValuesFormat(name=Lucene70), utf8=DocValuesFormat(name=Asserting), fie?ld=DocValuesFormat(name=Asserting), dvInt=DocValuesFormat(name=Asserting), longPoint2d=DocValuesFormat(name=Memory), dvBytesSortedVar=DocValuesFormat(name=Asserting), dvSortedSet=DocValuesFormat(name=Lucene70), content=DocValuesFormat(name=Asserting), floatPoint1d=DocValuesFormat(name=Lucene70), intPoint1d=DocValuesFormat(name=Memory), doublePoint2d=DocValuesFormat(name=Asserting), trieLong=DocValuesFormat(name=Lucene70), dvBytesDerefVar=DocValuesFormat(name=Lucene70), id=DocValuesFormat(name=Lucene70), binaryPoint2d=DocValuesFormat(name=Asserting), dvSortedNumeric=DocValuesFormat(name=Memory), dvBytesDerefFixed=DocValuesFormat(name=Lucene70), autf8=DocValuesFormat(name=Lucene70), dvBytesSortedFixed=DocValuesFormat(name=Lucene70), dvBytesStraightVar=DocValuesFormat(name=Memory), trieInt=DocValuesFormat(name=Asserting), dvBytesStraightFixed=DocValuesFormat(name=Asserting), dvLong=DocValuesFormat(name=Memory), longPoint1d=DocValuesFormat(name=Lucene70), floatPoint2d=DocValuesFormat(name=Lucene70), dvDouble=DocValuesFormat(name=Lucene70), dvFloat=DocValuesFormat(name=Lucene70), content6=DocValuesFormat(name=Asserting), content5=DocValuesFormat(name=Lucene70), dvPacked=DocValuesFormat(name=Memory), intPoint2d=DocValuesFormat(name=Lucene70), content4=DocValuesFormat(name=Lucene70), content3=DocValuesFormat(name=Memory), content2=DocValuesFormat(name=Asserting), doublePoint1d=DocValuesFormat(name=Memory), dvByte=DocValuesFormat(name=Memory), binaryPoint1d=DocValuesFormat(name=Lucene70)}, maxPointsInLeafNode=1299, maxMBSortInHeap=7.682360934506161, sim=RandomSimilarity(queryNorm=true): {content6=DFR I(F)B1, content5=DFI(Standardized), content2=DFR I(ne)B3(800.0), utf8=DFR I(F)BZ(0.3), fie?ld=IB LL-DZ(0.3), content=IB SPL-LZ(0.3), autf8=DFR I(n)L1}, locale=mt-MT, timezone=Africa/Kigali
   [junit4]   2> NOTE: Windows 10 10.0 amd64/Oracle Corporation 1.8.0_144 (64-bit)/cpus=3,threads=1,free=123322032,total=144703488
   [junit4]   2> NOTE: All tests run in this JVM: [TestBackwardsCompatibility]
   [junit4]   2> NOTE: reproduce with: ant test  -Dtestcase=TestBackwardsCompatibility -Dtests.seed=572A867B4BAE81D0 -Dtests.slow=true -Dtests.locale=mt-MT -Dtests.timezone=Africa/Kigali -Dtests.asserts=true -Dtests.file.encoding=US-ASCII
   [junit4] ERROR   0.00s J0 | TestBackwardsCompatibility (suite) <<<
   [junit4]    > Throwable #1: java.io.IOException: Could not remove the following files (in the order of attempts):
   [junit4]    >    C:\Users\jenkins\workspace\Lucene-Solr-7.x-Windows\lucene\build\backward-codecs\test\J0\temp\lucene.index.TestBackwardsCompatibility_572A867B4BAE81D0-001\4.5.0-nocfs-001: java.nio.file.DirectoryNotEmptyException: C:\Users\jenkins\workspace\Lucene-Solr-7.x-Windows\lucene\build\backward-codecs\test\J0\temp\lucene.index.TestBackwardsCompatibility_572A867B4BAE81D0-001\4.5.0-nocfs-001
   [junit4]    >    C:\Users\jenkins\workspace\Lucene-Solr-7.x-Windows\lucene\build\backward-codecs\test\J0\temp\lucene.index.TestBackwardsCompatibility_572A867B4BAE81D0-001\4.2.0-nocfs-001: java.nio.file.DirectoryNotEmptyException: C:\Users\jenkins\workspace\Lucene-Solr-7.x-Windows\lucene\build\backward-codecs\test\J0\temp\lucene.index.TestBackwardsCompatibility_572A867B4BAE81D0-001\4.2.0-nocfs-001
   [junit4]    > 	at __randomizedtesting.SeedInfo.seed([572A867B4BAE81D0]:0)
   [junit4]    > 	at org.apache.lucene.util.IOUtils.rm(IOUtils.java:329)
   [junit4]    > 	at java.lang.Thread.run(Thread.java:748)
   [junit4] Completed [4/8 (1!)] on J0 in 45.48s, 30 tests, 1 error, 8 skipped <<< FAILURES!

[...truncated 6987 lines...]
   [junit4] Suite: org.apache.solr.handler.component.TermVectorComponentTest
   [junit4]   2> Creating dataDir: C:\Users\jenkins\workspace\Lucene-Solr-7.x-Windows\solr\build\solr-core\test\J1\temp\solr.handler.component.TermVectorComponentTest_615A0EE3216D0837-001\init-core-data-001
   [junit4]   2> 155353 WARN  (SUITE-TermVectorComponentTest-seed#[615A0EE3216D0837]-worker) [    ] o.a.s.SolrTestCaseJ4 startTrackingSearchers: numOpens=4 numCloses=4
   [junit4]   2> 155353 INFO  (SUITE-TermVectorComponentTest-seed#[615A0EE3216D0837]-worker) [    ] o.a.s.SolrTestCaseJ4 Using PointFields (NUMERIC_POINTS_SYSPROP=true) w/NUMERIC_DOCVALUES_SYSPROP=true
   [junit4]   2> 155359 INFO  (SUITE-TermVectorComponentTest-seed#[615A0EE3216D0837]-worker) [    ] o.a.s.SolrTestCaseJ4 Randomized ssl (false) and clientAuth (false) via: @org.apache.solr.util.RandomizeSSL(reason=, value=NaN, ssl=NaN, clientAuth=NaN)
   [junit4]   2> 155360 INFO  (SUITE-TermVectorComponentTest-seed#[615A0EE3216D0837]-worker) [    ] o.a.s.SolrTestCaseJ4 SecureRandom sanity checks: test.solr.allowed.securerandom=null & java.security.egd=file:/dev/./urandom
   [junit4]   2> 155361 INFO  (SUITE-TermVectorComponentTest-seed#[615A0EE3216D0837]-worker) [    ] o.a.s.SolrTestCaseJ4 ####initCore
   [junit4]   2> 155361 INFO  (SUITE-TermVectorComponentTest-seed#[615A0EE3216D0837]-worker) [    ] o.a.s.c.SolrResourceLoader [null] Added 2 libs to classloader, from paths: [/C:/Users/jenkins/workspace/Lucene-Solr-7.x-Windows/solr/core/src/test-files/solr/collection1/lib, /C:/Users/jenkins/workspace/Lucene-Solr-7.x-Windows/solr/core/src/test-files/solr/collection1/lib/classes]
   [junit4]   2> 155407 INFO  (SUITE-TermVectorComponentTest-seed#[615A0EE3216D0837]-worker) [    ] o.a.s.c.SolrConfig Using Lucene MatchVersion: 7.3.0
   [junit4]   2> 155424 INFO  (SUITE-TermVectorComponentTest-seed#[615A0EE3216D0837]-worker) [    ] o.a.s.s.IndexSchema [null] Schema name=test
   [junit4]   2> 155503 INFO  (SUITE-TermVectorComponentTest-seed#[615A0EE3216D0837]-worker) [    ] o.a.s.s.IndexSchema Loaded schema test/1.0 with uniqueid field id
   [junit4]   2> 155580 INFO  (SUITE-TermVectorComponentTest-seed#[615A0EE3216D0837]-worker) [    ] o.a.s.m.r.SolrJmxReporter JMX monitoring for 'solr.node' (registry 'solr.node') enabled at server: com.sun.jmx.mbeanserver.JmxMBeanServer@55aca958
   [junit4]   2> 155585 INFO  (SUITE-TermVectorComponentTest-seed#[615A0EE3216D0837]-worker) [    ] o.a.s.m.r.SolrJmxReporter JMX monitoring for 'solr.jvm' (registry 'solr.jvm') enabled at server: com.sun.jmx.mbeanserver.JmxMBeanServer@55aca958
   [junit4]   2> 155585 INFO  (SUITE-TermVectorComponentTest-seed#[615A0EE3216D0837]-worker) [    ] o.a.s.m.r.SolrJmxReporter JMX monitoring for 'solr.jetty' (registry 'solr.jetty') enabled at server: com.sun.jmx.mbeanserver.JmxMBeanServer@55aca958
   [junit4]   2> 155586 INFO  (coreLoadExecutor-517-thread-1) [    ] o.a.s.c.TransientSolrCoreCacheDefault Allocating transient cache for 2147483647 transient cores
   [junit4]   2> 155588 INFO  (coreLoadExecutor-517-thread-1) [    x:collection1] o.a.s.c.SolrResourceLoader [null] Added 2 libs to classloader, from paths: [/C:/Users/jenkins/workspace/Lucene-Solr-7.x-Windows/solr/core/src/test-files/solr/collection1/lib, /C:/Users/jenkins/workspace/Lucene-Solr-7.x-Windows/solr/core/src/test-files/solr/collection1/lib/classes]
   [junit4]   2> 155636 INFO  (coreLoadExecutor-517-thread-1) [    x:collection1] o.a.s.c.SolrConfig Using Lucene MatchVersion: 7.3.0
   [junit4]   2> 155652 INFO  (coreLoadExecutor-517-thread-1) [    x:collection1] o.a.s.s.IndexSchema [collection1] Schema name=test
   [junit4]   2> 155716 INFO  (coreLoadExecutor-517-thread-1) [    x:collection1] o.a.s.s.IndexSchema Loaded schema test/1.0 with uniqueid field id
   [junit4]   2> 155731 INFO  (coreLoadExecutor-517-thread-1) [    x:collection1] o.a.s.c.CoreContainer Creating SolrCore 'collection1' using configuration from instancedir C:\Users\jenkins\workspace\Lucene-Solr-7.x-Windows\solr\core\src\test-files\solr\collection1, trusted=true
   [junit4]   2> 155731 INFO  (coreLoadExecutor-517-thread-1) [    x:collection1] o.a.s.m.r.SolrJmxReporter JMX monitoring for 'solr.core.collection1' (registry 'solr.core.collection1') enabled at server: com.sun.jmx.mbeanserver.JmxMBeanServer@55aca958
   [junit4]   2> 155732 INFO  (coreLoadExecutor-517-thread-1) [    x:collection1] o.a.s.c.SolrCore solr.RecoveryStrategy.Builder
   [junit4]   2> 155732 INFO  (coreLoadExecutor-517-thread-1) [    x:collection1] o.a.s.c.SolrCore [[collection1] ] Opening new SolrCore at [C:\Users\jenkins\workspace\Lucene-Solr-7.x-Windows\solr\core\src\test-files\solr\collection1], dataDir=[C:\Users\jenkins\workspace\Lucene-Solr-7.x-Windows\solr\build\solr-core\test\J1\temp\solr.handler.component.TermVectorComponentTest_615A0EE3216D0837-001\init-core-data-001\]
   [junit4]   2> 155733 INFO  (coreLoadExecutor-517-thread-1) [    x:collection1] o.a.s.u.RandomMergePolicy RandomMergePolicy wrapping class org.apache.lucene.index.TieredMergePolicy: [TieredMergePolicy: maxMergeAtOnce=43, maxMergeAtOnceExplicit=41, maxMergedSegmentMB=79.1171875, floorSegmentMB=1.1328125, forceMergeDeletesPctAllowed=6.6949345714053665, segmentsPerTier=29.0, maxCFSSegmentSizeMB=8.796093022207999E12, noCFSRatio=0.0
   [junit4]   2> 155833 INFO  (coreLoadExecutor-517-thread-1) [    x:collection1] o.a.s.u.UpdateHandler Using UpdateLog implementation: org.apache.solr.update.UpdateLog
   [junit4]   2> 155833 INFO  (coreLoadExecutor-517-thread-1) [    x:collection1] o.a.s.u.UpdateLog Initializing UpdateLog: dataDir= defaultSyncLevel=FLUSH numRecordsToKeep=100 maxNumLogsToKeep=10 numVersionBuckets=65536
   [junit4]   2> 155858 INFO  (coreLoadExecutor-517-thread-1) [    x:collection1] o.a.s.u.CommitTracker Hard AutoCommit: disabled
   [junit4]   2> 155858 INFO  (coreLoadExecutor-517-thread-1) [    x:collection1] o.a.s.u.CommitTracker Soft AutoCommit: disabled
   [junit4]   2> 155859 INFO  (coreLoadExecutor-517-thread-1) [    x:collection1] o.a.s.u.RandomMergePolicy RandomMergePolicy wrapping class org.apache.lucene.index.LogDocMergePolicy: [LogDocMergePolicy: minMergeSize=1000, mergeFactor=25, maxMergeSize=9223372036854775807, maxMergeSizeForForcedMerge=9223372036854775807, calibrateSizeByDeletes=true, maxMergeDocs=2147483647, maxCFSSegmentSizeMB=8.796093022207999E12, noCFSRatio=0.0]
   [junit4]   2> 155859 INFO  (coreLoadExecutor-517-thread-1) [    x:collection1] o.a.s.s.SolrIndexSearcher Opening [Searcher@5ad58b2a[collection1] main]
   [junit4]   2> 155860 INFO  (coreLoadExecutor-517-thread-1) [    x:collection1] o.a.s.h.c.SpellCheckComponent Initializing spell checkers
   [junit4]   2> 155868 INFO  (coreLoadExecutor-517-thread-1) [    x:collection1] o.a.s.s.DirectSolrSpellChecker init: {name=direct,classname=DirectSolrSpellChecker,field=lowerfilt,minQueryLength=3}
   [junit4]   2> 155909 INFO  (coreLoadExecutor-517-thread-1) [    x:collection1] o.a.s.h.ReplicationHandler Commits will be reserved for 10000ms.
   [junit4]   2> 155909 INFO  (searcherExecutor-518-thread-1-processing-x:collection1) [    x:collection1] o.a.s.h.c.SpellCheckComponent Loading spell index for spellchecker: default
   [junit4]   2> 155909 INFO  (coreLoadExecutor-517-thread-1) [    x:collection1] o.a.s.u.UpdateLog Could not find max version in index or recent updates, using new clock 1588690009879216128
   [junit4]   2> 155911 INFO  (searcherExecutor-518-thread-1-processing-x:collection1) [    x:collection1] o.a.s.h.c.SpellCheckComponent Loading spell index for spellchecker: direct
   [junit4]   2> 155911 INFO  (searcherExecutor-518-thread-1-processing-x:collection1) [    x:collection1] o.a.s.h.c.SpellCheckComponent Loading spell index for spellchecker: wordbreak
   [junit4]   2> 155911 INFO  (searcherExecutor-518-thread-1-processing-x:collection1) [    x:collection1] o.a.s.h.c.SpellCheckComponent Loading spell index for spellchecker: multipleFields
   [junit4]   2> 155912 INFO  (SUITE-TermVectorComponentTest-seed#[615A0EE3216D0837]-worker) [    ] o.a.s.SolrTestCaseJ4 ####initCore end
   [junit4]   2> 155913 INFO  (searcherExecutor-518-thread-1-processing-x:collection1) [    x:collection1] o.a.s.h.c.SpellCheckComponent Loading spell index for spellchecker: jarowinkler
   [junit4]   2> 155915 INFO  (searcherExecutor-518-thread-1-processing-x:collection1) [    x:collection1] o.a.s.h.c.SpellCheckComponent Loading spell index for spellchecker: external
   [junit4]   2> 155916 INFO  (searcherExecutor-518-thread-1-processing-x:collection1) [    x:collection1] o.a.s.h.c.SpellCheckComponent Loading spell index for spellchecker: freq
   [junit4]   2> 155916 INFO  (searcherExecutor-518-thread-1-processing-x:collection1) [    x:collection1] o.a.s.h.c.SpellCheckComponent Loading spell index for spellchecker: fqcn
   [junit4]   2> 155917 INFO  (searcherExecutor-518-thread-1-processing-x:collection1) [    x:collection1] o.a.s.h.c.SpellCheckComponent Loading spell index for spellchecker: perDict
   [junit4]   2> 155918 INFO  (searcherExecutor-518-thread-1-processing-x:collection1) [    x:collection1] o.a.s.c.SolrCore [collection1] Registered new searcher Searcher@5ad58b2a[collection1] main{ExitableDirectoryReader(UninvertingDirectoryReader())}
   [junit4]   2> 155925 INFO  (SUITE-TermVectorComponentTest-seed#[615A0EE3216D0837]-worker) [    ] o.a.s.u.p.LogUpdateProcessorFactory [collection1]  webapp=null path=null params={}{add=[0 (1588690009882361856)]} 0 12
   [junit4]   2> 155937 INFO  (SUITE-TermVectorComponentTest-seed#[615A0EE3216D0837]-worker) [    ] o.a.s.u.p.LogUpdateProcessorFactory [collection1]  webapp=null path=null params={}{add=[1 (1588690009906479104)]} 0 2
   [junit4]   2> 155940 INFO  (SUITE-TermVectorComponentTest-seed#[615A0EE3216D0837]-worker) [    ] o.a.s.u.p.LogUpdateProcessorFactory [collection1]  webapp=null path=null params={}{add=[2 (1588690009909624832)]} 0 1
   [junit4]   2> 155942 INFO  (SUITE-TermVectorComponentTest-seed#[615A0EE3216D0837]-worker) [    ] o.a.s.u.p.LogUpdateProcessorFactory [collection1]  webapp=null path=null params={}{add=[3 (1588690009912770560)]} 0 1
   [junit4]   2> 155944 INFO  (SUITE-TermVectorComponentTest-seed#[615A0EE3216D0837]-worker) [    ] o.a.s.u.p.LogUpdateProcessorFactory [collection1]  webapp=null path=null params={}{add=[4 (1588690009914867712)]} 0 1
   [junit4]   2> 155946 INFO  (SUITE-TermVectorComponentTest-seed#[615A0EE3216D0837]-worker) [    ] o.a.s.u.p.LogUpdateProcessorFactory [collection1]  webapp=null path=null params={}{add=[5 (1588690009916964864)]} 0 1
   [junit4]   2> 155948 INFO  (SUITE-TermVectorComponentTest-seed#[615A0EE3216D0837]-worker) [    ] o.a.s.u.p.LogUpdateProcessorFactory [collection1]  webapp=null path=null params={}{add=[6 (1588690009919062016)]} 0 1
   [junit4]   2> 155950 INFO  (SUITE-TermVectorComponentTest-seed#[615A0EE3216D0837]-worker) [    ] o.a.s.u.p.LogUpdateProcessorFactory [collection1]  webapp=null path=null params={}{add=[7 (1588690009921159168)]} 0 1
   [junit4]   2> 155952 INFO  (SUITE-TermVectorComponentTest-seed#[615A0EE3216D0837]-worker) [    ] o.a.s.u.p.LogUpdateProcessorFactory [collection1]  webapp=null path=null params={}{add=[8 (1588690009923256320)]} 0 1
   [junit4]   2> 155954 INFO  (SUITE-TermVectorComponentTest-seed#[615A0EE3216D0837]-worker) [    ] o.a.s.u.p.LogUpdateProcessorFactory [collection1]  webapp=null path=null params={}{add=[9 (1588690009925353472)]} 0 1
   [junit4]   2> 155955 INFO  (SUITE-TermVectorComponentTest-seed#[615A0EE3216D0837]-worker) [    ] o.a.s.u.DirectUpdateHandler2 start commit{_version_=1588690009927450624,optimize=false,openSearcher=true,waitSearcher=true,expungeDeletes=false,softCommit=false,prepareCommit=false}
   [junit4]   2> 155955 INFO  (SUITE-TermVectorComponentTest-seed#[615A0EE3216D0837]-worker) [    ] o.a.s.u.SolrIndexWriter Calling setCommitData with IW:org.apache.solr.update.SolrIndexWriter@13881626 commitCommandVersion:1588690009927450624
   [junit4]   2> 156066 INFO  (SUITE-TermVectorComponentTest-seed#[615A0EE3216D0837]-worker) [    ] o.a.s.s.SolrIndexSearcher Opening [Searcher@70e75d94[collection1] main]
   [junit4]   2> 156067 INFO  (SUITE-TermVectorComponentTest-seed#[615A0EE3216D0837]-worker) [    ] o.a.s.u.DirectUpdateHandler2 end_commit_flush
   [junit4]   2> 156068 INFO  (searcherExecutor-518-thread-1) [    ] o.a.s.c.SolrCore [collection1] Registered new searcher Searcher@70e75d94[collection1] main{ExitableDirectoryReader(UninvertingDirectoryReader(Uninverting(_0(7.3.0):c10)))}
   [junit4]   2> 156068 INFO  (SUITE-TermVectorComponentTest-seed#[615A0EE3216D0837]-worker) [    ] o.a.s.u.p.LogUpdateProcessorFactory [collection1]  webapp=null path=null params={}{commit=} 0 113
   [junit4]   2> 156072 INFO  (TEST-TermVectorComponentTest.testOptions-seed#[615A0EE3216D0837]) [    ] o.a.s.SolrTestCaseJ4 ###Starting testOptions
   [junit4]   2> 156100 INFO  (TEST-TermVectorComponentTest.testOptions-seed#[615A0EE3216D0837]) [    ] o.a.s.c.S.Request [collection1]  webapp=null path=null params={q=id:0&tv=true&tv.positions=true&qt=/tvrh&json.nl=map&tv.tf=true&tv.df=true&tv.offsets=true&tv.tf_idf=true&wt=xml} hits=1 status=0 QTime=27
   [junit4]   2> 156102 INFO  (TEST-TermVectorComponentTest.testOptions-seed#[615A0EE3216D0837]) [    ] o.a.s.c.S.Request [collection1]  webapp=null path=null params={q=id:0&tv=true&tv.all=true&qt=/tvrh&json.nl=map&wt=xml} hits=1 status=0 QTime=0
   [junit4]   2> 156103 INFO  (TEST-TermVectorComponentTest.testOptions-seed#[615A0EE3216D0837]) [    ] o.a.s.c.S.Request [collection1]  webapp=null path=null params={q=id:0&tv=true&tv.positions=false&qt=/tvrh&json.nl=map&tv.tf=true&tv.df=false&tv.offsets=true&tv.tf_idf=false&wt=xml} hits=1 status=0 QTime=0
   [junit4]   2> 156105 INFO  (TEST-TermVectorComponentTest.testOptions-seed#[615A0EE3216D0837]) [    ] o.a.s.SolrTestCaseJ4 ###Ending testOptions
   [junit4]   2> 156108 INFO  (TEST-TermVectorComponentTest.testBasics-seed#[615A0EE3216D0837]) [    ] o.a.s.SolrTestCaseJ4 ###Starting testBasics
   [junit4]   2> 156124 INFO  (TEST-TermVectorComponentTest.testBasics-seed#[615A0EE3216D0837]) [    ] o.a.s.c.S.Request [collection1]  webapp=null path=null params={q=id:0&tv=true&qt=/tvrh&json.nl=map&tv.tf=true&wt=xml} hits=1 status=0 QTime=16
   [junit4]   2> 156127 INFO  (TEST-TermVectorComponentTest.testBasics-seed#[615A0EE3216D0837]) [    ] o.a.s.c.S.Request [collection1]  webapp=null path=null params={q=id:0&tv=true&qt=/tvrh&json.nl=map&fl=*,score&tv.tf=true&tv.fl=test_basictv,test_offtv&wt=xml} hits=1 status=0 QTime=1
   [junit4]   2> 156127 INFO  (TEST-TermVectorComponentTest.testBasics-seed#[615A0EE3216D0837]) [    ] o.a.s.c.S.Request [collection1]  webapp=null path=null params={q=id:0&tv=true&qt=/tvrh&json.nl=map&fl=*,score&tv.tf=true&tv.fl=test_basictv&tv.fl=test_offtv&wt=xml} hits=1 status=0 QTime=0
   [junit4]   2> 156128 INFO  (TEST-TermVectorComponentTest.testBasics-seed#[615A0EE3216D0837]) [    ] o.a.s.c.S.Request [collection1]  webapp=null path=null params={q=id:0&tv=true&qt=/tvrh&json.nl=map&fl=*,score&tv.tf=true&wt=xml} hits=1 status=0 QTime=0
   [junit4]   2> 156146 INFO  (TEST-TermVectorComponentTest.testBasics-seed#[615A0EE3216D0837]) [    ] o.a.s.c.S.Request [collection1]  webapp=null path=null params={q=id:0&tv=true&qt=/tvrh&json.nl=map&fl=score,test_basictv,[docid],test_postv,val:sum(3,4)&tv.tf=true&wt=xml} hits=1 status=0 QTime=17
   [junit4]   2> 156150 INFO  (TEST-TermVectorComponentTest.testBasics-seed#[615A0EE3216D0837]) [    ] o.a.s.c.S.Request [collection1]  webapp=null path=null params={q=id:0&tv=true&qt=/tvrh&json.nl=map&fl=score,test_basictv&fl=[docid],test_postv,val:sum(3,4)&tv.tf=true&wt=xml} hits=1 status=0 QTime=0
   [junit4]   2> 156150 INFO  (TEST-TermVectorComponentTest.testBasics-seed#[615A0EE3216D0837]) [    ] o.a.s.SolrTestCaseJ4 ###Ending testBasics
   [junit4]   2> 156151 INFO  (TEST-TermVectorComponentTest.testPayloads-seed#[615A0EE3216D0837]) [    ] o.a.s.SolrTestCaseJ4 ###Starting testPayloads
   [junit4]   2> 156152 INFO  (TEST-TermVectorComponentTest.testPayloads-seed#[615A0EE3216D0837]) [    ] o.a.s.c.S.Request [collection1]  webapp=null path=null params={q=id:0&tv=true&tv.positions=true&qt=/tvrh&json.nl=map&tv.payloads=true&tv.tf=true&tv.df=true&tv.offsets=true&tv.tf_idf=true&wt=xml} hits=1 status=0 QTime=0
   [junit4]   2> 156153 INFO  (TEST-TermVectorComponentTest.testPayloads-seed#[615A0EE3216D0837]) [    ] o.a.s.SolrTestCaseJ4 ###Ending testPayloads
   [junit4]   2> 156155 INFO  (TEST-TermVectorComponentTest.testPerField-seed#[615A0EE3216D0837]) [    ] o.a.s.SolrTestCaseJ4 ###Starting testPerField
   [junit4]   2> 156156 INFO  (TEST-TermVectorComponentTest.testPerField-seed#[615A0EE3216D0837]) [    ] o.a.s.c.S.Request [collection1]  webapp=null path=null params={f.test_basictv.tv.tf_idf=false&tv=true&tv.positions=true&qt=/tvrh&json.nl=map&f.test_posoffpaytv.tv.payloads=false&f.test_posofftv.tv.positions=false&tv.tf=true&f.test_basictv.tv.df=false&tv.offsets=true&tv.fl=test_basictv,test_notv,test_postv,test_offtv,test_posofftv,test_posoffpaytv&tv.tf_idf=true&q=id:0&f.test_offtv.tv.offsets=false&tv.df=true&f.test_basictv.tv.tf=false&wt=xml} hits=1 status=0 QTime=1
   [junit4]   2> 156157 INFO  (TEST-TermVectorComponentTest.testPerField-seed#[615A0EE3216D0837]) [    ] o.a.s.SolrTestCaseJ4 ###Ending testPerField
   [junit4]   2> 156157 INFO  (SUITE-TermVectorComponentTest-seed#[615A0EE3216D0837]-worker) [    ] o.a.s.SolrTestCaseJ4 ###deleteCore
   [junit4]   2> 156157 INFO  (SUITE-TermVectorComponentTest-seed#[615A0EE3216D0837]-worker) [    ] o.a.s.c.CoreContainer Shutting down CoreContainer instance=509477539
   [junit4]   2> 156157 INFO  (SUITE-TermVectorComponentTest-seed#[615A0EE3216D0837]-worker) [    ] o.a.s.m.SolrMetricManager Closing metric reporters for registry=solr.node, tag=null
   [junit4]   2> 156157 INFO  (SUITE-TermVectorComponentTest-seed#[615A0EE3216D0837]-worker) [    ] o.a.s.m.r.SolrJmxReporter Closing reporter [org.apache.solr.metrics.reporters.SolrJmxReporter@3c8e945d: rootName = null, domain = solr.node, service url = null, agent id = null] for registry solr.node / com.codahale.metrics.MetricRegistry@2c51caed
   [junit4]   2> 156160 INFO  (SUITE-TermVectorComponentTest-seed#[615A0EE3216D0837]-worker) [    ] o.a.s.m.SolrMetricManager Closing metric reporters for registry=solr.jvm, tag=null
   [junit4]   2> 156160 INFO  (SUITE-TermVectorComponentTest-seed#[615A0EE3216D0837]-worker) [    ] o.a.s.m.r.SolrJmxReporter Closing reporter [org.apache.solr.metrics.reporters.SolrJmxReporter@73213eb2: rootName = null, domain = solr.jvm, service url = null, agent id = null] for registry solr.jvm / com.codahale.metrics.MetricRegistry@57c971ed
   [junit4]   2> 156162 INFO  (SUITE-TermVectorComponentTest-seed#[615A0EE3216D0837]-worker) [    ] o.a.s.m.SolrMetricManager Closing metric reporters for registry=solr.jetty, tag=null
   [junit4]   2> 156162 INFO  (SUITE-TermVectorComponentTest-seed#[615A0EE3216D0837]-worker) [    ] o.a.s.m.r.SolrJmxReporter Closing reporter [org.apache.solr.metrics.reporters.SolrJmxReporter@432f73db: rootName = null, domain = solr.jetty, service url = null, agent id = null] for registry solr.jetty / com.codahale.metrics.MetricRegistry@5af4f66d
   [junit4]   2> 156175 INFO  (coreCloseExecutor-523-thread-1) [    x:collection1] o.a.s.c.SolrCore [collection1]  CLOSING SolrCore org.apache.solr.core.SolrCore@77743dea
   [junit4]   2> 156175 INFO  (coreCloseExecutor-523-thread-1) [    x:collection1] o.a.s.m.SolrMetricManager Closing metric reporters for registry=solr.core.collection1, tag=2004106730
   [junit4]   2> 156175 INFO  (coreCloseExecutor-523-thread-1) [    x:collection1] o.a.s.m.r.SolrJmxReporter Closing reporter [org.apache.solr.metrics.reporters.SolrJmxReporter@1519ac2b: rootName = null, domain = solr.core.collection1, service url = null, agent id = null] for registry solr.core.collection1 / com.codahale.metrics.MetricRegistry@44553782
   [junit4]   2> 156187 INFO  (SUITE-TermVectorComponentTest-seed#[615A0EE3216D0837]-worker) [    ] o.a.s.SolrTestCaseJ4 ------------------------------------------------------- Done waiting for tracked resources to be released
   [junit4]   2> NOTE: test params are: codec=Asserting(Lucene70): {test_postv=FSTOrd50, test_basictv=Lucene50(blocksize=128), test_posofftv=PostingsFormat(name=Asserting), multiDefault=PostingsFormat(name=MockRandom), test_notv=PostingsFormat(name=MockRandom), id=Lucene50(blocksize=128), test_offtv=PostingsFormat(name=Asserting), test_posoffpaytv=PostingsFormat(name=Asserting)}, docValues:{range_facet_l_dv=DocValuesFormat(name=Asserting), _version_=DocValuesFormat(name=Direct), intDefault=DocValuesFormat(name=Direct), id_i1=DocValuesFormat(name=Direct), range_facet_i_dv=DocValuesFormat(name=Lucene70), intDvoDefault=DocValuesFormat(name=Asserting), timestamp=DocValuesFormat(name=Lucene70), range_facet_l=DocValuesFormat(name=Lucene70)}, maxPointsInLeafNode=1598, maxMBSortInHeap=7.564519128984286, sim=RandomSimilarity(queryNorm=true): {}, locale=mt-MT, timezone=Indian/Antananarivo
   [junit4]   2> NOTE: Windows 10 10.0 amd64/Oracle Corporation 1.8.0_144 (64-bit)/cpus=3,threads=1,free=316540944,total=467664896
   [junit4]   2> NOTE: All tests run in this JVM: [TestPullReplica, TestStressVersions, AutoAddReplicasPlanActionTest, TestAnalyzeInfixSuggestions, TestSchemalessBufferedUpdates, IndexSchemaRuntimeFieldTest, TestRawTransformer, TermVectorComponentTest]
   [junit4]   2> NOTE: reproduce with: ant test  -Dtestcase=TermVectorComponentTest -Dtests.seed=615A0EE3216D0837 -Dtests.slow=true -Dtests.locale=mt-MT -Dtests.timezone=Indian/Antananarivo -Dtests.asserts=true -Dtests.file.encoding=ISO-8859-1
   [junit4] ERROR   0.00s J1 | TermVectorComponentTest (suite) <<<
   [junit4]    > Throwable #1: java.io.IOException: Could not remove the following files (in the order of attempts):
   [junit4]    >    C:\Users\jenkins\workspace\Lucene-Solr-7.x-Windows\solr\build\solr-core\test\J1\temp\solr.handler.component.TermVectorComponentTest_615A0EE3216D0837-001\init-core-data-001\spellcheckerMultipleFields: java.nio.file.DirectoryNotEmptyException: C:\Users\jenkins\workspace\Lucene-Solr-7.x-Windows\solr\build\solr-core\test\J1\temp\solr.handler.component.TermVectorComponentTest_615A0EE3216D0837-001\init-core-data-001\spellcheckerMultipleFields
   [junit4]    >    C:\Users\jenkins\workspace\Lucene-Solr-7.x-Windows\solr\build\solr-core\test\J1\temp\solr.handler.component.TermVectorComponentTest_615A0EE3216D0837-001\init-core-data-001: java.nio.file.DirectoryNotEmptyException: C:\Users\jenkins\workspace\Lucene-Solr-7.x-Windows\solr\build\solr-core\test\J1\temp\solr.handler.component.TermVectorComponentTest_615A0EE3216D0837-001\init-core-data-001
   [junit4]    > 	at __randomizedtesting.SeedInfo.seed([615A0EE3216D0837]:0)
   [junit4]    > 	at org.apache.lucene.util.IOUtils.rm(IOUtils.java:329)
   [junit4]    > 	at java.lang.Thread.run(Thread.java:748)
   [junit4] Completed [23/765 (1!)] on J1 in 0.87s, 4 tests, 1 error <<< FAILURES!

[...truncated 4930 lines...]
   [junit4] Suite: org.apache.solr.update.processor.TestOpenNLPExtractNamedEntitiesUpdateProcessorFactory
   [junit4]   2> log4j:WARN No appenders could be found for logger (org.apache.solr.SolrTestCaseJ4).
   [junit4]   2> log4j:WARN Please initialize the log4j system properly.
   [junit4]   2> log4j:WARN See http://logging.apache.org/log4j/1.2/faq.html#noconfig for more info.
   [junit4]   2> Creating dataDir: C:\Users\jenkins\workspace\Lucene-Solr-7.x-Windows\solr\build\contrib\solr-analysis-extras\test\J1\temp\solr.update.processor.TestOpenNLPExtractNamedEntitiesUpdateProcessorFactory_7F8153C4CB428F05-001\init-core-data-001
   [junit4]   2> NOTE: test params are: codec=FastCompressingStoredFields(storedFieldsFormat=CompressingStoredFieldsFormat(compressionMode=FAST, chunkSize=28261, maxDocsPerChunk=7, blockSize=9), termVectorsFormat=CompressingTermVectorsFormat(compressionMode=FAST, chunkSize=28261, blockSize=9)), sim=RandomSimilarity(queryNorm=false): {}, locale=und, timezone=America/Aruba
   [junit4]   2> NOTE: Windows 10 10.0 amd64/Oracle Corporation 1.8.0_144 (64-bit)/cpus=3,threads=1,free=44519288,total=100663296
   [junit4]   2> NOTE: All tests run in this JVM: [TestOpenNLPExtractNamedEntitiesUpdateProcessorFactory]
   [junit4]   2> NOTE: reproduce with: ant test  -Dtestcase=TestOpenNLPExtractNamedEntitiesUpdateProcessorFactory -Dtests.seed=7F8153C4CB428F05 -Dtests.slow=true -Dtests.locale=und -Dtests.timezone=America/Aruba -Dtests.asserts=true -Dtests.file.encoding=US-ASCII
   [junit4] ERROR   0.00s J1 | TestOpenNLPExtractNamedEntitiesUpdateProcessorFactory (suite) <<<
   [junit4]    > Throwable #1: java.io.IOException: Could not remove the following files (in the order of attempts):
   [junit4]    >    C:\Users\jenkins\workspace\Lucene-Solr-7.x-Windows\solr\build\contrib\solr-analysis-extras\test\J1\temp\solr.update.processor.TestOpenNLPExtractNamedEntitiesUpdateProcessorFactory_7F8153C4CB428F05-001\tempDir-001\collection1\conf: java.nio.file.DirectoryNotEmptyException: C:\Users\jenkins\workspace\Lucene-Solr-7.x-Windows\solr\build\contrib\solr-analysis-extras\test\J1\temp\solr.update.processor.TestOpenNLPExtractNamedEntitiesUpdateProcessorFactory_7F8153C4CB428F05-001\tempDir-001\collection1\conf
   [junit4]    >    C:\Users\jenkins\workspace\Lucene-Solr-7.x-Windows\solr\build\contrib\solr-analysis-extras\test\J1\temp\solr.update.processor.TestOpenNLPExtractNamedEntitiesUpdateProcessorFactory_7F8153C4CB428F05-001\tempDir-001\collection1: java.nio.file.DirectoryNotEmptyException: C:\Users\jenkins\workspace\Lucene-Solr-7.x-Windows\solr\build\contrib\solr-analysis-extras\test\J1\temp\solr.update.processor.TestOpenNLPExtractNamedEntitiesUpdateProcessorFactory_7F8153C4CB428F05-001\tempDir-001\collection1
   [junit4]    >    C:\Users\jenkins\workspace\Lucene-Solr-7.x-Windows\solr\build\contrib\solr-analysis-extras\test\J1\temp\solr.update.processor.TestOpenNLPExtractNamedEntitiesUpdateProcessorFactory_7F8153C4CB428F05-001\tempDir-001: java.nio.file.DirectoryNotEmptyException: C:\Users\jenkins\workspace\Lucene-Solr-7.x-Windows\solr\build\contrib\solr-analysis-extras\test\J1\temp\solr.update.processor.TestOpenNLPExtractNamedEntitiesUpdateProcessorFactory_7F8153C4CB428F05-001\tempDir-001
   [junit4]    >    C:\Users\jenkins\workspace\Lucene-Solr-7.x-Windows\solr\build\contrib\solr-analysis-extras\test\J1\temp\solr.update.processor.TestOpenNLPExtractNamedEntitiesUpdateProcessorFactory_7F8153C4CB428F05-001\tempDir-001\collection1\conf\en-test-ner-person.bin: java.nio.file.AccessDeniedException: C:\Users\jenkins\workspace\Lucene-Solr-7.x-Windows\solr\build\contrib\solr-analysis-extras\test\J1\temp\solr.update.processor.TestOpenNLPExtractNamedEntitiesUpdateProcessorFactory_7F8153C4CB428F05-001\tempDir-001\collection1\conf\en-test-ner-person.bin
   [junit4]    >    C:\Users\jenkins\workspace\Lucene-Solr-7.x-Windows\solr\build\contrib\solr-analysis-extras\test\J1\temp\solr.update.processor.TestOpenNLPExtractNamedEntitiesUpdateProcessorFactory_7F8153C4CB428F05-001\tempDir-001\collection1\conf\en-test-sent.bin: java.nio.file.AccessDeniedException: C:\Users\jenkins\workspace\Lucene-Solr-7.x-Windows\solr\build\contrib\solr-analysis-extras\test\J1\temp\solr.update.processor.TestOpenNLPExtractNamedEntitiesUpdateProcessorFactory_7F8153C4CB428F05-001\tempDir-001\collection1\conf\en-test-sent.bin
   [junit4]    >    C:\Users\jenkins\workspace\Lucene-Solr-7.x-Windows\solr\build\contrib\solr-analysis-extras\test\J1\temp\solr.update.processor.TestOpenNLPExtractNamedEntitiesUpdateProcessorFactory_7F8153C4CB428F05-001\tempDir-001\collection1\conf\en-test-tokenizer.bin: java.nio.file.AccessDeniedException: C:\Users\jenkins\workspace\Lucene-Solr-7.x-Windows\solr\build\contrib\solr-analysis-extras\test\J1\temp\solr.update.processor.TestOpenNLPExtractNamedEntitiesUpdateProcessorFactory_7F8153C4CB428F05-001\tempDir-001\collection1\conf\en-test-tokenizer.bin
   [junit4]    >    C:\Users\jenkins\workspace\Lucene-Solr-7.x-Windows\solr\build\contrib\solr-analysis-extras\test\J1\temp\solr.update.processor.TestOpenNLPExtractNamedEntitiesUpdateProcessorFactory_7F8153C4CB428F05-001: java.nio.file.DirectoryNotEmptyException: C:\Users\jenkins\workspace\Lucene-Solr-7.x-Windows\solr\build\contrib\solr-analysis-extras\test\J1\temp\solr.update.processor.TestOpenNLPExtractNamedEntitiesUpdateProcessorFactory_7F8153C4CB428F05-001
   [junit4]    > 	at __randomizedtesting.SeedInfo.seed([7F8153C4CB428F05]:0)
   [junit4]    > 	at org.apache.lucene.util.IOUtils.rm(IOUtils.java:329)
   [junit4]    > 	at java.lang.Thread.run(Thread.java:748)
   [junit4] Completed [1/5 (1!)] on J1 in 18.29s, 8 tests, 1 error <<< FAILURES!

[...truncated 45786 lines...]

Mime
View raw message