lucene-dev mailing list archives

Site index · List index
Message view « Date » · « Thread »
Top « Date » · « Thread »
From Policeman Jenkins Server <jenk...@thetaphi.de>
Subject [JENKINS] Lucene-Solr-master-Windows (64bit/jdk1.8.0_144) - Build # 7094 - Still Unstable!
Date Fri, 05 Jan 2018 06:47:33 GMT
Build: https://jenkins.thetaphi.de/job/Lucene-Solr-master-Windows/7094/
Java: 64bit/jdk1.8.0_144 -XX:+UseCompressedOops -XX:+UseSerialGC

6 tests failed.
FAILED:  junit.framework.TestSuite.org.apache.lucene.analysis.snowball.TestSnowballVocab

Error Message:
Could not remove the following files (in the order of attempts):    C:\Users\jenkins\workspace\Lucene-Solr-master-Windows\lucene\build\analysis\common\test\J0\temp\lucene.analysis.snowball.TestSnowballVocab_65EFBF6AA4A4059F-001\tempDir-017: java.nio.file.DirectoryNotEmptyException: C:\Users\jenkins\workspace\Lucene-Solr-master-Windows\lucene\build\analysis\common\test\J0\temp\lucene.analysis.snowball.TestSnowballVocab_65EFBF6AA4A4059F-001\tempDir-017 

Stack Trace:
java.io.IOException: Could not remove the following files (in the order of attempts):
   C:\Users\jenkins\workspace\Lucene-Solr-master-Windows\lucene\build\analysis\common\test\J0\temp\lucene.analysis.snowball.TestSnowballVocab_65EFBF6AA4A4059F-001\tempDir-017: java.nio.file.DirectoryNotEmptyException: C:\Users\jenkins\workspace\Lucene-Solr-master-Windows\lucene\build\analysis\common\test\J0\temp\lucene.analysis.snowball.TestSnowballVocab_65EFBF6AA4A4059F-001\tempDir-017

	at __randomizedtesting.SeedInfo.seed([65EFBF6AA4A4059F]:0)
	at org.apache.lucene.util.IOUtils.rm(IOUtils.java:329)
	at org.apache.lucene.util.TestRuleTemporaryFilesCleanup.afterAlways(TestRuleTemporaryFilesCleanup.java:216)
	at com.carrotsearch.randomizedtesting.rules.TestRuleAdapter$1.afterAlways(TestRuleAdapter.java:31)
	at com.carrotsearch.randomizedtesting.rules.StatementAdapter.evaluate(StatementAdapter.java:43)
	at com.carrotsearch.randomizedtesting.rules.StatementAdapter.evaluate(StatementAdapter.java:36)
	at org.apache.lucene.util.TestRuleAssertionsRequired$1.evaluate(TestRuleAssertionsRequired.java:53)
	at org.apache.lucene.util.TestRuleMarkFailure$1.evaluate(TestRuleMarkFailure.java:47)
	at org.apache.lucene.util.TestRuleIgnoreAfterMaxFailures$1.evaluate(TestRuleIgnoreAfterMaxFailures.java:64)
	at org.apache.lucene.util.TestRuleIgnoreTestSuites$1.evaluate(TestRuleIgnoreTestSuites.java:54)
	at com.carrotsearch.randomizedtesting.rules.StatementAdapter.evaluate(StatementAdapter.java:36)
	at com.carrotsearch.randomizedtesting.ThreadLeakControl$StatementRunner.run(ThreadLeakControl.java:368)
	at java.lang.Thread.run(Thread.java:748)


FAILED:  junit.framework.TestSuite.org.apache.lucene.store.TestRAFDirectory

Error Message:
Could not remove the following files (in the order of attempts):    C:\Users\jenkins\workspace\Lucene-Solr-master-Windows\lucene\build\misc\test\J0\temp\lucene.store.TestRAFDirectory_252CB0D0D0AE7A03-001\testThreadSafety-001: java.nio.file.AccessDeniedException: C:\Users\jenkins\workspace\Lucene-Solr-master-Windows\lucene\build\misc\test\J0\temp\lucene.store.TestRAFDirectory_252CB0D0D0AE7A03-001\testThreadSafety-001    C:\Users\jenkins\workspace\Lucene-Solr-master-Windows\lucene\build\misc\test\J0\temp\lucene.store.TestRAFDirectory_252CB0D0D0AE7A03-001: java.nio.file.DirectoryNotEmptyException: C:\Users\jenkins\workspace\Lucene-Solr-master-Windows\lucene\build\misc\test\J0\temp\lucene.store.TestRAFDirectory_252CB0D0D0AE7A03-001 

Stack Trace:
java.io.IOException: Could not remove the following files (in the order of attempts):
   C:\Users\jenkins\workspace\Lucene-Solr-master-Windows\lucene\build\misc\test\J0\temp\lucene.store.TestRAFDirectory_252CB0D0D0AE7A03-001\testThreadSafety-001: java.nio.file.AccessDeniedException: C:\Users\jenkins\workspace\Lucene-Solr-master-Windows\lucene\build\misc\test\J0\temp\lucene.store.TestRAFDirectory_252CB0D0D0AE7A03-001\testThreadSafety-001
   C:\Users\jenkins\workspace\Lucene-Solr-master-Windows\lucene\build\misc\test\J0\temp\lucene.store.TestRAFDirectory_252CB0D0D0AE7A03-001: java.nio.file.DirectoryNotEmptyException: C:\Users\jenkins\workspace\Lucene-Solr-master-Windows\lucene\build\misc\test\J0\temp\lucene.store.TestRAFDirectory_252CB0D0D0AE7A03-001

	at __randomizedtesting.SeedInfo.seed([252CB0D0D0AE7A03]:0)
	at org.apache.lucene.util.IOUtils.rm(IOUtils.java:329)
	at org.apache.lucene.util.TestRuleTemporaryFilesCleanup.afterAlways(TestRuleTemporaryFilesCleanup.java:216)
	at com.carrotsearch.randomizedtesting.rules.TestRuleAdapter$1.afterAlways(TestRuleAdapter.java:31)
	at com.carrotsearch.randomizedtesting.rules.StatementAdapter.evaluate(StatementAdapter.java:43)
	at com.carrotsearch.randomizedtesting.rules.StatementAdapter.evaluate(StatementAdapter.java:36)
	at org.apache.lucene.util.TestRuleAssertionsRequired$1.evaluate(TestRuleAssertionsRequired.java:53)
	at org.apache.lucene.util.TestRuleMarkFailure$1.evaluate(TestRuleMarkFailure.java:47)
	at org.apache.lucene.util.TestRuleIgnoreAfterMaxFailures$1.evaluate(TestRuleIgnoreAfterMaxFailures.java:64)
	at org.apache.lucene.util.TestRuleIgnoreTestSuites$1.evaluate(TestRuleIgnoreTestSuites.java:54)
	at com.carrotsearch.randomizedtesting.rules.StatementAdapter.evaluate(StatementAdapter.java:36)
	at com.carrotsearch.randomizedtesting.ThreadLeakControl$StatementRunner.run(ThreadLeakControl.java:368)
	at java.lang.Thread.run(Thread.java:748)


FAILED:  junit.framework.TestSuite.org.apache.solr.analytics.facet.PivotFacetTest

Error Message:
Could not remove the following files (in the order of attempts):    C:\Users\jenkins\workspace\Lucene-Solr-master-Windows\solr\build\contrib\solr-analytics\test\J1\temp\solr.analytics.facet.PivotFacetTest_F45300399E9F81A7-001\tempDir-001\node2\collection1_shard1_replica_n1\data\tlog: java.nio.file.DirectoryNotEmptyException: C:\Users\jenkins\workspace\Lucene-Solr-master-Windows\solr\build\contrib\solr-analytics\test\J1\temp\solr.analytics.facet.PivotFacetTest_F45300399E9F81A7-001\tempDir-001\node2\collection1_shard1_replica_n1\data\tlog    C:\Users\jenkins\workspace\Lucene-Solr-master-Windows\solr\build\contrib\solr-analytics\test\J1\temp\solr.analytics.facet.PivotFacetTest_F45300399E9F81A7-001\tempDir-001\node2\collection1_shard1_replica_n1\data: java.nio.file.DirectoryNotEmptyException: C:\Users\jenkins\workspace\Lucene-Solr-master-Windows\solr\build\contrib\solr-analytics\test\J1\temp\solr.analytics.facet.PivotFacetTest_F45300399E9F81A7-001\tempDir-001\node2\collection1_shard1_replica_n1\data    C:\Users\jenkins\workspace\Lucene-Solr-master-Windows\solr\build\contrib\solr-analytics\test\J1\temp\solr.analytics.facet.PivotFacetTest_F45300399E9F81A7-001\tempDir-001\node2\collection1_shard1_replica_n1: java.nio.file.DirectoryNotEmptyException: C:\Users\jenkins\workspace\Lucene-Solr-master-Windows\solr\build\contrib\solr-analytics\test\J1\temp\solr.analytics.facet.PivotFacetTest_F45300399E9F81A7-001\tempDir-001\node2\collection1_shard1_replica_n1    C:\Users\jenkins\workspace\Lucene-Solr-master-Windows\solr\build\contrib\solr-analytics\test\J1\temp\solr.analytics.facet.PivotFacetTest_F45300399E9F81A7-001\tempDir-001\node2: java.nio.file.DirectoryNotEmptyException: C:\Users\jenkins\workspace\Lucene-Solr-master-Windows\solr\build\contrib\solr-analytics\test\J1\temp\solr.analytics.facet.PivotFacetTest_F45300399E9F81A7-001\tempDir-001\node2    C:\Users\jenkins\workspace\Lucene-Solr-master-Windows\solr\build\contrib\solr-analytics\test\J1\temp\solr.analytics.facet.PivotFacetTest_F45300399E9F81A7-001\tempDir-001: java.nio.file.DirectoryNotEmptyException: C:\Users\jenkins\workspace\Lucene-Solr-master-Windows\solr\build\contrib\solr-analytics\test\J1\temp\solr.analytics.facet.PivotFacetTest_F45300399E9F81A7-001\tempDir-001    C:\Users\jenkins\workspace\Lucene-Solr-master-Windows\solr\build\contrib\solr-analytics\test\J1\temp\solr.analytics.facet.PivotFacetTest_F45300399E9F81A7-001\tempDir-001\node2\collection1_shard1_replica_n1\data\tlog\tlog.0000000000000000001: java.nio.file.AccessDeniedException: C:\Users\jenkins\workspace\Lucene-Solr-master-Windows\solr\build\contrib\solr-analytics\test\J1\temp\solr.analytics.facet.PivotFacetTest_F45300399E9F81A7-001\tempDir-001\node2\collection1_shard1_replica_n1\data\tlog\tlog.0000000000000000001    C:\Users\jenkins\workspace\Lucene-Solr-master-Windows\solr\build\contrib\solr-analytics\test\J1\temp\solr.analytics.facet.PivotFacetTest_F45300399E9F81A7-001: java.nio.file.DirectoryNotEmptyException: C:\Users\jenkins\workspace\Lucene-Solr-master-Windows\solr\build\contrib\solr-analytics\test\J1\temp\solr.analytics.facet.PivotFacetTest_F45300399E9F81A7-001 

Stack Trace:
java.io.IOException: Could not remove the following files (in the order of attempts):
   C:\Users\jenkins\workspace\Lucene-Solr-master-Windows\solr\build\contrib\solr-analytics\test\J1\temp\solr.analytics.facet.PivotFacetTest_F45300399E9F81A7-001\tempDir-001\node2\collection1_shard1_replica_n1\data\tlog: java.nio.file.DirectoryNotEmptyException: C:\Users\jenkins\workspace\Lucene-Solr-master-Windows\solr\build\contrib\solr-analytics\test\J1\temp\solr.analytics.facet.PivotFacetTest_F45300399E9F81A7-001\tempDir-001\node2\collection1_shard1_replica_n1\data\tlog
   C:\Users\jenkins\workspace\Lucene-Solr-master-Windows\solr\build\contrib\solr-analytics\test\J1\temp\solr.analytics.facet.PivotFacetTest_F45300399E9F81A7-001\tempDir-001\node2\collection1_shard1_replica_n1\data: java.nio.file.DirectoryNotEmptyException: C:\Users\jenkins\workspace\Lucene-Solr-master-Windows\solr\build\contrib\solr-analytics\test\J1\temp\solr.analytics.facet.PivotFacetTest_F45300399E9F81A7-001\tempDir-001\node2\collection1_shard1_replica_n1\data
   C:\Users\jenkins\workspace\Lucene-Solr-master-Windows\solr\build\contrib\solr-analytics\test\J1\temp\solr.analytics.facet.PivotFacetTest_F45300399E9F81A7-001\tempDir-001\node2\collection1_shard1_replica_n1: java.nio.file.DirectoryNotEmptyException: C:\Users\jenkins\workspace\Lucene-Solr-master-Windows\solr\build\contrib\solr-analytics\test\J1\temp\solr.analytics.facet.PivotFacetTest_F45300399E9F81A7-001\tempDir-001\node2\collection1_shard1_replica_n1
   C:\Users\jenkins\workspace\Lucene-Solr-master-Windows\solr\build\contrib\solr-analytics\test\J1\temp\solr.analytics.facet.PivotFacetTest_F45300399E9F81A7-001\tempDir-001\node2: java.nio.file.DirectoryNotEmptyException: C:\Users\jenkins\workspace\Lucene-Solr-master-Windows\solr\build\contrib\solr-analytics\test\J1\temp\solr.analytics.facet.PivotFacetTest_F45300399E9F81A7-001\tempDir-001\node2
   C:\Users\jenkins\workspace\Lucene-Solr-master-Windows\solr\build\contrib\solr-analytics\test\J1\temp\solr.analytics.facet.PivotFacetTest_F45300399E9F81A7-001\tempDir-001: java.nio.file.DirectoryNotEmptyException: C:\Users\jenkins\workspace\Lucene-Solr-master-Windows\solr\build\contrib\solr-analytics\test\J1\temp\solr.analytics.facet.PivotFacetTest_F45300399E9F81A7-001\tempDir-001
   C:\Users\jenkins\workspace\Lucene-Solr-master-Windows\solr\build\contrib\solr-analytics\test\J1\temp\solr.analytics.facet.PivotFacetTest_F45300399E9F81A7-001\tempDir-001\node2\collection1_shard1_replica_n1\data\tlog\tlog.0000000000000000001: java.nio.file.AccessDeniedException: C:\Users\jenkins\workspace\Lucene-Solr-master-Windows\solr\build\contrib\solr-analytics\test\J1\temp\solr.analytics.facet.PivotFacetTest_F45300399E9F81A7-001\tempDir-001\node2\collection1_shard1_replica_n1\data\tlog\tlog.0000000000000000001
   C:\Users\jenkins\workspace\Lucene-Solr-master-Windows\solr\build\contrib\solr-analytics\test\J1\temp\solr.analytics.facet.PivotFacetTest_F45300399E9F81A7-001: java.nio.file.DirectoryNotEmptyException: C:\Users\jenkins\workspace\Lucene-Solr-master-Windows\solr\build\contrib\solr-analytics\test\J1\temp\solr.analytics.facet.PivotFacetTest_F45300399E9F81A7-001

	at __randomizedtesting.SeedInfo.seed([F45300399E9F81A7]:0)
	at org.apache.lucene.util.IOUtils.rm(IOUtils.java:329)
	at org.apache.lucene.util.TestRuleTemporaryFilesCleanup.afterAlways(TestRuleTemporaryFilesCleanup.java:216)
	at com.carrotsearch.randomizedtesting.rules.TestRuleAdapter$1.afterAlways(TestRuleAdapter.java:31)
	at com.carrotsearch.randomizedtesting.rules.StatementAdapter.evaluate(StatementAdapter.java:43)
	at com.carrotsearch.randomizedtesting.rules.StatementAdapter.evaluate(StatementAdapter.java:36)
	at org.apache.lucene.util.TestRuleAssertionsRequired$1.evaluate(TestRuleAssertionsRequired.java:53)
	at org.apache.lucene.util.TestRuleMarkFailure$1.evaluate(TestRuleMarkFailure.java:47)
	at org.apache.lucene.util.TestRuleIgnoreAfterMaxFailures$1.evaluate(TestRuleIgnoreAfterMaxFailures.java:64)
	at org.apache.lucene.util.TestRuleIgnoreTestSuites$1.evaluate(TestRuleIgnoreTestSuites.java:54)
	at com.carrotsearch.randomizedtesting.rules.StatementAdapter.evaluate(StatementAdapter.java:36)
	at com.carrotsearch.randomizedtesting.ThreadLeakControl$StatementRunner.run(ThreadLeakControl.java:368)
	at java.lang.Thread.run(Thread.java:748)


FAILED:  org.apache.solr.cloud.DocValuesNotIndexedTest.testGroupingDVOnly

Error Message:
Unexpected number of elements in the group for intGSF: 6

Stack Trace:
java.lang.AssertionError: Unexpected number of elements in the group for intGSF: 6
	at __randomizedtesting.SeedInfo.seed([2406AC01CBCFA736:BFBDC25986979568]:0)
	at org.junit.Assert.fail(Assert.java:93)
	at org.apache.solr.cloud.DocValuesNotIndexedTest.testGroupingDVOnly(DocValuesNotIndexedTest.java:377)
	at sun.reflect.NativeMethodAccessorImpl.invoke0(Native Method)
	at sun.reflect.NativeMethodAccessorImpl.invoke(NativeMethodAccessorImpl.java:62)
	at sun.reflect.DelegatingMethodAccessorImpl.invoke(DelegatingMethodAccessorImpl.java:43)
	at java.lang.reflect.Method.invoke(Method.java:498)
	at com.carrotsearch.randomizedtesting.RandomizedRunner.invoke(RandomizedRunner.java:1737)
	at com.carrotsearch.randomizedtesting.RandomizedRunner$8.evaluate(RandomizedRunner.java:934)
	at com.carrotsearch.randomizedtesting.RandomizedRunner$9.evaluate(RandomizedRunner.java:970)
	at com.carrotsearch.randomizedtesting.RandomizedRunner$10.evaluate(RandomizedRunner.java:984)
	at com.carrotsearch.randomizedtesting.rules.SystemPropertiesRestoreRule$1.evaluate(SystemPropertiesRestoreRule.java:57)
	at org.apache.lucene.util.TestRuleSetupTeardownChained$1.evaluate(TestRuleSetupTeardownChained.java:49)
	at org.apache.lucene.util.AbstractBeforeAfterRule$1.evaluate(AbstractBeforeAfterRule.java:45)
	at org.apache.lucene.util.TestRuleThreadAndTestName$1.evaluate(TestRuleThreadAndTestName.java:48)
	at org.apache.lucene.util.TestRuleIgnoreAfterMaxFailures$1.evaluate(TestRuleIgnoreAfterMaxFailures.java:64)
	at org.apache.lucene.util.TestRuleMarkFailure$1.evaluate(TestRuleMarkFailure.java:47)
	at com.carrotsearch.randomizedtesting.rules.StatementAdapter.evaluate(StatementAdapter.java:36)
	at com.carrotsearch.randomizedtesting.ThreadLeakControl$StatementRunner.run(ThreadLeakControl.java:368)
	at com.carrotsearch.randomizedtesting.ThreadLeakControl.forkTimeoutingTask(ThreadLeakControl.java:817)
	at com.carrotsearch.randomizedtesting.ThreadLeakControl$3.evaluate(ThreadLeakControl.java:468)
	at com.carrotsearch.randomizedtesting.RandomizedRunner.runSingleTest(RandomizedRunner.java:943)
	at com.carrotsearch.randomizedtesting.RandomizedRunner$5.evaluate(RandomizedRunner.java:829)
	at com.carrotsearch.randomizedtesting.RandomizedRunner$6.evaluate(RandomizedRunner.java:879)
	at com.carrotsearch.randomizedtesting.RandomizedRunner$7.evaluate(RandomizedRunner.java:890)
	at com.carrotsearch.randomizedtesting.rules.StatementAdapter.evaluate(StatementAdapter.java:36)
	at com.carrotsearch.randomizedtesting.rules.SystemPropertiesRestoreRule$1.evaluate(SystemPropertiesRestoreRule.java:57)
	at org.apache.lucene.util.AbstractBeforeAfterRule$1.evaluate(AbstractBeforeAfterRule.java:45)
	at com.carrotsearch.randomizedtesting.rules.StatementAdapter.evaluate(StatementAdapter.java:36)
	at org.apache.lucene.util.TestRuleStoreClassName$1.evaluate(TestRuleStoreClassName.java:41)
	at com.carrotsearch.randomizedtesting.rules.NoShadowingOrOverridesOnMethodsRule$1.evaluate(NoShadowingOrOverridesOnMethodsRule.java:40)
	at com.carrotsearch.randomizedtesting.rules.NoShadowingOrOverridesOnMethodsRule$1.evaluate(NoShadowingOrOverridesOnMethodsRule.java:40)
	at com.carrotsearch.randomizedtesting.rules.StatementAdapter.evaluate(StatementAdapter.java:36)
	at com.carrotsearch.randomizedtesting.rules.StatementAdapter.evaluate(StatementAdapter.java:36)
	at com.carrotsearch.randomizedtesting.rules.StatementAdapter.evaluate(StatementAdapter.java:36)
	at org.apache.lucene.util.TestRuleAssertionsRequired$1.evaluate(TestRuleAssertionsRequired.java:53)
	at org.apache.lucene.util.TestRuleMarkFailure$1.evaluate(TestRuleMarkFailure.java:47)
	at org.apache.lucene.util.TestRuleIgnoreAfterMaxFailures$1.evaluate(TestRuleIgnoreAfterMaxFailures.java:64)
	at org.apache.lucene.util.TestRuleIgnoreTestSuites$1.evaluate(TestRuleIgnoreTestSuites.java:54)
	at com.carrotsearch.randomizedtesting.rules.StatementAdapter.evaluate(StatementAdapter.java:36)
	at com.carrotsearch.randomizedtesting.ThreadLeakControl$StatementRunner.run(ThreadLeakControl.java:368)
	at java.lang.Thread.run(Thread.java:748)


FAILED:  junit.framework.TestSuite.org.apache.solr.update.PeerSyncWithIndexFingerprintCachingTest

Error Message:
Could not remove the following files (in the order of attempts):    C:\Users\jenkins\workspace\Lucene-Solr-master-Windows\solr\build\solr-core\test\J0\temp\solr.update.PeerSyncWithIndexFingerprintCachingTest_2406AC01CBCFA736-001\tempDir-001\shard2\configsets\cloud-minimal: java.nio.file.DirectoryNotEmptyException: C:\Users\jenkins\workspace\Lucene-Solr-master-Windows\solr\build\solr-core\test\J0\temp\solr.update.PeerSyncWithIndexFingerprintCachingTest_2406AC01CBCFA736-001\tempDir-001\shard2\configsets\cloud-minimal    C:\Users\jenkins\workspace\Lucene-Solr-master-Windows\solr\build\solr-core\test\J0\temp\solr.update.PeerSyncWithIndexFingerprintCachingTest_2406AC01CBCFA736-001\tempDir-001\shard2\configsets: java.nio.file.DirectoryNotEmptyException: C:\Users\jenkins\workspace\Lucene-Solr-master-Windows\solr\build\solr-core\test\J0\temp\solr.update.PeerSyncWithIndexFingerprintCachingTest_2406AC01CBCFA736-001\tempDir-001\shard2\configsets    C:\Users\jenkins\workspace\Lucene-Solr-master-Windows\solr\build\solr-core\test\J0\temp\solr.update.PeerSyncWithIndexFingerprintCachingTest_2406AC01CBCFA736-001\tempDir-001\shard2: java.nio.file.DirectoryNotEmptyException: C:\Users\jenkins\workspace\Lucene-Solr-master-Windows\solr\build\solr-core\test\J0\temp\solr.update.PeerSyncWithIndexFingerprintCachingTest_2406AC01CBCFA736-001\tempDir-001\shard2    C:\Users\jenkins\workspace\Lucene-Solr-master-Windows\solr\build\solr-core\test\J0\temp\solr.update.PeerSyncWithIndexFingerprintCachingTest_2406AC01CBCFA736-001\tempDir-001: java.nio.file.DirectoryNotEmptyException: C:\Users\jenkins\workspace\Lucene-Solr-master-Windows\solr\build\solr-core\test\J0\temp\solr.update.PeerSyncWithIndexFingerprintCachingTest_2406AC01CBCFA736-001\tempDir-001 

Stack Trace:
java.io.IOException: Could not remove the following files (in the order of attempts):
   C:\Users\jenkins\workspace\Lucene-Solr-master-Windows\solr\build\solr-core\test\J0\temp\solr.update.PeerSyncWithIndexFingerprintCachingTest_2406AC01CBCFA736-001\tempDir-001\shard2\configsets\cloud-minimal: java.nio.file.DirectoryNotEmptyException: C:\Users\jenkins\workspace\Lucene-Solr-master-Windows\solr\build\solr-core\test\J0\temp\solr.update.PeerSyncWithIndexFingerprintCachingTest_2406AC01CBCFA736-001\tempDir-001\shard2\configsets\cloud-minimal
   C:\Users\jenkins\workspace\Lucene-Solr-master-Windows\solr\build\solr-core\test\J0\temp\solr.update.PeerSyncWithIndexFingerprintCachingTest_2406AC01CBCFA736-001\tempDir-001\shard2\configsets: java.nio.file.DirectoryNotEmptyException: C:\Users\jenkins\workspace\Lucene-Solr-master-Windows\solr\build\solr-core\test\J0\temp\solr.update.PeerSyncWithIndexFingerprintCachingTest_2406AC01CBCFA736-001\tempDir-001\shard2\configsets
   C:\Users\jenkins\workspace\Lucene-Solr-master-Windows\solr\build\solr-core\test\J0\temp\solr.update.PeerSyncWithIndexFingerprintCachingTest_2406AC01CBCFA736-001\tempDir-001\shard2: java.nio.file.DirectoryNotEmptyException: C:\Users\jenkins\workspace\Lucene-Solr-master-Windows\solr\build\solr-core\test\J0\temp\solr.update.PeerSyncWithIndexFingerprintCachingTest_2406AC01CBCFA736-001\tempDir-001\shard2
   C:\Users\jenkins\workspace\Lucene-Solr-master-Windows\solr\build\solr-core\test\J0\temp\solr.update.PeerSyncWithIndexFingerprintCachingTest_2406AC01CBCFA736-001\tempDir-001: java.nio.file.DirectoryNotEmptyException: C:\Users\jenkins\workspace\Lucene-Solr-master-Windows\solr\build\solr-core\test\J0\temp\solr.update.PeerSyncWithIndexFingerprintCachingTest_2406AC01CBCFA736-001\tempDir-001

	at __randomizedtesting.SeedInfo.seed([2406AC01CBCFA736]:0)
	at org.apache.lucene.util.IOUtils.rm(IOUtils.java:329)
	at org.apache.lucene.util.TestRuleTemporaryFilesCleanup.afterAlways(TestRuleTemporaryFilesCleanup.java:216)
	at com.carrotsearch.randomizedtesting.rules.TestRuleAdapter$1.afterAlways(TestRuleAdapter.java:31)
	at com.carrotsearch.randomizedtesting.rules.StatementAdapter.evaluate(StatementAdapter.java:43)
	at com.carrotsearch.randomizedtesting.rules.StatementAdapter.evaluate(StatementAdapter.java:36)
	at org.apache.lucene.util.TestRuleAssertionsRequired$1.evaluate(TestRuleAssertionsRequired.java:53)
	at org.apache.lucene.util.TestRuleMarkFailure$1.evaluate(TestRuleMarkFailure.java:47)
	at org.apache.lucene.util.TestRuleIgnoreAfterMaxFailures$1.evaluate(TestRuleIgnoreAfterMaxFailures.java:64)
	at org.apache.lucene.util.TestRuleIgnoreTestSuites$1.evaluate(TestRuleIgnoreTestSuites.java:54)
	at com.carrotsearch.randomizedtesting.rules.StatementAdapter.evaluate(StatementAdapter.java:36)
	at com.carrotsearch.randomizedtesting.ThreadLeakControl$StatementRunner.run(ThreadLeakControl.java:368)
	at java.lang.Thread.run(Thread.java:748)


FAILED:  junit.framework.TestSuite.org.apache.solr.update.processor.TestOpenNLPExtractNamedEntitiesUpdateProcessorFactory

Error Message:
Could not remove the following files (in the order of attempts):    C:\Users\jenkins\workspace\Lucene-Solr-master-Windows\solr\build\contrib\solr-analysis-extras\test\J1\temp\solr.update.processor.TestOpenNLPExtractNamedEntitiesUpdateProcessorFactory_ED6F77C57C1D125F-001\tempDir-001\collection1\conf: java.nio.file.DirectoryNotEmptyException: C:\Users\jenkins\workspace\Lucene-Solr-master-Windows\solr\build\contrib\solr-analysis-extras\test\J1\temp\solr.update.processor.TestOpenNLPExtractNamedEntitiesUpdateProcessorFactory_ED6F77C57C1D125F-001\tempDir-001\collection1\conf    C:\Users\jenkins\workspace\Lucene-Solr-master-Windows\solr\build\contrib\solr-analysis-extras\test\J1\temp\solr.update.processor.TestOpenNLPExtractNamedEntitiesUpdateProcessorFactory_ED6F77C57C1D125F-001\tempDir-001\collection1: java.nio.file.DirectoryNotEmptyException: C:\Users\jenkins\workspace\Lucene-Solr-master-Windows\solr\build\contrib\solr-analysis-extras\test\J1\temp\solr.update.processor.TestOpenNLPExtractNamedEntitiesUpdateProcessorFactory_ED6F77C57C1D125F-001\tempDir-001\collection1    C:\Users\jenkins\workspace\Lucene-Solr-master-Windows\solr\build\contrib\solr-analysis-extras\test\J1\temp\solr.update.processor.TestOpenNLPExtractNamedEntitiesUpdateProcessorFactory_ED6F77C57C1D125F-001\tempDir-001: java.nio.file.DirectoryNotEmptyException: C:\Users\jenkins\workspace\Lucene-Solr-master-Windows\solr\build\contrib\solr-analysis-extras\test\J1\temp\solr.update.processor.TestOpenNLPExtractNamedEntitiesUpdateProcessorFactory_ED6F77C57C1D125F-001\tempDir-001    C:\Users\jenkins\workspace\Lucene-Solr-master-Windows\solr\build\contrib\solr-analysis-extras\test\J1\temp\solr.update.processor.TestOpenNLPExtractNamedEntitiesUpdateProcessorFactory_ED6F77C57C1D125F-001\tempDir-001\collection1\conf\en-test-tokenizer.bin: java.nio.file.AccessDeniedException: C:\Users\jenkins\workspace\Lucene-Solr-master-Windows\solr\build\contrib\solr-analysis-extras\test\J1\temp\solr.update.processor.TestOpenNLPExtractNamedEntitiesUpdateProcessorFactory_ED6F77C57C1D125F-001\tempDir-001\collection1\conf\en-test-tokenizer.bin    C:\Users\jenkins\workspace\Lucene-Solr-master-Windows\solr\build\contrib\solr-analysis-extras\test\J1\temp\solr.update.processor.TestOpenNLPExtractNamedEntitiesUpdateProcessorFactory_ED6F77C57C1D125F-001\tempDir-001\collection1\conf\en-test-sent.bin: java.nio.file.AccessDeniedException: C:\Users\jenkins\workspace\Lucene-Solr-master-Windows\solr\build\contrib\solr-analysis-extras\test\J1\temp\solr.update.processor.TestOpenNLPExtractNamedEntitiesUpdateProcessorFactory_ED6F77C57C1D125F-001\tempDir-001\collection1\conf\en-test-sent.bin    C:\Users\jenkins\workspace\Lucene-Solr-master-Windows\solr\build\contrib\solr-analysis-extras\test\J1\temp\solr.update.processor.TestOpenNLPExtractNamedEntitiesUpdateProcessorFactory_ED6F77C57C1D125F-001\tempDir-001\collection1\conf\en-test-ner-person.bin: java.nio.file.AccessDeniedException: C:\Users\jenkins\workspace\Lucene-Solr-master-Windows\solr\build\contrib\solr-analysis-extras\test\J1\temp\solr.update.processor.TestOpenNLPExtractNamedEntitiesUpdateProcessorFactory_ED6F77C57C1D125F-001\tempDir-001\collection1\conf\en-test-ner-person.bin    C:\Users\jenkins\workspace\Lucene-Solr-master-Windows\solr\build\contrib\solr-analysis-extras\test\J1\temp\solr.update.processor.TestOpenNLPExtractNamedEntitiesUpdateProcessorFactory_ED6F77C57C1D125F-001: java.nio.file.DirectoryNotEmptyException: C:\Users\jenkins\workspace\Lucene-Solr-master-Windows\solr\build\contrib\solr-analysis-extras\test\J1\temp\solr.update.processor.TestOpenNLPExtractNamedEntitiesUpdateProcessorFactory_ED6F77C57C1D125F-001 

Stack Trace:
java.io.IOException: Could not remove the following files (in the order of attempts):
   C:\Users\jenkins\workspace\Lucene-Solr-master-Windows\solr\build\contrib\solr-analysis-extras\test\J1\temp\solr.update.processor.TestOpenNLPExtractNamedEntitiesUpdateProcessorFactory_ED6F77C57C1D125F-001\tempDir-001\collection1\conf: java.nio.file.DirectoryNotEmptyException: C:\Users\jenkins\workspace\Lucene-Solr-master-Windows\solr\build\contrib\solr-analysis-extras\test\J1\temp\solr.update.processor.TestOpenNLPExtractNamedEntitiesUpdateProcessorFactory_ED6F77C57C1D125F-001\tempDir-001\collection1\conf
   C:\Users\jenkins\workspace\Lucene-Solr-master-Windows\solr\build\contrib\solr-analysis-extras\test\J1\temp\solr.update.processor.TestOpenNLPExtractNamedEntitiesUpdateProcessorFactory_ED6F77C57C1D125F-001\tempDir-001\collection1: java.nio.file.DirectoryNotEmptyException: C:\Users\jenkins\workspace\Lucene-Solr-master-Windows\solr\build\contrib\solr-analysis-extras\test\J1\temp\solr.update.processor.TestOpenNLPExtractNamedEntitiesUpdateProcessorFactory_ED6F77C57C1D125F-001\tempDir-001\collection1
   C:\Users\jenkins\workspace\Lucene-Solr-master-Windows\solr\build\contrib\solr-analysis-extras\test\J1\temp\solr.update.processor.TestOpenNLPExtractNamedEntitiesUpdateProcessorFactory_ED6F77C57C1D125F-001\tempDir-001: java.nio.file.DirectoryNotEmptyException: C:\Users\jenkins\workspace\Lucene-Solr-master-Windows\solr\build\contrib\solr-analysis-extras\test\J1\temp\solr.update.processor.TestOpenNLPExtractNamedEntitiesUpdateProcessorFactory_ED6F77C57C1D125F-001\tempDir-001
   C:\Users\jenkins\workspace\Lucene-Solr-master-Windows\solr\build\contrib\solr-analysis-extras\test\J1\temp\solr.update.processor.TestOpenNLPExtractNamedEntitiesUpdateProcessorFactory_ED6F77C57C1D125F-001\tempDir-001\collection1\conf\en-test-tokenizer.bin: java.nio.file.AccessDeniedException: C:\Users\jenkins\workspace\Lucene-Solr-master-Windows\solr\build\contrib\solr-analysis-extras\test\J1\temp\solr.update.processor.TestOpenNLPExtractNamedEntitiesUpdateProcessorFactory_ED6F77C57C1D125F-001\tempDir-001\collection1\conf\en-test-tokenizer.bin
   C:\Users\jenkins\workspace\Lucene-Solr-master-Windows\solr\build\contrib\solr-analysis-extras\test\J1\temp\solr.update.processor.TestOpenNLPExtractNamedEntitiesUpdateProcessorFactory_ED6F77C57C1D125F-001\tempDir-001\collection1\conf\en-test-sent.bin: java.nio.file.AccessDeniedException: C:\Users\jenkins\workspace\Lucene-Solr-master-Windows\solr\build\contrib\solr-analysis-extras\test\J1\temp\solr.update.processor.TestOpenNLPExtractNamedEntitiesUpdateProcessorFactory_ED6F77C57C1D125F-001\tempDir-001\collection1\conf\en-test-sent.bin
   C:\Users\jenkins\workspace\Lucene-Solr-master-Windows\solr\build\contrib\solr-analysis-extras\test\J1\temp\solr.update.processor.TestOpenNLPExtractNamedEntitiesUpdateProcessorFactory_ED6F77C57C1D125F-001\tempDir-001\collection1\conf\en-test-ner-person.bin: java.nio.file.AccessDeniedException: C:\Users\jenkins\workspace\Lucene-Solr-master-Windows\solr\build\contrib\solr-analysis-extras\test\J1\temp\solr.update.processor.TestOpenNLPExtractNamedEntitiesUpdateProcessorFactory_ED6F77C57C1D125F-001\tempDir-001\collection1\conf\en-test-ner-person.bin
   C:\Users\jenkins\workspace\Lucene-Solr-master-Windows\solr\build\contrib\solr-analysis-extras\test\J1\temp\solr.update.processor.TestOpenNLPExtractNamedEntitiesUpdateProcessorFactory_ED6F77C57C1D125F-001: java.nio.file.DirectoryNotEmptyException: C:\Users\jenkins\workspace\Lucene-Solr-master-Windows\solr\build\contrib\solr-analysis-extras\test\J1\temp\solr.update.processor.TestOpenNLPExtractNamedEntitiesUpdateProcessorFactory_ED6F77C57C1D125F-001

	at __randomizedtesting.SeedInfo.seed([ED6F77C57C1D125F]:0)
	at org.apache.lucene.util.IOUtils.rm(IOUtils.java:329)
	at org.apache.lucene.util.TestRuleTemporaryFilesCleanup.afterAlways(TestRuleTemporaryFilesCleanup.java:216)
	at com.carrotsearch.randomizedtesting.rules.TestRuleAdapter$1.afterAlways(TestRuleAdapter.java:31)
	at com.carrotsearch.randomizedtesting.rules.StatementAdapter.evaluate(StatementAdapter.java:43)
	at com.carrotsearch.randomizedtesting.rules.StatementAdapter.evaluate(StatementAdapter.java:36)
	at org.apache.lucene.util.TestRuleAssertionsRequired$1.evaluate(TestRuleAssertionsRequired.java:53)
	at org.apache.lucene.util.TestRuleMarkFailure$1.evaluate(TestRuleMarkFailure.java:47)
	at org.apache.lucene.util.TestRuleIgnoreAfterMaxFailures$1.evaluate(TestRuleIgnoreAfterMaxFailures.java:64)
	at org.apache.lucene.util.TestRuleIgnoreTestSuites$1.evaluate(TestRuleIgnoreTestSuites.java:54)
	at com.carrotsearch.randomizedtesting.rules.StatementAdapter.evaluate(StatementAdapter.java:36)
	at com.carrotsearch.randomizedtesting.ThreadLeakControl$StatementRunner.run(ThreadLeakControl.java:368)
	at java.lang.Thread.run(Thread.java:748)




Build Log:
[...truncated 2370 lines...]
   [junit4] Suite: org.apache.lucene.analysis.snowball.TestSnowballVocab
   [junit4]   2> NOTE: test params are: codec=Asserting(Lucene70): {}, docValues:{}, maxPointsInLeafNode=1888, maxMBSortInHeap=6.8919538715562805, sim=Asserting(org.apache.lucene.search.similarities.AssertingSimilarity@575c1584), locale=sr-Latn-ME, timezone=America/Creston
   [junit4]   2> NOTE: Windows 10 10.0 amd64/Oracle Corporation 1.8.0_144 (64-bit)/cpus=3,threads=1,free=70308256,total=97320960
   [junit4]   2> NOTE: All tests run in this JVM: [TestSimplePatternSplitTokenizer, TestTruncateTokenFilter, TestBrazilianStemFilterFactory, TestSnowballVocab]
   [junit4]   2> NOTE: reproduce with: ant test  -Dtestcase=TestSnowballVocab -Dtests.seed=65EFBF6AA4A4059F -Dtests.slow=true -Dtests.locale=sr-Latn-ME -Dtests.timezone=America/Creston -Dtests.asserts=true -Dtests.file.encoding=Cp1252
   [junit4] ERROR   0.00s J0 | TestSnowballVocab (suite) <<<
   [junit4]    > Throwable #1: java.io.IOException: Could not remove the following files (in the order of attempts):
   [junit4]    >    C:\Users\jenkins\workspace\Lucene-Solr-master-Windows\lucene\build\analysis\common\test\J0\temp\lucene.analysis.snowball.TestSnowballVocab_65EFBF6AA4A4059F-001\tempDir-017: java.nio.file.DirectoryNotEmptyException: C:\Users\jenkins\workspace\Lucene-Solr-master-Windows\lucene\build\analysis\common\test\J0\temp\lucene.analysis.snowball.TestSnowballVocab_65EFBF6AA4A4059F-001\tempDir-017
   [junit4]    > 	at __randomizedtesting.SeedInfo.seed([65EFBF6AA4A4059F]:0)
   [junit4]    > 	at org.apache.lucene.util.IOUtils.rm(IOUtils.java:329)
   [junit4]    > 	at java.lang.Thread.run(Thread.java:748)
   [junit4] Completed [21/285 (1!)] on J0 in 27.04s, 1 test, 1 error <<< FAILURES!

[...truncated 5754 lines...]
   [junit4] Suite: org.apache.lucene.store.TestRAFDirectory
   [junit4]   2> NOTE: test params are: codec=FastCompressingStoredFields(storedFieldsFormat=CompressingStoredFieldsFormat(compressionMode=FAST, chunkSize=20245, maxDocsPerChunk=4, blockSize=801), termVectorsFormat=CompressingTermVectorsFormat(compressionMode=FAST, chunkSize=20245, blockSize=801)), sim=Asserting(org.apache.lucene.search.similarities.AssertingSimilarity@14a45a6e), locale=be-BY, timezone=Europe/Riga
   [junit4]   2> NOTE: Windows 10 10.0 amd64/Oracle Corporation 1.8.0_144 (64-bit)/cpus=3,threads=1,free=74624064,total=97320960
   [junit4]   2> NOTE: All tests run in this JVM: [TestInetAddressRangeQueries, TestHighFreqTerms, TestRAFDirectory]
   [junit4]   2> NOTE: reproduce with: ant test  -Dtestcase=TestRAFDirectory -Dtests.seed=252CB0D0D0AE7A03 -Dtests.slow=true -Dtests.locale=be-BY -Dtests.timezone=Europe/Riga -Dtests.asserts=true -Dtests.file.encoding=ISO-8859-1
   [junit4] ERROR   0.00s J0 | TestRAFDirectory (suite) <<<
   [junit4]    > Throwable #1: java.io.IOException: Could not remove the following files (in the order of attempts):
   [junit4]    >    C:\Users\jenkins\workspace\Lucene-Solr-master-Windows\lucene\build\misc\test\J0\temp\lucene.store.TestRAFDirectory_252CB0D0D0AE7A03-001\testThreadSafety-001: java.nio.file.AccessDeniedException: C:\Users\jenkins\workspace\Lucene-Solr-master-Windows\lucene\build\misc\test\J0\temp\lucene.store.TestRAFDirectory_252CB0D0D0AE7A03-001\testThreadSafety-001
   [junit4]    >    C:\Users\jenkins\workspace\Lucene-Solr-master-Windows\lucene\build\misc\test\J0\temp\lucene.store.TestRAFDirectory_252CB0D0D0AE7A03-001: java.nio.file.DirectoryNotEmptyException: C:\Users\jenkins\workspace\Lucene-Solr-master-Windows\lucene\build\misc\test\J0\temp\lucene.store.TestRAFDirectory_252CB0D0D0AE7A03-001
   [junit4]    > 	at __randomizedtesting.SeedInfo.seed([252CB0D0D0AE7A03]:0)
   [junit4]    > 	at org.apache.lucene.util.IOUtils.rm(IOUtils.java:329)
   [junit4]    > 	at java.lang.Thread.run(Thread.java:748)
   [junit4] Completed [8/13 (1!)] on J0 in 1.90s, 42 tests, 1 error <<< FAILURES!

[...truncated 5253 lines...]
   [junit4] Suite: org.apache.solr.cloud.DocValuesNotIndexedTest
   [junit4]   2> 2111217 INFO  (SUITE-DocValuesNotIndexedTest-seed#[2406AC01CBCFA736]-worker) [    ] o.a.s.SolrTestCaseJ4 SecureRandom sanity checks: test.solr.allowed.securerandom=null & java.security.egd=file:/dev/./urandom
   [junit4]   2> Creating dataDir: C:\Users\jenkins\workspace\Lucene-Solr-master-Windows\solr\build\solr-core\test\J0\temp\solr.cloud.DocValuesNotIndexedTest_2406AC01CBCFA736-001\init-core-data-001
   [junit4]   2> 2111219 WARN  (SUITE-DocValuesNotIndexedTest-seed#[2406AC01CBCFA736]-worker) [    ] o.a.s.SolrTestCaseJ4 startTrackingSearchers: numOpens=7 numCloses=7
   [junit4]   2> 2111219 INFO  (SUITE-DocValuesNotIndexedTest-seed#[2406AC01CBCFA736]-worker) [    ] o.a.s.SolrTestCaseJ4 Using PointFields (NUMERIC_POINTS_SYSPROP=true) w/NUMERIC_DOCVALUES_SYSPROP=true
   [junit4]   2> 2111223 INFO  (SUITE-DocValuesNotIndexedTest-seed#[2406AC01CBCFA736]-worker) [    ] o.a.s.SolrTestCaseJ4 Randomized ssl (false) and clientAuth (false) via: @org.apache.solr.util.RandomizeSSL(reason=, value=NaN, ssl=NaN, clientAuth=NaN)
   [junit4]   2> 2111225 INFO  (SUITE-DocValuesNotIndexedTest-seed#[2406AC01CBCFA736]-worker) [    ] o.a.s.c.MiniSolrCloudCluster Starting cluster of 2 servers in C:\Users\jenkins\workspace\Lucene-Solr-master-Windows\solr\build\solr-core\test\J0\temp\solr.cloud.DocValuesNotIndexedTest_2406AC01CBCFA736-001\tempDir-001
   [junit4]   2> 2111225 INFO  (SUITE-DocValuesNotIndexedTest-seed#[2406AC01CBCFA736]-worker) [    ] o.a.s.c.ZkTestServer STARTING ZK TEST SERVER
   [junit4]   2> 2111225 INFO  (Thread-4417) [    ] o.a.s.c.ZkTestServer client port:0.0.0.0/0.0.0.0:0
   [junit4]   2> 2111225 INFO  (Thread-4417) [    ] o.a.s.c.ZkTestServer Starting server
   [junit4]   2> 2111227 ERROR (Thread-4417) [    ] o.a.z.s.ZooKeeperServer ZKShutdownHandler is not registered, so ZooKeeper server won't take any action on ERROR or SHUTDOWN server state changes
   [junit4]   2> 2111325 INFO  (SUITE-DocValuesNotIndexedTest-seed#[2406AC01CBCFA736]-worker) [    ] o.a.s.c.ZkTestServer start zk server on port:62621
   [junit4]   2> 2111332 INFO  (zkConnectionManagerCallback-5849-thread-1) [    ] o.a.s.c.c.ConnectionManager zkClient has connected
   [junit4]   2> 2111341 INFO  (jetty-launcher-5846-thread-1) [    ] o.e.j.s.Server jetty-9.3.20.v20170531
   [junit4]   2> 2111341 INFO  (jetty-launcher-5846-thread-2) [    ] o.e.j.s.Server jetty-9.3.20.v20170531
   [junit4]   2> 2111343 INFO  (jetty-launcher-5846-thread-1) [    ] o.e.j.s.h.ContextHandler Started o.e.j.s.ServletContextHandler@545ee855{/solr,null,AVAILABLE}
   [junit4]   2> 2111343 INFO  (jetty-launcher-5846-thread-2) [    ] o.e.j.s.h.ContextHandler Started o.e.j.s.ServletContextHandler@70f21314{/solr,null,AVAILABLE}
   [junit4]   2> 2111345 INFO  (jetty-launcher-5846-thread-2) [    ] o.e.j.s.AbstractConnector Started ServerConnector@f0ca875{HTTP/1.1,[http/1.1]}{127.0.0.1:62625}
   [junit4]   2> 2111345 INFO  (jetty-launcher-5846-thread-1) [    ] o.e.j.s.AbstractConnector Started ServerConnector@515b9166{HTTP/1.1,[http/1.1]}{127.0.0.1:62626}
   [junit4]   2> 2111347 INFO  (jetty-launcher-5846-thread-2) [    ] o.e.j.s.Server Started @2120878ms
   [junit4]   2> 2111347 INFO  (jetty-launcher-5846-thread-1) [    ] o.e.j.s.Server Started @2120878ms
   [junit4]   2> 2111347 INFO  (jetty-launcher-5846-thread-2) [    ] o.a.s.c.s.e.JettySolrRunner Jetty properties: {hostContext=/solr, hostPort=62625}
   [junit4]   2> 2111347 INFO  (jetty-launcher-5846-thread-1) [    ] o.a.s.c.s.e.JettySolrRunner Jetty properties: {hostContext=/solr, hostPort=62626}
   [junit4]   2> 2111347 ERROR (jetty-launcher-5846-thread-2) [    ] o.a.s.u.StartupLoggingUtils Missing Java Option solr.log.dir. Logging may be missing or incomplete.
   [junit4]   2> 2111347 ERROR (jetty-launcher-5846-thread-1) [    ] o.a.s.u.StartupLoggingUtils Missing Java Option solr.log.dir. Logging may be missing or incomplete.
   [junit4]   2> 2111348 INFO  (jetty-launcher-5846-thread-2) [    ] o.a.s.s.SolrDispatchFilter  ___      _       Welcome to Apache Solr™ version 8.0.0
   [junit4]   2> 2111348 INFO  (jetty-launcher-5846-thread-1) [    ] o.a.s.s.SolrDispatchFilter  ___      _       Welcome to Apache Solr™ version 8.0.0
   [junit4]   2> 2111348 INFO  (jetty-launcher-5846-thread-2) [    ] o.a.s.s.SolrDispatchFilter / __| ___| |_ _   Starting in cloud mode on port null
   [junit4]   2> 2111348 INFO  (jetty-launcher-5846-thread-1) [    ] o.a.s.s.SolrDispatchFilter / __| ___| |_ _   Starting in cloud mode on port null
   [junit4]   2> 2111348 INFO  (jetty-launcher-5846-thread-2) [    ] o.a.s.s.SolrDispatchFilter \__ \/ _ \ | '_|  Install dir: null
   [junit4]   2> 2111348 INFO  (jetty-launcher-5846-thread-1) [    ] o.a.s.s.SolrDispatchFilter \__ \/ _ \ | '_|  Install dir: null
   [junit4]   2> 2111348 INFO  (jetty-launcher-5846-thread-2) [    ] o.a.s.s.SolrDispatchFilter |___/\___/_|_|    Start time: 2018-01-05T06:04:01.602Z
   [junit4]   2> 2111348 INFO  (jetty-launcher-5846-thread-1) [    ] o.a.s.s.SolrDispatchFilter |___/\___/_|_|    Start time: 2018-01-05T06:04:01.602Z
   [junit4]   2> 2111353 INFO  (zkConnectionManagerCallback-5851-thread-1) [    ] o.a.s.c.c.ConnectionManager zkClient has connected
   [junit4]   2> 2111353 INFO  (zkConnectionManagerCallback-5853-thread-1) [    ] o.a.s.c.c.ConnectionManager zkClient has connected
   [junit4]   2> 2111355 INFO  (jetty-launcher-5846-thread-1) [    ] o.a.s.s.SolrDispatchFilter solr.xml found in ZooKeeper. Loading...
   [junit4]   2> 2111355 INFO  (jetty-launcher-5846-thread-2) [    ] o.a.s.s.SolrDispatchFilter solr.xml found in ZooKeeper. Loading...
   [junit4]   2> 2111376 INFO  (jetty-launcher-5846-thread-1) [    ] o.a.s.c.ZkContainer Zookeeper client=127.0.0.1:62621/solr
   [junit4]   2> 2111376 INFO  (jetty-launcher-5846-thread-2) [    ] o.a.s.c.ZkContainer Zookeeper client=127.0.0.1:62621/solr
   [junit4]   2> 2111378 INFO  (zkConnectionManagerCallback-5861-thread-1) [    ] o.a.s.c.c.ConnectionManager zkClient has connected
   [junit4]   2> 2111378 INFO  (zkConnectionManagerCallback-5859-thread-1) [    ] o.a.s.c.c.ConnectionManager zkClient has connected
   [junit4]   2> 2111379 WARN  (NIOServerCxn.Factory:0.0.0.0/0.0.0.0:0) [    ] o.a.z.s.NIOServerCnxn caught end of stream exception
   [junit4]   2> EndOfStreamException: Unable to read additional data from client sessionid 0x160c4eb46490003, likely client has closed socket
   [junit4]   2> 	at org.apache.zookeeper.server.NIOServerCnxn.doIO(NIOServerCnxn.java:239)
   [junit4]   2> 	at org.apache.zookeeper.server.NIOServerCnxnFactory.run(NIOServerCnxnFactory.java:203)
   [junit4]   2> 	at java.lang.Thread.run(Thread.java:748)
   [junit4]   2> 2111379 WARN  (NIOServerCxn.Factory:0.0.0.0/0.0.0.0:0) [    ] o.a.z.s.NIOServerCnxn caught end of stream exception
   [junit4]   2> EndOfStreamException: Unable to read additional data from client sessionid 0x160c4eb46490004, likely client has closed socket
   [junit4]   2> 	at org.apache.zookeeper.server.NIOServerCnxn.doIO(NIOServerCnxn.java:239)
   [junit4]   2> 	at org.apache.zookeeper.server.NIOServerCnxnFactory.run(NIOServerCnxnFactory.java:203)
   [junit4]   2> 	at java.lang.Thread.run(Thread.java:748)
   [junit4]   2> 2111381 INFO  (zkConnectionManagerCallback-5865-thread-1-processing-n:127.0.0.1:62626_solr) [n:127.0.0.1:62626_solr    ] o.a.s.c.c.ConnectionManager zkClient has connected
   [junit4]   2> 2111381 INFO  (zkConnectionManagerCallback-5863-thread-1-processing-n:127.0.0.1:62625_solr) [n:127.0.0.1:62625_solr    ] o.a.s.c.c.ConnectionManager zkClient has connected
   [junit4]   2> 2111462 INFO  (jetty-launcher-5846-thread-1) [n:127.0.0.1:62626_solr    ] o.a.s.c.Overseer Overseer (id=null) closing
   [junit4]   2> 2111463 INFO  (jetty-launcher-5846-thread-2) [n:127.0.0.1:62625_solr    ] o.a.s.c.Overseer Overseer (id=null) closing
   [junit4]   2> 2111463 INFO  (jetty-launcher-5846-thread-1) [n:127.0.0.1:62626_solr    ] o.a.s.c.OverseerElectionContext I am going to be the leader 127.0.0.1:62626_solr
   [junit4]   2> 2111463 INFO  (jetty-launcher-5846-thread-2) [n:127.0.0.1:62625_solr    ] o.a.s.c.ZkController Register node as live in ZooKeeper:/live_nodes/127.0.0.1:62625_solr
   [junit4]   2> 2111464 INFO  (jetty-launcher-5846-thread-1) [n:127.0.0.1:62626_solr    ] o.a.s.c.Overseer Overseer (id=99295706577698822-127.0.0.1:62626_solr-n_0000000000) starting
   [junit4]   2> 2111465 INFO  (zkCallback-5862-thread-1-processing-n:127.0.0.1:62625_solr) [n:127.0.0.1:62625_solr    ] o.a.s.c.c.ZkStateReader Updated live nodes from ZooKeeper... (0) -> (1)
   [junit4]   2> 2111466 INFO  (zkCallback-5864-thread-1-processing-n:127.0.0.1:62626_solr) [n:127.0.0.1:62626_solr    ] o.a.s.c.c.ZkStateReader Updated live nodes from ZooKeeper... (0) -> (1)
   [junit4]   2> 2111474 INFO  (jetty-launcher-5846-thread-1) [n:127.0.0.1:62626_solr    ] o.a.s.c.ZkController Register node as live in ZooKeeper:/live_nodes/127.0.0.1:62626_solr
   [junit4]   2> 2111477 INFO  (zkCallback-5862-thread-1-processing-n:127.0.0.1:62625_solr) [n:127.0.0.1:62625_solr    ] o.a.s.c.c.ZkStateReader Updated live nodes from ZooKeeper... (1) -> (2)
   [junit4]   2> 2111477 INFO  (OverseerStateUpdate-99295706577698822-127.0.0.1:62626_solr-n_0000000000) [n:127.0.0.1:62626_solr    ] o.a.s.c.c.ZkStateReader Updated live nodes from ZooKeeper... (1) -> (2)
   [junit4]   2> 2111586 INFO  (jetty-launcher-5846-thread-1) [n:127.0.0.1:62626_solr    ] o.a.s.m.r.SolrJmxReporter JMX monitoring for 'solr_62626.solr.node' (registry 'solr.node') enabled at server: com.sun.jmx.mbeanserver.JmxMBeanServer@e51effc
   [junit4]   2> 2111591 INFO  (jetty-launcher-5846-thread-1) [n:127.0.0.1:62626_solr    ] o.a.s.m.r.SolrJmxReporter JMX monitoring for 'solr_62626.solr.jvm' (registry 'solr.jvm') enabled at server: com.sun.jmx.mbeanserver.JmxMBeanServer@e51effc
   [junit4]   2> 2111591 INFO  (jetty-launcher-5846-thread-1) [n:127.0.0.1:62626_solr    ] o.a.s.m.r.SolrJmxReporter JMX monitoring for 'solr_62626.solr.jetty' (registry 'solr.jetty') enabled at server: com.sun.jmx.mbeanserver.JmxMBeanServer@e51effc
   [junit4]   2> 2111593 INFO  (jetty-launcher-5846-thread-1) [n:127.0.0.1:62626_solr    ] o.a.s.c.CorePropertiesLocator Found 0 core definitions underneath C:\Users\jenkins\workspace\Lucene-Solr-master-Windows\solr\build\solr-core\test\J0\temp\solr.cloud.DocValuesNotIndexedTest_2406AC01CBCFA736-001\tempDir-001\node1\.
   [junit4]   2> 2111634 INFO  (jetty-launcher-5846-thread-2) [n:127.0.0.1:62625_solr    ] o.a.s.m.r.SolrJmxReporter JMX monitoring for 'solr_62625.solr.node' (registry 'solr.node') enabled at server: com.sun.jmx.mbeanserver.JmxMBeanServer@e51effc
   [junit4]   2> 2111639 INFO  (jetty-launcher-5846-thread-2) [n:127.0.0.1:62625_solr    ] o.a.s.m.r.SolrJmxReporter JMX monitoring for 'solr_62625.solr.jvm' (registry 'solr.jvm') enabled at server: com.sun.jmx.mbeanserver.JmxMBeanServer@e51effc
   [junit4]   2> 2111639 INFO  (jetty-launcher-5846-thread-2) [n:127.0.0.1:62625_solr    ] o.a.s.m.r.SolrJmxReporter JMX monitoring for 'solr_62625.solr.jetty' (registry 'solr.jetty') enabled at server: com.sun.jmx.mbeanserver.JmxMBeanServer@e51effc
   [junit4]   2> 2111640 INFO  (jetty-launcher-5846-thread-2) [n:127.0.0.1:62625_solr    ] o.a.s.c.CorePropertiesLocator Found 0 core definitions underneath C:\Users\jenkins\workspace\Lucene-Solr-master-Windows\solr\build\solr-core\test\J0\temp\solr.cloud.DocValuesNotIndexedTest_2406AC01CBCFA736-001\tempDir-001\node2\.
   [junit4]   2> 2111659 INFO  (zkConnectionManagerCallback-5871-thread-1) [    ] o.a.s.c.c.ConnectionManager zkClient has connected
   [junit4]   2> 2111663 INFO  (zkConnectionManagerCallback-5875-thread-1) [    ] o.a.s.c.c.ConnectionManager zkClient has connected
   [junit4]   2> 2111665 INFO  (SUITE-DocValuesNotIndexedTest-seed#[2406AC01CBCFA736]-worker) [    ] o.a.s.c.c.ZkStateReader Updated live nodes from ZooKeeper... (0) -> (2)
   [junit4]   2> 2111666 INFO  (SUITE-DocValuesNotIndexedTest-seed#[2406AC01CBCFA736]-worker) [    ] o.a.s.c.s.i.ZkClientClusterStateProvider Cluster at 127.0.0.1:62621/solr ready
   [junit4]   2> 2111671 INFO  (qtp1545161076-22874) [n:127.0.0.1:62626_solr    ] o.a.s.h.a.CollectionsHandler Invoked Collection Action :create with params replicationFactor=1&collection.configName=conf1&maxShardsPerNode=2&name=dv_coll&nrtReplicas=1&action=CREATE&numShards=4&wt=javabin&version=2 and sendToOCPQueue=true
   [junit4]   2> 2111673 INFO  (OverseerThreadFactory-8178-thread-1-processing-n:127.0.0.1:62626_solr) [n:127.0.0.1:62626_solr    ] o.a.s.c.CreateCollectionCmd Create collection dv_coll
   [junit4]   2> 2111784 INFO  (OverseerStateUpdate-99295706577698822-127.0.0.1:62626_solr-n_0000000000) [n:127.0.0.1:62626_solr    ] o.a.s.c.o.SliceMutator createReplica() {
   [junit4]   2>   "operation":"ADDREPLICA",
   [junit4]   2>   "collection":"dv_coll",
   [junit4]   2>   "shard":"shard1",
   [junit4]   2>   "core":"dv_coll_shard1_replica_n1",
   [junit4]   2>   "state":"down",
   [junit4]   2>   "base_url":"http://127.0.0.1:62625/solr",
   [junit4]   2>   "type":"NRT",
   [junit4]   2>   "waitForFinalState":"false"} 
   [junit4]   2> 2111789 INFO  (OverseerStateUpdate-99295706577698822-127.0.0.1:62626_solr-n_0000000000) [n:127.0.0.1:62626_solr    ] o.a.s.c.o.SliceMutator createReplica() {
   [junit4]   2>   "operation":"ADDREPLICA",
   [junit4]   2>   "collection":"dv_coll",
   [junit4]   2>   "shard":"shard2",
   [junit4]   2>   "core":"dv_coll_shard2_replica_n2",
   [junit4]   2>   "state":"down",
   [junit4]   2>   "base_url":"http://127.0.0.1:62626/solr",
   [junit4]   2>   "type":"NRT",
   [junit4]   2>   "waitForFinalState":"false"} 
   [junit4]   2> 2111793 INFO  (OverseerStateUpdate-99295706577698822-127.0.0.1:62626_solr-n_0000000000) [n:127.0.0.1:62626_solr    ] o.a.s.c.o.SliceMutator createReplica() {
   [junit4]   2>   "operation":"ADDREPLICA",
   [junit4]   2>   "collection":"dv_coll",
   [junit4]   2>   "shard":"shard3",
   [junit4]   2>   "core":"dv_coll_shard3_replica_n4",
   [junit4]   2>   "state":"down",
   [junit4]   2>   "base_url":"http://127.0.0.1:62625/solr",
   [junit4]   2>   "type":"NRT",
   [junit4]   2>   "waitForFinalState":"false"} 
   [junit4]   2> 2111798 INFO  (OverseerStateUpdate-99295706577698822-127.0.0.1:62626_solr-n_0000000000) [n:127.0.0.1:62626_solr    ] o.a.s.c.o.SliceMutator createReplica() {
   [junit4]   2>   "operation":"ADDREPLICA",
   [junit4]   2>   "collection":"dv_coll",
   [junit4]   2>   "shard":"shard4",
   [junit4]   2>   "core":"dv_coll_shard4_replica_n6",
   [junit4]   2>   "state":"down",
   [junit4]   2>   "base_url":"http://127.0.0.1:62626/solr",
   [junit4]   2>   "type":"NRT",
   [junit4]   2>   "waitForFinalState":"false"} 
   [junit4]   2> 2112006 INFO  (qtp1545161076-22879) [n:127.0.0.1:62626_solr    ] o.a.s.h.a.CoreAdminOperation core create command qt=/admin/cores&coreNodeName=core_node5&collection.configName=conf1&newCollection=true&name=dv_coll_shard2_replica_n2&action=CREATE&numShards=4&collection=dv_coll&shard=shard2&wt=javabin&version=2&replicaType=NRT
   [junit4]   2> 2112007 INFO  (qtp1545161076-22879) [n:127.0.0.1:62626_solr    ] o.a.s.c.TransientSolrCoreCacheDefault Allocating transient cache for 2147483647 transient cores
   [junit4]   2> 2112008 INFO  (qtp662646076-22873) [n:127.0.0.1:62625_solr    ] o.a.s.h.a.CoreAdminOperation core create command qt=/admin/cores&coreNodeName=core_node7&collection.configName=conf1&newCollection=true&name=dv_coll_shard3_replica_n4&action=CREATE&numShards=4&collection=dv_coll&shard=shard3&wt=javabin&version=2&replicaType=NRT
   [junit4]   2> 2112008 INFO  (qtp662646076-22875) [n:127.0.0.1:62625_solr    ] o.a.s.h.a.CoreAdminOperation core create command qt=/admin/cores&coreNodeName=core_node3&collection.configName=conf1&newCollection=true&name=dv_coll_shard1_replica_n1&action=CREATE&numShards=4&collection=dv_coll&shard=shard1&wt=javabin&version=2&replicaType=NRT
   [junit4]   2> 2112009 INFO  (qtp662646076-22873) [n:127.0.0.1:62625_solr    ] o.a.s.c.TransientSolrCoreCacheDefault Allocating transient cache for 2147483647 transient cores
   [junit4]   2> 2112014 INFO  (qtp1545161076-22878) [n:127.0.0.1:62626_solr    ] o.a.s.h.a.CoreAdminOperation core create command qt=/admin/cores&coreNodeName=core_node8&collection.configName=conf1&newCollection=true&name=dv_coll_shard4_replica_n6&action=CREATE&numShards=4&collection=dv_coll&shard=shard4&wt=javabin&version=2&replicaType=NRT
   [junit4]   2> 2112135 INFO  (zkCallback-5864-thread-1-processing-n:127.0.0.1:62626_solr) [n:127.0.0.1:62626_solr    ] o.a.s.c.c.ZkStateReader A cluster state change: [WatchedEvent state:SyncConnected type:NodeDataChanged path:/collections/dv_coll/state.json] for collection [dv_coll] has occurred - updating... (live nodes size: [2])
   [junit4]   2> 2112135 INFO  (zkCallback-5862-thread-1-processing-n:127.0.0.1:62625_solr) [n:127.0.0.1:62625_solr    ] o.a.s.c.c.ZkStateReader A cluster state change: [WatchedEvent state:SyncConnected type:NodeDataChanged path:/collections/dv_coll/state.json] for collection [dv_coll] has occurred - updating... (live nodes size: [2])
   [junit4]   2> 2112137 INFO  (zkCallback-5864-thread-2-processing-n:127.0.0.1:62626_solr) [n:127.0.0.1:62626_solr    ] o.a.s.c.c.ZkStateReader A cluster state change: [WatchedEvent state:SyncConnected type:NodeDataChanged path:/collections/dv_coll/state.json] for collection [dv_coll] has occurred - updating... (live nodes size: [2])
   [junit4]   2> 2112137 INFO  (zkCallback-5864-thread-3-processing-n:127.0.0.1:62626_solr) [n:127.0.0.1:62626_solr    ] o.a.s.c.c.ZkStateReader A cluster state change: [WatchedEvent state:SyncConnected type:NodeDataChanged path:/collections/dv_coll/state.json] for collection [dv_coll] has occurred - updating... (live nodes size: [2])
   [junit4]   2> 2112137 INFO  (zkCallback-5862-thread-2-processing-n:127.0.0.1:62625_solr) [n:127.0.0.1:62625_solr    ] o.a.s.c.c.ZkStateReader A cluster state change: [WatchedEvent state:SyncConnected type:NodeDataChanged path:/collections/dv_coll/state.json] for collection [dv_coll] has occurred - updating... (live nodes size: [2])
   [junit4]   2> 2113070 INFO  (qtp1545161076-22878) [n:127.0.0.1:62626_solr c:dv_coll s:shard4 r:core_node8 x:dv_coll_shard4_replica_n6] o.a.s.c.SolrConfig Using Lucene MatchVersion: 8.0.0
   [junit4]   2> 2113070 INFO  (qtp662646076-22875) [n:127.0.0.1:62625_solr c:dv_coll s:shard1 r:core_node3 x:dv_coll_shard1_replica_n1] o.a.s.c.SolrConfig Using Lucene MatchVersion: 8.0.0
   [junit4]   2> 2113070 INFO  (qtp1545161076-22879) [n:127.0.0.1:62626_solr c:dv_coll s:shard2 r:core_node5 x:dv_coll_shard2_replica_n2] o.a.s.c.SolrConfig Using Lucene MatchVersion: 8.0.0
   [junit4]   2> 2113077 INFO  (qtp662646076-22873) [n:127.0.0.1:62625_solr c:dv_coll s:shard3 r:core_node7 x:dv_coll_shard3_replica_n4] o.a.s.c.SolrConfig Using Lucene MatchVersion: 8.0.0
   [junit4]   2> 2113079 INFO  (qtp662646076-22875) [n:127.0.0.1:62625_solr c:dv_coll s:shard1 r:core_node3 x:dv_coll_shard1_replica_n1] o.a.s.s.IndexSchema [dv_coll_shard1_replica_n1] Schema name=minimal
   [junit4]   2> 2113079 INFO  (qtp1545161076-22878) [n:127.0.0.1:62626_solr c:dv_coll s:shard4 r:core_node8 x:dv_coll_shard4_replica_n6] o.a.s.s.IndexSchema [dv_coll_shard4_replica_n6] Schema name=minimal
   [junit4]   2> 2113082 INFO  (qtp1545161076-22879) [n:127.0.0.1:62626_solr c:dv_coll s:shard2 r:core_node5 x:dv_coll_shard2_replica_n2] o.a.s.s.IndexSchema [dv_coll_shard2_replica_n2] Schema name=minimal
   [junit4]   2> 2113099 INFO  (qtp1545161076-22878) [n:127.0.0.1:62626_solr c:dv_coll s:shard4 r:core_node8 x:dv_coll_shard4_replica_n6] o.a.s.s.IndexSchema Loaded schema minimal/1.1 with uniqueid field id
   [junit4]   2> 2113099 INFO  (qtp1545161076-22878) [n:127.0.0.1:62626_solr c:dv_coll s:shard4 r:core_node8 x:dv_coll_shard4_replica_n6] o.a.s.c.CoreContainer Creating SolrCore 'dv_coll_shard4_replica_n6' using configuration from collection dv_coll, trusted=true
   [junit4]   2> 2113099 INFO  (qtp1545161076-22878) [n:127.0.0.1:62626_solr c:dv_coll s:shard4 r:core_node8 x:dv_coll_shard4_replica_n6] o.a.s.m.r.SolrJmxReporter JMX monitoring for 'solr_62626.solr.core.dv_coll.shard4.replica_n6' (registry 'solr.core.dv_coll.shard4.replica_n6') enabled at server: com.sun.jmx.mbeanserver.JmxMBeanServer@e51effc
   [junit4]   2> 2113099 INFO  (qtp1545161076-22878) [n:127.0.0.1:62626_solr c:dv_coll s:shard4 r:core_node8 x:dv_coll_shard4_replica_n6] o.a.s.c.SolrCore solr.RecoveryStrategy.Builder
   [junit4]   2> 2113099 INFO  (qtp1545161076-22878) [n:127.0.0.1:62626_solr c:dv_coll s:shard4 r:core_node8 x:dv_coll_shard4_replica_n6] o.a.s.c.SolrCore [[dv_coll_shard4_replica_n6] ] Opening new SolrCore at [C:\Users\jenkins\workspace\Lucene-Solr-master-Windows\solr\build\solr-core\test\J0\temp\solr.cloud.DocValuesNotIndexedTest_2406AC01CBCFA736-001\tempDir-001\node1\dv_coll_shard4_replica_n6], dataDir=[C:\Users\jenkins\workspace\Lucene-Solr-master-Windows\solr\build\solr-core\test\J0\temp\solr.cloud.DocValuesNotIndexedTest_2406AC01CBCFA736-001\tempDir-001\node1\.\dv_coll_shard4_replica_n6\data\]
   [junit4]   2> 2113100 INFO  (qtp662646076-22873) [n:127.0.0.1:62625_solr c:dv_coll s:shard3 r:core_node7 x:dv_coll_shard3_replica_n4] o.a.s.s.IndexSchema [dv_coll_shard3_replica_n4] Schema name=minimal
   [junit4]   2> 2113100 INFO  (qtp662646076-22875) [n:127.0.0.1:62625_solr c:dv_coll s:shard1 r:core_node3 x:dv_coll_shard1_replica_n1] o.a.s.s.IndexSchema Loaded schema minimal/1.1 with uniqueid field id
   [junit4]   2> 2113100 INFO  (qtp662646076-22875) [n:127.0.0.1:62625_solr c:dv_coll s:shard1 r:core_node3 x:dv_coll_shard1_replica_n1] o.a.s.c.CoreContainer Creating SolrCore 'dv_coll_shard1_replica_n1' using configuration from collection dv_coll, trusted=true
   [junit4]   2> 2113100 INFO  (qtp662646076-22875) [n:127.0.0.1:62625_solr c:dv_coll s:shard1 r:core_node3 x:dv_coll_shard1_replica_n1] o.a.s.m.r.SolrJmxReporter JMX monitoring for 'solr_62625.solr.core.dv_coll.shard1.replica_n1' (registry 'solr.core.dv_coll.shard1.replica_n1') enabled at server: com.sun.jmx.mbeanserver.JmxMBeanServer@e51effc
   [junit4]   2> 2113100 INFO  (qtp662646076-22875) [n:127.0.0.1:62625_solr c:dv_coll s:shard1 r:core_node3 x:dv_coll_shard1_replica_n1] o.a.s.c.SolrCore solr.RecoveryStrategy.Builder
   [junit4]   2> 2113100 INFO  (qtp662646076-22875) [n:127.0.0.1:62625_solr c:dv_coll s:shard1 r:core_node3 x:dv_coll_shard1_replica_n1] o.a.s.c.SolrCore [[dv_coll_shard1_replica_n1] ] Opening new SolrCore at [C:\Users\jenkins\workspace\Lucene-Solr-master-Windows\solr\build\solr-core\test\J0\temp\solr.cloud.DocValuesNotIndexedTest_2406AC01CBCFA736-001\tempDir-001\node2\dv_coll_shard1_replica_n1], dataDir=[C:\Users\jenkins\workspace\Lucene-Solr-master-Windows\solr\build\solr-core\test\J0\temp\solr.cloud.DocValuesNotIndexedTest_2406AC01CBCFA736-001\tempDir-001\node2\.\dv_coll_shard1_replica_n1\data\]
   [junit4]   2> 2113099 INFO  (qtp1545161076-22879) [n:127.0.0.1:62626_solr c:dv_coll s:shard2 r:core_node5 x:dv_coll_shard2_replica_n2] o.a.s.s.IndexSchema Loaded schema minimal/1.1 with uniqueid field id
   [junit4]   2> 2113100 INFO  (qtp1545161076-22879) [n:127.0.0.1:62626_solr c:dv_coll s:shard2 r:core_node5 x:dv_coll_shard2_replica_n2] o.a.s.c.CoreContainer Creating SolrCore 'dv_coll_shard2_replica_n2' using configuration from collection dv_coll, trusted=true
   [junit4]   2> 2113101 INFO  (qtp1545161076-22879) [n:127.0.0.1:62626_solr c:dv_coll s:shard2 r:core_node5 x:dv_coll_shard2_replica_n2] o.a.s.m.r.SolrJmxReporter JMX monitoring for 'solr_62626.solr.core.dv_coll.shard2.replica_n2' (registry 'solr.core.dv_coll.shard2.replica_n2') enabled at server: com.sun.jmx.mbeanserver.JmxMBeanServer@e51effc
   [junit4]   2> 2113101 INFO  (qtp662646076-22873) [n:127.0.0.1:62625_solr c:dv_coll s:shard3 r:core_node7 x:dv_coll_shard3_replica_n4] o.a.s.s.IndexSchema Loaded schema minimal/1.1 with uniqueid field id
   [junit4]   2> 2113101 INFO  (qtp662646076-22873) [n:127.0.0.1:62625_solr c:dv_coll s:shard3 r:core_node7 x:dv_coll_shard3_replica_n4] o.a.s.c.CoreContainer Creating SolrCore 'dv_coll_shard3_replica_n4' using configuration from collection dv_coll, trusted=true
   [junit4]   2> 2113101 INFO  (qtp1545161076-22879) [n:127.0.0.1:62626_solr c:dv_coll s:shard2 r:core_node5 x:dv_coll_shard2_replica_n2] o.a.s.c.SolrCore solr.RecoveryStrategy.Builder
   [junit4]   2> 2113101 INFO  (qtp1545161076-22879) [n:127.0.0.1:62626_solr c:dv_coll s:shard2 r:core_node5 x:dv_coll_shard2_replica_n2] o.a.s.c.SolrCore [[dv_coll_shard2_replica_n2] ] Opening new SolrCore at [C:\Users\jenkins\workspace\Lucene-Solr-master-Windows\solr\build\solr-core\test\J0\temp\solr.cloud.DocValuesNotIndexedTest_2406AC01CBCFA736-001\tempDir-001\node1\dv_coll_shard2_replica_n2], dataDir=[C:\Users\jenkins\workspace\Lucene-Solr-master-Windows\solr\build\solr-core\test\J0\temp\solr.cloud.DocValuesNotIndexedTest_2406AC01CBCFA736-001\tempDir-001\node1\.\dv_coll_shard2_replica_n2\data\]
   [junit4]   2> 2113101 INFO  (qtp662646076-22873) [n:127.0.0.1:62625_solr c:dv_coll s:shard3 r:core_node7 x:dv_coll_shard3_replica_n4] o.a.s.m.r.SolrJmxReporter JMX monitoring for 'solr_62625.solr.core.dv_coll.shard3.replica_n4' (registry 'solr.core.dv_coll.shard3.replica_n4') enabled at server: com.sun.jmx.mbeanserver.JmxMBeanServer@e51effc
   [junit4]   2> 2113101 INFO  (qtp662646076-22873) [n:127.0.0.1:62625_solr c:dv_coll s:shard3 r:core_node7 x:dv_coll_shard3_replica_n4] o.a.s.c.SolrCore solr.RecoveryStrategy.Builder
   [junit4]   2> 2113101 INFO  (qtp662646076-22873) [n:127.0.0.1:62625_solr c:dv_coll s:shard3 r:core_node7 x:dv_coll_shard3_replica_n4] o.a.s.c.SolrCore [[dv_coll_shard3_replica_n4] ] Opening new SolrCore at [C:\Users\jenkins\workspace\Lucene-Solr-master-Windows\solr\build\solr-core\test\J0\temp\solr.cloud.DocValuesNotIndexedTest_2406AC01CBCFA736-001\tempDir-001\node2\dv_coll_shard3_replica_n4], dataDir=[C:\Users\jenkins\workspace\Lucene-Solr-master-Windows\solr\build\solr-core\test\J0\temp\solr.cloud.DocValuesNotIndexedTest_2406AC01CBCFA736-001\tempDir-001\node2\.\dv_coll_shard3_replica_n4\data\]
   [junit4]   2> 2113184 INFO  (qtp662646076-22873) [n:127.0.0.1:62625_solr c:dv_coll s:shard3 r:core_node7 x:dv_coll_shard3_replica_n4] o.a.s.u.UpdateHandler Using UpdateLog implementation: org.apache.solr.update.UpdateLog
   [junit4]   2> 2113184 INFO  (qtp662646076-22873) [n:127.0.0.1:62625_solr c:dv_coll s:shard3 r:core_node7 x:dv_coll_shard3_replica_n4] o.a.s.u.UpdateLog Initializing UpdateLog: dataDir=null defaultSyncLevel=FLUSH numRecordsToKeep=100 maxNumLogsToKeep=10 numVersionBuckets=65536
   [junit4]   2> 2113186 INFO  (qtp662646076-22873) [n:127.0.0.1:62625_solr c:dv_coll s:shard3 r:core_node7 x:dv_coll_shard3_replica_n4] o.a.s.u.CommitTracker Hard AutoCommit: disabled
   [junit4]   2> 2113186 INFO  (qtp662646076-22873) [n:127.0.0.1:62625_solr c:dv_coll s:shard3 r:core_node7 x:dv_coll_shard3_replica_n4] o.a.s.u.CommitTracker Soft AutoCommit: disabled
   [junit4]   2> 2113187 INFO  (qtp662646076-22875) [n:127.0.0.1:62625_solr c:dv_coll s:shard1 r:core_node3 x:dv_coll_shard1_replica_n1] o.a.s.u.UpdateHandler Using UpdateLog implementation: org.apache.solr.update.UpdateLog
   [junit4]   2> 2113187 INFO  (qtp662646076-22875) [n:127.0.0.1:62625_solr c:dv_coll s:shard1 r:core_node3 x:dv_coll_shard1_replica_n1] o.a.s.u.UpdateLog Initializing UpdateLog: dataDir=null defaultSyncLevel=FLUSH numRecordsToKeep=100 maxNumLogsToKeep=10 numVersionBuckets=65536
   [junit4]   2> 2113189 INFO  (qtp1545161076-22878) [n:127.0.0.1:62626_solr c:dv_coll s:shard4 r:core_node8 x:dv_coll_shard4_replica_n6] o.a.s.u.UpdateHandler Using UpdateLog implementation: org.apache.solr.update.UpdateLog
   [junit4]   2> 2113189 INFO  (qtp1545161076-22878) [n:127.0.0.1:62626_solr c:dv_coll s:shard4 r:core_node8 x:dv_coll_shard4_replica_n6] o.a.s.u.UpdateLog Initializing UpdateLog: dataDir=null defaultSyncLevel=FLUSH numRecordsToKeep=100 maxNumLogsToKeep=10 numVersionBuckets=65536
   [junit4]   2> 2113190 INFO  (qtp662646076-22875) [n:127.0.0.1:62625_solr c:dv_coll s:shard1 r:core_node3 x:dv_coll_shard1_replica_n1] o.a.s.u.CommitTracker Hard AutoCommit: disabled
   [junit4]   2> 2113190 INFO  (qtp662646076-22875) [n:127.0.0.1:62625_solr c:dv_coll s:shard1 r:core_node3 x:dv_coll_shard1_replica_n1] o.a.s.u.CommitTracker Soft AutoCommit: disabled
   [junit4]   2> 2113190 INFO  (qtp662646076-22873) [n:127.0.0.1:62625_solr c:dv_coll s:shard3 r:core_node7 x:dv_coll_shard3_replica_n4] o.a.s.s.SolrIndexSearcher Opening [Searcher@2c926ac3[dv_coll_shard3_replica_n4] main]
   [junit4]   2> 2113190 INFO  (qtp1545161076-22878) [n:127.0.0.1:62626_solr c:dv_coll s:shard4 r:core_node8 x:dv_coll_shard4_replica_n6] o.a.s.u.CommitTracker Hard AutoCommit: disabled
   [junit4]   2> 2113190 INFO  (qtp1545161076-22878) [n:127.0.0.1:62626_solr c:dv_coll s:shard4 r:core_node8 x:dv_coll_shard4_replica_n6] o.a.s.u.CommitTracker Soft AutoCommit: disabled
   [junit4]   2> 2113191 INFO  (qtp662646076-22873) [n:127.0.0.1:62625_solr c:dv_coll s:shard3 r:core_node7 x:dv_coll_shard3_replica_n4] o.a.s.r.ManagedResourceStorage Configured ZooKeeperStorageIO with znodeBase: /configs/conf1
   [junit4]   2> 2113191 INFO  (qtp662646076-22873) [n:127.0.0.1:62625_solr c:dv_coll s:shard3 r:core_node7 x:dv_coll_shard3_replica_n4] o.a.s.r.ManagedResourceStorage Loaded null at path _rest_managed.json using ZooKeeperStorageIO:path=/configs/conf1
   [junit4]   2> 2113191 INFO  (qtp662646076-22875) [n:127.0.0.1:62625_solr c:dv_coll s:shard1 r:core_node3 x:dv_coll_shard1_replica_n1] o.a.s.s.SolrIndexSearcher Opening [Searcher@2d1986d[dv_coll_shard1_replica_n1] main]
   [junit4]   2> 2113191 INFO  (qtp662646076-22873) [n:127.0.0.1:62625_solr c:dv_coll s:shard3 r:core_node7 x:dv_coll_shard3_replica_n4] o.a.s.s.ZkIndexSchemaReader Creating ZooKeeper watch for the managed schema at /configs/conf1/managed-schema
   [junit4]   2> 2113191 INFO  (qtp662646076-22873) [n:127.0.0.1:62625_solr c:dv_coll s:shard3 r:core_node7 x:dv_coll_shard3_replica_n4] o.a.s.s.ZkIndexSchemaReader Current schema version 0 is already the latest
   [junit4]   2> 2113193 INFO  (qtp662646076-22873) [n:127.0.0.1:62625_solr c:dv_coll s:shard3 r:core_node7 x:dv_coll_shard3_replica_n4] o.a.s.h.ReplicationHandler Commits will be reserved for 10000ms.
   [junit4]   2> 2113193 INFO  (searcherExecutor-8186-thread-1-processing-n:127.0.0.1:62625_solr x:dv_coll_shard3_replica_n4 s:shard3 c:dv_coll r:core_node7) [n:127.0.0.1:62625_solr c:dv_coll s:shard3 r:core_node7 x:dv_coll_shard3_replica_n4] o.a.s.c.SolrCore [dv_coll_shard3_replica_n4] Registered new searcher Searcher@2c926ac3[dv_coll_shard3_replica_n4] main{ExitableDirectoryReader(UninvertingDirectoryReader())}
   [junit4]   2> 2113193 INFO  (qtp662646076-22873) [n:127.0.0.1:62625_solr c:dv_coll s:shard3 r:core_node7 x:dv_coll_shard3_replica_n4] o.a.s.u.UpdateLog Could not find max version in index or recent updates, using new clock 1588731307304681472
   [junit4]   2> 2113194 INFO  (qtp662646076-22875) [n:127.0.0.1:62625_solr c:dv_coll s:shard1 r:core_node3 x:dv_coll_shard1_replica_n1] o.a.s.r.ManagedResourceStorage Configured ZooKeeperStorageIO with znodeBase: /configs/conf1
   [junit4]   2> 2113194 INFO  (qtp662646076-22875) [n:127.0.0.1:62625_solr c:dv_coll s:shard1 r:core_node3 x:dv_coll_shard1_replica_n1] o.a.s.r.ManagedResourceStorage Loaded null at path _rest_managed.json using ZooKeeperStorageIO:path=/configs/conf1
   [junit4]   2> 2113194 INFO  (qtp662646076-22875) [n:127.0.0.1:62625_solr c:dv_coll s:shard1 r:core_node3 x:dv_coll_shard1_replica_n1] o.a.s.s.ZkIndexSchemaReader Creating ZooKeeper watch for the managed schema at /configs/conf1/managed-schema
   [junit4]   2> 2113194 INFO  (qtp662646076-22875) [n:127.0.0.1:62625_solr c:dv_coll s:shard1 r:core_node3 x:dv_coll_shard1_replica_n1] o.a.s.s.ZkIndexSchemaReader Current schema version 0 is already the latest
   [junit4]   2> 2113196 INFO  (qtp662646076-22875) [n:127.0.0.1:62625_solr c:dv_coll s:shard1 r:core_node3 x:dv_coll_shard1_replica_n1] o.a.s.h.ReplicationHandler Commits will be reserved for 10000ms.
   [junit4]   2> 2113196 INFO  (qtp1545161076-22878) [n:127.0.0.1:62626_solr c:dv_coll s:shard4 r:core_node8 x:dv_coll_shard4_replica_n6] o.a.s.s.SolrIndexSearcher Opening [Searcher@4ba57560[dv_coll_shard4_replica_n6] main]
   [junit4]   2> 2113196 INFO  (qtp1545161076-22879) [n:127.0.0.1:62626_solr c:dv_coll s:shard2 r:core_node5 x:dv_coll_shard2_replica_n2] o.a.s.u.UpdateHandler Using UpdateLog implementation: org.apache.solr.update.UpdateLog
   [junit4]   2> 2113196 INFO  (qtp1545161076-22879) [n:127.0.0.1:62626_solr c:dv_coll s:shard2 r:core_node5 x:dv_coll_shard2_replica_n2] o.a.s.u.UpdateLog Initializing UpdateLog: dataDir=null defaultSyncLevel=FLUSH numRecordsToKeep=100 maxNumLogsToKeep=10 numVersionBuckets=65536
   [junit4]   2> 2113196 INFO  (searcherExecutor-8184-thread-1-processing-n:127.0.0.1:62625_solr x:dv_coll_shard1_replica_n1 s:shard1 c:dv_coll r:core_node3) [n:127.0.0.1:62625_solr c:dv_coll s:shard1 r:core_node3 x:dv_coll_shard1_replica_n1] o.a.s.c.SolrCore [dv_coll_shard1_replica_n1] Registered new searcher Searcher@2d1986d[dv_coll_shard1_replica_n1] main{ExitableDirectoryReader(UninvertingDirectoryReader())}
   [junit4]   2> 2113197 INFO  (qtp662646076-22875) [n:127.0.0.1:62625_solr c:dv_coll s:shard1 r:core_node3 x:dv_coll_shard1_replica_n1] o.a.s.u.UpdateLog Could not find max version in index or recent updates, using new clock 1588731307308875776
   [junit4]   2> 2113198 INFO  (qtp662646076-22873) [n:127.0.0.1:62625_solr c:dv_coll s:shard3 r:core_node7 x:dv_coll_shard3_replica_n4] o.a.s.c.ShardLeaderElectionContext Enough replicas found to continue.
   [junit4]   2> 2113198 INFO  (qtp662646076-22873) [n:127.0.0.1:62625_solr c:dv_coll s:shard3 r:core_node7 x:dv_coll_shard3_replica_n4] o.a.s.c.ShardLeaderElectionContext I may be the new leader - try and sync
   [junit4]   2> 2113198 INFO  (qtp662646076-22873) [n:127.0.0.1:62625_solr c:dv_coll s:shard3 r:core_node7 x:dv_coll_shard3_replica_n4] o.a.s.c.SyncStrategy Sync replicas to http://127.0.0.1:62625/solr/dv_coll_shard3_replica_n4/
   [junit4]   2> 2113198 INFO  (qtp662646076-22873) [n:127.0.0.1:62625_solr c:dv_coll s:shard3 r:core_node7 x:dv_coll_shard3_replica_n4] o.a.s.c.SyncStrategy Sync Success - now sync replicas to me
   [junit4]   2> 2113198 INFO  (qtp662646076-22873) [n:127.0.0.1:62625_solr c:dv_coll s:shard3 r:core_node7 x:dv_coll_shard3_replica_n4] o.a.s.c.SyncStrategy http://127.0.0.1:62625/solr/dv_coll_shard3_replica_n4/ has no replicas
   [junit4]   2> 2113198 INFO  (qtp662646076-22873) [n:127.0.0.1:62625_solr c:dv_coll s:shard3 r:core_node7 x:dv_coll_shard3_replica_n4] o.a.s.c.ShardLeaderElectionContext Found all replicas participating in election, clear LIR
   [junit4]   2> 2113198 INFO  (qtp1545161076-22879) [n:127.0.0.1:62626_solr c:dv_coll s:shard2 r:core_node5 x:dv_coll_shard2_replica_n2] o.a.s.u.CommitTracker Hard AutoCommit: disabled
   [junit4]   2> 2113198 INFO  (qtp1545161076-22879) [n:127.0.0.1:62626_solr c:dv_coll s:shard2 r:core_node5 x:dv_coll_shard2_replica_n2] o.a.s.u.CommitTracker Soft AutoCommit: disabled
   [junit4]   2> 2113199 INFO  (qtp1545161076-22878) [n:127.0.0.1:62626_solr c:dv_coll s:shard4 r:core_node8 x:dv_coll_shard4_replica_n6] o.a.s.r.ManagedResourceStorage Configured ZooKeeperStorageIO with znodeBase: /configs/conf1
   [junit4]   2> 2113199 INFO  (qtp1545161076-22878) [n:127.0.0.1:62626_solr c:dv_coll s:shard4 r:core_node8 x:dv_coll_shard4_replica_n6] o.a.s.r.ManagedResourceStorage Loaded null at path _rest_managed.json using ZooKeeperStorageIO:path=/configs/conf1
   [junit4]   2> 2113199 INFO  (qtp1545161076-22878) [n:127.0.0.1:62626_solr c:dv_coll s:shard4 r:core_node8 x:dv_coll_shard4_replica_n6] o.a.s.s.ZkIndexSchemaReader Creating ZooKeeper watch for the managed schema at /configs/conf1/managed-schema
   [junit4]   2> 2113199 INFO  (qtp1545161076-22878) [n:127.0.0.1:62626_solr c:dv_coll s:shard4 r:core_node8 x:dv_coll_shard4_replica_n6] o.a.s.s.ZkIndexSchemaReader Current schema version 0 is already the latest
   [junit4]   2> 2113200 INFO  (qtp1545161076-22879) [n:127.0.0.1:62626_solr c:dv_coll s:shard2 r:core_node5 x:dv_coll_shard2_replica_n2] o.a.s.s.SolrIndexSearcher Opening [Searcher@4989d074[dv_coll_shard2_replica_n2] main]
   [junit4]   2> 2113200 INFO  (qtp1545161076-22878) [n:127.0.0.1:62626_solr c:dv_coll s:shard4 r:core_node8 x:dv_coll_shard4_replica_n6] o.a.s.h.ReplicationHandler Commits will be reserved for 10000ms.
   [junit4]   2> 2113200 INFO  (qtp662646076-22875) [n:127.0.0.1:62625_solr c:dv_coll s:shard1 r:core_node3 x:dv_coll_shard1_replica_n1] o.a.s.c.ShardLeaderElectionContext Enough replicas found to continue.
   [junit4]   2> 2113200 INFO  (qtp662646076-22875) [n:127.0.0.1:62625_solr c:dv_coll s:shard1 r:core_node3 x:dv_coll_shard1_replica_n1] o.a.s.c.ShardLeaderElectionContext I may be the new leader - try and sync
   [junit4]   2> 2113200 INFO  (qtp662646076-22875) [n:127.0.0.1:62625_solr c:dv_coll s:shard1 r:core_node3 x:dv_coll_shard1_replica_n1] o.a.s.c.SyncStrategy Sync replicas to http://127.0.0.1:62625/solr/dv_coll_shard1_replica_n1/
   [junit4]   2> 2113200 INFO  (qtp662646076-22875) [n:127.0.0.1:62625_solr c:dv_coll s:shard1 r:core_node3 x:dv_coll_shard1_replica_n1] o.a.s.c.SyncStrategy Sync Success - now sync replicas to me
   [junit4]   2> 2113200 INFO  (qtp662646076-22875) [n:127.0.0.1:62625_solr c:dv_coll s:shard1 r:core_node3 x:dv_coll_shard1_replica_n1] o.a.s.c.SyncStrategy http://127.0.0.1:62625/solr/dv_coll_shard1_replica_n1/ has no replicas
   [junit4]   2> 2113200 INFO  (qtp662646076-22875) [n:127.0.0.1:62625_solr c:dv_coll s:shard1 r:core_node3 x:dv_coll_shard1_replica_n1] o.a.s.c.ShardLeaderElectionContext Found all replicas participating in election, clear LIR
   [junit4]   2> 2113200 INFO  (qtp1545161076-22878) [n:127.0.0.1:62626_solr c:dv_coll s:shard4 r:core_node8 x:dv_coll_shard4_replica_n6] o.a.s.u.UpdateLog Could not find max version in index or recent updates, using new clock 1588731307312021504
   [junit4]   2> 2113201 INFO  (searcherExecutor-8183-thread-1-processing-n:127.0.0.1:62626_solr x:dv_coll_shard4_replica_n6 s:shard4 c:dv_coll r:core_node8) [n:127.0.0.1:62626_solr c:dv_coll s:shard4 r:core_node8 x:dv_coll_shard4_replica_n6] o.a.s.c.SolrCore [dv_coll_shard4_replica_n6] Registered new searcher Searcher@4ba57560[dv_coll_shard4_replica_n6] main{ExitableDirectoryReader(UninvertingDirectoryReader())}
   [junit4]   2> 2113202 INFO  (qtp662646076-22873) [n:127.0.0.1:62625_solr c:dv_coll s:shard3 r:core_node7 x:dv_coll_shard3_replica_n4] o.a.s.c.ShardLeaderElectionContext I am the new leader: http://127.0.0.1:62625/solr/dv_coll_shard3_replica_n4/ shard3
   [junit4]   2> 2113202 INFO  (qtp1545161076-22879) [n:127.0.0.1:62626_solr c:dv_coll s:shard2 r:core_node5 x:dv_coll_shard2_replica_n2] o.a.s.r.ManagedResourceStorage Configured ZooKeeperStorageIO with znodeBase: /configs/conf1
   [junit4]   2> 2113202 INFO  (qtp1545161076-22879) [n:127.0.0.1:62626_solr c:dv_coll s:shard2 r:core_node5 x:dv_coll_shard2_replica_n2] o.a.s.r.ManagedResourceStorage Loaded null at path _rest_managed.json using ZooKeeperStorageIO:path=/configs/conf1
   [junit4]   2> 2113202 INFO  (qtp1545161076-22879) [n:127.0.0.1:62626_solr c:dv_coll s:shard2 r:core_node5 x:dv_coll_shard2_replica_n2] o.a.s.s.ZkIndexSchemaReader Creating ZooKeeper watch for the managed schema at /configs/conf1/managed-schema
   [junit4]   2> 2113203 INFO  (qtp1545161076-22879) [n:127.0.0.1:62626_solr c:dv_coll s:shard2 r:core_node5 x:dv_coll_shard2_replica_n2] o.a.s.s.ZkIndexSchemaReader Current schema version 0 is already the latest
   [junit4]   2> 2113203 INFO  (qtp1545161076-22879) [n:127.0.0.1:62626_solr c:dv_coll s:shard2 r:core_node5 x:dv_coll_shard2_replica_n2] o.a.s.h.ReplicationHandler Commits will be reserved for 10000ms.
   [junit4]   2> 2113203 INFO  (qtp1545161076-22879) [n:127.0.0.1:62626_solr c:dv_coll s:shard2 r:core_node5 x:dv_coll_shard2_replica_n2] o.a.s.u.UpdateLog Could not find max version in index or recent updates, using new clock 1588731307315167232
   [junit4]   2> 2113204 INFO  (qtp662646076-22875) [n:127.0.0.1:62625_solr c:dv_coll s:shard1 r:core_node3 x:dv_coll_shard1_replica_n1] o.a.s.c.ShardLeaderElectionContext I am the new leader: http://127.0.0.1:62625/solr/dv_coll_shard1_replica_n1/ shard1
   [junit4]   2> 2113204 INFO  (searcherExecutor-8185-thread-1-processing-n:127.0.0.1:62626_solr x:dv_coll_shard2_replica_n2 s:shard2 c:dv_coll r:core_node5) [n:127.0.0.1:62626_solr c:dv_coll s:shard2 r:core_node5 x:dv_coll_shard2_replica_n2] o.a.s.c.SolrCore [dv_coll_shard2_replica_n2] Registered new searcher Searcher@4989d074[dv_coll_shard2_replica_n2] main{ExitableDirectoryReader(UninvertingDirectoryReader())}
   [junit4]   2> 2113205 INFO  (qtp1545161076-22878) [n:127.0.0.1:62626_solr c:dv_coll s:shard4 r:core_node8 x:dv_coll_shard4_replica_n6] o.a.s.c.ShardLeaderElectionContext Enough replicas found to continue.
   [junit4]   2> 2113205 INFO  (qtp1545161076-22878) [n:127.0.0.1:62626_solr c:dv_coll s:shard4 r:core_node8 x:dv_coll_shard4_replica_n6] o.a.s.c.ShardLeaderElectionContext I may be the new leader - try and sync
   [junit4]   2> 2113205 INFO  (qtp1545161076-22878) [n:127.0.0.1:62626_solr c:dv_coll s:shard4 r:core_node8 x:dv_coll_shard4_replica_n6] o.a.s.c.SyncStrategy Sync replicas to http://127.0.0.1:62626/solr/dv_coll_shard4_replica_n6/
   [junit4]   2> 2113205 INFO  (qtp1545161076-22878) [n:127.0.0.1:62626_solr c:dv_coll s:shard4 r:core_node8 x:dv_coll_shard4_replica_n6] o.a.s.c.SyncStrategy Sync Success - now sync replicas to me
   [junit4]   2> 2113205 INFO  (qtp1545161076-22878) [n:127.0.0.1:62626_solr c:dv_coll s:shard4 r:core_node8 x:dv_coll_shard4_replica_n6] o.a.s.c.SyncStrategy http://127.0.0.1:62626/solr/dv_coll_shard4_replica_n6/ has no replicas
   [junit4]   2> 2113205 INFO  (qtp1545161076-22878) [n:127.0.0.1:62626_solr c:dv_coll s:shard4 r:core_node8 x:dv_coll_shard4_replica_n6] o.a.s.c.ShardLeaderElectionContext Found all replicas participating in election, clear LIR
   [junit4]   2> 2113207 INFO  (qtp1545161076-22879) [n:127.0.0.1:62626_solr c:dv_coll s:shard2 r:core_node5 x:dv_coll_shard2_replica_n2] o.a.s.c.ShardLeaderElectionContext Enough replicas found to continue.
   [junit4]   2> 2113207 INFO  (qtp1545161076-22879) [n:127.0.0.1:62626_solr c:dv_coll s:shard2 r:core_node5 x:dv_coll_shard2_replica_n2] o.a.s.c.ShardLeaderElectionContext I may be the new leader - try and sync
   [junit4]   2> 2113207 INFO  (qtp1545161076-22879) [n:127.0.0.1:62626_solr c:dv_coll s:shard2 r:core_node5 x:dv_coll_shard2_replica_n2] o.a.s.c.SyncStrategy Sync replicas to http://127.0.0.1:62626/solr/dv_coll_shard2_replica_n2/
   [junit4]   2> 2113207 INFO  (qtp1545161076-22879) [n:127.0.0.1:62626_solr c:dv_coll s:shard2 r:core_node5 x:dv_coll_shard2_replica_n2] o.a.s.c.SyncStrategy Sync Success - now sync replicas to me
   [junit4]   2> 2113207 INFO  (qtp1545161076-22879) [n:127.0.0.1:62626_solr c:dv_coll s:shard2 r:core_node5 x:dv_coll_shard2_replica_n2] o.a.s.c.SyncStrategy http://127.0.0.1:62626/solr/dv_coll_shard2_replica_n2/ has no replicas
   [junit4]   2> 2113207 INFO  (qtp1545161076-22879) [n:127.0.0.1:62626_solr c:dv_coll s:shard2 r:core_node5 x:dv_coll_shard2_replica_n2] o.a.s.c.ShardLeaderElectionContext Found all replicas participating in election, clear LIR
   [junit4]   2> 2113208 INFO  (qtp1545161076-22878) [n:127.0.0.1:62626_solr c:dv_coll s:shard4 r:core_node8 x:dv_coll_shard4_replica_n6] o.a.s.c.ShardLeaderElectionContext I am the new leader: http://127.0.0.1:62626/solr/dv_coll_shard4_replica_n6/ shard4
   [junit4]   2> 2113210 INFO  (qtp1545161076-22879) [n:127.0.0.1:62626_solr c:dv_coll s:shard2 r:core_node5 x:dv_coll_shard2_replica_n2] o.a.s.c.ShardLeaderElectionContext I am the new leader: http://127.0.0.1:62626/solr/dv_coll_shard2_replica_n2/ shard2
   [junit4]   2> 2113312 INFO  (zkCallback-5864-thread-3-processing-n:127.0.0.1:62626_solr) [n:127.0.0.1:62626_solr    ] o.a.s.c.c.ZkStateReader A cluster state change: [WatchedEvent state:SyncConnected type:NodeDataChanged path:/collections/dv_coll/state.json] for collection [dv_coll] has occurred - updating... (live nodes size: [2])
   [junit4]   2> 2113312 INFO  (zkCallback-5862-thread-2-processing-n:127.0.0.1:62625_solr) [n:127.0.0.1:62625_solr    ] o.a.s.c.c.ZkStateReader A cluster state change: [WatchedEvent state:SyncConnected type:NodeDataChanged path:/collections/dv_coll/state.json] for collection [dv_coll] has occurred - updating... (live nodes size: [2])
   [junit4]   2> 2113312 INFO  (zkCallback-5864-thread-2-processing-n:127.0.0.1:62626_solr) [n:127.0.0.1:62626_solr    ] o.a.s.c.c.ZkStateReader A cluster state change: [WatchedEvent state:SyncConnected type:NodeDataChanged path:/collections/dv_coll/state.json] for collection [dv_coll] has occurred - updating... (live nodes size: [2])
   [junit4]   2> 2113312 INFO  (zkCallback-5864-thread-4-processing-n:127.0.0.1:62626_solr) [n:127.0.0.1:62626_solr    ] o.a.s.c.c.ZkStateReader A cluster state change: [WatchedEvent state:SyncConnected type:NodeDataChanged path:/collections/dv_coll/state.json] for collection [dv_coll] has occurred - updating... (live nodes size: [2])
   [junit4]   2> 2113312 INFO  (zkCallback-5862-thread-1-processing-n:127.0.0.1:62625_solr) [n:127.0.0.1:62625_solr    ] o.a.s.c.c.ZkStateReader A cluster state change: [WatchedEvent state:SyncConnected type:NodeDataChanged path:/collections/dv_coll/state.json] for collection [dv_coll] has occurred - updating... (live nodes size: [2])
   [junit4]   2> 2113354 INFO  (qtp662646076-22873) [n:127.0.0.1:62625_solr c:dv_coll s:shard3 r:core_node7 x:dv_coll_shard3_replica_n4] o.a.s.c.ZkController I am the leader, no recovery necessary
   [junit4]   2> 2113357 INFO  (qtp662646076-22875) [n:127.0.0.1:62625_solr c:dv_coll s:shard1 r:core_node3 x:dv_coll_shard1_replica_n1] o.a.s.c.ZkController I am the leader, no recovery necessary
   [junit4]   2> 2113361 INFO  (qtp1545161076-22878) [n:127.0.0.1:62626_solr c:dv_coll s:shard4 r:core_node8 x:dv_coll_shard4_replica_n6] o.a.s.c.ZkController I am the leader, no recovery necessary
   [junit4]   2> 2113361 INFO  (qtp662646076-22873) [n:127.0.0.1:62625_solr c:dv_coll s:shard3 r:core_node7 x:dv_coll_shard3_replica_n4] o.a.s.s.HttpSolrCall [admin] webapp=null path=/admin/cores params={qt=/admin/cores&coreNodeName=core_node7&collection.configName=conf1&newCollection=true&name=dv_coll_shard3_replica_n4&action=CREATE&numShards=4&collection=dv_coll&shard=shard3&wt=javabin&version=2&replicaType=NRT} status=0 QTime=1353
   [junit4]   2> 2113362 INFO  (qtp1545161076-22879) [n:127.0.0.1:62626_solr c:dv_coll s:shard2 r:core_node5 x:dv_coll_shard2_replica_n2] o.a.s.c.ZkController I am the leader, no recovery necessary
   [junit4]   2> 2113363 INFO  (qtp662646076-22875) [n:127.0.0.1:62625_solr c:dv_coll s:shard1 r:core_node3 x:dv_coll_shard1_replica_n1] o.a.s.s.HttpSolrCall [admin] webapp=null path=/admin/cores params={qt=/admin/cores&coreNodeName=core_node3&collection.configName=conf1&newCollection=true&name=dv_coll_shard1_replica_n1&action=CREATE&numShards=4&collection=dv_coll&shard=shard1&wt=javabin&version=2&replicaType=NRT} status=0 QTime=1355
   [junit4]   2> 2113368 INFO  (qtp1545161076-22878) [n:127.0.0.1:62626_solr c:dv_coll s:shard4 r:core_node8 x:dv_coll_shard4_replica_n6] o.a.s.s.HttpSolrCall [admin] webapp=null path=/admin/cores params={qt=/admin/cores&coreNodeName=core_node8&collection.configName=conf1&newCollection=true&name=dv_coll_shard4_replica_n6&action=CREATE&numShards=4&collection=dv_coll&shard=shard4&wt=javabin&version=2&replicaType=NRT} status=0 QTime=1353
   [junit4]   2> 2113370 INFO  (qtp1545161076-22879) [n:127.0.0.1:62626_solr c:dv_coll s:shard2 r:core_node5 x:dv_coll_shard2_replica_n2] o.a.s.s.HttpSolrCall [admin] webapp=null path=/admin/cores params={qt=/admin/cores&coreNodeName=core_node5&collection.configName=conf1&newCollection=true&name=dv_coll_shard2_replica_n2&action=CREATE&numShards=4&collection=dv_coll&shard=shard2&wt=javabin&version=2&replicaType=NRT} status=0 QTime=1363
   [junit4]   2> 2113374 INFO  (qtp1545161076-22874) [n:127.0.0.1:62626_solr    ] o.a.s.h.a.CollectionsHandler Wait for new collection to be active for at most 30 seconds. Check all shard replicas
   [junit4]   2> 2113468 INFO  (zkCallback-5862-thread-1-processing-n:127.0.0.1:62625_solr) [n:127.0.0.1:62625_solr    ] o.a.s.c.c.ZkStateReader A cluster state change: [WatchedEvent state:SyncConnected type:NodeDataChanged path:/collections/dv_coll/state.json] for collection [dv_coll] has occurred - updating... (live nodes size: [2])
   [junit4]   2> 2113470 INFO  (zkCallback-5862-thread-2-processing-n:127.0.0.1:62625_solr) [n:127.0.0.1:62625_solr    ] o.a.s.c.c.ZkStateReader A cluster state change: [WatchedEvent state:SyncConnected type:NodeDataChanged path:/collections/dv_coll/state.json] for collection [dv_coll] has occurred - updating... (live nodes size: [2])
   [junit4]   2> 2113470 INFO  (zkCallback-5864-thread-2-processing-n:127.0.0.1:62626_solr) [n:127.0.0.1:62626_solr    ] o.a.s.c.c.ZkStateReader A cluster state change: [WatchedEvent state:SyncConnected type:NodeDataChanged path:/collections/dv_coll/state.json] for collection [dv_coll] has occurred - updating... (live nodes size: [2])
   [junit4]   2> 2113470 INFO  (zkCallback-5864-thread-4-processing-n:127.0.0.1:62626_solr) [n:127.0.0.1:62626_solr    ] o.a.s.c.c.ZkStateReader A cluster state change: [WatchedEvent state:SyncConnected type:NodeDataChanged path:/collections/dv_coll/state.json] for collection [dv_coll] has occurred - updating... (live nodes size: [2])
   [junit4]   2> 2113468 INFO  (zkCallback-5864-thread-3-processing-n:127.0.0.1:62626_solr) [n:127.0.0.1:62626_solr    ] o.a.s.c.c.ZkStateReader A cluster state change: [WatchedEvent state:SyncConnected type:NodeDataChanged path:/collections/dv_coll/state.json] for collection [dv_coll] has occurred - updating... (live nodes size: [2])
   [junit4]   2> 2113675 INFO  (OverseerCollectionConfigSetProcessor-99295706577698822-127.0.0.1:62626_solr-n_0000000000) [n:127.0.0.1:62626_solr    ] o.a.s.c.OverseerTaskQueue Response ZK path: /overseer/collection-queue-work/qnr-0000000000 doesn't exist.  Requestor may have disconnected from ZooKeeper
   [junit4]   2> 2114375 INFO  (qtp1545161076-22874) [n:127.0.0.1:62626_solr    ] o.a.s.s.HttpSolrCall [admin] webapp=null path=/admin/collections params={replicationFactor=1&collection.configName=conf1&maxShardsPerNode=2&name=dv_coll&nrtReplicas=1&action=CREATE&numShards=4&wt=javabin&version=2} status=0 QTime=2704
   [junit4]   2> 2114385 INFO  (qtp1545161076-22877) [n:127.0.0.1:62626_solr c:dv_coll s:shard4 r:core_node8 x:dv_coll_shard4_replica_n6] o.a.s.s.SchemaManager managed schema loaded . version : 0 
   [junit4]   2> 2114400 INFO  (qtp1545161076-22877) [n:127.0.0.1:62626_solr c:dv_coll s:shard4 r:core_node8 x:dv_coll_shard4_replica_n6] o.a.s.s.IndexSchema [dv_coll_shard4_replica_n6] Schema name=minimal
   [junit4]   2> 2114408 INFO  (qtp1545161076-22877) [n:127.0.0.1:62626_solr c:dv_coll s:shard4 r:core_node8 x:dv_coll_shard4_replica_n6] o.a.s.s.IndexSchema Loaded schema minimal/1.1 with uniqueid field id
   [junit4]   2> 2114416 INFO  (qtp1545161076-22877) [n:127.0.0.1:62626_solr c:dv_coll s:shard4 r:core_node8 x:dv_coll_shard4_replica_n6] o.a.s.c.ZkController Persisted config data to node /configs/conf1/managed-schema 
   [junit4]   2> 2114416 INFO  (zkCallback-5864-thread-3-processing-n:127.0.0.1:62626_solr) [n:127.0.0.1:62626_solr    ] o.a.s.s.ZkIndexSchemaReader A schema change: WatchedEvent state:SyncConnected type:NodeDataChanged path:/configs/conf1/managed-schema, has occurred - updating schema from ZooKeeper ...
   [junit4]   2> 2114416 INFO  (zkCallback-5862-thread-2-processing-n:127.0.0.1:62625_solr) [n:127.0.0.1:62625_solr    ] o.a.s.s.ZkIndexSchemaReader A schema change: WatchedEvent state:SyncConnected type:NodeDataChanged path:/configs/conf1/managed-schema, has occurred - updating schema from ZooKeeper ...
   [junit4]   2> 2114416 INFO  (zkCallback-5862-thread-1-processing-n:127.0.0.1:62625_solr) [n:127.0.0.1:62625_solr    ] o.a.s.s.ZkIndexSchemaReader A schema change: WatchedEvent state:SyncConnected type:NodeDataChanged path:/configs/conf1/managed-schema, has occurred - updating schema from ZooKeeper ...
   [junit4]   2> 2114416 INFO  (zkCallback-5864-thread-4-processing-n:127.0.0.1:62626_solr) [n:127.0.0.1:62626_solr    ] o.a.s.s.ZkIndexSchemaReader A schema change: WatchedEvent state:SyncConnected type:NodeDataChanged path:/configs/conf1/managed-schema, has occurred - updating schema from ZooKeeper ...
   [junit4]   2> 2114417 INFO  (zkCallback-5864-thread-3-processing-n:127.0.0.1:62626_solr) [n:127.0.0.1:62626_solr    ] o.a.s.s.ZkIndexSchemaReader Retrieved schema version 1 from ZooKeeper
   [junit4]   2> 2114417 INFO  (zkCallback-5862-thread-2-processing-n:127.0.0.1:62625_solr) [n:127.0.0.1:62625_solr    ] o.a.s.s.ZkIndexSchemaReader Retrieved schema version 1 from ZooKeeper
   [junit4]   2> 2114418 INFO  (zkCallback-5862-thread-1-processing-n:127.0.0.1:62625_solr) [n:127.0.0.1:62625_solr    ] o.a.s.s.ZkIndexSchemaReader Retrieved schema version 1 from ZooKeeper
   [junit4]   2> 2114419 INFO  (zkCallback-5864-thread-3-processing-n:127.0.0.1:62626_solr) [n:127.0.0.1:62626_solr    ] o.a.s.s.IndexSchema [dv_coll_shard2_replica_n2] Schema name=minimal
   [junit4]   2> 2114420 INFO  (zkCallback-5862-thread-2-processing-n:127.0.0.1:62625_solr) [n:127.0.0.1:62625_solr    ] o.a.s.s.IndexSchema [dv_coll_shard3_replica_n4] Schema name=minimal
   [junit4]   2> 2114421 INFO  (zkCallback-5862-thread-1-processing-n:127.0.0.1:62625_solr) [n:127.0.0.1:62625_solr    ] o.a.s.s.IndexSchema [dv_coll_shard1_replica_n1] Schema name=minimal
   [junit4]   2> 2114458 INFO  (Thread-4436) [n:127.0.0.1:62626_solr    ] o.a.s.c.SolrCore config update listener called for core dv_coll_shard4_replica_n6
   [junit4]   2> 2114459 INFO  (zkCallback-5864-thread-3-processing-n:127.0.0.1:62626_solr) [n:127.0.0.1:62626_solr    ] o.a.s.s.IndexSchema Loaded schema minimal/1.1 with uniqueid field id
   [junit4]   2> 2114459 INFO  (zkCallback-5864-thread-3-processing-n:127.0.0.1:62626_solr) [n:127.0.0.1:62626_solr    ] o.a.s.s.ZkIndexSchemaReader Finished refreshing schema in 42 ms
   [junit4]   2> 2114461 INFO  (zkCallback-5862-thread-2-processing-n:127.0.0.1:62625_solr) [n:127.0.0.1:62625_solr    ] o.a.s.s.IndexSchema Loaded schema minimal/1.1 with uniqueid field id
   [junit4]   2> 2114461 INFO  (zkCallback-5862-thread-1-processing-n:127.0.0.1:62625_solr) [n:127.0.0.1:62625_solr    ] o.a.s.s.IndexSchema Loaded schema minimal/1.1 with uniqueid field id
   [junit4]   2> 2114461 INFO  (zkCallback-5862-thread-2-processing-n:127.0.0.1:62625_solr) [n:127.0.0.1:62625_solr    ] o.a.s.s.ZkIndexSchemaReader Finished refreshing schema in 43 ms
   [junit4]   2> 2114461 INFO  (zkCallback-5862-thread-1-processing-n:127.0.0.1:62625_solr) [n:127.0.0.1:62625_solr    ] o.a.s.s.ZkIndexSchemaReader Finished refreshing schema in 42 ms
   [junit4]   2> 2114462 INFO  (Thread-4436

[...truncated too long message...]

ws\solr\build\contrib\solr-analysis-extras\test\J1\temp\solr.update.processor.TestOpenNLPExtractNamedEntitiesUpdateProcessorFactory_ED6F77C57C1D125F-001\tempDir-001\collection1: java.nio.file.DirectoryNotEmptyException: C:\Users\jenkins\workspace\Lucene-Solr-master-Windows\solr\build\contrib\solr-analysis-extras\test\J1\temp\solr.update.processor.TestOpenNLPExtractNamedEntitiesUpdateProcessorFactory_ED6F77C57C1D125F-001\tempDir-001\collection1
   [junit4]    >    C:\Users\jenkins\workspace\Lucene-Solr-master-Windows\solr\build\contrib\solr-analysis-extras\test\J1\temp\solr.update.processor.TestOpenNLPExtractNamedEntitiesUpdateProcessorFactory_ED6F77C57C1D125F-001\tempDir-001: java.nio.file.DirectoryNotEmptyException: C:\Users\jenkins\workspace\Lucene-Solr-master-Windows\solr\build\contrib\solr-analysis-extras\test\J1\temp\solr.update.processor.TestOpenNLPExtractNamedEntitiesUpdateProcessorFactory_ED6F77C57C1D125F-001\tempDir-001
   [junit4]    >    C:\Users\jenkins\workspace\Lucene-Solr-master-Windows\solr\build\contrib\solr-analysis-extras\test\J1\temp\solr.update.processor.TestOpenNLPExtractNamedEntitiesUpdateProcessorFactory_ED6F77C57C1D125F-001\tempDir-001\collection1\conf\en-test-tokenizer.bin: java.nio.file.AccessDeniedException: C:\Users\jenkins\workspace\Lucene-Solr-master-Windows\solr\build\contrib\solr-analysis-extras\test\J1\temp\solr.update.processor.TestOpenNLPExtractNamedEntitiesUpdateProcessorFactory_ED6F77C57C1D125F-001\tempDir-001\collection1\conf\en-test-tokenizer.bin
   [junit4]    >    C:\Users\jenkins\workspace\Lucene-Solr-master-Windows\solr\build\contrib\solr-analysis-extras\test\J1\temp\solr.update.processor.TestOpenNLPExtractNamedEntitiesUpdateProcessorFactory_ED6F77C57C1D125F-001\tempDir-001\collection1\conf\en-test-sent.bin: java.nio.file.AccessDeniedException: C:\Users\jenkins\workspace\Lucene-Solr-master-Windows\solr\build\contrib\solr-analysis-extras\test\J1\temp\solr.update.processor.TestOpenNLPExtractNamedEntitiesUpdateProcessorFactory_ED6F77C57C1D125F-001\tempDir-001\collection1\conf\en-test-sent.bin
   [junit4]    >    C:\Users\jenkins\workspace\Lucene-Solr-master-Windows\solr\build\contrib\solr-analysis-extras\test\J1\temp\solr.update.processor.TestOpenNLPExtractNamedEntitiesUpdateProcessorFactory_ED6F77C57C1D125F-001\tempDir-001\collection1\conf\en-test-ner-person.bin: java.nio.file.AccessDeniedException: C:\Users\jenkins\workspace\Lucene-Solr-master-Windows\solr\build\contrib\solr-analysis-extras\test\J1\temp\solr.update.processor.TestOpenNLPExtractNamedEntitiesUpdateProcessorFactory_ED6F77C57C1D125F-001\tempDir-001\collection1\conf\en-test-ner-person.bin
   [junit4]    >    C:\Users\jenkins\workspace\Lucene-Solr-master-Windows\solr\build\contrib\solr-analysis-extras\test\J1\temp\solr.update.processor.TestOpenNLPExtractNamedEntitiesUpdateProcessorFactory_ED6F77C57C1D125F-001: java.nio.file.DirectoryNotEmptyException: C:\Users\jenkins\workspace\Lucene-Solr-master-Windows\solr\build\contrib\solr-analysis-extras\test\J1\temp\solr.update.processor.TestOpenNLPExtractNamedEntitiesUpdateProcessorFactory_ED6F77C57C1D125F-001
   [junit4]    > 	at __randomizedtesting.SeedInfo.seed([ED6F77C57C1D125F]:0)
   [junit4]    > 	at org.apache.lucene.util.IOUtils.rm(IOUtils.java:329)
   [junit4]    > 	at java.lang.Thread.run(Thread.java:748)
   [junit4] Completed [1/5 (1!)] on J1 in 13.62s, 8 tests, 1 error <<< FAILURES!

[...truncated 702 lines...]
   [junit4] Suite: org.apache.solr.analytics.facet.PivotFacetTest
   [junit4]   2> Creating dataDir: C:\Users\jenkins\workspace\Lucene-Solr-master-Windows\solr\build\contrib\solr-analytics\test\J1\temp\solr.analytics.facet.PivotFacetTest_F45300399E9F81A7-001\init-core-data-001
   [junit4]   2> Jan 05, 2018 6:27:12 AM com.carrotsearch.randomizedtesting.ThreadLeakControl checkThreadLeaks
   [junit4]   2> WARNING: Will linger awaiting termination of 4 leaked thread(s).
   [junit4]   2> NOTE: test params are: codec=Asserting(Lucene70): {int_i=PostingsFormat(name=LuceneVarGapDocFreqInterval), double_dm=PostingsFormat(name=LuceneVarGapDocFreqInterval), float_fm=PostingsFormat(name=LuceneVarGapFixedInterval), int_im=PostingsFormat(name=Asserting), date_dt=PostingsFormat(name=LuceneVarGapDocFreqInterval), date_dtm=PostingsFormat(name=Asserting), long_lm=PostingsFormat(name=Asserting), double_d=PostingsFormat(name=LuceneVarGapFixedInterval), float_f=PostingsFormat(name=LuceneVarGapDocFreqInterval), long_l=FSTOrd50, _version_=PostingsFormat(name=LuceneVarGapFixedInterval), string_s=PostingsFormat(name=LuceneVarGapDocFreqInterval), id=FSTOrd50, string_sm=PostingsFormat(name=Asserting)}, docValues:{int_i=DocValuesFormat(name=Memory), double_dm=DocValuesFormat(name=Memory), float_fm=DocValuesFormat(name=Lucene70), int_im=DocValuesFormat(name=Lucene70), date_dt=DocValuesFormat(name=Memory), date_dtm=DocValuesFormat(name=Lucene70), long_lm=DocValuesFormat(name=Lucene70), double_d=DocValuesFormat(name=Lucene70), float_f=DocValuesFormat(name=Memory), long_l=DocValuesFormat(name=Direct), _version_=DocValuesFormat(name=Lucene70), string_s=DocValuesFormat(name=Memory), id=DocValuesFormat(name=Direct), string_sm=DocValuesFormat(name=Lucene70)}, maxPointsInLeafNode=373, maxMBSortInHeap=6.515554890810635, sim=Asserting(org.apache.lucene.search.similarities.AssertingSimilarity@5693b370), locale=et, timezone=Asia/Tomsk
   [junit4]   2> NOTE: Windows 10 10.0 amd64/Oracle Corporation 1.8.0_144 (64-bit)/cpus=3,threads=1,free=17495576,total=97714176
   [junit4]   2> NOTE: All tests run in this JVM: [AndFunctionTest, LegacyFieldFacetExtrasCloudTest, LegacyQueryFacetTest, ExistsFunctionTest, LegacyAbstractAnalyticsFacetCloudTest, LegacyExpressionTest, CastingFloatValueStreamTest, LegacyFacetSortingTest, SubtractFunctionTest, FilterFunctionTest, CastingDateValueStreamTest, CastingBooleanValueStreamTest, FloatFieldsTest, OrFunctionTest, RemoveFunctionTest, LegacyAbstractAnalyticsCloudTest, DateFieldsTest, CastingStringValueStreamTest, ConstantValueTest, LongFieldsTest, ExpressionFactoryTest, NoFacetTest, PivotFacetTest]
   [junit4]   2> NOTE: reproduce with: ant test  -Dtestcase=PivotFacetTest -Dtests.seed=F45300399E9F81A7 -Dtests.slow=true -Dtests.locale=et -Dtests.timezone=Asia/Tomsk -Dtests.asserts=true -Dtests.file.encoding=UTF-8
   [junit4] ERROR   0.00s J1 | PivotFacetTest (suite) <<<
   [junit4]    > Throwable #1: java.io.IOException: Could not remove the following files (in the order of attempts):
   [junit4]    >    C:\Users\jenkins\workspace\Lucene-Solr-master-Windows\solr\build\contrib\solr-analytics\test\J1\temp\solr.analytics.facet.PivotFacetTest_F45300399E9F81A7-001\tempDir-001\node2\collection1_shard1_replica_n1\data\tlog: java.nio.file.DirectoryNotEmptyException: C:\Users\jenkins\workspace\Lucene-Solr-master-Windows\solr\build\contrib\solr-analytics\test\J1\temp\solr.analytics.facet.PivotFacetTest_F45300399E9F81A7-001\tempDir-001\node2\collection1_shard1_replica_n1\data\tlog
   [junit4]    >    C:\Users\jenkins\workspace\Lucene-Solr-master-Windows\solr\build\contrib\solr-analytics\test\J1\temp\solr.analytics.facet.PivotFacetTest_F45300399E9F81A7-001\tempDir-001\node2\collection1_shard1_replica_n1\data: java.nio.file.DirectoryNotEmptyException: C:\Users\jenkins\workspace\Lucene-Solr-master-Windows\solr\build\contrib\solr-analytics\test\J1\temp\solr.analytics.facet.PivotFacetTest_F45300399E9F81A7-001\tempDir-001\node2\collection1_shard1_replica_n1\data
   [junit4]    >    C:\Users\jenkins\workspace\Lucene-Solr-master-Windows\solr\build\contrib\solr-analytics\test\J1\temp\solr.analytics.facet.PivotFacetTest_F45300399E9F81A7-001\tempDir-001\node2\collection1_shard1_replica_n1: java.nio.file.DirectoryNotEmptyException: C:\Users\jenkins\workspace\Lucene-Solr-master-Windows\solr\build\contrib\solr-analytics\test\J1\temp\solr.analytics.facet.PivotFacetTest_F45300399E9F81A7-001\tempDir-001\node2\collection1_shard1_replica_n1
   [junit4]    >    C:\Users\jenkins\workspace\Lucene-Solr-master-Windows\solr\build\contrib\solr-analytics\test\J1\temp\solr.analytics.facet.PivotFacetTest_F45300399E9F81A7-001\tempDir-001\node2: java.nio.file.DirectoryNotEmptyException: C:\Users\jenkins\workspace\Lucene-Solr-master-Windows\solr\build\contrib\solr-analytics\test\J1\temp\solr.analytics.facet.PivotFacetTest_F45300399E9F81A7-001\tempDir-001\node2
   [junit4]    >    C:\Users\jenkins\workspace\Lucene-Solr-master-Windows\solr\build\contrib\solr-analytics\test\J1\temp\solr.analytics.facet.PivotFacetTest_F45300399E9F81A7-001\tempDir-001: java.nio.file.DirectoryNotEmptyException: C:\Users\jenkins\workspace\Lucene-Solr-master-Windows\solr\build\contrib\solr-analytics\test\J1\temp\solr.analytics.facet.PivotFacetTest_F45300399E9F81A7-001\tempDir-001
   [junit4]    >    C:\Users\jenkins\workspace\Lucene-Solr-master-Windows\solr\build\contrib\solr-analytics\test\J1\temp\solr.analytics.facet.PivotFacetTest_F45300399E9F81A7-001\tempDir-001\node2\collection1_shard1_replica_n1\data\tlog\tlog.0000000000000000001: java.nio.file.AccessDeniedException: C:\Users\jenkins\workspace\Lucene-Solr-master-Windows\solr\build\contrib\solr-analytics\test\J1\temp\solr.analytics.facet.PivotFacetTest_F45300399E9F81A7-001\tempDir-001\node2\collection1_shard1_replica_n1\data\tlog\tlog.0000000000000000001
   [junit4]    >    C:\Users\jenkins\workspace\Lucene-Solr-master-Windows\solr\build\contrib\solr-analytics\test\J1\temp\solr.analytics.facet.PivotFacetTest_F45300399E9F81A7-001: java.nio.file.DirectoryNotEmptyException: C:\Users\jenkins\workspace\Lucene-Solr-master-Windows\solr\build\contrib\solr-analytics\test\J1\temp\solr.analytics.facet.PivotFacetTest_F45300399E9F81A7-001
   [junit4]    > 	at __randomizedtesting.SeedInfo.seed([F45300399E9F81A7]:0)
   [junit4]    > 	at org.apache.lucene.util.IOUtils.rm(IOUtils.java:329)
   [junit4]    > 	at java.lang.Thread.run(Thread.java:748)
   [junit4] Completed [43/78 (1!)] on J1 in 5.04s, 1 test, 1 error <<< FAILURES!

[...truncated 45015 lines...]

Mime
View raw message