lucene-dev mailing list archives

Site index · List index
Message view « Date » · « Thread »
Top « Date » · « Thread »
From Policeman Jenkins Server <jenk...@thetaphi.de>
Subject [JENKINS] Lucene-Solr-7.x-Windows (64bit/jdk-9.0.1) - Build # 373 - Failure!
Date Mon, 01 Jan 2018 03:37:44 GMT
Build: https://jenkins.thetaphi.de/job/Lucene-Solr-7.x-Windows/373/
Java: 64bit/jdk-9.0.1 -XX:-UseCompressedOops -XX:+UseParallelGC

8 tests failed.
FAILED:  junit.framework.TestSuite.org.apache.solr.handler.dataimport.TestSolrEntityProcessorEndToEnd

Error Message:
Could not remove the following files (in the order of attempts):    C:\Users\jenkins\workspace\Lucene-Solr-7.x-Windows\solr\build\contrib\solr-dataimporthandler\test\J0\temp\solr.handler.dataimport.TestSolrEntityProcessorEndToEnd_D15CAD2F727C59E2-001\tempDir-006\collection1\data\index: java.nio.file.DirectoryNotEmptyException: C:\Users\jenkins\workspace\Lucene-Solr-7.x-Windows\solr\build\contrib\solr-dataimporthandler\test\J0\temp\solr.handler.dataimport.TestSolrEntityProcessorEndToEnd_D15CAD2F727C59E2-001\tempDir-006\collection1\data\index    C:\Users\jenkins\workspace\Lucene-Solr-7.x-Windows\solr\build\contrib\solr-dataimporthandler\test\J0\temp\solr.handler.dataimport.TestSolrEntityProcessorEndToEnd_D15CAD2F727C59E2-001\tempDir-006\collection1\data: java.nio.file.DirectoryNotEmptyException: C:\Users\jenkins\workspace\Lucene-Solr-7.x-Windows\solr\build\contrib\solr-dataimporthandler\test\J0\temp\solr.handler.dataimport.TestSolrEntityProcessorEndToEnd_D15CAD2F727C59E2-001\tempDir-006\collection1\data    C:\Users\jenkins\workspace\Lucene-Solr-7.x-Windows\solr\build\contrib\solr-dataimporthandler\test\J0\temp\solr.handler.dataimport.TestSolrEntityProcessorEndToEnd_D15CAD2F727C59E2-001\tempDir-006\collection1: java.nio.file.DirectoryNotEmptyException: C:\Users\jenkins\workspace\Lucene-Solr-7.x-Windows\solr\build\contrib\solr-dataimporthandler\test\J0\temp\solr.handler.dataimport.TestSolrEntityProcessorEndToEnd_D15CAD2F727C59E2-001\tempDir-006\collection1    C:\Users\jenkins\workspace\Lucene-Solr-7.x-Windows\solr\build\contrib\solr-dataimporthandler\test\J0\temp\solr.handler.dataimport.TestSolrEntityProcessorEndToEnd_D15CAD2F727C59E2-001\tempDir-006: java.nio.file.DirectoryNotEmptyException: C:\Users\jenkins\workspace\Lucene-Solr-7.x-Windows\solr\build\contrib\solr-dataimporthandler\test\J0\temp\solr.handler.dataimport.TestSolrEntityProcessorEndToEnd_D15CAD2F727C59E2-001\tempDir-006    C:\Users\jenkins\workspace\Lucene-Solr-7.x-Windows\solr\build\contrib\solr-dataimporthandler\test\J0\temp\solr.handler.dataimport.TestSolrEntityProcessorEndToEnd_D15CAD2F727C59E2-001\tempDir-006\collection1\data\index\segments_2: java.nio.file.AccessDeniedException: C:\Users\jenkins\workspace\Lucene-Solr-7.x-Windows\solr\build\contrib\solr-dataimporthandler\test\J0\temp\solr.handler.dataimport.TestSolrEntityProcessorEndToEnd_D15CAD2F727C59E2-001\tempDir-006\collection1\data\index\segments_2    C:\Users\jenkins\workspace\Lucene-Solr-7.x-Windows\solr\build\contrib\solr-dataimporthandler\test\J0\temp\solr.handler.dataimport.TestSolrEntityProcessorEndToEnd_D15CAD2F727C59E2-001: java.nio.file.DirectoryNotEmptyException: C:\Users\jenkins\workspace\Lucene-Solr-7.x-Windows\solr\build\contrib\solr-dataimporthandler\test\J0\temp\solr.handler.dataimport.TestSolrEntityProcessorEndToEnd_D15CAD2F727C59E2-001 

Stack Trace:
java.io.IOException: Could not remove the following files (in the order of attempts):
   C:\Users\jenkins\workspace\Lucene-Solr-7.x-Windows\solr\build\contrib\solr-dataimporthandler\test\J0\temp\solr.handler.dataimport.TestSolrEntityProcessorEndToEnd_D15CAD2F727C59E2-001\tempDir-006\collection1\data\index: java.nio.file.DirectoryNotEmptyException: C:\Users\jenkins\workspace\Lucene-Solr-7.x-Windows\solr\build\contrib\solr-dataimporthandler\test\J0\temp\solr.handler.dataimport.TestSolrEntityProcessorEndToEnd_D15CAD2F727C59E2-001\tempDir-006\collection1\data\index
   C:\Users\jenkins\workspace\Lucene-Solr-7.x-Windows\solr\build\contrib\solr-dataimporthandler\test\J0\temp\solr.handler.dataimport.TestSolrEntityProcessorEndToEnd_D15CAD2F727C59E2-001\tempDir-006\collection1\data: java.nio.file.DirectoryNotEmptyException: C:\Users\jenkins\workspace\Lucene-Solr-7.x-Windows\solr\build\contrib\solr-dataimporthandler\test\J0\temp\solr.handler.dataimport.TestSolrEntityProcessorEndToEnd_D15CAD2F727C59E2-001\tempDir-006\collection1\data
   C:\Users\jenkins\workspace\Lucene-Solr-7.x-Windows\solr\build\contrib\solr-dataimporthandler\test\J0\temp\solr.handler.dataimport.TestSolrEntityProcessorEndToEnd_D15CAD2F727C59E2-001\tempDir-006\collection1: java.nio.file.DirectoryNotEmptyException: C:\Users\jenkins\workspace\Lucene-Solr-7.x-Windows\solr\build\contrib\solr-dataimporthandler\test\J0\temp\solr.handler.dataimport.TestSolrEntityProcessorEndToEnd_D15CAD2F727C59E2-001\tempDir-006\collection1
   C:\Users\jenkins\workspace\Lucene-Solr-7.x-Windows\solr\build\contrib\solr-dataimporthandler\test\J0\temp\solr.handler.dataimport.TestSolrEntityProcessorEndToEnd_D15CAD2F727C59E2-001\tempDir-006: java.nio.file.DirectoryNotEmptyException: C:\Users\jenkins\workspace\Lucene-Solr-7.x-Windows\solr\build\contrib\solr-dataimporthandler\test\J0\temp\solr.handler.dataimport.TestSolrEntityProcessorEndToEnd_D15CAD2F727C59E2-001\tempDir-006
   C:\Users\jenkins\workspace\Lucene-Solr-7.x-Windows\solr\build\contrib\solr-dataimporthandler\test\J0\temp\solr.handler.dataimport.TestSolrEntityProcessorEndToEnd_D15CAD2F727C59E2-001\tempDir-006\collection1\data\index\segments_2: java.nio.file.AccessDeniedException: C:\Users\jenkins\workspace\Lucene-Solr-7.x-Windows\solr\build\contrib\solr-dataimporthandler\test\J0\temp\solr.handler.dataimport.TestSolrEntityProcessorEndToEnd_D15CAD2F727C59E2-001\tempDir-006\collection1\data\index\segments_2
   C:\Users\jenkins\workspace\Lucene-Solr-7.x-Windows\solr\build\contrib\solr-dataimporthandler\test\J0\temp\solr.handler.dataimport.TestSolrEntityProcessorEndToEnd_D15CAD2F727C59E2-001: java.nio.file.DirectoryNotEmptyException: C:\Users\jenkins\workspace\Lucene-Solr-7.x-Windows\solr\build\contrib\solr-dataimporthandler\test\J0\temp\solr.handler.dataimport.TestSolrEntityProcessorEndToEnd_D15CAD2F727C59E2-001

	at __randomizedtesting.SeedInfo.seed([D15CAD2F727C59E2]:0)
	at org.apache.lucene.util.IOUtils.rm(IOUtils.java:329)
	at org.apache.lucene.util.TestRuleTemporaryFilesCleanup.afterAlways(TestRuleTemporaryFilesCleanup.java:216)
	at com.carrotsearch.randomizedtesting.rules.TestRuleAdapter$1.afterAlways(TestRuleAdapter.java:31)
	at com.carrotsearch.randomizedtesting.rules.StatementAdapter.evaluate(StatementAdapter.java:43)
	at com.carrotsearch.randomizedtesting.rules.StatementAdapter.evaluate(StatementAdapter.java:36)
	at org.apache.lucene.util.TestRuleAssertionsRequired$1.evaluate(TestRuleAssertionsRequired.java:53)
	at org.apache.lucene.util.TestRuleMarkFailure$1.evaluate(TestRuleMarkFailure.java:47)
	at org.apache.lucene.util.TestRuleIgnoreAfterMaxFailures$1.evaluate(TestRuleIgnoreAfterMaxFailures.java:64)
	at org.apache.lucene.util.TestRuleIgnoreTestSuites$1.evaluate(TestRuleIgnoreTestSuites.java:54)
	at com.carrotsearch.randomizedtesting.rules.StatementAdapter.evaluate(StatementAdapter.java:36)
	at com.carrotsearch.randomizedtesting.ThreadLeakControl$StatementRunner.run(ThreadLeakControl.java:368)
	at java.base/java.lang.Thread.run(Thread.java:844)


FAILED:  org.apache.solr.cloud.autoscaling.sim.TestGenericDistributedQueue.testDistributedQueueBlocking

Error Message:


Stack Trace:
java.util.concurrent.TimeoutException
	at __randomizedtesting.SeedInfo.seed([806926B8BB1B5CD0:C5C354C1FF49E0A4]:0)
	at java.base/java.util.concurrent.FutureTask.get(FutureTask.java:204)
	at org.apache.solr.cloud.autoscaling.sim.TestSimDistributedQueue.testDistributedQueueBlocking(TestSimDistributedQueue.java:101)
	at java.base/jdk.internal.reflect.NativeMethodAccessorImpl.invoke0(Native Method)
	at java.base/jdk.internal.reflect.NativeMethodAccessorImpl.invoke(NativeMethodAccessorImpl.java:62)
	at java.base/jdk.internal.reflect.DelegatingMethodAccessorImpl.invoke(DelegatingMethodAccessorImpl.java:43)
	at java.base/java.lang.reflect.Method.invoke(Method.java:564)
	at com.carrotsearch.randomizedtesting.RandomizedRunner.invoke(RandomizedRunner.java:1737)
	at com.carrotsearch.randomizedtesting.RandomizedRunner$8.evaluate(RandomizedRunner.java:934)
	at com.carrotsearch.randomizedtesting.RandomizedRunner$9.evaluate(RandomizedRunner.java:970)
	at com.carrotsearch.randomizedtesting.RandomizedRunner$10.evaluate(RandomizedRunner.java:984)
	at com.carrotsearch.randomizedtesting.rules.SystemPropertiesRestoreRule$1.evaluate(SystemPropertiesRestoreRule.java:57)
	at org.apache.lucene.util.TestRuleSetupTeardownChained$1.evaluate(TestRuleSetupTeardownChained.java:49)
	at org.apache.lucene.util.AbstractBeforeAfterRule$1.evaluate(AbstractBeforeAfterRule.java:45)
	at org.apache.lucene.util.TestRuleThreadAndTestName$1.evaluate(TestRuleThreadAndTestName.java:48)
	at org.apache.lucene.util.TestRuleIgnoreAfterMaxFailures$1.evaluate(TestRuleIgnoreAfterMaxFailures.java:64)
	at org.apache.lucene.util.TestRuleMarkFailure$1.evaluate(TestRuleMarkFailure.java:47)
	at com.carrotsearch.randomizedtesting.rules.StatementAdapter.evaluate(StatementAdapter.java:36)
	at com.carrotsearch.randomizedtesting.ThreadLeakControl$StatementRunner.run(ThreadLeakControl.java:368)
	at com.carrotsearch.randomizedtesting.ThreadLeakControl.forkTimeoutingTask(ThreadLeakControl.java:817)
	at com.carrotsearch.randomizedtesting.ThreadLeakControl$3.evaluate(ThreadLeakControl.java:468)
	at com.carrotsearch.randomizedtesting.RandomizedRunner.runSingleTest(RandomizedRunner.java:943)
	at com.carrotsearch.randomizedtesting.RandomizedRunner$5.evaluate(RandomizedRunner.java:829)
	at com.carrotsearch.randomizedtesting.RandomizedRunner$6.evaluate(RandomizedRunner.java:879)
	at com.carrotsearch.randomizedtesting.RandomizedRunner$7.evaluate(RandomizedRunner.java:890)
	at com.carrotsearch.randomizedtesting.rules.StatementAdapter.evaluate(StatementAdapter.java:36)
	at com.carrotsearch.randomizedtesting.rules.SystemPropertiesRestoreRule$1.evaluate(SystemPropertiesRestoreRule.java:57)
	at org.apache.lucene.util.AbstractBeforeAfterRule$1.evaluate(AbstractBeforeAfterRule.java:45)
	at com.carrotsearch.randomizedtesting.rules.StatementAdapter.evaluate(StatementAdapter.java:36)
	at org.apache.lucene.util.TestRuleStoreClassName$1.evaluate(TestRuleStoreClassName.java:41)
	at com.carrotsearch.randomizedtesting.rules.NoShadowingOrOverridesOnMethodsRule$1.evaluate(NoShadowingOrOverridesOnMethodsRule.java:40)
	at com.carrotsearch.randomizedtesting.rules.NoShadowingOrOverridesOnMethodsRule$1.evaluate(NoShadowingOrOverridesOnMethodsRule.java:40)
	at com.carrotsearch.randomizedtesting.rules.StatementAdapter.evaluate(StatementAdapter.java:36)
	at com.carrotsearch.randomizedtesting.rules.StatementAdapter.evaluate(StatementAdapter.java:36)
	at org.apache.lucene.util.TestRuleAssertionsRequired$1.evaluate(TestRuleAssertionsRequired.java:53)
	at org.apache.lucene.util.TestRuleMarkFailure$1.evaluate(TestRuleMarkFailure.java:47)
	at org.apache.lucene.util.TestRuleIgnoreAfterMaxFailures$1.evaluate(TestRuleIgnoreAfterMaxFailures.java:64)
	at org.apache.lucene.util.TestRuleIgnoreTestSuites$1.evaluate(TestRuleIgnoreTestSuites.java:54)
	at com.carrotsearch.randomizedtesting.rules.StatementAdapter.evaluate(StatementAdapter.java:36)
	at com.carrotsearch.randomizedtesting.ThreadLeakControl$StatementRunner.run(ThreadLeakControl.java:368)
	at java.base/java.lang.Thread.run(Thread.java:844)


FAILED:  junit.framework.TestSuite.org.apache.solr.cloud.autoscaling.sim.TestGenericDistributedQueue

Error Message:
1 thread leaked from SUITE scope at org.apache.solr.cloud.autoscaling.sim.TestGenericDistributedQueue:     1) Thread[id=16833, name=sdqtest--4671-thread-1, state=TIMED_WAITING, group=TGRP-TestGenericDistributedQueue]         at java.base@9.0.1/jdk.internal.misc.Unsafe.park(Native Method)         at java.base@9.0.1/java.util.concurrent.locks.LockSupport.parkNanos(LockSupport.java:234)         at java.base@9.0.1/java.util.concurrent.locks.AbstractQueuedSynchronizer$ConditionObject.awaitNanos(AbstractQueuedSynchronizer.java:2104)         at app//org.apache.solr.cloud.autoscaling.sim.GenericDistributedQueue.peek(GenericDistributedQueue.java:194)         at app//org.apache.solr.cloud.autoscaling.sim.GenericDistributedQueue.peek(GenericDistributedQueue.java:167)         at app//org.apache.solr.cloud.autoscaling.sim.TestSimDistributedQueue.lambda$testDistributedQueueBlocking$0(TestSimDistributedQueue.java:92)         at app//org.apache.solr.cloud.autoscaling.sim.TestSimDistributedQueue$$Lambda$1004/1561190309.call(Unknown Source)         at java.base@9.0.1/java.util.concurrent.FutureTask.run(FutureTask.java:264)         at app//org.apache.solr.common.util.ExecutorUtil$MDCAwareThreadPoolExecutor.lambda$execute$0(ExecutorUtil.java:188)         at app//org.apache.solr.common.util.ExecutorUtil$MDCAwareThreadPoolExecutor$$Lambda$227/874731739.run(Unknown Source)         at java.base@9.0.1/java.util.concurrent.ThreadPoolExecutor.runWorker(ThreadPoolExecutor.java:1167)         at java.base@9.0.1/java.util.concurrent.ThreadPoolExecutor$Worker.run(ThreadPoolExecutor.java:641)         at java.base@9.0.1/java.lang.Thread.run(Thread.java:844)

Stack Trace:
com.carrotsearch.randomizedtesting.ThreadLeakError: 1 thread leaked from SUITE scope at org.apache.solr.cloud.autoscaling.sim.TestGenericDistributedQueue: 
   1) Thread[id=16833, name=sdqtest--4671-thread-1, state=TIMED_WAITING, group=TGRP-TestGenericDistributedQueue]
        at java.base@9.0.1/jdk.internal.misc.Unsafe.park(Native Method)
        at java.base@9.0.1/java.util.concurrent.locks.LockSupport.parkNanos(LockSupport.java:234)
        at java.base@9.0.1/java.util.concurrent.locks.AbstractQueuedSynchronizer$ConditionObject.awaitNanos(AbstractQueuedSynchronizer.java:2104)
        at app//org.apache.solr.cloud.autoscaling.sim.GenericDistributedQueue.peek(GenericDistributedQueue.java:194)
        at app//org.apache.solr.cloud.autoscaling.sim.GenericDistributedQueue.peek(GenericDistributedQueue.java:167)
        at app//org.apache.solr.cloud.autoscaling.sim.TestSimDistributedQueue.lambda$testDistributedQueueBlocking$0(TestSimDistributedQueue.java:92)
        at app//org.apache.solr.cloud.autoscaling.sim.TestSimDistributedQueue$$Lambda$1004/1561190309.call(Unknown Source)
        at java.base@9.0.1/java.util.concurrent.FutureTask.run(FutureTask.java:264)
        at app//org.apache.solr.common.util.ExecutorUtil$MDCAwareThreadPoolExecutor.lambda$execute$0(ExecutorUtil.java:188)
        at app//org.apache.solr.common.util.ExecutorUtil$MDCAwareThreadPoolExecutor$$Lambda$227/874731739.run(Unknown Source)
        at java.base@9.0.1/java.util.concurrent.ThreadPoolExecutor.runWorker(ThreadPoolExecutor.java:1167)
        at java.base@9.0.1/java.util.concurrent.ThreadPoolExecutor$Worker.run(ThreadPoolExecutor.java:641)
        at java.base@9.0.1/java.lang.Thread.run(Thread.java:844)
	at __randomizedtesting.SeedInfo.seed([806926B8BB1B5CD0]:0)


FAILED:  junit.framework.TestSuite.org.apache.solr.core.TestInfoStreamLogging

Error Message:
Could not remove the following files (in the order of attempts):    C:\Users\jenkins\workspace\Lucene-Solr-7.x-Windows\solr\build\solr-core\test\J1\temp\solr.core.TestInfoStreamLogging_806926B8BB1B5CD0-001\init-core-data-001: java.nio.file.AccessDeniedException: C:\Users\jenkins\workspace\Lucene-Solr-7.x-Windows\solr\build\solr-core\test\J1\temp\solr.core.TestInfoStreamLogging_806926B8BB1B5CD0-001\init-core-data-001 

Stack Trace:
java.io.IOException: Could not remove the following files (in the order of attempts):
   C:\Users\jenkins\workspace\Lucene-Solr-7.x-Windows\solr\build\solr-core\test\J1\temp\solr.core.TestInfoStreamLogging_806926B8BB1B5CD0-001\init-core-data-001: java.nio.file.AccessDeniedException: C:\Users\jenkins\workspace\Lucene-Solr-7.x-Windows\solr\build\solr-core\test\J1\temp\solr.core.TestInfoStreamLogging_806926B8BB1B5CD0-001\init-core-data-001

	at __randomizedtesting.SeedInfo.seed([806926B8BB1B5CD0]:0)
	at org.apache.lucene.util.IOUtils.rm(IOUtils.java:329)
	at org.apache.lucene.util.TestRuleTemporaryFilesCleanup.afterAlways(TestRuleTemporaryFilesCleanup.java:216)
	at com.carrotsearch.randomizedtesting.rules.TestRuleAdapter$1.afterAlways(TestRuleAdapter.java:31)
	at com.carrotsearch.randomizedtesting.rules.StatementAdapter.evaluate(StatementAdapter.java:43)
	at com.carrotsearch.randomizedtesting.rules.StatementAdapter.evaluate(StatementAdapter.java:36)
	at org.apache.lucene.util.TestRuleAssertionsRequired$1.evaluate(TestRuleAssertionsRequired.java:53)
	at org.apache.lucene.util.TestRuleMarkFailure$1.evaluate(TestRuleMarkFailure.java:47)
	at org.apache.lucene.util.TestRuleIgnoreAfterMaxFailures$1.evaluate(TestRuleIgnoreAfterMaxFailures.java:64)
	at org.apache.lucene.util.TestRuleIgnoreTestSuites$1.evaluate(TestRuleIgnoreTestSuites.java:54)
	at com.carrotsearch.randomizedtesting.rules.StatementAdapter.evaluate(StatementAdapter.java:36)
	at com.carrotsearch.randomizedtesting.ThreadLeakControl$StatementRunner.run(ThreadLeakControl.java:368)
	at java.base/java.lang.Thread.run(Thread.java:844)


FAILED:  junit.framework.TestSuite.org.apache.solr.core.TestSolrIndexConfig

Error Message:
Could not remove the following files (in the order of attempts):    C:\Users\jenkins\workspace\Lucene-Solr-7.x-Windows\solr\build\solr-core\test\J1\temp\solr.core.TestSolrIndexConfig_806926B8BB1B5CD0-001\init-core-data-001: java.nio.file.NoSuchFileException: C:\Users\jenkins\workspace\Lucene-Solr-7.x-Windows\solr\build\solr-core\test\J1\temp\solr.core.TestSolrIndexConfig_806926B8BB1B5CD0-001\init-core-data-001 

Stack Trace:
java.io.IOException: Could not remove the following files (in the order of attempts):
   C:\Users\jenkins\workspace\Lucene-Solr-7.x-Windows\solr\build\solr-core\test\J1\temp\solr.core.TestSolrIndexConfig_806926B8BB1B5CD0-001\init-core-data-001: java.nio.file.NoSuchFileException: C:\Users\jenkins\workspace\Lucene-Solr-7.x-Windows\solr\build\solr-core\test\J1\temp\solr.core.TestSolrIndexConfig_806926B8BB1B5CD0-001\init-core-data-001

	at __randomizedtesting.SeedInfo.seed([806926B8BB1B5CD0]:0)
	at org.apache.lucene.util.IOUtils.rm(IOUtils.java:329)
	at org.apache.lucene.util.TestRuleTemporaryFilesCleanup.afterAlways(TestRuleTemporaryFilesCleanup.java:216)
	at com.carrotsearch.randomizedtesting.rules.TestRuleAdapter$1.afterAlways(TestRuleAdapter.java:31)
	at com.carrotsearch.randomizedtesting.rules.StatementAdapter.evaluate(StatementAdapter.java:43)
	at com.carrotsearch.randomizedtesting.rules.StatementAdapter.evaluate(StatementAdapter.java:36)
	at org.apache.lucene.util.TestRuleAssertionsRequired$1.evaluate(TestRuleAssertionsRequired.java:53)
	at org.apache.lucene.util.TestRuleMarkFailure$1.evaluate(TestRuleMarkFailure.java:47)
	at org.apache.lucene.util.TestRuleIgnoreAfterMaxFailures$1.evaluate(TestRuleIgnoreAfterMaxFailures.java:64)
	at org.apache.lucene.util.TestRuleIgnoreTestSuites$1.evaluate(TestRuleIgnoreTestSuites.java:54)
	at com.carrotsearch.randomizedtesting.rules.StatementAdapter.evaluate(StatementAdapter.java:36)
	at com.carrotsearch.randomizedtesting.ThreadLeakControl$StatementRunner.run(ThreadLeakControl.java:368)
	at java.base/java.lang.Thread.run(Thread.java:844)


FAILED:  org.apache.solr.rest.schema.analysis.TestManagedSynonymGraphFilterFactory.testManagedSynonyms

Error Message:
Unable to delete directory C:\Users\jenkins\workspace\Lucene-Solr-7.x-Windows\solr\build\solr-core\test\J0\temp\solr.rest.schema.analysis.TestManagedSynonymGraphFilterFactory_806926B8BB1B5CD0-001\tempDir-001\collection1.

Stack Trace:
java.io.IOException: Unable to delete directory C:\Users\jenkins\workspace\Lucene-Solr-7.x-Windows\solr\build\solr-core\test\J0\temp\solr.rest.schema.analysis.TestManagedSynonymGraphFilterFactory_806926B8BB1B5CD0-001\tempDir-001\collection1.
	at __randomizedtesting.SeedInfo.seed([806926B8BB1B5CD0:321999D23B6F18F4]:0)
	at org.apache.commons.io.FileUtils.deleteDirectory(FileUtils.java:1581)
	at org.apache.commons.io.FileUtils.forceDelete(FileUtils.java:2372)
	at org.apache.commons.io.FileUtils.cleanDirectory(FileUtils.java:1679)
	at org.apache.commons.io.FileUtils.deleteDirectory(FileUtils.java:1575)
	at org.apache.solr.rest.schema.analysis.TestManagedSynonymGraphFilterFactory.after(TestManagedSynonymGraphFilterFactory.java:66)
	at java.base/jdk.internal.reflect.NativeMethodAccessorImpl.invoke0(Native Method)
	at java.base/jdk.internal.reflect.NativeMethodAccessorImpl.invoke(NativeMethodAccessorImpl.java:62)
	at java.base/jdk.internal.reflect.DelegatingMethodAccessorImpl.invoke(DelegatingMethodAccessorImpl.java:43)
	at java.base/java.lang.reflect.Method.invoke(Method.java:564)
	at com.carrotsearch.randomizedtesting.RandomizedRunner.invoke(RandomizedRunner.java:1737)
	at com.carrotsearch.randomizedtesting.RandomizedRunner$10.evaluate(RandomizedRunner.java:992)
	at com.carrotsearch.randomizedtesting.rules.SystemPropertiesRestoreRule$1.evaluate(SystemPropertiesRestoreRule.java:57)
	at org.apache.lucene.util.TestRuleSetupTeardownChained$1.evaluate(TestRuleSetupTeardownChained.java:49)
	at org.apache.lucene.util.AbstractBeforeAfterRule$1.evaluate(AbstractBeforeAfterRule.java:45)
	at org.apache.lucene.util.TestRuleThreadAndTestName$1.evaluate(TestRuleThreadAndTestName.java:48)
	at org.apache.lucene.util.TestRuleIgnoreAfterMaxFailures$1.evaluate(TestRuleIgnoreAfterMaxFailures.java:64)
	at org.apache.lucene.util.TestRuleMarkFailure$1.evaluate(TestRuleMarkFailure.java:47)
	at com.carrotsearch.randomizedtesting.rules.StatementAdapter.evaluate(StatementAdapter.java:36)
	at com.carrotsearch.randomizedtesting.ThreadLeakControl$StatementRunner.run(ThreadLeakControl.java:368)
	at com.carrotsearch.randomizedtesting.ThreadLeakControl.forkTimeoutingTask(ThreadLeakControl.java:817)
	at com.carrotsearch.randomizedtesting.ThreadLeakControl$3.evaluate(ThreadLeakControl.java:468)
	at com.carrotsearch.randomizedtesting.RandomizedRunner.runSingleTest(RandomizedRunner.java:943)
	at com.carrotsearch.randomizedtesting.RandomizedRunner$5.evaluate(RandomizedRunner.java:829)
	at com.carrotsearch.randomizedtesting.RandomizedRunner$6.evaluate(RandomizedRunner.java:879)
	at com.carrotsearch.randomizedtesting.RandomizedRunner$7.evaluate(RandomizedRunner.java:890)
	at com.carrotsearch.randomizedtesting.rules.StatementAdapter.evaluate(StatementAdapter.java:36)
	at com.carrotsearch.randomizedtesting.rules.SystemPropertiesRestoreRule$1.evaluate(SystemPropertiesRestoreRule.java:57)
	at org.apache.lucene.util.AbstractBeforeAfterRule$1.evaluate(AbstractBeforeAfterRule.java:45)
	at com.carrotsearch.randomizedtesting.rules.StatementAdapter.evaluate(StatementAdapter.java:36)
	at org.apache.lucene.util.TestRuleStoreClassName$1.evaluate(TestRuleStoreClassName.java:41)
	at com.carrotsearch.randomizedtesting.rules.NoShadowingOrOverridesOnMethodsRule$1.evaluate(NoShadowingOrOverridesOnMethodsRule.java:40)
	at com.carrotsearch.randomizedtesting.rules.NoShadowingOrOverridesOnMethodsRule$1.evaluate(NoShadowingOrOverridesOnMethodsRule.java:40)
	at com.carrotsearch.randomizedtesting.rules.StatementAdapter.evaluate(StatementAdapter.java:36)
	at com.carrotsearch.randomizedtesting.rules.StatementAdapter.evaluate(StatementAdapter.java:36)
	at org.apache.lucene.util.TestRuleAssertionsRequired$1.evaluate(TestRuleAssertionsRequired.java:53)
	at org.apache.lucene.util.TestRuleMarkFailure$1.evaluate(TestRuleMarkFailure.java:47)
	at org.apache.lucene.util.TestRuleIgnoreAfterMaxFailures$1.evaluate(TestRuleIgnoreAfterMaxFailures.java:64)
	at org.apache.lucene.util.TestRuleIgnoreTestSuites$1.evaluate(TestRuleIgnoreTestSuites.java:54)
	at com.carrotsearch.randomizedtesting.rules.StatementAdapter.evaluate(StatementAdapter.java:36)
	at com.carrotsearch.randomizedtesting.ThreadLeakControl$StatementRunner.run(ThreadLeakControl.java:368)
	at java.base/java.lang.Thread.run(Thread.java:844)


FAILED:  junit.framework.TestSuite.org.apache.solr.rest.schema.analysis.TestManagedSynonymGraphFilterFactory

Error Message:
1 thread leaked from SUITE scope at org.apache.solr.rest.schema.analysis.TestManagedSynonymGraphFilterFactory:     1) Thread[id=15826, name=Connection evictor, state=TIMED_WAITING, group=TGRP-TestManagedSynonymGraphFilterFactory]         at java.base@9.0.1/java.lang.Thread.sleep(Native Method)         at app//org.apache.http.impl.client.IdleConnectionEvictor$1.run(IdleConnectionEvictor.java:66)         at java.base@9.0.1/java.lang.Thread.run(Thread.java:844)

Stack Trace:
com.carrotsearch.randomizedtesting.ThreadLeakError: 1 thread leaked from SUITE scope at org.apache.solr.rest.schema.analysis.TestManagedSynonymGraphFilterFactory: 
   1) Thread[id=15826, name=Connection evictor, state=TIMED_WAITING, group=TGRP-TestManagedSynonymGraphFilterFactory]
        at java.base@9.0.1/java.lang.Thread.sleep(Native Method)
        at app//org.apache.http.impl.client.IdleConnectionEvictor$1.run(IdleConnectionEvictor.java:66)
        at java.base@9.0.1/java.lang.Thread.run(Thread.java:844)
	at __randomizedtesting.SeedInfo.seed([806926B8BB1B5CD0]:0)


FAILED:  junit.framework.TestSuite.org.apache.solr.update.processor.TestOpenNLPExtractNamedEntitiesUpdateProcessorFactory

Error Message:
Could not remove the following files (in the order of attempts):    C:\Users\jenkins\workspace\Lucene-Solr-7.x-Windows\solr\build\contrib\solr-analysis-extras\test\J1\temp\solr.update.processor.TestOpenNLPExtractNamedEntitiesUpdateProcessorFactory_1E3C145D69161F51-001\tempDir-001\collection1\conf: java.nio.file.DirectoryNotEmptyException: C:\Users\jenkins\workspace\Lucene-Solr-7.x-Windows\solr\build\contrib\solr-analysis-extras\test\J1\temp\solr.update.processor.TestOpenNLPExtractNamedEntitiesUpdateProcessorFactory_1E3C145D69161F51-001\tempDir-001\collection1\conf    C:\Users\jenkins\workspace\Lucene-Solr-7.x-Windows\solr\build\contrib\solr-analysis-extras\test\J1\temp\solr.update.processor.TestOpenNLPExtractNamedEntitiesUpdateProcessorFactory_1E3C145D69161F51-001\tempDir-001\collection1: java.nio.file.DirectoryNotEmptyException: C:\Users\jenkins\workspace\Lucene-Solr-7.x-Windows\solr\build\contrib\solr-analysis-extras\test\J1\temp\solr.update.processor.TestOpenNLPExtractNamedEntitiesUpdateProcessorFactory_1E3C145D69161F51-001\tempDir-001\collection1    C:\Users\jenkins\workspace\Lucene-Solr-7.x-Windows\solr\build\contrib\solr-analysis-extras\test\J1\temp\solr.update.processor.TestOpenNLPExtractNamedEntitiesUpdateProcessorFactory_1E3C145D69161F51-001\tempDir-001: java.nio.file.DirectoryNotEmptyException: C:\Users\jenkins\workspace\Lucene-Solr-7.x-Windows\solr\build\contrib\solr-analysis-extras\test\J1\temp\solr.update.processor.TestOpenNLPExtractNamedEntitiesUpdateProcessorFactory_1E3C145D69161F51-001\tempDir-001    C:\Users\jenkins\workspace\Lucene-Solr-7.x-Windows\solr\build\contrib\solr-analysis-extras\test\J1\temp\solr.update.processor.TestOpenNLPExtractNamedEntitiesUpdateProcessorFactory_1E3C145D69161F51-001\tempDir-001\collection1\conf\en-test-sent.bin: java.nio.file.AccessDeniedException: C:\Users\jenkins\workspace\Lucene-Solr-7.x-Windows\solr\build\contrib\solr-analysis-extras\test\J1\temp\solr.update.processor.TestOpenNLPExtractNamedEntitiesUpdateProcessorFactory_1E3C145D69161F51-001\tempDir-001\collection1\conf\en-test-sent.bin    C:\Users\jenkins\workspace\Lucene-Solr-7.x-Windows\solr\build\contrib\solr-analysis-extras\test\J1\temp\solr.update.processor.TestOpenNLPExtractNamedEntitiesUpdateProcessorFactory_1E3C145D69161F51-001\tempDir-001\collection1\conf\en-test-tokenizer.bin: java.nio.file.AccessDeniedException: C:\Users\jenkins\workspace\Lucene-Solr-7.x-Windows\solr\build\contrib\solr-analysis-extras\test\J1\temp\solr.update.processor.TestOpenNLPExtractNamedEntitiesUpdateProcessorFactory_1E3C145D69161F51-001\tempDir-001\collection1\conf\en-test-tokenizer.bin    C:\Users\jenkins\workspace\Lucene-Solr-7.x-Windows\solr\build\contrib\solr-analysis-extras\test\J1\temp\solr.update.processor.TestOpenNLPExtractNamedEntitiesUpdateProcessorFactory_1E3C145D69161F51-001\tempDir-001\collection1\conf\en-test-ner-person.bin: java.nio.file.AccessDeniedException: C:\Users\jenkins\workspace\Lucene-Solr-7.x-Windows\solr\build\contrib\solr-analysis-extras\test\J1\temp\solr.update.processor.TestOpenNLPExtractNamedEntitiesUpdateProcessorFactory_1E3C145D69161F51-001\tempDir-001\collection1\conf\en-test-ner-person.bin    C:\Users\jenkins\workspace\Lucene-Solr-7.x-Windows\solr\build\contrib\solr-analysis-extras\test\J1\temp\solr.update.processor.TestOpenNLPExtractNamedEntitiesUpdateProcessorFactory_1E3C145D69161F51-001: java.nio.file.DirectoryNotEmptyException: C:\Users\jenkins\workspace\Lucene-Solr-7.x-Windows\solr\build\contrib\solr-analysis-extras\test\J1\temp\solr.update.processor.TestOpenNLPExtractNamedEntitiesUpdateProcessorFactory_1E3C145D69161F51-001 

Stack Trace:
java.io.IOException: Could not remove the following files (in the order of attempts):
   C:\Users\jenkins\workspace\Lucene-Solr-7.x-Windows\solr\build\contrib\solr-analysis-extras\test\J1\temp\solr.update.processor.TestOpenNLPExtractNamedEntitiesUpdateProcessorFactory_1E3C145D69161F51-001\tempDir-001\collection1\conf: java.nio.file.DirectoryNotEmptyException: C:\Users\jenkins\workspace\Lucene-Solr-7.x-Windows\solr\build\contrib\solr-analysis-extras\test\J1\temp\solr.update.processor.TestOpenNLPExtractNamedEntitiesUpdateProcessorFactory_1E3C145D69161F51-001\tempDir-001\collection1\conf
   C:\Users\jenkins\workspace\Lucene-Solr-7.x-Windows\solr\build\contrib\solr-analysis-extras\test\J1\temp\solr.update.processor.TestOpenNLPExtractNamedEntitiesUpdateProcessorFactory_1E3C145D69161F51-001\tempDir-001\collection1: java.nio.file.DirectoryNotEmptyException: C:\Users\jenkins\workspace\Lucene-Solr-7.x-Windows\solr\build\contrib\solr-analysis-extras\test\J1\temp\solr.update.processor.TestOpenNLPExtractNamedEntitiesUpdateProcessorFactory_1E3C145D69161F51-001\tempDir-001\collection1
   C:\Users\jenkins\workspace\Lucene-Solr-7.x-Windows\solr\build\contrib\solr-analysis-extras\test\J1\temp\solr.update.processor.TestOpenNLPExtractNamedEntitiesUpdateProcessorFactory_1E3C145D69161F51-001\tempDir-001: java.nio.file.DirectoryNotEmptyException: C:\Users\jenkins\workspace\Lucene-Solr-7.x-Windows\solr\build\contrib\solr-analysis-extras\test\J1\temp\solr.update.processor.TestOpenNLPExtractNamedEntitiesUpdateProcessorFactory_1E3C145D69161F51-001\tempDir-001
   C:\Users\jenkins\workspace\Lucene-Solr-7.x-Windows\solr\build\contrib\solr-analysis-extras\test\J1\temp\solr.update.processor.TestOpenNLPExtractNamedEntitiesUpdateProcessorFactory_1E3C145D69161F51-001\tempDir-001\collection1\conf\en-test-sent.bin: java.nio.file.AccessDeniedException: C:\Users\jenkins\workspace\Lucene-Solr-7.x-Windows\solr\build\contrib\solr-analysis-extras\test\J1\temp\solr.update.processor.TestOpenNLPExtractNamedEntitiesUpdateProcessorFactory_1E3C145D69161F51-001\tempDir-001\collection1\conf\en-test-sent.bin
   C:\Users\jenkins\workspace\Lucene-Solr-7.x-Windows\solr\build\contrib\solr-analysis-extras\test\J1\temp\solr.update.processor.TestOpenNLPExtractNamedEntitiesUpdateProcessorFactory_1E3C145D69161F51-001\tempDir-001\collection1\conf\en-test-tokenizer.bin: java.nio.file.AccessDeniedException: C:\Users\jenkins\workspace\Lucene-Solr-7.x-Windows\solr\build\contrib\solr-analysis-extras\test\J1\temp\solr.update.processor.TestOpenNLPExtractNamedEntitiesUpdateProcessorFactory_1E3C145D69161F51-001\tempDir-001\collection1\conf\en-test-tokenizer.bin
   C:\Users\jenkins\workspace\Lucene-Solr-7.x-Windows\solr\build\contrib\solr-analysis-extras\test\J1\temp\solr.update.processor.TestOpenNLPExtractNamedEntitiesUpdateProcessorFactory_1E3C145D69161F51-001\tempDir-001\collection1\conf\en-test-ner-person.bin: java.nio.file.AccessDeniedException: C:\Users\jenkins\workspace\Lucene-Solr-7.x-Windows\solr\build\contrib\solr-analysis-extras\test\J1\temp\solr.update.processor.TestOpenNLPExtractNamedEntitiesUpdateProcessorFactory_1E3C145D69161F51-001\tempDir-001\collection1\conf\en-test-ner-person.bin
   C:\Users\jenkins\workspace\Lucene-Solr-7.x-Windows\solr\build\contrib\solr-analysis-extras\test\J1\temp\solr.update.processor.TestOpenNLPExtractNamedEntitiesUpdateProcessorFactory_1E3C145D69161F51-001: java.nio.file.DirectoryNotEmptyException: C:\Users\jenkins\workspace\Lucene-Solr-7.x-Windows\solr\build\contrib\solr-analysis-extras\test\J1\temp\solr.update.processor.TestOpenNLPExtractNamedEntitiesUpdateProcessorFactory_1E3C145D69161F51-001

	at __randomizedtesting.SeedInfo.seed([1E3C145D69161F51]:0)
	at org.apache.lucene.util.IOUtils.rm(IOUtils.java:329)
	at org.apache.lucene.util.TestRuleTemporaryFilesCleanup.afterAlways(TestRuleTemporaryFilesCleanup.java:216)
	at com.carrotsearch.randomizedtesting.rules.TestRuleAdapter$1.afterAlways(TestRuleAdapter.java:31)
	at com.carrotsearch.randomizedtesting.rules.StatementAdapter.evaluate(StatementAdapter.java:43)
	at com.carrotsearch.randomizedtesting.rules.StatementAdapter.evaluate(StatementAdapter.java:36)
	at org.apache.lucene.util.TestRuleAssertionsRequired$1.evaluate(TestRuleAssertionsRequired.java:53)
	at org.apache.lucene.util.TestRuleMarkFailure$1.evaluate(TestRuleMarkFailure.java:47)
	at org.apache.lucene.util.TestRuleIgnoreAfterMaxFailures$1.evaluate(TestRuleIgnoreAfterMaxFailures.java:64)
	at org.apache.lucene.util.TestRuleIgnoreTestSuites$1.evaluate(TestRuleIgnoreTestSuites.java:54)
	at com.carrotsearch.randomizedtesting.rules.StatementAdapter.evaluate(StatementAdapter.java:36)
	at com.carrotsearch.randomizedtesting.ThreadLeakControl$StatementRunner.run(ThreadLeakControl.java:368)
	at java.base/java.lang.Thread.run(Thread.java:844)




Build Log:
[...truncated 12415 lines...]
   [junit4] Suite: org.apache.solr.rest.schema.analysis.TestManagedSynonymGraphFilterFactory
   [junit4]   2> 1853132 INFO  (SUITE-TestManagedSynonymGraphFilterFactory-seed#[806926B8BB1B5CD0]-worker) [    ] o.a.s.SolrTestCaseJ4 SecureRandom sanity checks: test.solr.allowed.securerandom=null & java.security.egd=file:/dev/./urandom
   [junit4]   2> Creating dataDir: C:\Users\jenkins\workspace\Lucene-Solr-7.x-Windows\solr\build\solr-core\test\J0\temp\solr.rest.schema.analysis.TestManagedSynonymGraphFilterFactory_806926B8BB1B5CD0-001\init-core-data-001
   [junit4]   2> 1853133 WARN  (SUITE-TestManagedSynonymGraphFilterFactory-seed#[806926B8BB1B5CD0]-worker) [    ] o.a.s.SolrTestCaseJ4 startTrackingSearchers: numOpens=27 numCloses=27
   [junit4]   2> 1853134 INFO  (SUITE-TestManagedSynonymGraphFilterFactory-seed#[806926B8BB1B5CD0]-worker) [    ] o.a.s.SolrTestCaseJ4 Using PointFields (NUMERIC_POINTS_SYSPROP=true) w/NUMERIC_DOCVALUES_SYSPROP=true
   [junit4]   2> 1853136 INFO  (SUITE-TestManagedSynonymGraphFilterFactory-seed#[806926B8BB1B5CD0]-worker) [    ] o.a.s.SolrTestCaseJ4 Randomized ssl (false) and clientAuth (false) via: @org.apache.solr.util.RandomizeSSL(reason="", value=0.0/0.0, ssl=0.0/0.0, clientAuth=0.0/0.0)
   [junit4]   2> 1853138 INFO  (TEST-TestManagedSynonymGraphFilterFactory.testManagedSynonyms-seed#[806926B8BB1B5CD0]) [    ] o.a.s.SolrTestCaseJ4 ###Starting testManagedSynonyms
   [junit4]   2> 1854326 INFO  (TEST-TestManagedSynonymGraphFilterFactory.testManagedSynonyms-seed#[806926B8BB1B5CD0]) [    ] o.a.s.SolrTestCaseJ4 ####initCore
   [junit4]   2> 1854326 INFO  (TEST-TestManagedSynonymGraphFilterFactory.testManagedSynonyms-seed#[806926B8BB1B5CD0]) [    ] o.a.s.SolrTestCaseJ4 ####initCore end
   [junit4]   2> 1854326 INFO  (TEST-TestManagedSynonymGraphFilterFactory.testManagedSynonyms-seed#[806926B8BB1B5CD0]) [    ] o.a.s.SolrTestCaseJ4 Writing core.properties file to C:\Users\jenkins\workspace\Lucene-Solr-7.x-Windows\solr\build\solr-core\test\J0\temp\solr.rest.schema.analysis.TestManagedSynonymGraphFilterFactory_806926B8BB1B5CD0-001\tempDir-003\cores\core
   [junit4]   2> 1854339 INFO  (TEST-TestManagedSynonymGraphFilterFactory.testManagedSynonyms-seed#[806926B8BB1B5CD0]) [    ] o.e.j.s.Server jetty-9.3.20.v20170531
   [junit4]   2> 1854339 INFO  (TEST-TestManagedSynonymGraphFilterFactory.testManagedSynonyms-seed#[806926B8BB1B5CD0]) [    ] o.e.j.s.h.ContextHandler Started o.e.j.s.ServletContextHandler@386728f9{/solr,null,AVAILABLE}
   [junit4]   2> 1854353 INFO  (TEST-TestManagedSynonymGraphFilterFactory.testManagedSynonyms-seed#[806926B8BB1B5CD0]) [    ] o.e.j.s.AbstractConnector Started ServerConnector@6493e4a1{HTTP/1.1,[http/1.1]}{127.0.0.1:55230}
   [junit4]   2> 1854353 INFO  (TEST-TestManagedSynonymGraphFilterFactory.testManagedSynonyms-seed#[806926B8BB1B5CD0]) [    ] o.e.j.s.Server Started @1864241ms
   [junit4]   2> 1854353 INFO  (TEST-TestManagedSynonymGraphFilterFactory.testManagedSynonyms-seed#[806926B8BB1B5CD0]) [    ] o.a.s.c.s.e.JettySolrRunner Jetty properties: {hostContext=/solr, configSetBaseDir=C:\Users\jenkins\workspace\Lucene-Solr-7.x-Windows\solr\build\solr-core\test\J0\temp\solr.rest.schema.analysis.TestManagedSynonymGraphFilterFactory_806926B8BB1B5CD0-001\tempDir-001, hostPort=55230, coreRootDirectory=C:\Users\jenkins\workspace\Lucene-Solr-7.x-Windows\solr\build\solr-core\test\J0\temp\solr.rest.schema.analysis.TestManagedSynonymGraphFilterFactory_806926B8BB1B5CD0-001\tempDir-003\cores}
   [junit4]   2> 1854353 ERROR (TEST-TestManagedSynonymGraphFilterFactory.testManagedSynonyms-seed#[806926B8BB1B5CD0]) [    ] o.a.s.u.StartupLoggingUtils Missing Java Option solr.log.dir. Logging may be missing or incomplete.
   [junit4]   2> 1854353 INFO  (TEST-TestManagedSynonymGraphFilterFactory.testManagedSynonyms-seed#[806926B8BB1B5CD0]) [    ] o.a.s.s.SolrDispatchFilter  ___      _       Welcome to Apache Solr? version 7.3.0
   [junit4]   2> 1854353 INFO  (TEST-TestManagedSynonymGraphFilterFactory.testManagedSynonyms-seed#[806926B8BB1B5CD0]) [    ] o.a.s.s.SolrDispatchFilter / __| ___| |_ _   Starting in standalone mode on port null
   [junit4]   2> 1854353 INFO  (TEST-TestManagedSynonymGraphFilterFactory.testManagedSynonyms-seed#[806926B8BB1B5CD0]) [    ] o.a.s.s.SolrDispatchFilter \__ \/ _ \ | '_|  Install dir: null
   [junit4]   2> 1854353 INFO  (TEST-TestManagedSynonymGraphFilterFactory.testManagedSynonyms-seed#[806926B8BB1B5CD0]) [    ] o.a.s.s.SolrDispatchFilter |___/\___/_|_|    Start time: 2018-01-01T02:45:50.043706700Z
   [junit4]   2> 1854353 INFO  (TEST-TestManagedSynonymGraphFilterFactory.testManagedSynonyms-seed#[806926B8BB1B5CD0]) [    ] o.a.s.c.SolrXmlConfig Loading container configuration from C:\Users\jenkins\workspace\Lucene-Solr-7.x-Windows\solr\build\solr-core\test\J0\temp\solr.rest.schema.analysis.TestManagedSynonymGraphFilterFactory_806926B8BB1B5CD0-001\tempDir-001\solr.xml
   [junit4]   2> 1854403 INFO  (TEST-TestManagedSynonymGraphFilterFactory.testManagedSynonyms-seed#[806926B8BB1B5CD0]) [    ] o.a.s.c.SolrXmlConfig Configuration parameter autoReplicaFailoverWorkLoopDelay is ignored
   [junit4]   2> 1854403 INFO  (TEST-TestManagedSynonymGraphFilterFactory.testManagedSynonyms-seed#[806926B8BB1B5CD0]) [    ] o.a.s.c.SolrXmlConfig Configuration parameter autoReplicaFailoverBadNodeExpiration is ignored
   [junit4]   2> 1854403 INFO  (TEST-TestManagedSynonymGraphFilterFactory.testManagedSynonyms-seed#[806926B8BB1B5CD0]) [    ] o.a.s.c.SolrXmlConfig MBean server found: com.sun.jmx.mbeanserver.JmxMBeanServer@6f39ea77, but no JMX reporters were configured - adding default JMX reporter.
   [junit4]   2> 1854508 INFO  (TEST-TestManagedSynonymGraphFilterFactory.testManagedSynonyms-seed#[806926B8BB1B5CD0]) [    ] o.a.s.m.r.SolrJmxReporter JMX monitoring for 'solr.node' (registry 'solr.node') enabled at server: com.sun.jmx.mbeanserver.JmxMBeanServer@6f39ea77
   [junit4]   2> 1854537 INFO  (TEST-TestManagedSynonymGraphFilterFactory.testManagedSynonyms-seed#[806926B8BB1B5CD0]) [    ] o.a.s.m.r.SolrJmxReporter JMX monitoring for 'solr.jvm' (registry 'solr.jvm') enabled at server: com.sun.jmx.mbeanserver.JmxMBeanServer@6f39ea77
   [junit4]   2> 1854537 INFO  (TEST-TestManagedSynonymGraphFilterFactory.testManagedSynonyms-seed#[806926B8BB1B5CD0]) [    ] o.a.s.m.r.SolrJmxReporter JMX monitoring for 'solr.jetty' (registry 'solr.jetty') enabled at server: com.sun.jmx.mbeanserver.JmxMBeanServer@6f39ea77
   [junit4]   2> 1854537 INFO  (TEST-TestManagedSynonymGraphFilterFactory.testManagedSynonyms-seed#[806926B8BB1B5CD0]) [    ] o.a.s.c.CorePropertiesLocator Found 1 core definitions underneath C:\Users\jenkins\workspace\Lucene-Solr-7.x-Windows\solr\build\solr-core\test\J0\temp\solr.rest.schema.analysis.TestManagedSynonymGraphFilterFactory_806926B8BB1B5CD0-001\tempDir-003\cores
   [junit4]   2> 1854537 INFO  (TEST-TestManagedSynonymGraphFilterFactory.testManagedSynonyms-seed#[806926B8BB1B5CD0]) [    ] o.a.s.c.CorePropertiesLocator Cores are: [collection1]
   [junit4]   2> 1854546 INFO  (coreLoadExecutor-4484-thread-1) [    ] o.a.s.c.TransientSolrCoreCacheDefault Allocating transient cache for 4 transient cores
   [junit4]   2> 1854548 INFO  (coreLoadExecutor-4484-thread-1) [    x:collection1] o.a.s.c.SolrResourceLoader [null] Added 2 libs to classloader, from paths: [/C:/Users/jenkins/workspace/Lucene-Solr-7.x-Windows/solr/build/solr-core/test/J0/temp/solr.rest.schema.analysis.TestManagedSynonymGraphFilterFactory_806926B8BB1B5CD0-001/tempDir-001/collection1/lib, /C:/Users/jenkins/workspace/Lucene-Solr-7.x-Windows/solr/build/solr-core/test/J0/temp/solr.rest.schema.analysis.TestManagedSynonymGraphFilterFactory_806926B8BB1B5CD0-001/tempDir-001/collection1/lib/classes]
   [junit4]   2> 1854609 INFO  (coreLoadExecutor-4484-thread-1) [    x:collection1] o.a.s.c.SolrConfig Using Lucene MatchVersion: 7.3.0
   [junit4]   2> 1854624 INFO  (coreLoadExecutor-4484-thread-1) [    x:collection1] o.a.s.s.ManagedIndexSchemaFactory The schema is configured as managed, but managed schema resource managed-schema not found - loading non-managed schema schema-rest.xml instead
   [junit4]   2> 1854632 INFO  (coreLoadExecutor-4484-thread-1) [    x:collection1] o.a.s.s.IndexSchema [collection1] Schema name=test-rest
   [junit4]   2> 1854834 WARN  (coreLoadExecutor-4484-thread-1) [    x:collection1] o.a.s.s.IndexSchema Field title is not multivalued and destination for multiple copyFields (3)
   [junit4]   2> 1854846 INFO  (coreLoadExecutor-4484-thread-1) [    x:collection1] o.a.s.r.RestManager Registered ManagedResource impl org.apache.solr.rest.schema.analysis.ManagedWordSetResource for path /schema/analysis/stopwords/german
   [junit4]   2> 1854846 INFO  (coreLoadExecutor-4484-thread-1) [    x:collection1] o.a.s.r.RestManager Registered ManagedResource impl org.apache.solr.rest.schema.analysis.ManagedSynonymFilterFactory$SynonymManager for path /schema/analysis/synonyms/german
   [junit4]   2> 1854846 INFO  (coreLoadExecutor-4484-thread-1) [    x:collection1] o.a.s.r.RestManager Registered ManagedResource impl org.apache.solr.rest.schema.analysis.ManagedWordSetResource for path /schema/analysis/stopwords/english
   [junit4]   2> 1854846 INFO  (coreLoadExecutor-4484-thread-1) [    x:collection1] o.a.s.r.RestManager Registered ManagedResource impl org.apache.solr.rest.schema.analysis.ManagedSynonymGraphFilterFactory$SynonymManager for path /schema/analysis/synonyms/englishgraph
   [junit4]   2> 1854846 INFO  (coreLoadExecutor-4484-thread-1) [    x:collection1] o.a.s.r.RestManager Added observer of type org.apache.solr.rest.schema.analysis.ManagedStopFilterFactory to existing ManagedResource /schema/analysis/stopwords/english
   [junit4]   2> 1854846 INFO  (coreLoadExecutor-4484-thread-1) [    x:collection1] o.a.s.r.RestManager Added observer of type org.apache.solr.rest.schema.analysis.ManagedSynonymGraphFilterFactory to existing ManagedResource /schema/analysis/synonyms/englishgraph
   [junit4]   2> 1854851 INFO  (coreLoadExecutor-4484-thread-1) [    x:collection1] o.a.s.r.RestManager Added observer of type org.apache.solr.rest.schema.analysis.ManagedStopFilterFactory to existing ManagedResource /schema/analysis/stopwords/german
   [junit4]   2> 1854851 INFO  (coreLoadExecutor-4484-thread-1) [    x:collection1] o.a.s.r.RestManager Registered ManagedResource impl org.apache.solr.rest.schema.analysis.ManagedSynonymGraphFilterFactory$SynonymManager for path /schema/analysis/synonyms/germangraph
   [junit4]   2> 1854851 INFO  (coreLoadExecutor-4484-thread-1) [    x:collection1] o.a.s.r.RestManager Added observer of type org.apache.solr.rest.schema.analysis.ManagedStopFilterFactory to existing ManagedResource /schema/analysis/stopwords/german
   [junit4]   2> 1854852 INFO  (coreLoadExecutor-4484-thread-1) [    x:collection1] o.a.s.r.RestManager Added observer of type org.apache.solr.rest.schema.analysis.ManagedSynonymGraphFilterFactory to existing ManagedResource /schema/analysis/synonyms/germangraph
   [junit4]   2> 1854862 INFO  (coreLoadExecutor-4484-thread-1) [    x:collection1] o.a.s.r.RestManager Added observer of type org.apache.solr.rest.schema.analysis.ManagedStopFilterFactory to existing ManagedResource /schema/analysis/stopwords/english
   [junit4]   2> 1854862 INFO  (coreLoadExecutor-4484-thread-1) [    x:collection1] o.a.s.r.RestManager Registered ManagedResource impl org.apache.solr.rest.schema.analysis.ManagedSynonymFilterFactory$SynonymManager for path /schema/analysis/synonyms/english
   [junit4]   2> 1854862 INFO  (coreLoadExecutor-4484-thread-1) [    x:collection1] o.a.s.s.IndexSchema Loaded schema test-rest/1.6 with uniqueid field id
   [junit4]   2> 1854888 INFO  (coreLoadExecutor-4484-thread-1) [    x:collection1] o.a.s.r.RestManager Added observer of type org.apache.solr.rest.schema.analysis.ManagedStopFilterFactory to existing ManagedResource /schema/analysis/stopwords/english
   [junit4]   2> 1854888 INFO  (coreLoadExecutor-4484-thread-1) [    x:collection1] o.a.s.r.RestManager Added observer of type org.apache.solr.rest.schema.analysis.ManagedSynonymFilterFactory to existing ManagedResource /schema/analysis/synonyms/english
   [junit4]   2> 1854888 INFO  (coreLoadExecutor-4484-thread-1) [    x:collection1] o.a.s.r.RestManager Added observer of type org.apache.solr.rest.schema.analysis.ManagedStopFilterFactory to existing ManagedResource /schema/analysis/stopwords/german
   [junit4]   2> 1854888 INFO  (coreLoadExecutor-4484-thread-1) [    x:collection1] o.a.s.r.RestManager Added observer of type org.apache.solr.rest.schema.analysis.ManagedSynonymFilterFactory to existing ManagedResource /schema/analysis/synonyms/german
   [junit4]   2> 1854888 INFO  (coreLoadExecutor-4484-thread-1) [    x:collection1] o.a.s.r.RestManager Added observer of type org.apache.solr.rest.schema.analysis.ManagedStopFilterFactory to existing ManagedResource /schema/analysis/stopwords/english
   [junit4]   2> 1854888 INFO  (coreLoadExecutor-4484-thread-1) [    x:collection1] o.a.s.r.RestManager Added observer of type org.apache.solr.rest.schema.analysis.ManagedSynonymGraphFilterFactory to existing ManagedResource /schema/analysis/synonyms/englishgraph
   [junit4]   2> 1854888 INFO  (coreLoadExecutor-4484-thread-1) [    x:collection1] o.a.s.r.RestManager Added observer of type org.apache.solr.rest.schema.analysis.ManagedStopFilterFactory to existing ManagedResource /schema/analysis/stopwords/english
   [junit4]   2> 1854888 INFO  (coreLoadExecutor-4484-thread-1) [    x:collection1] o.a.s.r.RestManager Added observer of type org.apache.solr.rest.schema.analysis.ManagedSynonymGraphFilterFactory to existing ManagedResource /schema/analysis/synonyms/englishgraph
   [junit4]   2> 1854888 INFO  (coreLoadExecutor-4484-thread-1) [    x:collection1] o.a.s.r.RestManager Added observer of type org.apache.solr.rest.schema.analysis.ManagedStopFilterFactory to existing ManagedResource /schema/analysis/stopwords/german
   [junit4]   2> 1854888 INFO  (coreLoadExecutor-4484-thread-1) [    x:collection1] o.a.s.r.RestManager Added observer of type org.apache.solr.rest.schema.analysis.ManagedSynonymGraphFilterFactory to existing ManagedResource /schema/analysis/synonyms/germangraph
   [junit4]   2> 1854888 INFO  (coreLoadExecutor-4484-thread-1) [    x:collection1] o.a.s.r.RestManager Added observer of type org.apache.solr.rest.schema.analysis.ManagedStopFilterFactory to existing ManagedResource /schema/analysis/stopwords/german
   [junit4]   2> 1854888 INFO  (coreLoadExecutor-4484-thread-1) [    x:collection1] o.a.s.r.RestManager Added observer of type org.apache.solr.rest.schema.analysis.ManagedSynonymGraphFilterFactory to existing ManagedResource /schema/analysis/synonyms/germangraph
   [junit4]   2> 1854891 INFO  (coreLoadExecutor-4484-thread-1) [    x:collection1] o.a.s.s.ManagedIndexSchema Upgraded to managed schema at C:\Users\jenkins\workspace\Lucene-Solr-7.x-Windows\solr\build\solr-core\test\J0\temp\solr.rest.schema.analysis.TestManagedSynonymGraphFilterFactory_806926B8BB1B5CD0-001\tempDir-001\collection1\conf\managed-schema
   [junit4]   2> 1854895 INFO  (coreLoadExecutor-4484-thread-1) [    x:collection1] o.a.s.s.ManagedIndexSchemaFactory After upgrading to managed schema, renamed the non-managed schema C:\Users\jenkins\workspace\Lucene-Solr-7.x-Windows\solr\build\solr-core\test\J0\temp\solr.rest.schema.analysis.TestManagedSynonymGraphFilterFactory_806926B8BB1B5CD0-001\tempDir-001\collection1\conf\schema-rest.xml to C:\Users\jenkins\workspace\Lucene-Solr-7.x-Windows\solr\build\solr-core\test\J0\temp\solr.rest.schema.analysis.TestManagedSynonymGraphFilterFactory_806926B8BB1B5CD0-001\tempDir-001\collection1\conf\schema-rest.xml.bak
   [junit4]   2> 1854895 INFO  (coreLoadExecutor-4484-thread-1) [    x:collection1] o.a.s.c.CoreContainer Creating SolrCore 'collection1' using configuration from configset C:\Users\jenkins\workspace\Lucene-Solr-7.x-Windows\solr\build\solr-core\test\J0\temp\solr.rest.schema.analysis.TestManagedSynonymGraphFilterFactory_806926B8BB1B5CD0-001\tempDir-001\collection1, trusted=true
   [junit4]   2> 1854897 INFO  (coreLoadExecutor-4484-thread-1) [    x:collection1] o.a.s.m.r.SolrJmxReporter JMX monitoring for 'solr.core.collection1' (registry 'solr.core.collection1') enabled at server: com.sun.jmx.mbeanserver.JmxMBeanServer@6f39ea77
   [junit4]   2> 1854897 INFO  (coreLoadExecutor-4484-thread-1) [    x:collection1] o.a.s.c.SolrCore solr.RecoveryStrategy.Builder
   [junit4]   2> 1854897 INFO  (coreLoadExecutor-4484-thread-1) [    x:collection1] o.a.s.c.SolrCore [[collection1] ] Opening new SolrCore at [C:\Users\jenkins\workspace\Lucene-Solr-7.x-Windows\solr\build\solr-core\test\J0\temp\solr.rest.schema.analysis.TestManagedSynonymGraphFilterFactory_806926B8BB1B5CD0-001\tempDir-001\collection1], dataDir=[C:\Users\jenkins\workspace\Lucene-Solr-7.x-Windows\solr\build\solr-core\test\J0\temp\solr.rest.schema.analysis.TestManagedSynonymGraphFilterFactory_806926B8BB1B5CD0-001\tempDir-003\cores\core\data\]
   [junit4]   2> 1854920 INFO  (coreLoadExecutor-4484-thread-1) [    x:collection1] o.a.s.u.RandomMergePolicy RandomMergePolicy wrapping class org.apache.lucene.index.LogDocMergePolicy: [LogDocMergePolicy: minMergeSize=1000, mergeFactor=17, maxMergeSize=9223372036854775807, maxMergeSizeForForcedMerge=9223372036854775807, calibrateSizeByDeletes=false, maxMergeDocs=2147483647, maxCFSSegmentSizeMB=8.796093022207999E12, noCFSRatio=1.0]
   [junit4]   2> 1854952 WARN  (coreLoadExecutor-4484-thread-1) [    x:collection1] o.a.s.c.RequestHandlers INVALID paramSet a in requestHandler {type = requestHandler,name = /dump,class = DumpRequestHandler,attributes = {initParams=a, name=/dump, registerPath=/solr,/v2, class=DumpRequestHandler},args = {defaults={a=A,b=B}}}
   [junit4]   2> 1855113 INFO  (coreLoadExecutor-4484-thread-1) [    x:collection1] o.a.s.u.CommitTracker Hard AutoCommit: disabled
   [junit4]   2> 1855113 INFO  (coreLoadExecutor-4484-thread-1) [    x:collection1] o.a.s.u.CommitTracker Soft AutoCommit: disabled
   [junit4]   2> 1855113 INFO  (coreLoadExecutor-4484-thread-1) [    x:collection1] o.a.s.u.RandomMergePolicy RandomMergePolicy wrapping class org.apache.lucene.index.LogDocMergePolicy: [LogDocMergePolicy: minMergeSize=1000, mergeFactor=14, maxMergeSize=9223372036854775807, maxMergeSizeForForcedMerge=9223372036854775807, calibrateSizeByDeletes=false, maxMergeDocs=2147483647, maxCFSSegmentSizeMB=8.796093022207999E12, noCFSRatio=1.0]
   [junit4]   2> 1855122 INFO  (coreLoadExecutor-4484-thread-1) [    x:collection1] o.a.s.s.SolrIndexSearcher Opening [Searcher@6b5d81ce[collection1] main]
   [junit4]   2> 1855131 INFO  (coreLoadExecutor-4484-thread-1) [    x:collection1] o.a.s.r.ManagedResourceStorage File-based storage initialized to use dir: C:\Users\jenkins\workspace\Lucene-Solr-7.x-Windows\solr\build\solr-core\test\J0\temp\solr.rest.schema.analysis.TestManagedSynonymGraphFilterFactory_806926B8BB1B5CD0-001\tempDir-001\collection1\conf
   [junit4]   2> 1855140 WARN  (coreLoadExecutor-4484-thread-1) [    x:collection1] o.a.s.r.ManagedResource No stored data found for /schema/analysis/stopwords/english
   [junit4]   2> 1855143 INFO  (coreLoadExecutor-4484-thread-1) [    x:collection1] o.a.s.r.ManagedResourceStorage Saved JSON object to path _schema_analysis_stopwords_english.json using file:dir=C:\Users\jenkins\workspace\Lucene-Solr-7.x-Windows\solr\build\solr-core\test\J0\temp\solr.rest.schema.analysis.TestManagedSynonymGraphFilterFactory_806926B8BB1B5CD0-001\tempDir-001\collection1\conf
   [junit4]   2> 1855143 INFO  (coreLoadExecutor-4484-thread-1) [    x:collection1] o.a.s.r.s.a.ManagedWordSetResource Loaded 0 words for /schema/analysis/stopwords/english
   [junit4]   2> 1855144 INFO  (coreLoadExecutor-4484-thread-1) [    x:collection1] o.a.s.r.ManagedResource Notified 6 observers of /schema/analysis/stopwords/english
   [junit4]   2> 1855144 WARN  (coreLoadExecutor-4484-thread-1) [    x:collection1] o.a.s.r.ManagedResource No stored data found for /schema/analysis/stopwords/german
   [junit4]   2> 1855145 INFO  (coreLoadExecutor-4484-thread-1) [    x:collection1] o.a.s.r.ManagedResourceStorage Saved JSON object to path _schema_analysis_stopwords_german.json using file:dir=C:\Users\jenkins\workspace\Lucene-Solr-7.x-Windows\solr\build\solr-core\test\J0\temp\solr.rest.schema.analysis.TestManagedSynonymGraphFilterFactory_806926B8BB1B5CD0-001\tempDir-001\collection1\conf
   [junit4]   2> 1855145 INFO  (coreLoadExecutor-4484-thread-1) [    x:collection1] o.a.s.r.s.a.ManagedWordSetResource Loaded 0 words for /schema/analysis/stopwords/german
   [junit4]   2> 1855145 INFO  (coreLoadExecutor-4484-thread-1) [    x:collection1] o.a.s.r.ManagedResource Notified 6 observers of /schema/analysis/stopwords/german
   [junit4]   2> 1855145 WARN  (coreLoadExecutor-4484-thread-1) [    x:collection1] o.a.s.r.ManagedResource No stored data found for /schema/analysis/synonyms/english
   [junit4]   2> 1855145 INFO  (coreLoadExecutor-4484-thread-1) [    x:collection1] o.a.s.r.s.a.ManagedSynonymFilterFactory Loaded 0 synonym mappings for /schema/analysis/synonyms/english
   [junit4]   2> 1855156 INFO  (coreLoadExecutor-4484-thread-1) [    x:collection1] o.a.s.r.ManagedResource Notified 2 observers of /schema/analysis/synonyms/english
   [junit4]   2> 1855156 WARN  (coreLoadExecutor-4484-thread-1) [    x:collection1] o.a.s.r.ManagedResource No stored data found for /schema/analysis/synonyms/englishgraph
   [junit4]   2> 1855156 INFO  (coreLoadExecutor-4484-thread-1) [    x:collection1] o.a.s.r.s.a.ManagedSynonymGraphFilterFactory Loaded 0 synonym mappings for /schema/analysis/synonyms/englishgraph
   [junit4]   2> 1855156 INFO  (coreLoadExecutor-4484-thread-1) [    x:collection1] o.a.s.r.ManagedResource Notified 4 observers of /schema/analysis/synonyms/englishgraph
   [junit4]   2> 1855156 WARN  (coreLoadExecutor-4484-thread-1) [    x:collection1] o.a.s.r.ManagedResource No stored data found for /schema/analysis/synonyms/german
   [junit4]   2> 1855156 INFO  (coreLoadExecutor-4484-thread-1) [    x:collection1] o.a.s.r.s.a.ManagedSynonymFilterFactory Loaded 0 synonym mappings for /schema/analysis/synonyms/german
   [junit4]   2> 1855156 INFO  (coreLoadExecutor-4484-thread-1) [    x:collection1] o.a.s.r.ManagedResource Notified 2 observers of /schema/analysis/synonyms/german
   [junit4]   2> 1855156 WARN  (coreLoadExecutor-4484-thread-1) [    x:collection1] o.a.s.r.ManagedResource No stored data found for /schema/analysis/synonyms/germangraph
   [junit4]   2> 1855156 INFO  (coreLoadExecutor-4484-thread-1) [    x:collection1] o.a.s.r.s.a.ManagedSynonymGraphFilterFactory Loaded 0 synonym mappings for /schema/analysis/synonyms/germangraph
   [junit4]   2> 1855156 INFO  (coreLoadExecutor-4484-thread-1) [    x:collection1] o.a.s.r.ManagedResource Notified 4 observers of /schema/analysis/synonyms/germangraph
   [junit4]   2> 1855156 INFO  (coreLoadExecutor-4484-thread-1) [    x:collection1] o.a.s.h.ReplicationHandler Commits will be reserved for 10000ms.
   [junit4]   2> 1855203 INFO  (searcherExecutor-4485-thread-1-processing-x:collection1) [    x:collection1] o.a.s.c.SolrCore [collection1] Registered new searcher Searcher@6b5d81ce[collection1] main{ExitableDirectoryReader(UninvertingDirectoryReader())}
   [junit4]   2> 1855704 INFO  (TEST-TestManagedSynonymGraphFilterFactory.testManagedSynonyms-seed#[806926B8BB1B5CD0]) [    ] o.a.s.SolrJettyTestBase Jetty Assigned Port#55230
   [junit4]   2> 1855726 INFO  (qtp2021734036-15810) [    x:collection1] /solr SolrSchemaRestApi: [Restlet] ServerServlet: component class is null
   [junit4]   2> 1855759 INFO  (qtp2021734036-15810) [    x:collection1] /solr SolrSchemaRestApi: [Restlet] Attaching application: org.apache.solr.rest.SolrSchemaRestApi@31f19d93 to URI: /solr/schema
   [junit4]   2> ??? 01, 2018 3:45:51 ??? ????? org.restlet.Application start
   [junit4]   2> INFO: Starting org.apache.solr.rest.SolrSchemaRestApi application
   [junit4]   2> 1855801 INFO  (qtp2021734036-15810) [    x:collection1] o.a.s.r.SolrSchemaRestApi createInboundRoot started for /schema
   [junit4]   2> 1855801 INFO  (qtp2021734036-15810) [    x:collection1] o.a.s.r.RestManager Attached managed resource at path: /analysis/stopwords/english
   [junit4]   2> 1855801 INFO  (qtp2021734036-15810) [    x:collection1] o.a.s.r.RestManager Attached managed resource at path: /analysis/stopwords/german
   [junit4]   2> 1855801 INFO  (qtp2021734036-15810) [    x:collection1] o.a.s.r.RestManager Attached managed resource at path: /analysis/synonyms/english
   [junit4]   2> 1855801 INFO  (qtp2021734036-15810) [    x:collection1] o.a.s.r.RestManager Attached managed resource at path: /analysis/synonyms/englishgraph
   [junit4]   2> 1855801 INFO  (qtp2021734036-15810) [    x:collection1] o.a.s.r.RestManager Attached managed resource at path: /analysis/synonyms/german
   [junit4]   2> 1855801 INFO  (qtp2021734036-15810) [    x:collection1] o.a.s.r.RestManager Attached managed resource at path: /analysis/synonyms/germangraph
   [junit4]   2> 1855801 INFO  (qtp2021734036-15810) [    x:collection1] o.a.s.r.RestManager Attached managed resource at path: /managed
   [junit4]   2> 1855801 INFO  (qtp2021734036-15810) [    x:collection1] o.a.s.r.RestManager Attached 7 ManagedResource endpoints to Restlet router: /schema
   [junit4]   2> 1855801 INFO  (qtp2021734036-15810) [    x:collection1] o.a.s.r.SolrSchemaRestApi createInboundRoot complete for /schema
   [junit4]   2> 1855825 INFO  (qtp2021734036-15810) [    x:collection1] o.a.s.r.RestManager Found ManagedResource [org.apache.solr.rest.schema.analysis.ManagedSynonymGraphFilterFactory$SynonymManager@458b8953] for /schema/analysis/synonyms/englishgraph
   [junit4]   2> 1855825 INFO  (qtp2021734036-15810) [    x:collection1] o.a.s.r.RestManager [collection1]  webapp=/solr path=/schema/analysis/synonyms/englishgraph params={indent=on&wt=json} status=0 QTime=103
   [junit4]   2> ??? 01, 2018 3:45:51 ??? ????? org.restlet.engine.log.LogFilter afterHandle
   [junit4]   2> INFO: 2018-01-01	03:45:51	127.0.0.1	-	127.0.0.1	55230	GET	/solr/schema/analysis/synonyms/englishgraph	wt=json&indent=on	200	-	0	66	http://127.0.0.1:55230	Apache-HttpClient/4.5.3 (Java/9.0.1)	-
   [junit4]   2> 1855825 WARN  (qtp2021734036-15810) [    x:collection1] o.e.j.s.ServletHandler Error for /solr/collection1/schema/analysis/synonyms/englishgraph
   [junit4]   2> java.lang.AssertionError: Attempted close of response output stream.
   [junit4]   2> 	at org.apache.solr.servlet.SolrDispatchFilter$2$1.close(SolrDispatchFilter.java:525)
   [junit4]   2> 	at org.eclipse.jetty.server.Dispatcher.commitResponse(Dispatcher.java:270)
   [junit4]   2> 	at org.eclipse.jetty.server.Dispatcher.forward(Dispatcher.java:202)
   [junit4]   2> 	at org.eclipse.jetty.server.Dispatcher.forward(Dispatcher.java:74)
   [junit4]   2> 	at org.apache.solr.servlet.SolrDispatchFilter.doFilter(SolrDispatchFilter.java:391)
   [junit4]   2> 	at org.apache.solr.servlet.SolrDispatchFilter.doFilter(SolrDispatchFilter.java:326)
   [junit4]   2> 	at org.eclipse.jetty.servlet.ServletHandler$CachedChain.doFilter(ServletHandler.java:1759)
   [junit4]   2> 	at org.apache.solr.client.solrj.embedded.JettySolrRunner$DebugFilter.doFilter(JettySolrRunner.java:139)
   [junit4]   2> 	at org.eclipse.jetty.servlet.ServletHandler$CachedChain.doFilter(ServletHandler.java:1759)
   [junit4]   2> 	at org.eclipse.jetty.servlet.ServletHandler.doHandle(ServletHandler.java:582)
   [junit4]   2> 	at org.eclipse.jetty.server.session.SessionHandler.doHandle(SessionHandler.java:224)
   [junit4]   2> 	at org.eclipse.jetty.server.handler.ContextHandler.doHandle(ContextHandler.java:1180)
   [junit4]   2> 	at org.eclipse.jetty.servlet.ServletHandler.doScope(ServletHandler.java:512)
   [junit4]   2> 	at org.eclipse.jetty.server.session.SessionHandler.doScope(SessionHandler.java:185)
   [junit4]   2> 	at org.eclipse.jetty.server.handler.ContextHandler.doScope(ContextHandler.java:1112)
   [junit4]   2> 	at org.eclipse.jetty.server.handler.ScopedHandler.handle(ScopedHandler.java:141)
   [junit4]   2> 	at org.eclipse.jetty.server.handler.gzip.GzipHandler.handle(GzipHandler.java:493)
   [junit4]   2> 	at org.eclipse.jetty.server.handler.HandlerWrapper.handle(HandlerWrapper.java:134)
   [junit4]   2> 	at org.eclipse.jetty.server.Server.handle(Server.java:534)
   [junit4]   2> 	at org.eclipse.jetty.server.HttpChannel.handle(HttpChannel.java:320)
   [junit4]   2> 	at org.eclipse.jetty.server.HttpConnection.onFillable(HttpConnection.java:251)
   [junit4]   2> 	at org.eclipse.jetty.io.AbstractConnection$ReadCallback.succeeded(AbstractConnection.java:283)
   [junit4]   2> 	at org.eclipse.jetty.io.FillInterest.fillable(FillInterest.java:108)
   [junit4]   2> 	at org.eclipse.jetty.io.SelectChannelEndPoint$2.run(SelectChannelEndPoint.java:93)
   [junit4]   2> 	at org.eclipse.jetty.util.thread.strategy.ExecuteProduceConsume.executeProduceConsume(ExecuteProduceConsume.java:303)
   [junit4]   2> 	at org.eclipse.jetty.util.thread.strategy.ExecuteProduceConsume.produceConsume(ExecuteProduceConsume.java:148)
   [junit4]   2> 	at org.eclipse.jetty.util.thread.strategy.ExecuteProduceConsume.execute(ExecuteProduceConsume.java:100)
   [junit4]   2> 	at org.eclipse.jetty.io.ManagedSelector.run(ManagedSelector.java:147)
   [junit4]   2> 	at org.eclipse.jetty.util.thread.QueuedThreadPool.runJob(QueuedThreadPool.java:671)
   [junit4]   2> 	at org.eclipse.jetty.util.thread.QueuedThreadPool$2.run(QueuedThreadPool.java:589)
   [junit4]   2> 	at java.base/java.lang.Thread.run(Thread.java:844)
   [junit4]   2> 1855848 INFO  (qtp2021734036-15812) [    x:collection1] o.a.s.r.RestManager Found ManagedResource [org.apache.solr.rest.schema.analysis.ManagedSynonymGraphFilterFactory$SynonymManager@458b8953] for /schema/analysis/synonyms/englishgraph
   [junit4]   2> 1855849 INFO  (qtp2021734036-15812) [    x:collection1] o.a.s.r.ManagedResource Processing update to /schema/analysis/synonyms/englishgraph: {happy=[glad, cheerful, joyful]} is a java.util.LinkedHashMap
   [junit4]   2> 1855850 INFO  (qtp2021734036-15812) [    x:collection1] o.a.s.r.ManagedResourceStorage Saved JSON object to path _schema_analysis_synonyms_englishgraph.json using file:dir=C:\Users\jenkins\workspace\Lucene-Solr-7.x-Windows\solr\build\solr-core\test\J0\temp\solr.rest.schema.analysis.TestManagedSynonymGraphFilterFactory_806926B8BB1B5CD0-001\tempDir-001\collection1\conf
   [junit4]   2> 1855850 INFO  (qtp2021734036-15812) [    x:collection1] o.a.s.r.RestManager [collection1]  webapp=/solr path=/schema/analysis/synonyms/englishgraph params={indent=on&wt=json} status=0 QTime=7
   [junit4]   2> ??? 01, 2018 3:45:51 ??? ????? org.restlet.engine.log.LogFilter afterHandle
   [junit4]   2> INFO: 2018-01-01	03:45:51	127.0.0.1	-	127.0.0.1	55230	PUT	/solr/schema/analysis/synonyms/englishgraph	wt=json&indent=on	200	-	53	4	http://127.0.0.1:55230	Apache-HttpClient/4.5.3 (Java/9.0.1)	-
   [junit4]   2> 1855855 WARN  (qtp2021734036-15812) [    x:collection1] o.e.j.s.ServletHandler Error for /solr/collection1/schema/analysis/synonyms/englishgraph
   [junit4]   2> java.lang.AssertionError: Attempted close of response output stream.
   [junit4]   2> 	at org.apache.solr.servlet.SolrDispatchFilter$2$1.close(SolrDispatchFilter.java:525)
   [junit4]   2> 	at org.eclipse.jetty.server.Dispatcher.commitResponse(Dispatcher.java:270)
   [junit4]   2> 	at org.eclipse.jetty.server.Dispatcher.forward(Dispatcher.java:202)
   [junit4]   2> 	at org.eclipse.jetty.server.Dispatcher.forward(Dispatcher.java:74)
   [junit4]   2> 	at org.apache.solr.servlet.SolrDispatchFilter.doFilter(SolrDispatchFilter.java:391)
   [junit4]   2> 	at org.apache.solr.servlet.SolrDispatchFilter.doFilter(SolrDispatchFilter.java:326)
   [junit4]   2> 	at org.eclipse.jetty.servlet.ServletHandler$CachedChain.doFilter(ServletHandler.java:1759)
   [junit4]   2> 	at org.apache.solr.client.solrj.embedded.JettySolrRunner$DebugFilter.doFilter(JettySolrRunner.java:139)
   [junit4]   2> 	at org.eclipse.jetty.servlet.ServletHandler$CachedChain.doFilter(ServletHandler.java:1759)
   [junit4]   2> 	at org.eclipse.jetty.servlet.ServletHandler.doHandle(ServletHandler.java:582)
   [junit4]   2> 	at org.eclipse.jetty.server.session.SessionHandler.doHandle(SessionHandler.java:224)
   [junit4]   2> 	at org.eclipse.jetty.server.handler.ContextHandler.doHandle(ContextHandler.java:1180)
   [junit4]   2> 	at org.eclipse.jetty.servlet.ServletHandler.doScope(ServletHandler.java:512)
   [junit4]   2> 	at org.eclipse.jetty.server.session.SessionHandler.doScope(SessionHandler.java:185)
   [junit4]   2> 	at org.eclipse.jetty.server.handler.ContextHandler.doScope(ContextHandler.java:1112)
   [junit4]   2> 	at org.eclipse.jetty.server.handler.ScopedHandler.handle(ScopedHandler.java:141)
   [junit4]   2> 	at org.eclipse.jetty.server.handler.gzip.GzipHandler.handle(GzipHandler.java:426)
   [junit4]   2> 	at org.eclipse.jetty.server.handler.HandlerWrapper.handle(HandlerWrapper.java:134)
   [junit4]   2> 	at org.eclipse.jetty.server.Server.handle(Server.java:534)
   [junit4]   2> 	at org.eclipse.jetty.server.HttpChannel.handle(HttpChannel.java:320)
   [junit4]   2> 	at org.eclipse.jetty.server.HttpConnection.onFillable(HttpConnection.java:251)
   [junit4]   2> 	at org.eclipse.jetty.io.AbstractConnection$ReadCallback.succeeded(AbstractConnection.java:283)
   [junit4]   2> 	at org.eclipse.jetty.io.FillInterest.fillable(FillInterest.java:108)
   [junit4]   2> 	at org.eclipse.jetty.io.SelectChannelEndPoint$2.run(SelectChannelEndPoint.java:93)
   [junit4]   2> 	at org.eclipse.jetty.util.thread.strategy.ExecuteProduceConsume.executeProduceConsume(ExecuteProduceConsume.java:303)
   [junit4]   2> 	at org.eclipse.jetty.util.thread.strategy.ExecuteProduceConsume.produceConsume(ExecuteProduceConsume.java:148)
   [junit4]   2> 	at org.eclipse.jetty.util.thread.strategy.ExecuteProduceConsume.run(ExecuteProduceConsume.java:136)
   [junit4]   2> 	at org.eclipse.jetty.util.thread.QueuedThreadPool.runJob(QueuedThreadPool.java:671)
   [junit4]   2> 	at org.eclipse.jetty.util.thread.QueuedThreadPool$2.run(QueuedThreadPool.java:589)
   [junit4]   2> 	at java.base/java.lang.Thread.run(Thread.java:844)
   [junit4]   2> 1855857 INFO  (qtp2021734036-15813) [    x:collection1] o.a.s.r.RestManager Found ManagedResource [org.apache.solr.rest.schema.analysis.ManagedSynonymGraphFilterFactory$SynonymManager@458b8953] for /schema/analysis/synonyms/englishgraph
   [junit4]   2> 1855858 INFO  (qtp2021734036-15813) [    x:collection1] o.a.s.r.RestManager [collection1]  webapp=/solr path=/schema/analysis/synonyms/englishgraph params={indent=on&wt=json} status=0 QTime=1
   [junit4]   2> ??? 01, 2018 3:45:51 ??? ????? org.restlet.engine.log.LogFilter afterHandle
   [junit4]   2> INFO: 2018-01-01	03:45:51	127.0.0.1	-	127.0.0.1	55230	GET	/solr/schema/analysis/synonyms/englishgraph	wt=json&indent=on	200	-	0	1	http://127.0.0.1:55230	Apache-HttpClient/4.5.3 (Java/9.0.1)	-
   [junit4]   2> 1855859 WARN  (qtp2021734036-15813) [    x:collection1] o.e.j.s.ServletHandler Error for /solr/collection1/schema/analysis/synonyms/englishgraph
   [junit4]   2> java.lang.AssertionError: Attempted close of response output stream.
   [junit4]   2> 	at org.apache.solr.servlet.SolrDispatchFilter$2$1.close(SolrDispatchFilter.java:525)
   [junit4]   2> 	at org.eclipse.jetty.server.Dispatcher.commitResponse(Dispatcher.java:270)
   [junit4]   2> 	at org.eclipse.jetty.server.Dispatcher.forward(Dispatcher.java:202)
   [junit4]   2> 	at org.eclipse.jetty.server.Dispatcher.forward(Dispatcher.java:74)
   [junit4]   2> 	at org.apache.solr.servlet.SolrDispatchFilter.doFilter(SolrDispatchFilter.java:391)
   [junit4]   2> 	at org.apache.solr.servlet.SolrDispatchFilter.doFilter(SolrDispatchFilter.java:326)
   [junit4]   2> 	at org.eclipse.jetty.servlet.ServletHandler$CachedChain.doFilter(ServletHandler.java:1759)
   [junit4]   2> 	at org.apache.solr.client.solrj.embedded.JettySolrRunner$DebugFilter.doFilter(JettySolrRunner.java:139)
   [junit4]   2> 	at org.eclipse.jetty.servlet.ServletHandler$CachedChain.doFilter(ServletHandler.java:1759)
   [junit4]   2> 	at org.eclipse.jetty.servlet.ServletHandler.doHandle(ServletHandler.java:582)
   [junit4]   2> 	at org.eclipse.jetty.server.session.SessionHandler.doHandle(SessionHandler.java:224)
   [junit4]   2> 	at org.eclipse.jetty.server.handler.ContextHandler.doHandle(ContextHandler.java:1180)
   [junit4]   2> 	at org.eclipse.jetty.servlet.ServletHandler.doScope(ServletHandler.java:512)
   [junit4]   2> 	at org.eclipse.jetty.server.session.SessionHandler.doScope(SessionHandler.java:185)
   [junit4]   2> 	at org.eclipse.jetty.server.handler.ContextHandler.doScope(ContextHandler.java:1112)
   [junit4]   2> 	at org.eclipse.jetty.server.handler.ScopedHandler.handle(ScopedHandler.java:141)
   [junit4]   2> 	at org.eclipse.jetty.server.handler.gzip.GzipHandler.handle(GzipHandler.java:493)
   [junit4]   2> 	at org.eclipse.jetty.server.handler.HandlerWrapper.handle(HandlerWrapper.java:134)
   [junit4]   2> 	at org.eclipse.jetty.server.Server.handle(Server.java:534)
   [junit4]   2> 	at org.eclipse.jetty.server.HttpChannel.handle(HttpChannel.java:320)
   [junit4]   2> 	at org.eclipse.jetty.server.HttpConnection.onFillable(HttpConnection.java:251)
   [junit4]   2> 	at org.eclipse.jetty.io.AbstractConnection$ReadCallback.succeeded(AbstractConnection.java:283)
   [junit4]   2> 	at org.eclipse.jetty.io.FillInterest.fillable(FillInterest.java:108)
   [junit4]   2> 	at org.eclipse.jetty.io.SelectChannelEndPoint$2.run(SelectChannelEndPoint.java:93)
   [junit4]   2> 	at org.eclipse.jetty.util.thread.strategy.ExecuteProduceConsume.executeProduceConsume(ExecuteProduceConsume.java:303)
   [junit4]   2> 	at org.eclipse.jetty.util.thread.strategy.ExecuteProduceConsume.produceConsume(ExecuteProduceConsume.java:148)
   [junit4]   2> 	at org.eclipse.jetty.util.thread.strategy.ExecuteProduceConsume.run(ExecuteProduceConsume.java:136)
   [junit4]   2> 	at org.eclipse.jetty.util.thread.QueuedThreadPool.runJob(QueuedThreadPool.java:671)
   [junit4]   2> 	at org.eclipse.jetty.util.thread.QueuedThreadPool$2.run(QueuedThreadPool.java:589)
   [junit4]   2> 	at java.base/java.lang.Thread.run(Thread.java:844)
   [junit4]   2> 1855861 INFO  (qtp2021734036-15813) [    x:collection1] o.a.s.r.RestManager Resource not found for /schema/analysis/synonyms/englishgraph/happy, looking for parent: /schema/analysis/synonyms/englishgraph
   [junit4]   2> 1855861 INFO  (qtp2021734036-15813) [    x:collection1] o.a.s.r.RestManager Found parent resource /schema/analysis/synonyms/englishgraph for child: happy
   [junit4]   2> 1855861 INFO  (qtp2021734036-15813) [    x:collection1] o.a.s.r.RestManager Found ManagedResource [org.apache.solr.rest.schema.analysis.ManagedSynonymGraphFilterFactory$SynonymManager@458b8953] for /schema/analysis/synonyms/englishgraph/happy
   [junit4]   2> 1855861 INFO  (qtp2021734036-15813) [    x:collection1] o.a.s.r.RestManager [collection1]  webapp=/solr path=/schema/analysis/synonyms/englishgraph/happy params={indent=on&wt=json} status=0 QTime=1
   [junit4]   2> ??? 01, 2018 3:45:51 ??? ????? org.restlet.engine.log.LogFilter afterHandle
   [junit4]   2> INFO: 2018-01-01	03:45:51	127.0.0.1	-	127.0.0.1	55230	GET	/solr/schema/analysis/synonyms/englishgraph/happy	wt=json&indent=on	200	-	0	1	http://127.0.0.1:55230	Apache-HttpClient/4.5.3 (Java/9.0.1)	-
   [junit4]   2> 1855862 WARN  (qtp2021734036-15813) [    x:collection1] o.e.j.s.ServletHandler Error for /solr/collection1/schema/analysis/synonyms/englishgraph/happy
   [junit4]   2> java.lang.AssertionError: Attempted close of response output stream.
   [junit4]   2> 	at org.apache.solr.servlet.SolrDispatchFilter$2$1.close(SolrDispatchFilter.java:525)
   [junit4]   2> 	at org.eclipse.jetty.server.Dispatcher.commitResponse(Dispatcher.java:270)
   [junit4]   2> 	at org.eclipse.jetty.server.Dispatcher.forward(Dispatcher.java:202)
   [junit4]   2> 	at org.eclipse.jetty.server.Dispatcher.forward(Dispatcher.java:74)
   [junit4]   2> 	at org.apache.solr.servlet.SolrDispatchFilter.doFilter(SolrDispatchFilter.java:391)
   [junit4]   2> 	at org.apache.solr.servlet.SolrDispatchFilter.doFilter(SolrDispatchFilter.java:326)
   [junit4]   2> 	at org.eclipse.jetty.servlet.ServletHandler$CachedChain.doFilter(ServletHandler.java:1759)
   [junit4]   2> 	at org.apache.solr.client.solrj.embedded.JettySolrRunner$DebugFilter.doFilter(JettySolrRunner.java:139)
   [junit4]   2> 	at org.eclipse.jetty.servlet.ServletHandler$CachedChain.doFilter(ServletHandler.java:1759)
   [junit4]   2> 	at org.eclipse.jetty.servlet.ServletHandler.doHandle(ServletHandler.java:582)
   [junit4]   2> 	at org.eclipse.jetty.server.session.SessionHandler.doHandle(SessionHandler.java:224)
   [junit4]   2> 	at org.eclipse.jetty.server.handler.ContextHandler.doHandle(ContextHandler.java:1180)
   [junit4]   2> 	at org.eclipse.jetty.servlet.ServletHandler.doScope(ServletHandler.java:512)
   [junit4]   2> 	at org.eclipse.jetty.server.session.SessionHandler.doScope(SessionHandler.java:185)
   [junit4]   2> 	at org.eclipse.jetty.server.handler.ContextHandler.doScope(ContextHandler.java:1112)
   [junit4]   2> 	at org.eclipse.jetty.server.handler.ScopedHandler.handle(ScopedHandler.java:141)
   [junit4]   2> 	at org.eclipse.jetty.server.handler.gzip.GzipHandler.handle(GzipHandler.java:493)
   [junit4]   2> 	at org.eclipse.jetty.server.handler.HandlerWrapper.handle(HandlerWrapper.java:134)
   [junit4]   2> 	at org.eclipse.jetty.server.Server.handle(Server.java:534)
   [junit4]   2> 	at org.eclipse.jetty.server.HttpChannel.handle(HttpChannel.java:320)
   [junit4]   2> 	at org.eclipse.jetty.server.HttpConnection.onFillable(HttpConnection.java:251)
   [junit4]   2> 	at org.eclipse.jetty.io.AbstractConnection$ReadCallback.succeeded(AbstractConnection.java:283)
   [junit4]   2> 	at org.eclipse.jetty.io.FillInterest.fillable(FillInterest.java:108)
   [junit4]   2> 	at org.eclipse.jetty.io.SelectChannelEndPoint$2.run(SelectChannelEndPoint.java:93)
   [junit4]   2> 	at org.eclipse.jetty.util.thread.strategy.ExecuteProduceConsume.executeProduceConsume(ExecuteProduceConsume.java:303)
   [junit4]   2> 	at org.eclipse.jetty.util.thread.strategy.ExecuteProduceConsume.produceConsume(ExecuteProduceConsume.java:148)
   [junit4]   2> 	at org.eclipse.jetty.util.thread.strategy.ExecuteProduceConsume.run(ExecuteProduceConsume.java:136)
   [junit4]   2> 	at org.eclipse.jetty.util.thread.QueuedThreadPool.runJob(QueuedThreadPool.java:671)
   [junit4]   2> 	at org.eclipse.jetty.util.thread.QueuedThreadPool$2.run(QueuedThreadPool.java:589)
   [junit4]   2> 	at java.base/java.lang.Thread.run(Thread.java:844)
   [junit4]   2> 1855865 INFO  (qtp2021734036-15813) [    x:collection1] o.a.s.r.RestManager Resource not found for /schema/analysis/synonyms/englishgraph/sad, looking for parent: /schema/analysis/synonyms/englishgraph
   [junit4]   2> 1855865 INFO  (qtp2021734036-15813) [    x:collection1] o.a.s.r.RestManager Found parent resource /schema/analysis/synonyms/englishgraph for child: sad
   [junit4]   2> 1855865 INFO  (qtp2021734036-15813) [    x:collection1] o.a.s.r.RestManager Found ManagedResource [org.apache.solr.rest.schema.analysis.ManagedSynonymGraphFilterFactory$SynonymManager@458b8953] for /schema/analysis/synonyms/englishgraph/sad
   [junit4]   2> 1855865 INFO  (qtp2021734036-15813) [    x:collection1] o.a.s.r.RestManager [collection1]  webapp=/solr path=/schema/analysis/synonyms/englishgraph/sad params={indent=on&wt=json} msg={sad not found in /schema/analysis/synonyms/englishgraph} status=404 QTime=1
   [junit4]   2> ??? 01, 2018 3:45:51 ??? ????? org.restlet.engine.log.LogFilter afterHandle
   [junit4]   2> INFO: 2018-01-01	03:45:51	127.0.0.1	-	127.0.0.1	55230	GET	/solr/schema/analysis/synonyms/englishgraph/sad	wt=json&indent=on	404	-	0	0	http://127.0.0.1:55230	Apache-HttpClient/4.5.3 (Java/9.0.1)	-
   [junit4]   2> 1855871 WARN  (qtp2021734036-15813) [    x:collection1] o.e.j.s.ServletHandler Error for /solr/collection1/schema/analysis/synonyms/englishgraph/sad
   [junit4]   2> java.lang.AssertionError: Attempted close of response output stream.
   [junit4]   2> 	at org.apache.solr.servlet.SolrDispatchFilter$2$1.close(SolrDispatchFilter.java:525)
   [junit4]   2> 	at org.eclipse.jetty.server.Dispatcher.commitResponse(Dispatcher.java:270)
   [junit4]   2> 	at org.eclipse.jetty.server.Dispatcher.forward(Dispatcher.java:202)
   [junit4]   2> 	at org.eclipse.jetty.server.Dispatcher.forward(Dispatcher.java:74)
   [junit4]   2> 	at org.apache.solr.servlet.SolrDispatchFilter.doFilter(SolrDispatchFilter.java:391)
   [junit4]   2> 	at org.apache.solr.servlet.SolrDispatchFilter.doFilter(SolrDispatchFilter.java:326)
   [junit4]   2> 	at org.eclipse.jetty.servlet.ServletHandler$CachedChain.doFilter(ServletHandler.java:1759)
   [junit4]   2> 	at org.apache.solr.client.solrj.embedded.JettySolrRunner$DebugFilter.doFilter(JettySolrRunner.java:139)
   [junit4]   2> 	at org.eclipse.jetty.servlet.ServletHandler$CachedChain.doFilter(ServletHandler.java:1759)
   [junit4]   2> 	at org.eclipse.jetty.servlet.ServletHandler.doHandle(ServletHandler.java:582)
   [junit4]   2> 	at org.eclipse.jetty.server.session.SessionHandler.doHandle(SessionHandler.java:224)
   [junit4]   2> 	at org.eclipse.jetty.server.handler.ContextHandler.doHandle(ContextHandler.java:1180)
   [junit4]   2> 	at org.eclipse.jetty.servlet.ServletHandler.doScope(ServletHandler.java:512)
   [junit4]   2> 	at org.eclipse.jetty.server.session.SessionHandler.doScope(SessionHandler.java:185)
   [junit4]   2> 	at org.eclipse.jetty.server.handler.ContextHandler.doScope(ContextHandler.java:1112)
   [junit4]   2> 	at org.eclipse.jetty.server.handler.ScopedHandler.handle(ScopedHandler.java:141)
   [junit4]   2> 	at org.eclipse.jetty.server.handler.gzip.GzipHandler.handle(GzipHandler.java:493)
   [junit4]   2> 	at org.eclipse.jetty.server.handler.HandlerWrapper.handle(HandlerWrapper.java:134)
   [junit4]   2> 	at org.eclipse.jetty.server.Server.handle(Server.java:534)
   [junit4]   2> 	at org.eclipse.jetty.server.HttpChannel.handle(HttpChannel.java:320)
   [junit4]   2> 	at org.eclipse.jetty.server.HttpConnection.onFillable(HttpConnection.java:251)
   [junit4]   2> 	at org.eclipse.jetty.io.AbstractConnection$ReadCallback.succeeded(AbstractConnection.java:283)
   [junit4]   2> 	at org.eclipse.jetty.io.FillInterest.fillable(FillInterest.java:108)
   [junit4]   2> 	at org.eclipse.jetty.io.SelectChannelEndPoint$2.run(SelectChannelEndPoint.java:93)
   [junit4]   2> 	at org.eclipse.jetty.util.thread.strategy.ExecuteProduceConsume.executeProduceConsume(ExecuteProduceConsume.java:303)
   [junit4]   2> 	at org.eclipse.jetty.util.thread.strategy.ExecuteProduceConsume.produceConsume(ExecuteProduceConsume.java:148)
   [junit4]   2> 	at org.eclipse.jetty.util.thread.strategy.ExecuteProduceConsume.run(ExecuteProduceConsume.java:136)
   [junit4]   2> 	at org.eclipse.jetty.util.thread.QueuedThreadPool.runJob(QueuedThreadPool.java:671)
   [junit4]   2> 	at org.eclipse.jetty.util.thread.QueuedThreadPool$2.run(QueuedThreadPool.java:589)
   [junit4]   2> 	at java.base/java.lang.Thread.run(Thread.java:844)
   [junit4]   2> 1855876 INFO  (qtp2021734036-15814) [    x:collection1] o.a.s.r.RestManager Found ManagedResource [org.apache.solr.rest.schema.analysis.ManagedSynonymGraphFilterFactory$SynonymManager@458b8953] for /schema/analysis/synonyms/englishgraph
   [junit4]   2> 1855876 INFO  (qtp2021734036-15814) [    x:collection1] o.a.s.r.ManagedResource Processing update to /schema/analysis/synonyms/englishgraph: {initArgs={ignoreCase=true}} is a java.util.LinkedHashMap
   [junit4]   2> 1855879 INFO  (qtp2021734036-15814) [    x:collection1] o.a.s.r.ManagedResourceStorage Saved JSON object to path _schema_analysis_synonyms_englishgraph.json using file:dir=C:\Users\jenkins\workspace\Lucene-Solr-7.x-Windows\solr\build\solr-core\test\J0\temp\solr.rest.schema.analysis.TestManagedSynonymGraphFilterFactory_806926B8BB1B5CD0-001\tempDir-001\collection1\conf
   [junit4]   2> 1855879 INFO  (qtp2021734036-15814) [    x:collection1] o.a.s.r.RestManager [collection1]  webapp=/solr path=/schema/analysis/synonyms/englishgraph params={indent=on&wt=json} status=0 QTime=7
   [junit4]   2> ??? 01, 2018 3:45:51 ??? ????? org.restlet.engine.log.LogFilter afterHandle
   [junit4]   2> INFO: 2018-01-01	03:45:51	127.0.0.1	-	127.0.0.1	55230	PUT	/solr/schema/analysis/synonyms/englishgraph	wt=json&indent=on	200	-	36	4	http://127.0.0.1:55230	Apache-HttpClient/4.5.3 (Java/9.0.1)	-
   [junit4]   2> 1855879 WARN  (qtp2021734036-15814) [    x:collection1] o.e.j.s.ServletHandler Error for /solr/collection1/schema/analysis/synonyms/englishgraph
   [junit4]   2> java.lang.AssertionError: Attempted close of response output stream.
   [junit4]   2> 	at org.apache.solr.servlet.SolrDispatchFilter$2$1.close(SolrDispatchFilter.java:525)
   [junit4]   2> 	at org.eclipse.jetty.server.Dispatcher.commitResponse(Dispatcher.java:270)
   [junit4]   2> 	at org.eclipse.jetty.server.Dispatcher.forward(Dispatcher.java:202)
   [junit4]   2> 	at org.eclipse.jetty.server.Dispatcher.forward(Dispatcher.java:74)
   [junit4]   2> 	at org.apache.solr.servlet.SolrDispatchFilter.doFilter(SolrDispatchFilter.java:391)
   [junit4]   2> 	at org.apache.solr.servlet.SolrDispatchFilter.doFilter(SolrDispatchFilter.java:326)
   [junit4]   2> 	at org.eclipse.jetty.servlet.ServletHandler$CachedChain.doFilter(ServletHandler.java:1759)
   [junit4]   2> 	at org.apache.solr.client.solrj.embedded.JettySolrRunner$DebugFilter.doFilter(JettySolrRunner.java:139)
   [junit4]   2> 	at org.eclipse.jetty.servlet.ServletHandler$CachedChain.doFilter(ServletHandler.java:1759)
   [junit4]   2> 	at org.eclipse.jetty.servlet.ServletHandler.doHandle(ServletHandler.java:582)
   [junit4]   2> 	at org.eclipse.jetty.server.session.SessionHandler.doHandle(SessionHandler.java:224)
   [junit4]   2> 	at org.eclipse.jetty.server.handler.ContextHandler.doHandle(ContextHandler.java:1180)
   [junit4]   2> 	at org.eclipse.jetty.servlet.ServletHandler.doScope(ServletHandler.java:512)
   [junit4]   2> 	at org.eclipse.jetty.server.session.SessionHandler.doScope(SessionHandler.java:185)
   [junit4]   2> 	at org.eclipse.jetty.server.handler.ContextHandler.doScope(ContextHandler.java:1112)
   [junit4]   2> 	at org.eclipse.jetty.server.handler.ScopedHandler.handle(ScopedHandler.java:141)
   [junit4]   2> 	at org.eclipse.jetty.server.handler.gzip.GzipHandler.handle(GzipHandler.java:426)
   [junit4]   2> 	at org.eclipse.jetty.server.handler.HandlerWrapper.handle(HandlerWrapper.java:134)
   [junit4]   2> 	at org.eclipse.jetty.server.Server.handle(Server.java:534)
   [junit4]   2> 	at org.eclipse.jetty.server.HttpChannel.handle(HttpChannel.java:320)
   [junit4]   2> 	at org.eclipse.jetty.server.HttpConnection.onFillable(HttpConnection.java:251)
   [junit4]   2> 	at org.eclipse.jetty.io.AbstractConnection$ReadCallback.succeeded(AbstractConnection.java:283)
   [junit4]   2> 	at org.eclipse.jetty.io.FillInterest.fillable(FillInterest.java:108)
   [junit4]   2> 	at org.eclipse.jetty.io.SelectChannelEndPoint$2.run(SelectChannelEndPoint.java:93)
   [junit4]   2> 	at org.eclipse.jetty.util.thread.strategy.ExecuteProduceConsume.executeProduceConsume(ExecuteProduceConsume.java:303)
   [junit4]   2> 	at org.eclipse.jetty.util.thread.strategy.ExecuteProduceConsume.produceConsume(ExecuteProduceConsume.java:148)
   [junit4]   2> 	at org.eclipse.jetty.util.thread.strategy.ExecuteProduceConsume.run(ExecuteProduceConsume.java:136)
   [junit4]   2> 	at org.eclipse.jetty.util.thread.QueuedThreadPool.runJob(QueuedThreadPool.java:671)
   [junit4]   2> 	at org.eclipse.jetty.util.thread.QueuedThreadPool$2.run(QueuedThreadPool.java:589)
   [junit4]   2> 	at java.base/java.lang.Thread.run(Thread.java:844)
   [junit4]   2> 1855879 INFO  (qtp2021734036-15815) [    x:collection1] o.a.s.r.RestManager Found ManagedResource [org.apache.solr.rest.schema.analysis.ManagedSynonymGraphFilterFactory$SynonymManager@458b8953] for /schema/analysis/synonyms/englishgraph
   [junit4]   2> 1855886 INFO  (qtp2021734036-15815) [    x:collection1] o.a.s.r.RestManager [collection1]  webapp=/solr path=/schema/analysis/synonyms/englishgraph params={indent=on&wt=json} status=0 QTime=1
   [junit4]   2> ??? 01, 2018 3:45:51 ??? ????? org.restlet.engine.log.LogFilter afterHandle
   [junit4]   2> INFO: 2018-01-01	03:45:51	127.0.0.1	-	127.0.0.1	55230	GET	/solr/schema/analysis/synonyms/englishgraph	wt=json&indent=on	200	-	0	11	http://127.0.0.1:55230	Apache-HttpClient/4.5.3 (Java/9.0.1)	-
   [junit4]   2> 1855891 WARN  (qtp2021734036-15815) [    x:collection1] o.e.j.s.ServletHandler Error for /solr/collection1/schema/analysis/synonyms/englishgraph
   [junit4]   2> java.lang.AssertionError: Attempted close of response output stream.
   [junit4]   2> 	at org.apache.solr.servlet.SolrDispatchFilter$2$1.close(SolrDispatchFilter.java:525)
   [junit4]   2> 	at org.eclipse.jetty.server.Dispatcher.commitResponse(Dispatcher.java:270)
   [junit4]   2> 	at org.eclipse.jetty.server.Dispatcher.forward(Dispatcher.java:202)
   [junit4]   2> 	at org.eclipse.jetty.server.Dispatcher.forward(Dispatcher.java:74)
   [junit4]   2> 	at org.apache.solr.servlet.SolrDispatchFilter.doFilter(SolrDispatchFilter.java:391)
   [junit4]   2> 	at org.apache.solr.servlet.SolrDispatchFilter.doFilter(SolrDispatchFilter.java:326)
   [junit4]   2> 	at org.eclipse.jetty.servlet.ServletHandler$CachedChain.doFilter(ServletHandler.java:1759)
   [junit4]   2> 	at org.apache.solr.client.solrj.embedded.JettySolrRunner$DebugFilter.doFilter(JettySolrRunner.java:139)
   [junit4]   2> 	at org.eclipse.jetty.servlet.ServletHandler$CachedChain.doFilter(ServletHandler.java:1759)
   [junit4]   2> 	at org.eclipse.jetty.servlet.ServletHandler.doHandle(ServletHandler.java:582)
   [junit4]   2> 	at org.eclipse.jetty.server.session.SessionHandler.doHandle(SessionHandler.java:224)
   [junit4]   2> 	at org.eclipse.jetty.server.handler.ContextHandler.doHandle(ContextHandler.java:1180)
   [junit4]   2> 	at org.eclipse.jetty.servlet.ServletHandler.doScope(ServletHandler.java:512)
   [junit4]   2> 	at org.eclipse.jetty.server.session.SessionHandler.doScope(SessionHandler.java:185)
   [junit4]   2> 	at org.eclipse.jetty.server.handler.ContextHandler.doScope(ContextHandler.java:1112)
   [junit4]   2> 	at org.eclipse.jetty.server.handler.ScopedHandler.handle(ScopedHandler.java:141)
   [junit4]   2> 	at org.eclipse.jetty.server.handler.gzip.GzipHandler.handle(GzipHandler.java:493)
   [junit4]   2> 	at org.eclipse.jetty.server.handler.HandlerWrapper.handle(HandlerWrapper.java:134)
   [junit4]   2> 	at org.eclipse.jetty.server.Server.handle(Server.java:534)
   [junit4]   2> 	at org.eclipse.jetty.server.HttpChannel.handle(HttpChannel.java:320)
   [junit4]   2> 	at org.eclipse.jetty.server.HttpConnection.onFillable(HttpConnection.java:251)
   [junit4]   2> 	at org.eclipse.jetty.io.AbstractConnection$ReadCallback.succeeded(AbstractConnection.java:283)
   [junit4]   2> 	at org.eclipse.jetty.io.FillInterest.fillable(FillInterest.java:108)
   [junit4]   2> 	at org.eclipse.jetty.io.SelectChannelEndPoint$2.run(SelectChannelEndPoint.java:93)
   [junit4]   2> 	at org.eclipse.jetty.util.thread.strategy.ExecuteProduceConsume.executeProduceConsume(ExecuteProduceConsume.java:303)
   [junit4]   2> 	at org.eclipse.jetty.util.thread.strategy.ExecuteProduceConsume.produceConsume(ExecuteProduceConsume.java:148)
   [junit4]   2> 	at org.eclipse.jetty.util.thread.strategy.ExecuteProduceConsume.run(ExecuteProduceConsume.java:136)
   [junit4]   2> 	at org.eclipse.jetty.util.thread.QueuedThreadPool.runJob(QueuedThreadPool.java:671)
   [junit4]   2> 	at org.eclipse.jetty.util.thread.QueuedThreadPool$2.run(QueuedThreadPool.java:589)
   [junit4]   2> 	at java.base/java.lang.Thread.run(Thread.java:844)
   [junit4]   2> 1855894 I

[...truncated too long message...]

y+name%3D'se'+processor%3D'SolrEntityProcessor'+query%3D'id:${db.dbid_s}'%0a+++++url%3D'https://127.0.0.1:62631/solr/collection1'+fields%3D'id,desc'>%0d%0a++++++++<field+column%3D'id'+/>%0d%0a++++++++<field+column%3D'desc'+/>%0d%0a++++++</entity>%0d%0a++++</entity>%0d%0a++</document>%0d%0a</dataConfig>%0d%0a&clean=true&wt=xml&command=full-import}{deleteByQuery=*:*,add=[1, 2],commit=} 0 93
   [junit4]   2> 25195 T116 C14 oasc.SolrCore.execute [collection1]  webapp=null path=null params={q=*:*&qt=&start=0&rows=20&version=2.2} hits=2 status=0 QTime=0
   [junit4]   2> 25198 T116 C14 oasc.SolrCore.execute [collection1]  webapp=null path=null params={q=id:1&qt=&start=0&rows=20&version=2.2} hits=1 status=0 QTime=0
   [junit4]   2> 25201 T116 C14 oasc.SolrCore.execute [collection1]  webapp=null path=null params={q=id:2&qt=&start=0&rows=20&version=2.2} hits=1 status=0 QTime=0
   [junit4]   2> 25201 T116 oas.SolrTestCaseJ4.deleteCore ###deleteCore
   [junit4]   2> 25201 T116 oasc.CoreContainer.shutdown Shutting down CoreContainer instance=1169431436
   [junit4]   2> 25202 T116 oasm.SolrMetricManager.closeReporters Closing metric reporters for registry=solr.node, tag=null
   [junit4]   2> 25202 T116 oasmr.SolrJmxReporter.close Closing reporter [org.apache.solr.metrics.reporters.SolrJmxReporter@1b915e14: rootName = null, domain = solr.node, service url = null, agent id = null] for registry solr.node / com.codahale.metrics.MetricRegistry@18f72006
   [junit4]   2> 25206 T116 oasm.SolrMetricManager.closeReporters Closing metric reporters for registry=solr.jvm, tag=null
   [junit4]   2> 25206 T116 oasmr.SolrJmxReporter.close Closing reporter [org.apache.solr.metrics.reporters.SolrJmxReporter@68f29fb8: rootName = null, domain = solr.jvm, service url = null, agent id = null] for registry solr.jvm / com.codahale.metrics.MetricRegistry@184de3ab
   [junit4]   2> 25207 T116 oasm.SolrMetricManager.closeReporters Closing metric reporters for registry=solr.jetty, tag=null
   [junit4]   2> 25207 T116 oasmr.SolrJmxReporter.close Closing reporter [org.apache.solr.metrics.reporters.SolrJmxReporter@5025ee40: rootName = null, domain = solr.jetty, service url = null, agent id = null] for registry solr.jetty / com.codahale.metrics.MetricRegistry@2ef6853e
   [junit4]   2> 25211 T336 x:x:collection1 oasc.SolrCore.close [collection1]  CLOSING SolrCore org.apache.solr.core.SolrCore@24ce682c
   [junit4]   2> 25211 T336 x:x:collection1 oasm.SolrMetricManager.closeReporters Closing metric reporters for registry=solr.core.collection1, tag=617506860
   [junit4]   2> 25211 T336 x:x:collection1 oasmr.SolrJmxReporter.close Closing reporter [org.apache.solr.metrics.reporters.SolrJmxReporter@6bbdd93d: rootName = null, domain = solr.core.collection1, service url = null, agent id = null] for registry solr.core.collection1 / com.codahale.metrics.MetricRegistry@219d2c87
   [junit4]   2> 25222 T116 oejs.AbstractConnector.doStop Stopped ServerConnector@3e6fde22{SSL,[ssl, http/1.1]}{127.0.0.1:0}
   [junit4]   2> 25222 T116 oasc.CoreContainer.shutdown Shutting down CoreContainer instance=1350494236
   [junit4]   2> 25223 T116 oasm.SolrMetricManager.closeReporters Closing metric reporters for registry=solr.node, tag=null
   [junit4]   2> 25223 T116 oasmr.SolrJmxReporter.close Closing reporter [org.apache.solr.metrics.reporters.SolrJmxReporter@62e6199: rootName = null, domain = solr.node, service url = null, agent id = null] for registry solr.node / com.codahale.metrics.MetricRegistry@6f64944a
   [junit4]   2> 25228 T116 oasm.SolrMetricManager.closeReporters Closing metric reporters for registry=solr.jvm, tag=null
   [junit4]   2> 25228 T116 oasmr.SolrJmxReporter.close Closing reporter [org.apache.solr.metrics.reporters.SolrJmxReporter@583f81b1: rootName = null, domain = solr.jvm, service url = null, agent id = null] for registry solr.jvm / com.codahale.metrics.MetricRegistry@184de3ab
   [junit4]   2> 25232 T116 oasm.SolrMetricManager.closeReporters Closing metric reporters for registry=solr.jetty, tag=null
   [junit4]   2> 25232 T116 oasmr.SolrJmxReporter.close Closing reporter [org.apache.solr.metrics.reporters.SolrJmxReporter@668a85fd: rootName = null, domain = solr.jetty, service url = null, agent id = null] for registry solr.jetty / com.codahale.metrics.MetricRegistry@2ef6853e
   [junit4]   2> 25234 T339 x:x:collection1 oasc.SolrCore.close [collection1]  CLOSING SolrCore org.apache.solr.core.SolrCore@6f466660
   [junit4]   2> 25234 T339 x:x:collection1 oasm.SolrMetricManager.closeReporters Closing metric reporters for registry=solr.core.collection1, tag=1866884704
   [junit4]   2> 25234 T339 x:x:collection1 oasmr.SolrJmxReporter.close Closing reporter [org.apache.solr.metrics.reporters.SolrJmxReporter@2b8f80d2: rootName = null, domain = solr.core.collection1, service url = null, agent id = null] for registry solr.core.collection1 / com.codahale.metrics.MetricRegistry@1f1b236
   [junit4]   2> 25246 T116 oejsh.ContextHandler.doStop Stopped o.e.j.s.ServletContextHandler@52452a1c{/solr,null,UNAVAILABLE}
   [junit4]   2> 25256 T116 oas.SolrTestCaseJ4.tearDown ###Ending testFullImportInnerEntity
   [junit4]   2> 25257 T116 oas.SolrTestCaseJ4.clearObjectTrackerAndCheckEmpty ------------------------------------------------------- Done waiting for tracked resources to be released
   [junit4]   2> NOTE: test params are: codec=Lucene70, sim=RandomSimilarity(queryNorm=false): {}, locale=fr, timezone=Asia/Kuala_Lumpur
   [junit4]   2> NOTE: Windows 10 10.0 amd64/Oracle Corporation 9.0.1 (64-bit)/cpus=3,threads=2,free=131085160,total=238551040
   [junit4]   2> NOTE: All tests run in this JVM: [TestHierarchicalDocBuilder, TestZKPropertiesWriter, TestSolrEntityProcessorEndToEnd]
   [junit4]   2> NOTE: reproduce with: ant test  -Dtestcase=TestSolrEntityProcessorEndToEnd -Dtests.seed=D15CAD2F727C59E2 -Dtests.slow=true -Dtests.locale=fr -Dtests.timezone=Asia/Kuala_Lumpur -Dtests.asserts=true -Dtests.file.encoding=ISO-8859-1
   [junit4] ERROR   0.00s J0 | TestSolrEntityProcessorEndToEnd (suite) <<<
   [junit4]    > Throwable #1: java.io.IOException: Could not remove the following files (in the order of attempts):
   [junit4]    >    C:\Users\jenkins\workspace\Lucene-Solr-7.x-Windows\solr\build\contrib\solr-dataimporthandler\test\J0\temp\solr.handler.dataimport.TestSolrEntityProcessorEndToEnd_D15CAD2F727C59E2-001\tempDir-006\collection1\data\index: java.nio.file.DirectoryNotEmptyException: C:\Users\jenkins\workspace\Lucene-Solr-7.x-Windows\solr\build\contrib\solr-dataimporthandler\test\J0\temp\solr.handler.dataimport.TestSolrEntityProcessorEndToEnd_D15CAD2F727C59E2-001\tempDir-006\collection1\data\index
   [junit4]    >    C:\Users\jenkins\workspace\Lucene-Solr-7.x-Windows\solr\build\contrib\solr-dataimporthandler\test\J0\temp\solr.handler.dataimport.TestSolrEntityProcessorEndToEnd_D15CAD2F727C59E2-001\tempDir-006\collection1\data: java.nio.file.DirectoryNotEmptyException: C:\Users\jenkins\workspace\Lucene-Solr-7.x-Windows\solr\build\contrib\solr-dataimporthandler\test\J0\temp\solr.handler.dataimport.TestSolrEntityProcessorEndToEnd_D15CAD2F727C59E2-001\tempDir-006\collection1\data
   [junit4]    >    C:\Users\jenkins\workspace\Lucene-Solr-7.x-Windows\solr\build\contrib\solr-dataimporthandler\test\J0\temp\solr.handler.dataimport.TestSolrEntityProcessorEndToEnd_D15CAD2F727C59E2-001\tempDir-006\collection1: java.nio.file.DirectoryNotEmptyException: C:\Users\jenkins\workspace\Lucene-Solr-7.x-Windows\solr\build\contrib\solr-dataimporthandler\test\J0\temp\solr.handler.dataimport.TestSolrEntityProcessorEndToEnd_D15CAD2F727C59E2-001\tempDir-006\collection1
   [junit4]    >    C:\Users\jenkins\workspace\Lucene-Solr-7.x-Windows\solr\build\contrib\solr-dataimporthandler\test\J0\temp\solr.handler.dataimport.TestSolrEntityProcessorEndToEnd_D15CAD2F727C59E2-001\tempDir-006: java.nio.file.DirectoryNotEmptyException: C:\Users\jenkins\workspace\Lucene-Solr-7.x-Windows\solr\build\contrib\solr-dataimporthandler\test\J0\temp\solr.handler.dataimport.TestSolrEntityProcessorEndToEnd_D15CAD2F727C59E2-001\tempDir-006
   [junit4]    >    C:\Users\jenkins\workspace\Lucene-Solr-7.x-Windows\solr\build\contrib\solr-dataimporthandler\test\J0\temp\solr.handler.dataimport.TestSolrEntityProcessorEndToEnd_D15CAD2F727C59E2-001\tempDir-006\collection1\data\index\segments_2: java.nio.file.AccessDeniedException: C:\Users\jenkins\workspace\Lucene-Solr-7.x-Windows\solr\build\contrib\solr-dataimporthandler\test\J0\temp\solr.handler.dataimport.TestSolrEntityProcessorEndToEnd_D15CAD2F727C59E2-001\tempDir-006\collection1\data\index\segments_2
   [junit4]    >    C:\Users\jenkins\workspace\Lucene-Solr-7.x-Windows\solr\build\contrib\solr-dataimporthandler\test\J0\temp\solr.handler.dataimport.TestSolrEntityProcessorEndToEnd_D15CAD2F727C59E2-001: java.nio.file.DirectoryNotEmptyException: C:\Users\jenkins\workspace\Lucene-Solr-7.x-Windows\solr\build\contrib\solr-dataimporthandler\test\J0\temp\solr.handler.dataimport.TestSolrEntityProcessorEndToEnd_D15CAD2F727C59E2-001
   [junit4]    > 	at __randomizedtesting.SeedInfo.seed([D15CAD2F727C59E2]:0)
   [junit4]    > 	at org.apache.lucene.util.IOUtils.rm(IOUtils.java:329)
   [junit4]    > 	at java.base/java.lang.Thread.run(Thread.java:844)
   [junit4] Completed [15/38 (1!)] on J0 in 9.13s, 7 tests, 1 error <<< FAILURES!

[...truncated 3020 lines...]
BUILD FAILED
C:\Users\jenkins\workspace\Lucene-Solr-7.x-Windows\build.xml:835: The following error occurred while executing this line:
C:\Users\jenkins\workspace\Lucene-Solr-7.x-Windows\build.xml:787: Some of the tests produced a heap dump, but did not fail. Maybe a suppressed OutOfMemoryError? Dumps created:
* java_pid6084.hprof

Total time: 100 minutes 43 seconds
Build step 'Invoke Ant' marked build as failure
Archiving artifacts
[WARNINGS] Skipping publisher since build result is FAILURE
Recording test results
Email was triggered for: Failure - Any
Sending email for trigger: Failure - Any

Mime
View raw message