lucene-dev mailing list archives

Site index · List index
Message view « Date » · « Thread »
Top « Date » · « Thread »
From Policeman Jenkins Server <jenk...@thetaphi.de>
Subject [JENKINS] Lucene-Solr-7.x-Windows (64bit/jdk-9.0.1) - Build # 380 - Still Unstable!
Date Thu, 04 Jan 2018 10:05:16 GMT
Build: https://jenkins.thetaphi.de/job/Lucene-Solr-7.x-Windows/380/
Java: 64bit/jdk-9.0.1 -XX:-UseCompressedOops -XX:+UseSerialGC

4 tests failed.
FAILED:  junit.framework.TestSuite.org.apache.solr.rest.schema.TestFieldTypeResource

Error Message:
Could not remove the following files (in the order of attempts):    C:\Users\jenkins\workspace\Lucene-Solr-7.x-Windows\solr\build\solr-core\test\J1\temp\solr.rest.schema.TestFieldTypeResource_24F6D41EE9EF49EC-001\tempDir-001\cores: java.nio.file.DirectoryNotEmptyException: C:\Users\jenkins\workspace\Lucene-Solr-7.x-Windows\solr\build\solr-core\test\J1\temp\solr.rest.schema.TestFieldTypeResource_24F6D41EE9EF49EC-001\tempDir-001\cores    C:\Users\jenkins\workspace\Lucene-Solr-7.x-Windows\solr\build\solr-core\test\J1\temp\solr.rest.schema.TestFieldTypeResource_24F6D41EE9EF49EC-001\tempDir-001: java.nio.file.DirectoryNotEmptyException: C:\Users\jenkins\workspace\Lucene-Solr-7.x-Windows\solr\build\solr-core\test\J1\temp\solr.rest.schema.TestFieldTypeResource_24F6D41EE9EF49EC-001\tempDir-001    C:\Users\jenkins\workspace\Lucene-Solr-7.x-Windows\solr\build\solr-core\test\J1\temp\solr.rest.schema.TestFieldTypeResource_24F6D41EE9EF49EC-001\tempDir-001\cores\core: java.nio.file.AccessDeniedException: C:\Users\jenkins\workspace\Lucene-Solr-7.x-Windows\solr\build\solr-core\test\J1\temp\solr.rest.schema.TestFieldTypeResource_24F6D41EE9EF49EC-001\tempDir-001\cores\core    C:\Users\jenkins\workspace\Lucene-Solr-7.x-Windows\solr\build\solr-core\test\J1\temp\solr.rest.schema.TestFieldTypeResource_24F6D41EE9EF49EC-001: java.nio.file.DirectoryNotEmptyException: C:\Users\jenkins\workspace\Lucene-Solr-7.x-Windows\solr\build\solr-core\test\J1\temp\solr.rest.schema.TestFieldTypeResource_24F6D41EE9EF49EC-001 

Stack Trace:
java.io.IOException: Could not remove the following files (in the order of attempts):
   C:\Users\jenkins\workspace\Lucene-Solr-7.x-Windows\solr\build\solr-core\test\J1\temp\solr.rest.schema.TestFieldTypeResource_24F6D41EE9EF49EC-001\tempDir-001\cores: java.nio.file.DirectoryNotEmptyException: C:\Users\jenkins\workspace\Lucene-Solr-7.x-Windows\solr\build\solr-core\test\J1\temp\solr.rest.schema.TestFieldTypeResource_24F6D41EE9EF49EC-001\tempDir-001\cores
   C:\Users\jenkins\workspace\Lucene-Solr-7.x-Windows\solr\build\solr-core\test\J1\temp\solr.rest.schema.TestFieldTypeResource_24F6D41EE9EF49EC-001\tempDir-001: java.nio.file.DirectoryNotEmptyException: C:\Users\jenkins\workspace\Lucene-Solr-7.x-Windows\solr\build\solr-core\test\J1\temp\solr.rest.schema.TestFieldTypeResource_24F6D41EE9EF49EC-001\tempDir-001
   C:\Users\jenkins\workspace\Lucene-Solr-7.x-Windows\solr\build\solr-core\test\J1\temp\solr.rest.schema.TestFieldTypeResource_24F6D41EE9EF49EC-001\tempDir-001\cores\core: java.nio.file.AccessDeniedException: C:\Users\jenkins\workspace\Lucene-Solr-7.x-Windows\solr\build\solr-core\test\J1\temp\solr.rest.schema.TestFieldTypeResource_24F6D41EE9EF49EC-001\tempDir-001\cores\core
   C:\Users\jenkins\workspace\Lucene-Solr-7.x-Windows\solr\build\solr-core\test\J1\temp\solr.rest.schema.TestFieldTypeResource_24F6D41EE9EF49EC-001: java.nio.file.DirectoryNotEmptyException: C:\Users\jenkins\workspace\Lucene-Solr-7.x-Windows\solr\build\solr-core\test\J1\temp\solr.rest.schema.TestFieldTypeResource_24F6D41EE9EF49EC-001

	at __randomizedtesting.SeedInfo.seed([24F6D41EE9EF49EC]:0)
	at org.apache.lucene.util.IOUtils.rm(IOUtils.java:329)
	at org.apache.lucene.util.TestRuleTemporaryFilesCleanup.afterAlways(TestRuleTemporaryFilesCleanup.java:216)
	at com.carrotsearch.randomizedtesting.rules.TestRuleAdapter$1.afterAlways(TestRuleAdapter.java:31)
	at com.carrotsearch.randomizedtesting.rules.StatementAdapter.evaluate(StatementAdapter.java:43)
	at com.carrotsearch.randomizedtesting.rules.StatementAdapter.evaluate(StatementAdapter.java:36)
	at org.apache.lucene.util.TestRuleAssertionsRequired$1.evaluate(TestRuleAssertionsRequired.java:53)
	at org.apache.lucene.util.TestRuleMarkFailure$1.evaluate(TestRuleMarkFailure.java:47)
	at org.apache.lucene.util.TestRuleIgnoreAfterMaxFailures$1.evaluate(TestRuleIgnoreAfterMaxFailures.java:64)
	at org.apache.lucene.util.TestRuleIgnoreTestSuites$1.evaluate(TestRuleIgnoreTestSuites.java:54)
	at com.carrotsearch.randomizedtesting.rules.StatementAdapter.evaluate(StatementAdapter.java:36)
	at com.carrotsearch.randomizedtesting.ThreadLeakControl$StatementRunner.run(ThreadLeakControl.java:368)
	at java.base/java.lang.Thread.run(Thread.java:844)


FAILED:  junit.framework.TestSuite.org.apache.solr.search.facet.DistributedFacetSimpleRefinementLongTailTest

Error Message:
Could not remove the following files (in the order of attempts):    C:\Users\jenkins\workspace\Lucene-Solr-7.x-Windows\solr\build\solr-core\test\J1\temp\solr.search.facet.DistributedFacetSimpleRefinementLongTailTest_24F6D41EE9EF49EC-001\tempDir-001\shard2\collection1: java.nio.file.DirectoryNotEmptyException: C:\Users\jenkins\workspace\Lucene-Solr-7.x-Windows\solr\build\solr-core\test\J1\temp\solr.search.facet.DistributedFacetSimpleRefinementLongTailTest_24F6D41EE9EF49EC-001\tempDir-001\shard2\collection1    C:\Users\jenkins\workspace\Lucene-Solr-7.x-Windows\solr\build\solr-core\test\J1\temp\solr.search.facet.DistributedFacetSimpleRefinementLongTailTest_24F6D41EE9EF49EC-001\tempDir-001\shard2: java.nio.file.DirectoryNotEmptyException: C:\Users\jenkins\workspace\Lucene-Solr-7.x-Windows\solr\build\solr-core\test\J1\temp\solr.search.facet.DistributedFacetSimpleRefinementLongTailTest_24F6D41EE9EF49EC-001\tempDir-001\shard2    C:\Users\jenkins\workspace\Lucene-Solr-7.x-Windows\solr\build\solr-core\test\J1\temp\solr.search.facet.DistributedFacetSimpleRefinementLongTailTest_24F6D41EE9EF49EC-001\tempDir-001: java.nio.file.DirectoryNotEmptyException: C:\Users\jenkins\workspace\Lucene-Solr-7.x-Windows\solr\build\solr-core\test\J1\temp\solr.search.facet.DistributedFacetSimpleRefinementLongTailTest_24F6D41EE9EF49EC-001\tempDir-001 

Stack Trace:
java.io.IOException: Could not remove the following files (in the order of attempts):
   C:\Users\jenkins\workspace\Lucene-Solr-7.x-Windows\solr\build\solr-core\test\J1\temp\solr.search.facet.DistributedFacetSimpleRefinementLongTailTest_24F6D41EE9EF49EC-001\tempDir-001\shard2\collection1: java.nio.file.DirectoryNotEmptyException: C:\Users\jenkins\workspace\Lucene-Solr-7.x-Windows\solr\build\solr-core\test\J1\temp\solr.search.facet.DistributedFacetSimpleRefinementLongTailTest_24F6D41EE9EF49EC-001\tempDir-001\shard2\collection1
   C:\Users\jenkins\workspace\Lucene-Solr-7.x-Windows\solr\build\solr-core\test\J1\temp\solr.search.facet.DistributedFacetSimpleRefinementLongTailTest_24F6D41EE9EF49EC-001\tempDir-001\shard2: java.nio.file.DirectoryNotEmptyException: C:\Users\jenkins\workspace\Lucene-Solr-7.x-Windows\solr\build\solr-core\test\J1\temp\solr.search.facet.DistributedFacetSimpleRefinementLongTailTest_24F6D41EE9EF49EC-001\tempDir-001\shard2
   C:\Users\jenkins\workspace\Lucene-Solr-7.x-Windows\solr\build\solr-core\test\J1\temp\solr.search.facet.DistributedFacetSimpleRefinementLongTailTest_24F6D41EE9EF49EC-001\tempDir-001: java.nio.file.DirectoryNotEmptyException: C:\Users\jenkins\workspace\Lucene-Solr-7.x-Windows\solr\build\solr-core\test\J1\temp\solr.search.facet.DistributedFacetSimpleRefinementLongTailTest_24F6D41EE9EF49EC-001\tempDir-001

	at __randomizedtesting.SeedInfo.seed([24F6D41EE9EF49EC]:0)
	at org.apache.lucene.util.IOUtils.rm(IOUtils.java:329)
	at org.apache.lucene.util.TestRuleTemporaryFilesCleanup.afterAlways(TestRuleTemporaryFilesCleanup.java:216)
	at com.carrotsearch.randomizedtesting.rules.TestRuleAdapter$1.afterAlways(TestRuleAdapter.java:31)
	at com.carrotsearch.randomizedtesting.rules.StatementAdapter.evaluate(StatementAdapter.java:43)
	at com.carrotsearch.randomizedtesting.rules.StatementAdapter.evaluate(StatementAdapter.java:36)
	at org.apache.lucene.util.TestRuleAssertionsRequired$1.evaluate(TestRuleAssertionsRequired.java:53)
	at org.apache.lucene.util.TestRuleMarkFailure$1.evaluate(TestRuleMarkFailure.java:47)
	at org.apache.lucene.util.TestRuleIgnoreAfterMaxFailures$1.evaluate(TestRuleIgnoreAfterMaxFailures.java:64)
	at org.apache.lucene.util.TestRuleIgnoreTestSuites$1.evaluate(TestRuleIgnoreTestSuites.java:54)
	at com.carrotsearch.randomizedtesting.rules.StatementAdapter.evaluate(StatementAdapter.java:36)
	at com.carrotsearch.randomizedtesting.ThreadLeakControl$StatementRunner.run(ThreadLeakControl.java:368)
	at java.base/java.lang.Thread.run(Thread.java:844)


FAILED:  junit.framework.TestSuite.org.apache.solr.update.TestExceedMaxTermLength

Error Message:
Could not remove the following files (in the order of attempts):    C:\Users\jenkins\workspace\Lucene-Solr-7.x-Windows\solr\build\solr-core\test\J0\temp\solr.update.TestExceedMaxTermLength_24F6D41EE9EF49EC-001\init-core-data-001\tlog: java.nio.file.DirectoryNotEmptyException: C:\Users\jenkins\workspace\Lucene-Solr-7.x-Windows\solr\build\solr-core\test\J0\temp\solr.update.TestExceedMaxTermLength_24F6D41EE9EF49EC-001\init-core-data-001\tlog    C:\Users\jenkins\workspace\Lucene-Solr-7.x-Windows\solr\build\solr-core\test\J0\temp\solr.update.TestExceedMaxTermLength_24F6D41EE9EF49EC-001\init-core-data-001: java.nio.file.DirectoryNotEmptyException: C:\Users\jenkins\workspace\Lucene-Solr-7.x-Windows\solr\build\solr-core\test\J0\temp\solr.update.TestExceedMaxTermLength_24F6D41EE9EF49EC-001\init-core-data-001    C:\Users\jenkins\workspace\Lucene-Solr-7.x-Windows\solr\build\solr-core\test\J0\temp\solr.update.TestExceedMaxTermLength_24F6D41EE9EF49EC-001\init-core-data-001\tlog\tlog.0000000000000000000: java.nio.file.NoSuchFileException: C:\Users\jenkins\workspace\Lucene-Solr-7.x-Windows\solr\build\solr-core\test\J0\temp\solr.update.TestExceedMaxTermLength_24F6D41EE9EF49EC-001\init-core-data-001\tlog\tlog.0000000000000000000 

Stack Trace:
java.io.IOException: Could not remove the following files (in the order of attempts):
   C:\Users\jenkins\workspace\Lucene-Solr-7.x-Windows\solr\build\solr-core\test\J0\temp\solr.update.TestExceedMaxTermLength_24F6D41EE9EF49EC-001\init-core-data-001\tlog: java.nio.file.DirectoryNotEmptyException: C:\Users\jenkins\workspace\Lucene-Solr-7.x-Windows\solr\build\solr-core\test\J0\temp\solr.update.TestExceedMaxTermLength_24F6D41EE9EF49EC-001\init-core-data-001\tlog
   C:\Users\jenkins\workspace\Lucene-Solr-7.x-Windows\solr\build\solr-core\test\J0\temp\solr.update.TestExceedMaxTermLength_24F6D41EE9EF49EC-001\init-core-data-001: java.nio.file.DirectoryNotEmptyException: C:\Users\jenkins\workspace\Lucene-Solr-7.x-Windows\solr\build\solr-core\test\J0\temp\solr.update.TestExceedMaxTermLength_24F6D41EE9EF49EC-001\init-core-data-001
   C:\Users\jenkins\workspace\Lucene-Solr-7.x-Windows\solr\build\solr-core\test\J0\temp\solr.update.TestExceedMaxTermLength_24F6D41EE9EF49EC-001\init-core-data-001\tlog\tlog.0000000000000000000: java.nio.file.NoSuchFileException: C:\Users\jenkins\workspace\Lucene-Solr-7.x-Windows\solr\build\solr-core\test\J0\temp\solr.update.TestExceedMaxTermLength_24F6D41EE9EF49EC-001\init-core-data-001\tlog\tlog.0000000000000000000

	at __randomizedtesting.SeedInfo.seed([24F6D41EE9EF49EC]:0)
	at org.apache.lucene.util.IOUtils.rm(IOUtils.java:329)
	at org.apache.lucene.util.TestRuleTemporaryFilesCleanup.afterAlways(TestRuleTemporaryFilesCleanup.java:216)
	at com.carrotsearch.randomizedtesting.rules.TestRuleAdapter$1.afterAlways(TestRuleAdapter.java:31)
	at com.carrotsearch.randomizedtesting.rules.StatementAdapter.evaluate(StatementAdapter.java:43)
	at com.carrotsearch.randomizedtesting.rules.StatementAdapter.evaluate(StatementAdapter.java:36)
	at org.apache.lucene.util.TestRuleAssertionsRequired$1.evaluate(TestRuleAssertionsRequired.java:53)
	at org.apache.lucene.util.TestRuleMarkFailure$1.evaluate(TestRuleMarkFailure.java:47)
	at org.apache.lucene.util.TestRuleIgnoreAfterMaxFailures$1.evaluate(TestRuleIgnoreAfterMaxFailures.java:64)
	at org.apache.lucene.util.TestRuleIgnoreTestSuites$1.evaluate(TestRuleIgnoreTestSuites.java:54)
	at com.carrotsearch.randomizedtesting.rules.StatementAdapter.evaluate(StatementAdapter.java:36)
	at com.carrotsearch.randomizedtesting.ThreadLeakControl$StatementRunner.run(ThreadLeakControl.java:368)
	at java.base/java.lang.Thread.run(Thread.java:844)


FAILED:  junit.framework.TestSuite.org.apache.solr.update.processor.TestOpenNLPExtractNamedEntitiesUpdateProcessorFactory

Error Message:
Could not remove the following files (in the order of attempts):    C:\Users\jenkins\workspace\Lucene-Solr-7.x-Windows\solr\build\contrib\solr-analysis-extras\test\J0\temp\solr.update.processor.TestOpenNLPExtractNamedEntitiesUpdateProcessorFactory_6866BEE959AE9AE5-001\tempDir-001\collection1\conf: java.nio.file.DirectoryNotEmptyException: C:\Users\jenkins\workspace\Lucene-Solr-7.x-Windows\solr\build\contrib\solr-analysis-extras\test\J0\temp\solr.update.processor.TestOpenNLPExtractNamedEntitiesUpdateProcessorFactory_6866BEE959AE9AE5-001\tempDir-001\collection1\conf    C:\Users\jenkins\workspace\Lucene-Solr-7.x-Windows\solr\build\contrib\solr-analysis-extras\test\J0\temp\solr.update.processor.TestOpenNLPExtractNamedEntitiesUpdateProcessorFactory_6866BEE959AE9AE5-001\tempDir-001\collection1: java.nio.file.DirectoryNotEmptyException: C:\Users\jenkins\workspace\Lucene-Solr-7.x-Windows\solr\build\contrib\solr-analysis-extras\test\J0\temp\solr.update.processor.TestOpenNLPExtractNamedEntitiesUpdateProcessorFactory_6866BEE959AE9AE5-001\tempDir-001\collection1    C:\Users\jenkins\workspace\Lucene-Solr-7.x-Windows\solr\build\contrib\solr-analysis-extras\test\J0\temp\solr.update.processor.TestOpenNLPExtractNamedEntitiesUpdateProcessorFactory_6866BEE959AE9AE5-001\tempDir-001: java.nio.file.DirectoryNotEmptyException: C:\Users\jenkins\workspace\Lucene-Solr-7.x-Windows\solr\build\contrib\solr-analysis-extras\test\J0\temp\solr.update.processor.TestOpenNLPExtractNamedEntitiesUpdateProcessorFactory_6866BEE959AE9AE5-001\tempDir-001    C:\Users\jenkins\workspace\Lucene-Solr-7.x-Windows\solr\build\contrib\solr-analysis-extras\test\J0\temp\solr.update.processor.TestOpenNLPExtractNamedEntitiesUpdateProcessorFactory_6866BEE959AE9AE5-001\tempDir-001\collection1\conf\en-test-ner-person.bin: java.nio.file.AccessDeniedException: C:\Users\jenkins\workspace\Lucene-Solr-7.x-Windows\solr\build\contrib\solr-analysis-extras\test\J0\temp\solr.update.processor.TestOpenNLPExtractNamedEntitiesUpdateProcessorFactory_6866BEE959AE9AE5-001\tempDir-001\collection1\conf\en-test-ner-person.bin    C:\Users\jenkins\workspace\Lucene-Solr-7.x-Windows\solr\build\contrib\solr-analysis-extras\test\J0\temp\solr.update.processor.TestOpenNLPExtractNamedEntitiesUpdateProcessorFactory_6866BEE959AE9AE5-001\tempDir-001\collection1\conf\en-test-sent.bin: java.nio.file.AccessDeniedException: C:\Users\jenkins\workspace\Lucene-Solr-7.x-Windows\solr\build\contrib\solr-analysis-extras\test\J0\temp\solr.update.processor.TestOpenNLPExtractNamedEntitiesUpdateProcessorFactory_6866BEE959AE9AE5-001\tempDir-001\collection1\conf\en-test-sent.bin    C:\Users\jenkins\workspace\Lucene-Solr-7.x-Windows\solr\build\contrib\solr-analysis-extras\test\J0\temp\solr.update.processor.TestOpenNLPExtractNamedEntitiesUpdateProcessorFactory_6866BEE959AE9AE5-001\tempDir-001\collection1\conf\en-test-tokenizer.bin: java.nio.file.AccessDeniedException: C:\Users\jenkins\workspace\Lucene-Solr-7.x-Windows\solr\build\contrib\solr-analysis-extras\test\J0\temp\solr.update.processor.TestOpenNLPExtractNamedEntitiesUpdateProcessorFactory_6866BEE959AE9AE5-001\tempDir-001\collection1\conf\en-test-tokenizer.bin    C:\Users\jenkins\workspace\Lucene-Solr-7.x-Windows\solr\build\contrib\solr-analysis-extras\test\J0\temp\solr.update.processor.TestOpenNLPExtractNamedEntitiesUpdateProcessorFactory_6866BEE959AE9AE5-001: java.nio.file.DirectoryNotEmptyException: C:\Users\jenkins\workspace\Lucene-Solr-7.x-Windows\solr\build\contrib\solr-analysis-extras\test\J0\temp\solr.update.processor.TestOpenNLPExtractNamedEntitiesUpdateProcessorFactory_6866BEE959AE9AE5-001 

Stack Trace:
java.io.IOException: Could not remove the following files (in the order of attempts):
   C:\Users\jenkins\workspace\Lucene-Solr-7.x-Windows\solr\build\contrib\solr-analysis-extras\test\J0\temp\solr.update.processor.TestOpenNLPExtractNamedEntitiesUpdateProcessorFactory_6866BEE959AE9AE5-001\tempDir-001\collection1\conf: java.nio.file.DirectoryNotEmptyException: C:\Users\jenkins\workspace\Lucene-Solr-7.x-Windows\solr\build\contrib\solr-analysis-extras\test\J0\temp\solr.update.processor.TestOpenNLPExtractNamedEntitiesUpdateProcessorFactory_6866BEE959AE9AE5-001\tempDir-001\collection1\conf
   C:\Users\jenkins\workspace\Lucene-Solr-7.x-Windows\solr\build\contrib\solr-analysis-extras\test\J0\temp\solr.update.processor.TestOpenNLPExtractNamedEntitiesUpdateProcessorFactory_6866BEE959AE9AE5-001\tempDir-001\collection1: java.nio.file.DirectoryNotEmptyException: C:\Users\jenkins\workspace\Lucene-Solr-7.x-Windows\solr\build\contrib\solr-analysis-extras\test\J0\temp\solr.update.processor.TestOpenNLPExtractNamedEntitiesUpdateProcessorFactory_6866BEE959AE9AE5-001\tempDir-001\collection1
   C:\Users\jenkins\workspace\Lucene-Solr-7.x-Windows\solr\build\contrib\solr-analysis-extras\test\J0\temp\solr.update.processor.TestOpenNLPExtractNamedEntitiesUpdateProcessorFactory_6866BEE959AE9AE5-001\tempDir-001: java.nio.file.DirectoryNotEmptyException: C:\Users\jenkins\workspace\Lucene-Solr-7.x-Windows\solr\build\contrib\solr-analysis-extras\test\J0\temp\solr.update.processor.TestOpenNLPExtractNamedEntitiesUpdateProcessorFactory_6866BEE959AE9AE5-001\tempDir-001
   C:\Users\jenkins\workspace\Lucene-Solr-7.x-Windows\solr\build\contrib\solr-analysis-extras\test\J0\temp\solr.update.processor.TestOpenNLPExtractNamedEntitiesUpdateProcessorFactory_6866BEE959AE9AE5-001\tempDir-001\collection1\conf\en-test-ner-person.bin: java.nio.file.AccessDeniedException: C:\Users\jenkins\workspace\Lucene-Solr-7.x-Windows\solr\build\contrib\solr-analysis-extras\test\J0\temp\solr.update.processor.TestOpenNLPExtractNamedEntitiesUpdateProcessorFactory_6866BEE959AE9AE5-001\tempDir-001\collection1\conf\en-test-ner-person.bin
   C:\Users\jenkins\workspace\Lucene-Solr-7.x-Windows\solr\build\contrib\solr-analysis-extras\test\J0\temp\solr.update.processor.TestOpenNLPExtractNamedEntitiesUpdateProcessorFactory_6866BEE959AE9AE5-001\tempDir-001\collection1\conf\en-test-sent.bin: java.nio.file.AccessDeniedException: C:\Users\jenkins\workspace\Lucene-Solr-7.x-Windows\solr\build\contrib\solr-analysis-extras\test\J0\temp\solr.update.processor.TestOpenNLPExtractNamedEntitiesUpdateProcessorFactory_6866BEE959AE9AE5-001\tempDir-001\collection1\conf\en-test-sent.bin
   C:\Users\jenkins\workspace\Lucene-Solr-7.x-Windows\solr\build\contrib\solr-analysis-extras\test\J0\temp\solr.update.processor.TestOpenNLPExtractNamedEntitiesUpdateProcessorFactory_6866BEE959AE9AE5-001\tempDir-001\collection1\conf\en-test-tokenizer.bin: java.nio.file.AccessDeniedException: C:\Users\jenkins\workspace\Lucene-Solr-7.x-Windows\solr\build\contrib\solr-analysis-extras\test\J0\temp\solr.update.processor.TestOpenNLPExtractNamedEntitiesUpdateProcessorFactory_6866BEE959AE9AE5-001\tempDir-001\collection1\conf\en-test-tokenizer.bin
   C:\Users\jenkins\workspace\Lucene-Solr-7.x-Windows\solr\build\contrib\solr-analysis-extras\test\J0\temp\solr.update.processor.TestOpenNLPExtractNamedEntitiesUpdateProcessorFactory_6866BEE959AE9AE5-001: java.nio.file.DirectoryNotEmptyException: C:\Users\jenkins\workspace\Lucene-Solr-7.x-Windows\solr\build\contrib\solr-analysis-extras\test\J0\temp\solr.update.processor.TestOpenNLPExtractNamedEntitiesUpdateProcessorFactory_6866BEE959AE9AE5-001

	at __randomizedtesting.SeedInfo.seed([6866BEE959AE9AE5]:0)
	at org.apache.lucene.util.IOUtils.rm(IOUtils.java:329)
	at org.apache.lucene.util.TestRuleTemporaryFilesCleanup.afterAlways(TestRuleTemporaryFilesCleanup.java:216)
	at com.carrotsearch.randomizedtesting.rules.TestRuleAdapter$1.afterAlways(TestRuleAdapter.java:31)
	at com.carrotsearch.randomizedtesting.rules.StatementAdapter.evaluate(StatementAdapter.java:43)
	at com.carrotsearch.randomizedtesting.rules.StatementAdapter.evaluate(StatementAdapter.java:36)
	at org.apache.lucene.util.TestRuleAssertionsRequired$1.evaluate(TestRuleAssertionsRequired.java:53)
	at org.apache.lucene.util.TestRuleMarkFailure$1.evaluate(TestRuleMarkFailure.java:47)
	at org.apache.lucene.util.TestRuleIgnoreAfterMaxFailures$1.evaluate(TestRuleIgnoreAfterMaxFailures.java:64)
	at org.apache.lucene.util.TestRuleIgnoreTestSuites$1.evaluate(TestRuleIgnoreTestSuites.java:54)
	at com.carrotsearch.randomizedtesting.rules.StatementAdapter.evaluate(StatementAdapter.java:36)
	at com.carrotsearch.randomizedtesting.ThreadLeakControl$StatementRunner.run(ThreadLeakControl.java:368)
	at java.base/java.lang.Thread.run(Thread.java:844)




Build Log:
[...truncated 12312 lines...]
   [junit4] Suite: org.apache.solr.update.TestExceedMaxTermLength
   [junit4]   2> 837560 INFO  (SUITE-TestExceedMaxTermLength-seed#[24F6D41EE9EF49EC]-worker) [    ] o.a.s.SolrTestCaseJ4 SecureRandom sanity checks: test.solr.allowed.securerandom=null & java.security.egd=file:/dev/./urandom
   [junit4]   2> Creating dataDir: C:\Users\jenkins\workspace\Lucene-Solr-7.x-Windows\solr\build\solr-core\test\J0\temp\solr.update.TestExceedMaxTermLength_24F6D41EE9EF49EC-001\init-core-data-001
   [junit4]   2> 837561 WARN  (SUITE-TestExceedMaxTermLength-seed#[24F6D41EE9EF49EC]-worker) [    ] o.a.s.SolrTestCaseJ4 startTrackingSearchers: numOpens=1 numCloses=1
   [junit4]   2> 837561 INFO  (SUITE-TestExceedMaxTermLength-seed#[24F6D41EE9EF49EC]-worker) [    ] o.a.s.SolrTestCaseJ4 Using PointFields (NUMERIC_POINTS_SYSPROP=true) w/NUMERIC_DOCVALUES_SYSPROP=false
   [junit4]   2> 837563 INFO  (SUITE-TestExceedMaxTermLength-seed#[24F6D41EE9EF49EC]-worker) [    ] o.a.s.SolrTestCaseJ4 Randomized ssl (false) and clientAuth (true) via: @org.apache.solr.util.RandomizeSSL(reason="", value=0.0/0.0, ssl=0.0/0.0, clientAuth=0.0/0.0)
   [junit4]   2> 837563 INFO  (SUITE-TestExceedMaxTermLength-seed#[24F6D41EE9EF49EC]-worker) [    ] o.a.s.SolrTestCaseJ4 ####initCore
   [junit4]   2> 837564 INFO  (SUITE-TestExceedMaxTermLength-seed#[24F6D41EE9EF49EC]-worker) [    ] o.a.s.c.SolrResourceLoader [null] Added 2 libs to classloader, from paths: [/C:/Users/jenkins/workspace/Lucene-Solr-7.x-Windows/solr/core/src/test-files/solr/collection1/lib, /C:/Users/jenkins/workspace/Lucene-Solr-7.x-Windows/solr/core/src/test-files/solr/collection1/lib/classes]
   [junit4]   2> 837596 INFO  (SUITE-TestExceedMaxTermLength-seed#[24F6D41EE9EF49EC]-worker) [    ] o.a.s.c.SolrConfig Using Lucene MatchVersion: 7.3.0
   [junit4]   2> 837614 INFO  (SUITE-TestExceedMaxTermLength-seed#[24F6D41EE9EF49EC]-worker) [    ] o.a.s.s.IndexSchema [null] Schema name=example
   [junit4]   2> 837647 INFO  (SUITE-TestExceedMaxTermLength-seed#[24F6D41EE9EF49EC]-worker) [    ] o.a.s.s.IndexSchema Loaded schema example/1.1 with uniqueid field id
   [junit4]   2> 837695 INFO  (SUITE-TestExceedMaxTermLength-seed#[24F6D41EE9EF49EC]-worker) [    ] o.a.s.m.r.SolrJmxReporter JMX monitoring for 'solr.node' (registry 'solr.node') enabled at server: com.sun.jmx.mbeanserver.JmxMBeanServer@6d4d54d0
   [junit4]   2> 837701 INFO  (SUITE-TestExceedMaxTermLength-seed#[24F6D41EE9EF49EC]-worker) [    ] o.a.s.m.r.SolrJmxReporter JMX monitoring for 'solr.jvm' (registry 'solr.jvm') enabled at server: com.sun.jmx.mbeanserver.JmxMBeanServer@6d4d54d0
   [junit4]   2> 837701 INFO  (SUITE-TestExceedMaxTermLength-seed#[24F6D41EE9EF49EC]-worker) [    ] o.a.s.m.r.SolrJmxReporter JMX monitoring for 'solr.jetty' (registry 'solr.jetty') enabled at server: com.sun.jmx.mbeanserver.JmxMBeanServer@6d4d54d0
   [junit4]   2> 837703 INFO  (coreLoadExecutor-2918-thread-1) [    ] o.a.s.c.TransientSolrCoreCacheDefault Allocating transient cache for 2147483647 transient cores
   [junit4]   2> 837704 INFO  (coreLoadExecutor-2918-thread-1) [    x:collection1] o.a.s.c.SolrResourceLoader [null] Added 2 libs to classloader, from paths: [/C:/Users/jenkins/workspace/Lucene-Solr-7.x-Windows/solr/core/src/test-files/solr/collection1/lib, /C:/Users/jenkins/workspace/Lucene-Solr-7.x-Windows/solr/core/src/test-files/solr/collection1/lib/classes]
   [junit4]   2> 837730 INFO  (coreLoadExecutor-2918-thread-1) [    x:collection1] o.a.s.c.SolrConfig Using Lucene MatchVersion: 7.3.0
   [junit4]   2> 837745 INFO  (coreLoadExecutor-2918-thread-1) [    x:collection1] o.a.s.s.IndexSchema [collection1] Schema name=example
   [junit4]   2> 837781 INFO  (coreLoadExecutor-2918-thread-1) [    x:collection1] o.a.s.s.IndexSchema Loaded schema example/1.1 with uniqueid field id
   [junit4]   2> 837787 INFO  (coreLoadExecutor-2918-thread-1) [    x:collection1] o.a.s.c.CoreContainer Creating SolrCore 'collection1' using configuration from instancedir C:\Users\jenkins\workspace\Lucene-Solr-7.x-Windows\solr\core\src\test-files\solr\collection1, trusted=true
   [junit4]   2> 837787 INFO  (coreLoadExecutor-2918-thread-1) [    x:collection1] o.a.s.m.r.SolrJmxReporter JMX monitoring for 'solr.core.collection1' (registry 'solr.core.collection1') enabled at server: com.sun.jmx.mbeanserver.JmxMBeanServer@6d4d54d0
   [junit4]   2> 837787 INFO  (coreLoadExecutor-2918-thread-1) [    x:collection1] o.a.s.c.SolrCore solr.RecoveryStrategy.Builder
   [junit4]   2> 837787 INFO  (coreLoadExecutor-2918-thread-1) [    x:collection1] o.a.s.c.SolrCore [[collection1] ] Opening new SolrCore at [C:\Users\jenkins\workspace\Lucene-Solr-7.x-Windows\solr\core\src\test-files\solr\collection1], dataDir=[C:\Users\jenkins\workspace\Lucene-Solr-7.x-Windows\solr\build\solr-core\test\J0\temp\solr.update.TestExceedMaxTermLength_24F6D41EE9EF49EC-001\init-core-data-001\]
   [junit4]   2> 837789 INFO  (coreLoadExecutor-2918-thread-1) [    x:collection1] o.a.s.u.RandomMergePolicy RandomMergePolicy wrapping class org.apache.lucene.index.LogByteSizeMergePolicy: [LogByteSizeMergePolicy: minMergeSize=1677721, mergeFactor=34, maxMergeSize=2147483648, maxMergeSizeForForcedMerge=9223372036854775807, calibrateSizeByDeletes=true, maxMergeDocs=2147483647, maxCFSSegmentSizeMB=8.796093022207999E12, noCFSRatio=0.4924459028558009]
   [junit4]   2> 837862 INFO  (coreLoadExecutor-2918-thread-1) [    x:collection1] o.a.s.u.UpdateHandler Using UpdateLog implementation: org.apache.solr.update.UpdateLog
   [junit4]   2> 837862 INFO  (coreLoadExecutor-2918-thread-1) [    x:collection1] o.a.s.u.UpdateLog Initializing UpdateLog: dataDir= defaultSyncLevel=FLUSH numRecordsToKeep=100 maxNumLogsToKeep=10 numVersionBuckets=65536
   [junit4]   2> 837863 INFO  (coreLoadExecutor-2918-thread-1) [    x:collection1] o.a.s.u.CommitTracker Hard AutoCommit: disabled
   [junit4]   2> 837864 INFO  (coreLoadExecutor-2918-thread-1) [    x:collection1] o.a.s.u.CommitTracker Soft AutoCommit: disabled
   [junit4]   2> 837864 INFO  (coreLoadExecutor-2918-thread-1) [    x:collection1] o.a.s.u.RandomMergePolicy RandomMergePolicy wrapping class org.apache.lucene.index.TieredMergePolicy: [TieredMergePolicy: maxMergeAtOnce=47, maxMergeAtOnceExplicit=40, maxMergedSegmentMB=51.8271484375, floorSegmentMB=1.740234375, forceMergeDeletesPctAllowed=7.5990988528704815, segmentsPerTier=38.0, maxCFSSegmentSizeMB=8.796093022207999E12, noCFSRatio=0.0
   [junit4]   2> 837864 INFO  (coreLoadExecutor-2918-thread-1) [    x:collection1] o.a.s.s.SolrIndexSearcher Opening [Searcher@31870573[collection1] main]
   [junit4]   2> 837865 INFO  (coreLoadExecutor-2918-thread-1) [    x:collection1] o.a.s.h.c.SpellCheckComponent Initializing spell checkers
   [junit4]   2> 837871 INFO  (coreLoadExecutor-2918-thread-1) [    x:collection1] o.a.s.s.DirectSolrSpellChecker init: {name=direct,classname=DirectSolrSpellChecker,field=lowerfilt,minQueryLength=3}
   [junit4]   2> 837912 INFO  (coreLoadExecutor-2918-thread-1) [    x:collection1] o.a.s.h.ReplicationHandler Commits will be reserved for 10000ms.
   [junit4]   2> 837912 INFO  (searcherExecutor-2919-thread-1-processing-x:collection1) [    x:collection1] o.a.s.h.c.SpellCheckComponent Loading spell index for spellchecker: default
   [junit4]   2> 837912 INFO  (coreLoadExecutor-2918-thread-1) [    x:collection1] o.a.s.u.UpdateLog Could not find max version in index or recent updates, using new clock 1588652289436942336
   [junit4]   2> 837914 INFO  (searcherExecutor-2919-thread-1-processing-x:collection1) [    x:collection1] o.a.s.h.c.SpellCheckComponent Loading spell index for spellchecker: direct
   [junit4]   2> 837914 INFO  (searcherExecutor-2919-thread-1-processing-x:collection1) [    x:collection1] o.a.s.h.c.SpellCheckComponent Loading spell index for spellchecker: wordbreak
   [junit4]   2> 837914 INFO  (searcherExecutor-2919-thread-1-processing-x:collection1) [    x:collection1] o.a.s.h.c.SpellCheckComponent Loading spell index for spellchecker: multipleFields
   [junit4]   2> 837915 INFO  (searcherExecutor-2919-thread-1-processing-x:collection1) [    x:collection1] o.a.s.h.c.SpellCheckComponent Loading spell index for spellchecker: jarowinkler
   [junit4]   2> 837916 INFO  (searcherExecutor-2919-thread-1-processing-x:collection1) [    x:collection1] o.a.s.h.c.SpellCheckComponent Loading spell index for spellchecker: external
   [junit4]   2> 837916 INFO  (searcherExecutor-2919-thread-1-processing-x:collection1) [    x:collection1] o.a.s.h.c.SpellCheckComponent Loading spell index for spellchecker: freq
   [junit4]   2> 837917 INFO  (SUITE-TestExceedMaxTermLength-seed#[24F6D41EE9EF49EC]-worker) [    ] o.a.s.SolrTestCaseJ4 ####initCore end
   [junit4]   2> 837917 INFO  (searcherExecutor-2919-thread-1-processing-x:collection1) [    x:collection1] o.a.s.h.c.SpellCheckComponent Loading spell index for spellchecker: fqcn
   [junit4]   2> 837919 INFO  (searcherExecutor-2919-thread-1-processing-x:collection1) [    x:collection1] o.a.s.h.c.SpellCheckComponent Loading spell index for spellchecker: perDict
   [junit4]   2> 837919 INFO  (TEST-TestExceedMaxTermLength.testExceededMaxTermLengthWithLimitingFilter-seed#[24F6D41EE9EF49EC]) [    ] o.a.s.SolrTestCaseJ4 ###Starting testExceededMaxTermLengthWithLimitingFilter
   [junit4]   2> 837920 INFO  (searcherExecutor-2919-thread-1-processing-x:collection1) [    x:collection1] o.a.s.c.SolrCore [collection1] Registered new searcher Searcher@31870573[collection1] main{ExitableDirectoryReader(UninvertingDirectoryReader())}
   [junit4]   2> 837941 INFO  (TEST-TestExceedMaxTermLength.testExceededMaxTermLengthWithLimitingFilter-seed#[24F6D41EE9EF49EC]) [    ] o.a.s.u.p.LogUpdateProcessorFactory [collection1]  webapp=null path=null params={wt=json&indent=true}{add=[1 (1588652289449525248)]} 0 17
   [junit4]   2> 837941 INFO  (TEST-TestExceedMaxTermLength.testExceededMaxTermLengthWithLimitingFilter-seed#[24F6D41EE9EF49EC]) [    ] o.a.s.u.DirectUpdateHandler2 start commit{_version_=1588652289467351040,optimize=false,openSearcher=true,waitSearcher=true,expungeDeletes=false,softCommit=false,prepareCommit=false}
   [junit4]   2> 837941 INFO  (TEST-TestExceedMaxTermLength.testExceededMaxTermLengthWithLimitingFilter-seed#[24F6D41EE9EF49EC]) [    ] o.a.s.u.SolrIndexWriter Calling setCommitData with IW:org.apache.solr.update.SolrIndexWriter@4fed9731 commitCommandVersion:1588652289467351040
   [junit4]   2> 837947 INFO  (TEST-TestExceedMaxTermLength.testExceededMaxTermLengthWithLimitingFilter-seed#[24F6D41EE9EF49EC]) [    ] o.a.s.s.SolrIndexSearcher Opening [Searcher@4762783c[collection1] main]
   [junit4]   2> 837949 INFO  (searcherExecutor-2919-thread-1) [    ] o.a.s.c.SolrCore [collection1] Registered new searcher Searcher@4762783c[collection1] main{ExitableDirectoryReader(UninvertingDirectoryReader(Uninverting(_0(7.3.0):C1)))}
   [junit4]   2> 837949 INFO  (TEST-TestExceedMaxTermLength.testExceededMaxTermLengthWithLimitingFilter-seed#[24F6D41EE9EF49EC]) [    ] o.a.s.u.DirectUpdateHandler2 end_commit_flush
   [junit4]   2> 837949 INFO  (TEST-TestExceedMaxTermLength.testExceededMaxTermLengthWithLimitingFilter-seed#[24F6D41EE9EF49EC]) [    ] o.a.s.u.p.LogUpdateProcessorFactory [collection1]  webapp=null path=null params={}{commit=} 0 7
   [junit4]   2> 837951 INFO  (TEST-TestExceedMaxTermLength.testExceededMaxTermLengthWithLimitingFilter-seed#[24F6D41EE9EF49EC]) [    ] o.a.s.c.S.Request [collection1]  webapp=null path=null params={q=*:*&wt=xml} hits=1 status=0 QTime=0
   [junit4]   2> 837955 INFO  (TEST-TestExceedMaxTermLength.testExceededMaxTermLengthWithLimitingFilter-seed#[24F6D41EE9EF49EC]) [    ] o.a.s.s.SolrIndexSearcher Opening [Searcher@324b9bee[collection1] realtime]
   [junit4]   2> 837955 INFO  (TEST-TestExceedMaxTermLength.testExceededMaxTermLengthWithLimitingFilter-seed#[24F6D41EE9EF49EC]) [    ] o.a.s.u.p.LogUpdateProcessorFactory [collection1]  webapp=null path=null params={}{deleteByQuery=*:* (-1588652289479933952)} 0 2
   [junit4]   2> 837955 INFO  (TEST-TestExceedMaxTermLength.testExceededMaxTermLengthWithLimitingFilter-seed#[24F6D41EE9EF49EC]) [    ] o.a.s.u.DirectUpdateHandler2 start commit{_version_=1588652289482031104,optimize=false,openSearcher=true,waitSearcher=true,expungeDeletes=false,softCommit=false,prepareCommit=false}
   [junit4]   2> 837956 INFO  (TEST-TestExceedMaxTermLength.testExceededMaxTermLengthWithLimitingFilter-seed#[24F6D41EE9EF49EC]) [    ] o.a.s.u.SolrIndexWriter Calling setCommitData with IW:org.apache.solr.update.SolrIndexWriter@4fed9731 commitCommandVersion:1588652289482031104
   [junit4]   2> 837956 INFO  (TEST-TestExceedMaxTermLength.testExceededMaxTermLengthWithLimitingFilter-seed#[24F6D41EE9EF49EC]) [    ] o.a.s.s.SolrIndexSearcher Opening [Searcher@30e8c5fe[collection1] main]
   [junit4]   2> 837956 INFO  (TEST-TestExceedMaxTermLength.testExceededMaxTermLengthWithLimitingFilter-seed#[24F6D41EE9EF49EC]) [    ] o.a.s.u.DirectUpdateHandler2 end_commit_flush
   [junit4]   2> 837958 INFO  (searcherExecutor-2919-thread-1) [    ] o.a.s.c.SolrCore [collection1] Registered new searcher Searcher@30e8c5fe[collection1] main{ExitableDirectoryReader(UninvertingDirectoryReader())}
   [junit4]   2> 837958 INFO  (TEST-TestExceedMaxTermLength.testExceededMaxTermLengthWithLimitingFilter-seed#[24F6D41EE9EF49EC]) [    ] o.a.s.u.p.LogUpdateProcessorFactory [collection1]  webapp=null path=null params={}{commit=} 0 2
   [junit4]   2> 837958 INFO  (TEST-TestExceedMaxTermLength.testExceededMaxTermLengthWithLimitingFilter-seed#[24F6D41EE9EF49EC]) [    ] o.a.s.SolrTestCaseJ4 ###Ending testExceededMaxTermLengthWithLimitingFilter
   [junit4]   2> 837960 INFO  (TEST-TestExceedMaxTermLength.testExceededMaxTermLength-seed#[24F6D41EE9EF49EC]) [    ] o.a.s.SolrTestCaseJ4 ###Starting testExceededMaxTermLength
   [junit4]   2> 837964 INFO  (TEST-TestExceedMaxTermLength.testExceededMaxTermLength-seed#[24F6D41EE9EF49EC]) [    ] o.a.s.u.p.LogUpdateProcessorFactory [collection1]  webapp=null path=null params={}{} 0 1
   [junit4]   2> 837965 ERROR (TEST-TestExceedMaxTermLength.testExceededMaxTermLength-seed#[24F6D41EE9EF49EC]) [    ] o.a.s.h.RequestHandlerBase org.apache.solr.common.SolrException: Exception writing document id 1 to the index; possible analysis error: Document contains at least one immense term in field="cat" (whose UTF8 encoding is longer than the max length 32766), all of which were skipped.  Please correct the analyzer to not produce such terms.  The prefix of the first immense term is: '[105, 107, 105, 113, 118, 118, 109, 106, 99, 109, 100, 114, 122, 102, 121, 108, 113, 122, 113, 103, 119, 105, 120, 97, 97, 116, 106, 118, 102, 110]...', original message: bytes can be at most 32766 in length; got 56656. Perhaps the document has an indexed string field (solr.StrField) which is too large
   [junit4]   2> 	at org.apache.solr.update.DirectUpdateHandler2.addDoc(DirectUpdateHandler2.java:226)
   [junit4]   2> 	at org.apache.solr.update.processor.RunUpdateProcessor.processAdd(RunUpdateProcessorFactory.java:67)
   [junit4]   2> 	at org.apache.solr.update.processor.UpdateRequestProcessor.processAdd(UpdateRequestProcessor.java:55)
   [junit4]   2> 	at org.apache.solr.update.processor.DistributedUpdateProcessor.doLocalAdd(DistributedUpdateProcessor.java:911)
   [junit4]   2> 	at org.apache.solr.update.processor.DistributedUpdateProcessor.versionAdd(DistributedUpdateProcessor.java:1122)
   [junit4]   2> 	at org.apache.solr.update.processor.DistributedUpdateProcessor.processAdd(DistributedUpdateProcessor.java:617)
   [junit4]   2> 	at org.apache.solr.update.processor.LogUpdateProcessorFactory$LogUpdateProcessor.processAdd(LogUpdateProcessorFactory.java:103)
   [junit4]   2> 	at org.apache.solr.handler.loader.XMLLoader.processUpdate(XMLLoader.java:261)
   [junit4]   2> 	at org.apache.solr.handler.loader.XMLLoader.load(XMLLoader.java:188)
   [junit4]   2> 	at org.apache.solr.handler.UpdateRequestHandler$1.load(UpdateRequestHandler.java:97)
   [junit4]   2> 	at org.apache.solr.handler.ContentStreamHandlerBase.handleRequestBody(ContentStreamHandlerBase.java:68)
   [junit4]   2> 	at org.apache.solr.handler.RequestHandlerBase.handleRequest(RequestHandlerBase.java:177)
   [junit4]   2> 	at org.apache.solr.core.SolrCore.execute(SolrCore.java:2503)
   [junit4]   2> 	at org.apache.solr.servlet.DirectSolrConnection.request(DirectSolrConnection.java:125)
   [junit4]   2> 	at org.apache.solr.util.TestHarness.update(TestHarness.java:284)
   [junit4]   2> 	at org.apache.solr.util.BaseTestHarness.checkUpdateStatus(BaseTestHarness.java:281)
   [junit4]   2> 	at org.apache.solr.util.BaseTestHarness.validateErrorUpdate(BaseTestHarness.java:264)
   [junit4]   2> 	at org.apache.solr.SolrTestCaseJ4.checkUpdateU(SolrTestCaseJ4.java:852)
   [junit4]   2> 	at org.apache.solr.SolrTestCaseJ4.assertFailedU(SolrTestCaseJ4.java:840)
   [junit4]   2> 	at org.apache.solr.SolrTestCaseJ4.assertFailedU(SolrTestCaseJ4.java:834)
   [junit4]   2> 	at org.apache.solr.update.TestExceedMaxTermLength.testExceededMaxTermLength(TestExceedMaxTermLength.java:72)
   [junit4]   2> 	at java.base/jdk.internal.reflect.NativeMethodAccessorImpl.invoke0(Native Method)
   [junit4]   2> 	at java.base/jdk.internal.reflect.NativeMethodAccessorImpl.invoke(NativeMethodAccessorImpl.java:62)
   [junit4]   2> 	at java.base/jdk.internal.reflect.DelegatingMethodAccessorImpl.invoke(DelegatingMethodAccessorImpl.java:43)
   [junit4]   2> 	at java.base/java.lang.reflect.Method.invoke(Method.java:564)
   [junit4]   2> 	at com.carrotsearch.randomizedtesting.RandomizedRunner.invoke(RandomizedRunner.java:1737)
   [junit4]   2> 	at com.carrotsearch.randomizedtesting.RandomizedRunner$8.evaluate(RandomizedRunner.java:934)
   [junit4]   2> 	at com.carrotsearch.randomizedtesting.RandomizedRunner$9.evaluate(RandomizedRunner.java:970)
   [junit4]   2> 	at com.carrotsearch.randomizedtesting.RandomizedRunner$10.evaluate(RandomizedRunner.java:984)
   [junit4]   2> 	at com.carrotsearch.randomizedtesting.rules.SystemPropertiesRestoreRule$1.evaluate(SystemPropertiesRestoreRule.java:57)
   [junit4]   2> 	at org.apache.lucene.util.TestRuleSetupTeardownChained$1.evaluate(TestRuleSetupTeardownChained.java:49)
   [junit4]   2> 	at org.apache.lucene.util.AbstractBeforeAfterRule$1.evaluate(AbstractBeforeAfterRule.java:45)
   [junit4]   2> 	at org.apache.lucene.util.TestRuleThreadAndTestName$1.evaluate(TestRuleThreadAndTestName.java:48)
   [junit4]   2> 	at org.apache.lucene.util.TestRuleIgnoreAfterMaxFailures$1.evaluate(TestRuleIgnoreAfterMaxFailures.java:64)
   [junit4]   2> 	at org.apache.lucene.util.TestRuleMarkFailure$1.evaluate(TestRuleMarkFailure.java:47)
   [junit4]   2> 	at com.carrotsearch.randomizedtesting.rules.StatementAdapter.evaluate(StatementAdapter.java:36)
   [junit4]   2> 	at com.carrotsearch.randomizedtesting.ThreadLeakControl$StatementRunner.run(ThreadLeakControl.java:368)
   [junit4]   2> 	at com.carrotsearch.randomizedtesting.ThreadLeakControl.forkTimeoutingTask(ThreadLeakControl.java:817)
   [junit4]   2> 	at com.carrotsearch.randomizedtesting.ThreadLeakControl$3.evaluate(ThreadLeakControl.java:468)
   [junit4]   2> 	at com.carrotsearch.randomizedtesting.RandomizedRunner.runSingleTest(RandomizedRunner.java:943)
   [junit4]   2> 	at com.carrotsearch.randomizedtesting.RandomizedRunner$5.evaluate(RandomizedRunner.java:829)
   [junit4]   2> 	at com.carrotsearch.randomizedtesting.RandomizedRunner$6.evaluate(RandomizedRunner.java:879)
   [junit4]   2> 	at com.carrotsearch.randomizedtesting.RandomizedRunner$7.evaluate(RandomizedRunner.java:890)
   [junit4]   2> 	at com.carrotsearch.randomizedtesting.rules.StatementAdapter.evaluate(StatementAdapter.java:36)
   [junit4]   2> 	at com.carrotsearch.randomizedtesting.rules.SystemPropertiesRestoreRule$1.evaluate(SystemPropertiesRestoreRule.java:57)
   [junit4]   2> 	at org.apache.lucene.util.AbstractBeforeAfterRule$1.evaluate(AbstractBeforeAfterRule.java:45)
   [junit4]   2> 	at com.carrotsearch.randomizedtesting.rules.StatementAdapter.evaluate(StatementAdapter.java:36)
   [junit4]   2> 	at org.apache.lucene.util.TestRuleStoreClassName$1.evaluate(TestRuleStoreClassName.java:41)
   [junit4]   2> 	at com.carrotsearch.randomizedtesting.rules.NoShadowingOrOverridesOnMethodsRule$1.evaluate(NoShadowingOrOverridesOnMethodsRule.java:40)
   [junit4]   2> 	at com.carrotsearch.randomizedtesting.rules.NoShadowingOrOverridesOnMethodsRule$1.evaluate(NoShadowingOrOverridesOnMethodsRule.java:40)
   [junit4]   2> 	at com.carrotsearch.randomizedtesting.rules.StatementAdapter.evaluate(StatementAdapter.java:36)
   [junit4]   2> 	at com.carrotsearch.randomizedtesting.rules.StatementAdapter.evaluate(StatementAdapter.java:36)
   [junit4]   2> 	at org.apache.lucene.util.TestRuleAssertionsRequired$1.evaluate(TestRuleAssertionsRequired.java:53)
   [junit4]   2> 	at org.apache.lucene.util.TestRuleMarkFailure$1.evaluate(TestRuleMarkFailure.java:47)
   [junit4]   2> 	at org.apache.lucene.util.TestRuleIgnoreAfterMaxFailures$1.evaluate(TestRuleIgnoreAfterMaxFailures.java:64)
   [junit4]   2> 	at org.apache.lucene.util.TestRuleIgnoreTestSuites$1.evaluate(TestRuleIgnoreTestSuites.java:54)
   [junit4]   2> 	at com.carrotsearch.randomizedtesting.rules.StatementAdapter.evaluate(StatementAdapter.java:36)
   [junit4]   2> 	at com.carrotsearch.randomizedtesting.ThreadLeakControl$StatementRunner.run(ThreadLeakControl.java:368)
   [junit4]   2> 	at java.base/java.lang.Thread.run(Thread.java:844)
   [junit4]   2> Caused by: java.lang.IllegalArgumentException: Document contains at least one immense term in field="cat" (whose UTF8 encoding is longer than the max length 32766), all of which were skipped.  Please correct the analyzer to not produce such terms.  The prefix of the first immense term is: '[105, 107, 105, 113, 118, 118, 109, 106, 99, 109, 100, 114, 122, 102, 121, 108, 113, 122, 113, 103, 119, 105, 120, 97, 97, 116, 106, 118, 102, 110]...', original message: bytes can be at most 32766 in length; got 56656
   [junit4]   2> 	at org.apache.lucene.index.DefaultIndexingChain$PerField.invert(DefaultIndexingChain.java:796)
   [junit4]   2> 	at org.apache.lucene.index.DefaultIndexingChain.processField(DefaultIndexingChain.java:430)
   [junit4]   2> 	at org.apache.lucene.index.DefaultIndexingChain.processDocument(DefaultIndexingChain.java:392)
   [junit4]   2> 	at org.apache.lucene.index.DocumentsWriterPerThread.updateDocument(DocumentsWriterPerThread.java:240)
   [junit4]   2> 	at org.apache.lucene.index.DocumentsWriter.updateDocument(DocumentsWriter.java:497)
   [junit4]   2> 	at org.apache.lucene.index.IndexWriter.updateDocument(IndexWriter.java:1729)
   [junit4]   2> 	at org.apache.solr.update.DirectUpdateHandler2.updateDocument(DirectUpdateHandler2.java:965)
   [junit4]   2> 	at org.apache.solr.update.DirectUpdateHandler2.updateDocOrDocValues(DirectUpdateHandler2.java:954)
   [junit4]   2> 	at org.apache.solr.update.DirectUpdateHandler2.doNormalUpdate(DirectUpdateHandler2.java:334)
   [junit4]   2> 	at org.apache.solr.update.DirectUpdateHandler2.addDoc0(DirectUpdateHandler2.java:271)
   [junit4]   2> 	at org.apache.solr.update.DirectUpdateHandler2.addDoc(DirectUpdateHandler2.java:221)
   [junit4]   2> 	... 58 more
   [junit4]   2> Caused by: org.apache.lucene.util.BytesRefHash$MaxBytesLengthExceededException: bytes can be at most 32766 in length; got 56656
   [junit4]   2> 	at org.apache.lucene.util.BytesRefHash.add(BytesRefHash.java:263)
   [junit4]   2> 	at org.apache.lucene.index.TermsHashPerField.add(TermsHashPerField.java:151)
   [junit4]   2> 	at org.apache.lucene.index.DefaultIndexingChain$PerField.invert(DefaultIndexingChain.java:786)
   [junit4]   2> 	... 68 more
   [junit4]   2> 
   [junit4]   2> 837965 INFO  (TEST-TestExceedMaxTermLength.testExceededMaxTermLength-seed#[24F6D41EE9EF49EC]) [    ] o.a.s.u.DirectUpdateHandler2 start commit{_version_=1588652289492516864,optimize=false,openSearcher=true,waitSearcher=true,expungeDeletes=false,softCommit=false,prepareCommit=false}
   [junit4]   2> 837965 INFO  (TEST-TestExceedMaxTermLength.testExceededMaxTermLength-seed#[24F6D41EE9EF49EC]) [    ] o.a.s.u.SolrIndexWriter Calling setCommitData with IW:org.apache.solr.update.SolrIndexWriter@4fed9731 commitCommandVersion:1588652289492516864
   [junit4]   2> 837967 INFO  (TEST-TestExceedMaxTermLength.testExceededMaxTermLength-seed#[24F6D41EE9EF49EC]) [    ] o.a.s.s.SolrIndexSearcher Opening [Searcher@69e6cab0[collection1] main]
   [junit4]   2> 837967 INFO  (TEST-TestExceedMaxTermLength.testExceededMaxTermLength-seed#[24F6D41EE9EF49EC]) [    ] o.a.s.u.DirectUpdateHandler2 end_commit_flush
   [junit4]   2> 837968 INFO  (searcherExecutor-2919-thread-1) [    ] o.a.s.c.SolrCore [collection1] Registered new searcher Searcher@69e6cab0[collection1] main{ExitableDirectoryReader(UninvertingDirectoryReader())}
   [junit4]   2> 837968 INFO  (TEST-TestExceedMaxTermLength.testExceededMaxTermLength-seed#[24F6D41EE9EF49EC]) [    ] o.a.s.u.p.LogUpdateProcessorFactory [collection1]  webapp=null path=null params={}{commit=} 0 3
   [junit4]   2> 837969 INFO  (TEST-TestExceedMaxTermLength.testExceededMaxTermLength-seed#[24F6D41EE9EF49EC]) [    ] o.a.s.c.S.Request [collection1]  webapp=null path=null params={q=*:*&wt=xml} hits=0 status=0 QTime=0
   [junit4]   2> 837971 INFO  (TEST-TestExceedMaxTermLength.testExceededMaxTermLength-seed#[24F6D41EE9EF49EC]) [    ] o.a.s.s.SolrIndexSearcher Opening [Searcher@2aa9c664[collection1] realtime]
   [junit4]   2> 837971 INFO  (TEST-TestExceedMaxTermLength.testExceededMaxTermLength-seed#[24F6D41EE9EF49EC]) [    ] o.a.s.u.p.LogUpdateProcessorFactory [collection1]  webapp=null path=null params={}{deleteByQuery=*:* (-1588652289496711168)} 0 2
   [junit4]   2> 837972 INFO  (TEST-TestExceedMaxTermLength.testExceededMaxTermLength-seed#[24F6D41EE9EF49EC]) [    ] o.a.s.u.DirectUpdateHandler2 start commit{_version_=1588652289499856896,optimize=false,openSearcher=true,waitSearcher=true,expungeDeletes=false,softCommit=false,prepareCommit=false}
   [junit4]   2> 837972 INFO  (TEST-TestExceedMaxTermLength.testExceededMaxTermLength-seed#[24F6D41EE9EF49EC]) [    ] o.a.s.u.SolrIndexWriter Calling setCommitData with IW:org.apache.solr.update.SolrIndexWriter@4fed9731 commitCommandVersion:1588652289499856896
   [junit4]   2> 837972 INFO  (TEST-TestExceedMaxTermLength.testExceededMaxTermLength-seed#[24F6D41EE9EF49EC]) [    ] o.a.s.s.SolrIndexSearcher Opening [Searcher@2364c647[collection1] main]
   [junit4]   2> 837973 INFO  (TEST-TestExceedMaxTermLength.testExceededMaxTermLength-seed#[24F6D41EE9EF49EC]) [    ] o.a.s.u.DirectUpdateHandler2 end_commit_flush
   [junit4]   2> 837974 INFO  (searcherExecutor-2919-thread-1) [    ] o.a.s.c.SolrCore [collection1] Registered new searcher Searcher@2364c647[collection1] main{ExitableDirectoryReader(UninvertingDirectoryReader())}
   [junit4]   2> 837974 INFO  (TEST-TestExceedMaxTermLength.testExceededMaxTermLength-seed#[24F6D41EE9EF49EC]) [    ] o.a.s.u.p.LogUpdateProcessorFactory [collection1]  webapp=null path=null params={}{commit=} 0 2
   [junit4]   2> 837974 INFO  (TEST-TestExceedMaxTermLength.testExceededMaxTermLength-seed#[24F6D41EE9EF49EC]) [    ] o.a.s.SolrTestCaseJ4 ###Ending testExceededMaxTermLength
   [junit4]   2> 837975 INFO  (SUITE-TestExceedMaxTermLength-seed#[24F6D41EE9EF49EC]-worker) [    ] o.a.s.SolrTestCaseJ4 ###deleteCore
   [junit4]   2> 837975 INFO  (SUITE-TestExceedMaxTermLength-seed#[24F6D41EE9EF49EC]-worker) [    ] o.a.s.c.CoreContainer Shutting down CoreContainer instance=1220717966
   [junit4]   2> 837975 INFO  (SUITE-TestExceedMaxTermLength-seed#[24F6D41EE9EF49EC]-worker) [    ] o.a.s.m.SolrMetricManager Closing metric reporters for registry=solr.node, tag=null
   [junit4]   2> 837975 INFO  (SUITE-TestExceedMaxTermLength-seed#[24F6D41EE9EF49EC]-worker) [    ] o.a.s.m.r.SolrJmxReporter Closing reporter [org.apache.solr.metrics.reporters.SolrJmxReporter@6e423fa2: rootName = null, domain = solr.node, service url = null, agent id = null] for registry solr.node / com.codahale.metrics.MetricRegistry@34b6b9f3
   [junit4]   2> 837978 INFO  (SUITE-TestExceedMaxTermLength-seed#[24F6D41EE9EF49EC]-worker) [    ] o.a.s.m.SolrMetricManager Closing metric reporters for registry=solr.jvm, tag=null
   [junit4]   2> 837978 INFO  (SUITE-TestExceedMaxTermLength-seed#[24F6D41EE9EF49EC]-worker) [    ] o.a.s.m.r.SolrJmxReporter Closing reporter [org.apache.solr.metrics.reporters.SolrJmxReporter@3a643cea: rootName = null, domain = solr.jvm, service url = null, agent id = null] for registry solr.jvm / com.codahale.metrics.MetricRegistry@574d09c9
   [junit4]   2> 837982 INFO  (SUITE-TestExceedMaxTermLength-seed#[24F6D41EE9EF49EC]-worker) [    ] o.a.s.m.SolrMetricManager Closing metric reporters for registry=solr.jetty, tag=null
   [junit4]   2> 837982 INFO  (SUITE-TestExceedMaxTermLength-seed#[24F6D41EE9EF49EC]-worker) [    ] o.a.s.m.r.SolrJmxReporter Closing reporter [org.apache.solr.metrics.reporters.SolrJmxReporter@3b5f5ab0: rootName = null, domain = solr.jetty, service url = null, agent id = null] for registry solr.jetty / com.codahale.metrics.MetricRegistry@537287f8
   [junit4]   2> 837983 INFO  (coreCloseExecutor-2924-thread-1) [    x:collection1] o.a.s.c.SolrCore [collection1]  CLOSING SolrCore org.apache.solr.core.SolrCore@2f90ac39
   [junit4]   2> 837983 INFO  (coreCloseExecutor-2924-thread-1) [    x:collection1] o.a.s.m.SolrMetricManager Closing metric reporters for registry=solr.core.collection1, tag=798010425
   [junit4]   2> 837984 INFO  (coreCloseExecutor-2924-thread-1) [    x:collection1] o.a.s.m.r.SolrJmxReporter Closing reporter [org.apache.solr.metrics.reporters.SolrJmxReporter@7734a7d4: rootName = null, domain = solr.core.collection1, service url = null, agent id = null] for registry solr.core.collection1 / com.codahale.metrics.MetricRegistry@57e1a7fe
   [junit4]   2> 838000 INFO  (SUITE-TestExceedMaxTermLength-seed#[24F6D41EE9EF49EC]-worker) [    ] o.a.s.SolrTestCaseJ4 ------------------------------------------------------- Done waiting for tracked resources to be released
   [junit4]   2> NOTE: test params are: codec=Asserting(Lucene70): {cat_length=PostingsFormat(name=LuceneVarGapFixedInterval), id=PostingsFormat(name=LuceneVarGapFixedInterval)}, docValues:{}, maxPointsInLeafNode=140, maxMBSortInHeap=5.843200683838472, sim=RandomSimilarity(queryNorm=false): {}, locale=de-CH, timezone=Asia/Aqtau
   [junit4]   2> NOTE: Windows 10 10.0 amd64/Oracle Corporation 9.0.1 (64-bit)/cpus=3,threads=1,free=97756688,total=430383104
   [junit4]   2> NOTE: All tests run in this JVM: [SolrSlf4jReporterTest, TestCloudPseudoReturnFields, TestManagedResourceStorage, MultiTermTest, IndexSchemaTest, TestHalfAndHalfDocValues, CollectionReloadTest, TestTlogReplica, TestNumericTerms32, ConjunctionSolrSpellCheckerTest, TimeRoutedAliasUpdateProcessorTest, SuggesterTest, TestSolrDeletionPolicy2, TestTolerantUpdateProcessorRandomCloud, RequestHandlersTest, TestSQLHandler, RankQueryTest, OverseerStatusTest, TestJsonRequest, TestExportWriter, HighlighterTest, TestTolerantSearch, TestAddFieldRealTimeGet, JavabinLoaderTest, TestLFUCache, TestSolrCLIRunExample, TestCloudSearcherWarming, DataDrivenBlockJoinTest, TestSolrCoreSnapshots, TestSchemaSimilarityResource, CircularListTest, TestCustomStream, CSVRequestHandlerTest, TestInPlaceUpdatesDistrib, HdfsThreadLeakTest, NumberUtilsTest, AtomicUpdatesTest, TestUtils, TestAnalyzeInfixSuggestions, DefaultValueUpdateProcessorTest, TestConfigSetImmutable, NumericFieldsTest, TestLegacyTerms, TestDistribStateManager, TestRandomDVFaceting, SpatialFilterTest, CollectionTooManyReplicasTest, TestDownShardTolerantSearch, HdfsUnloadDistributedZkTest, TestManagedSchemaAPI, BlockJoinFacetDistribTest, TestJoin, DisMaxRequestHandlerTest, TestIntervalFaceting, TestXIncludeConfig, TestSolrCloudWithDelegationTokens, SpellCheckComponentTest, CurrencyFieldTypeTest, DeleteNodeTest, LeaderElectionTest, TestImplicitCoreProperties, TestDefaultStatsCache, TestUninvertingReader, TestCodecSupport, TestBackupRepositoryFactory, DeleteShardTest, SortByFunctionTest, BadIndexSchemaTest, TestExpandComponent, AutoAddReplicasIntegrationTest, TestMissingGroups, UnloadDistributedZkTest, TestExactSharedStatsCache, TestSmileRequest, TestFileDictionaryLookup, TestExceedMaxTermLength]
   [junit4]   2> NOTE: reproduce with: ant test  -Dtestcase=TestExceedMaxTermLength -Dtests.seed=24F6D41EE9EF49EC -Dtests.slow=true -Dtests.locale=de-CH -Dtests.timezone=Asia/Aqtau -Dtests.asserts=true -Dtests.file.encoding=UTF-8
   [junit4] ERROR   0.00s J0 | TestExceedMaxTermLength (suite) <<<
   [junit4]    > Throwable #1: java.io.IOException: Could not remove the following files (in the order of attempts):
   [junit4]    >    C:\Users\jenkins\workspace\Lucene-Solr-7.x-Windows\solr\build\solr-core\test\J0\temp\solr.update.TestExceedMaxTermLength_24F6D41EE9EF49EC-001\init-core-data-001\tlog: java.nio.file.DirectoryNotEmptyException: C:\Users\jenkins\workspace\Lucene-Solr-7.x-Windows\solr\build\solr-core\test\J0\temp\solr.update.TestExceedMaxTermLength_24F6D41EE9EF49EC-001\init-core-data-001\tlog
   [junit4]    >    C:\Users\jenkins\workspace\Lucene-Solr-7.x-Windows\solr\build\solr-core\test\J0\temp\solr.update.TestExceedMaxTermLength_24F6D41EE9EF49EC-001\init-core-data-001: java.nio.file.DirectoryNotEmptyException: C:\Users\jenkins\workspace\Lucene-Solr-7.x-Windows\solr\build\solr-core\test\J0\temp\solr.update.TestExceedMaxTermLength_24F6D41EE9EF49EC-001\init-core-data-001
   [junit4]    >    C:\Users\jenkins\workspace\Lucene-Solr-7.x-Windows\solr\build\solr-core\test\J0\temp\solr.update.TestExceedMaxTermLength_24F6D41EE9EF49EC-001\init-core-data-001\tlog\tlog.0000000000000000000: java.nio.file.NoSuchFileException: C:\Users\jenkins\workspace\Lucene-Solr-7.x-Windows\solr\build\solr-core\test\J0\temp\solr.update.TestExceedMaxTermLength_24F6D41EE9EF49EC-001\init-core-data-001\tlog\tlog.0000000000000000000
   [junit4]    > 	at __randomizedtesting.SeedInfo.seed([24F6D41EE9EF49EC]:0)
   [junit4]    > 	at org.apache.lucene.util.IOUtils.rm(IOUtils.java:329)
   [junit4]    > 	at java.base/java.lang.Thread.run(Thread.java:844)
   [junit4] Completed [171/764 (1!)] on J0 in 0.47s, 2 tests, 1 error <<< FAILURES!

[...truncated 48 lines...]
   [junit4] Suite: org.apache.solr.rest.schema.TestFieldTypeResource
   [junit4]   2> 874288 INFO  (SUITE-TestFieldTypeResource-seed#[24F6D41EE9EF49EC]-worker) [    ] o.a.s.SolrTestCaseJ4 SecureRandom sanity checks: test.solr.allowed.securerandom=null & java.security.egd=file:/dev/./urandom
   [junit4]   2> Creating dataDir: C:\Users\jenkins\workspace\Lucene-Solr-7.x-Windows\solr\build\solr-core\test\J1\temp\solr.rest.schema.TestFieldTypeResource_24F6D41EE9EF49EC-001\init-core-data-001
   [junit4]   2> 874289 WARN  (SUITE-TestFieldTypeResource-seed#[24F6D41EE9EF49EC]-worker) [    ] o.a.s.SolrTestCaseJ4 startTrackingSearchers: numOpens=59 numCloses=59
   [junit4]   2> 874289 INFO  (SUITE-TestFieldTypeResource-seed#[24F6D41EE9EF49EC]-worker) [    ] o.a.s.SolrTestCaseJ4 Using PointFields (NUMERIC_POINTS_SYSPROP=true) w/NUMERIC_DOCVALUES_SYSPROP=false
   [junit4]   2> 874292 INFO  (SUITE-TestFieldTypeResource-seed#[24F6D41EE9EF49EC]-worker) [    ] o.a.s.SolrTestCaseJ4 Randomized ssl (false) and clientAuth (false) via: @org.apache.solr.util.RandomizeSSL(reason="", value=0.0/0.0, ssl=0.0/0.0, clientAuth=0.0/0.0)
   [junit4]   2> 874292 INFO  (SUITE-TestFieldTypeResource-seed#[24F6D41EE9EF49EC]-worker) [    ] o.a.s.SolrTestCaseJ4 Writing core.properties file to C:\Users\jenkins\workspace\Lucene-Solr-7.x-Windows\solr\build\solr-core\test\J1\temp\solr.rest.schema.TestFieldTypeResource_24F6D41EE9EF49EC-001\tempDir-001\cores\core
   [junit4]   2> 874297 INFO  (SUITE-TestFieldTypeResource-seed#[24F6D41EE9EF49EC]-worker) [    ] o.a.s.SolrTestCaseJ4 ####initCore
   [junit4]   2> 874297 INFO  (SUITE-TestFieldTypeResource-seed#[24F6D41EE9EF49EC]-worker) [    ] o.a.s.SolrTestCaseJ4 ####initCore end
   [junit4]   2> 874297 INFO  (SUITE-TestFieldTypeResource-seed#[24F6D41EE9EF49EC]-worker) [    ] o.a.s.SolrTestCaseJ4 Writing core.properties file to C:\Users\jenkins\workspace\Lucene-Solr-7.x-Windows\solr\build\solr-core\test\J1\temp\solr.rest.schema.TestFieldTypeResource_24F6D41EE9EF49EC-001\tempDir-003\cores\core
   [junit4]   2> 874304 INFO  (SUITE-TestFieldTypeResource-seed#[24F6D41EE9EF49EC]-worker) [    ] o.e.j.s.Server jetty-9.3.20.v20170531
   [junit4]   2> 874306 INFO  (SUITE-TestFieldTypeResource-seed#[24F6D41EE9EF49EC]-worker) [    ] o.e.j.s.h.ContextHandler Started o.e.j.s.ServletContextHandler@3022899e{/solr,null,AVAILABLE}
   [junit4]   2> 874309 INFO  (SUITE-TestFieldTypeResource-seed#[24F6D41EE9EF49EC]-worker) [    ] o.e.j.s.AbstractConnector Started ServerConnector@6f5528bb{HTTP/1.1,[http/1.1]}{127.0.0.1:61886}
   [junit4]   2> 874309 INFO  (SUITE-TestFieldTypeResource-seed#[24F6D41EE9EF49EC]-worker) [    ] o.e.j.s.Server Started @885143ms
   [junit4]   2> 874309 INFO  (SUITE-TestFieldTypeResource-seed#[24F6D41EE9EF49EC]-worker) [    ] o.a.s.c.s.e.JettySolrRunner Jetty properties: {hostContext=/solr, configSetBaseDir=C:\Users\jenkins\workspace\Lucene-Solr-7.x-Windows\solr\core\src\test-files\solr, hostPort=61886, coreRootDirectory=C:\Users\jenkins\workspace\Lucene-Solr-7.x-Windows\solr\build\solr-core\test\J1\temp\solr.rest.schema.TestFieldTypeResource_24F6D41EE9EF49EC-001\tempDir-003\cores}
   [junit4]   2> 874310 ERROR (SUITE-TestFieldTypeResource-seed#[24F6D41EE9EF49EC]-worker) [    ] o.a.s.u.StartupLoggingUtils Missing Java Option solr.log.dir. Logging may be missing or incomplete.
   [junit4]   2> 874310 INFO  (SUITE-TestFieldTypeResource-seed#[24F6D41EE9EF49EC]-worker) [    ] o.a.s.s.SolrDispatchFilter  ___      _       Welcome to Apache Solr™ version 7.3.0
   [junit4]   2> 874310 INFO  (SUITE-TestFieldTypeResource-seed#[24F6D41EE9EF49EC]-worker) [    ] o.a.s.s.SolrDispatchFilter / __| ___| |_ _   Starting in standalone mode on port null
   [junit4]   2> 874310 INFO  (SUITE-TestFieldTypeResource-seed#[24F6D41EE9EF49EC]-worker) [    ] o.a.s.s.SolrDispatchFilter \__ \/ _ \ | '_|  Install dir: null
   [junit4]   2> 874310 INFO  (SUITE-TestFieldTypeResource-seed#[24F6D41EE9EF49EC]-worker) [    ] o.a.s.s.SolrDispatchFilter |___/\___/_|_|    Start time: 2018-01-04T09:08:42.562943100Z
   [junit4]   2> 874310 INFO  (SUITE-TestFieldTypeResource-seed#[24F6D41EE9EF49EC]-worker) [    ] o.a.s.c.SolrXmlConfig Loading container configuration from C:\Users\jenkins\workspace\Lucene-Solr-7.x-Windows\solr\core\src\test-files\solr\solr.xml
   [junit4]   2> 874322 INFO  (SUITE-TestFieldTypeResource-seed#[24F6D41EE9EF49EC]-worker) [    ] o.a.s.c.SolrXmlConfig Configuration parameter autoReplicaFailoverWorkLoopDelay is ignored
   [junit4]   2> 874322 INFO  (SUITE-TestFieldTypeResource-seed#[24F6D41EE9EF49EC]-worker) [    ] o.a.s.c.SolrXmlConfig Configuration parameter autoReplicaFailoverBadNodeExpiration is ignored
   [junit4]   2> 874323 INFO  (SUITE-TestFieldTypeResource-seed#[24F6D41EE9EF49EC]-worker) [    ] o.a.s.c.SolrXmlConfig MBean server found: com.sun.jmx.mbeanserver.JmxMBeanServer@e0ef3b6, but no JMX reporters were configured - adding default JMX reporter.
   [junit4]   2> 874398 INFO  (SUITE-TestFieldTypeResource-seed#[24F6D41EE9EF49EC]-worker) [    ] o.a.s.m.r.SolrJmxReporter JMX monitoring for 'solr.node' (registry 'solr.node') enabled at server: com.sun.jmx.mbeanserver.JmxMBeanServer@e0ef3b6
   [junit4]   2> 874412 INFO  (SUITE-TestFieldTypeResource-seed#[24F6D41EE9EF49EC]-worker) [    ] o.a.s.m.r.SolrJmxReporter JMX monitoring for 'solr.jvm' (registry 'solr.jvm') enabled at server: com.sun.jmx.mbeanserver.JmxMBeanServer@e0ef3b6
   [junit4]   2> 874413 INFO  (SUITE-TestFieldTypeResource-seed#[24F6D41EE9EF49EC]-worker) [    ] o.a.s.m.r.SolrJmxReporter JMX monitoring for 'solr.jetty' (registry 'solr.jetty') enabled at server: com.sun.jmx.mbeanserver.JmxMBeanServer@e0ef3b6
   [junit4]   2> 874416 INFO  (SUITE-TestFieldTypeResource-seed#[24F6D41EE9EF49EC]-worker) [    ] o.a.s.c.CorePropertiesLocator Found 1 core definitions underneath C:\Users\jenkins\workspace\Lucene-Solr-7.x-Windows\solr\build\solr-core\test\J1\temp\solr.rest.schema.TestFieldTypeResource_24F6D41EE9EF49EC-001\tempDir-003\cores
   [junit4]   2> 874416 INFO  (SUITE-TestFieldTypeResource-seed#[24F6D41EE9EF49EC]-worker) [    ] o.a.s.c.CorePropertiesLocator Cores are: [collection1]
   [junit4]   2> 874452 INFO  (coreLoadExecutor-3746-thread-1) [    ] o.a.s.c.TransientSolrCoreCacheDefault Allocating transient cache for 4 transient cores
   [junit4]   2> 874454 INFO  (coreLoadExecutor-3746-thread-1) [    x:collection1] o.a.s.c.SolrResourceLoader [null] Added 2 libs to classloader, from paths: [/C:/Users/jenkins/workspace/Lucene-Solr-7.x-Windows/solr/core/src/test-files/solr/collection1/lib, /C:/Users/jenkins/workspace/Lucene-Solr-7.x-Windows/solr/core/src/test-files/solr/collection1/lib/classes]
   [junit4]   2> 874673 INFO  (coreLoadExecutor-3746-thread-1) [    x:collection1] o.a.s.c.SolrConfig Using Lucene MatchVersion: 7.3.0
   [junit4]   2> 874740 INFO  (coreLoadExecutor-3746-thread-1) [    x:collection1] o.a.s.s.IndexSchema [collection1] Schema name=test-rest
   [junit4]   2> 874922 WARN  (coreLoadExecutor-3746-thread-1) [    x:collection1] o.a.s.s.IndexSchema Field title is not multivalued and destination for multiple copyFields (3)
   [junit4]   2> 874922 INFO  (coreLoadExecutor-3746-thread-1) [    x:collection1] o.a.s.s.IndexSchema Loaded schema test-rest/1.6 with uniqueid field id
   [junit4]   2> 874972 INFO  (coreLoadExecutor-3746-thread-1) [    x:collection1] o.a.s.r.RestManager Registered ManagedResource impl org.apache.solr.rest.schema.analysis.ManagedWordSetResource for path /schema/analysis/stopwords/english
   [junit4]   2> 874972 INFO  (coreLoadExecutor-3746-thread-1) [    x:collection1] o.a.s.r.RestManager Registered ManagedResource impl org.apache.solr.rest.schema.analysis.ManagedSynonymFilterFactory$SynonymManager for path /schema/analysis/synonyms/english
   [junit4]   2> 874972 INFO  (coreLoadExecutor-3746-thread-1) [    x:collection1] o.a.s.r.RestManager Registered ManagedResource impl org.apache.solr.rest.schema.analysis.ManagedWordSetResource for path /schema/analysis/stopwords/german
   [junit4]   2> 874972 INFO  (coreLoadExecutor-3746-thread-1) [    x:collection1] o.a.s.r.RestManager Registered ManagedResource impl org.apache.solr.rest.schema.analysis.ManagedSynonymFilterFactory$SynonymManager for path /schema/analysis/synonyms/german
   [junit4]   2> 874972 INFO  (coreLoadExecutor-3746-thread-1) [    x:collection1] o.a.s.r.RestManager Added observer of type org.apache.solr.rest.schema.analysis.ManagedStopFilterFactory to existing ManagedResource /schema/analysis/stopwords/english
   [junit4]   2> 874972 INFO  (coreLoadExecutor-3746-thread-1) [    x:collection1] o.a.s.r.RestManager Registered ManagedResource impl org.apache.solr.rest.schema.analysis.ManagedSynonymGraphFilterFactory$SynonymManager for path /schema/analysis/synonyms/englishgraph
   [junit4]   2> 874972 INFO  (coreLoadExecutor-3746-thread-1) [    x:collection1] o.a.s.r.RestManager Added observer of type org.apache.solr.rest.schema.analysis.ManagedStopFilterFactory to existing ManagedResource /schema/analysis/stopwords/english
   [junit4]   2> 874972 INFO  (coreLoadExecutor-3746-thread-1) [    x:collection1] o.a.s.r.RestManager Added observer of type org.apache.solr.rest.schema.analysis.ManagedSynonymGraphFilterFactory to existing ManagedResource /schema/analysis/synonyms/englishgraph
   [junit4]   2> 874972 INFO  (coreLoadExecutor-3746-thread-1) [    x:collection1] o.a.s.r.RestManager Added observer of type org.apache.solr.rest.schema.analysis.ManagedStopFilterFactory to existing ManagedResource /schema/analysis/stopwords/german
   [junit4]   2> 874972 INFO  (coreLoadExecutor-3746-thread-1) [    x:collection1] o.a.s.r.RestManager Registered ManagedResource impl org.apache.solr.rest.schema.analysis.ManagedSynonymGraphFilterFactory$SynonymManager for path /schema/analysis/synonyms/germangraph
   [junit4]   2> 874972 INFO  (coreLoadExecutor-3746-thread-1) [    x:collection1] o.a.s.r.RestManager Added observer of type org.apache.solr.rest.schema.analysis.ManagedStopFilterFactory to existing ManagedResource /schema/analysis/stopwords/german
   [junit4]   2> 874972 INFO  (coreLoadExecutor-3746-thread-1) [    x:collection1] o.a.s.r.RestManager Added observer of type org.apache.solr.rest.schema.analysis.ManagedSynonymGraphFilterFactory to existing ManagedResource /schema/analysis/synonyms/germangraph
   [junit4]   2> 874972 INFO  (coreLoadExecutor-3746-thread-1) [    x:collection1] o.a.s.c.CoreContainer Creating SolrCore 'collection1' using configuration from configset C:\Users\jenkins\workspace\Lucene-Solr-7.x-Windows\solr\core\src\test-files\solr\collection1, trusted=true
   [junit4]   2> 874980 INFO  (coreLoadExecutor-3746-thread-1) [    x:collection1] o.a.s.m.r.SolrJmxReporter JMX monitoring for 'solr.core.collection1' (registry 'solr.core.collection1') enabled at server: com.sun.jmx.mbeanserver.JmxMBeanServer@e0ef3b6
   [junit4]   2> 874980 INFO  (coreLoadExecutor-3746-thread-1) [    x:collection1] o.a.s.c.SolrCore solr.RecoveryStrategy.Builder
   [junit4]   2> 874980 INFO  (coreLoadExecutor-3746-thread-1) [    x:collection1] o.a.s.c.SolrCore [[collection1] ] Opening new SolrCore at [C:\Users\jenkins\workspace\Lucene-Solr-7.x-Windows\solr\core\src\test-files\solr\collection1], dataDir=[C:\Users\jenkins\workspace\Lucene-Solr-7.x-Windows\solr\build\solr-core\test\J1\temp\solr.rest.schema.TestFieldTypeResource_24F6D41EE9EF49EC-001\tempDir-003\cores\core\data\]
   [junit4]   2> 874982 INFO  (coreLoadExecutor-3746-thread-1) [    x:collection1] o.a.s.u.RandomMergePolicy RandomMergePolicy wrapping class org.apache.lucene.index.LogDocMergePolicy: [LogDocMergePolicy: minMergeSize=1000, mergeFactor=26, maxMergeSize=9223372036854775807, maxMergeSizeForForcedMerge=9223372036854775807, calibrateSizeByDeletes=true, maxMergeDocs=2147483647, maxCFSSegmentSizeMB=8.796093022207999E12, noCFSRatio=0.0]
   [junit4]   2> 875199 INFO  (coreLoadExecutor-3746-thread-1) [    x:collection1] o.a.s.u.UpdateHandler Using UpdateLog implementation: org.apache.solr.update.UpdateLog
   [junit4]   2> 875199 INFO  (coreLoadExecutor-3746-thread-1) [    x:collection1] o.a.s.u.UpdateLog Initializing UpdateLog: dataDir= defaultSyncLevel=FLUSH numRecordsToKeep=100 maxNumLogsToKeep=10 numVersionBuckets=65536
   [junit4]   2> 875209 INFO  (coreLoadExecutor-3746-thread-1) [    x:collection1] o.a.s.u.CommitTracker Hard AutoCommit: disabled
   [junit4]   2> 875210 INFO  (coreLoadExecutor-3746-thread-1) [    x:collection1] o.a.s.u.CommitTracker Soft AutoCommit: disabled
   [junit4]   2> 875212 INFO  (coreLoadExecutor-3746-thread-1) [    x:collection1] o.a.s.u.RandomMergePolicy RandomMergePolicy wrapping class org.apache.lucene.index.TieredMergePolicy: [TieredMergePolicy: maxMergeAtOnce=11, maxMergeAtOnceExplicit=15, maxMergedSegmentMB=85.052734375, floorSegmentMB=1.26953125, forceMergeDeletesPctAllowed=5.773275685466856, segmentsPerTier=40.0, maxCFSSegmentSizeMB=8.796093022207999E12, noCFSRatio=0.0
   [junit4]   2> 875212 INFO  (coreLoadExecutor-3746-thread-1) [    x:collection1] o.a.s.s.SolrIndexSearcher Opening [Searcher@336554f0[collection1] main]
   [junit4]   2> 875212 WARN  (coreLoadExecutor-3746-thread-1) [    x:collection1] o.a.s.r.ManagedResource No stored data found for /schema/analysis/stopwords/english
   [junit4]   2> 875212 INFO  (coreLoadExecutor-3746-thread-1) [    x:collection1] o.a.s.r.ManagedResourceStorage Saved JSON object to path _schema_analysis_stopwords_english.json using InMemoryStorage
   [junit4]   2> 875212 INFO  (coreLoadExecutor-3746-thread-1) [    x:collection1] o.a.s.r.s.a.ManagedWordSetResource Loaded 0 words for /schema/analysis/stopwords/english
   [junit4]   2> 875212 INFO  (coreLoadExecutor-3746-thread-1) [    x:collection1] o.a.s.r.ManagedResource Notified 3 observers of /schema/analysis/stopwords/english
   [junit4]   2> 875212 WARN  (coreLoadExecutor-3746-thread-1) [    x:collection1] o.a.s.r.ManagedResource No stored data found for /schema/analysis/stopwords/german
   [junit4]   2> 875212 INFO  (coreLoadExecutor-3746-thread-1) [    x:collection1] o.a.s.r.ManagedResourceStorage Saved JSON object to path _schema_analysis_stopwords_german.json using InMemoryStorage
   [junit4]   2> 875212 INFO  (coreLoadExecutor-3746-thread-1) [    x:collection1] o.a.s.r.s.a.ManagedWordSetResource Loaded 0 words for /schema/analysis/stopwords/german
   [junit4]   2> 875212 INFO  (coreLoadExecutor-3746-thread-1) [    x:collection1] o.a.s.r.ManagedResource Notified 3 observers of /schema/analysis/stopwords/german
   [junit4]   2> 875212 WARN  (coreLoadExecutor-3746-thread-1) [    x:collection1] o.a.s.r.ManagedResource No stored data found for /schema/analysis/synonyms/english
   [junit4]   2> 875212 INFO  (coreLoadExecutor-3746-thread-1) [    x:collection1] o.a.s.r.s.a.ManagedSynonymFilterFactory Loaded 0 synonym mappings for /schema/analysis/synonyms/english
   [junit4]   2> 875212 INFO  (coreLoadExecutor-3746-thread-1) [    x:collection1] o.a.s.r.ManagedResource Notified 1 observers of /schema/analysis/synonyms/english
   [junit4]   2> 875212 WARN  (coreLoadExecutor-3746-thread-1) [    x:collection1] o.a.s.r.ManagedResource No stored data found for /schema/analysis/synonyms/englishgraph
   [junit4]   2> 875212 INFO  (coreLoadExecutor-3746-thread-1) [    x:collection1] o.a.s.r.s.a.ManagedSynonymGraphFilterFactory Loaded 0 synonym mappings for /schema/analysis/synonyms/englishgraph
   [junit4]   2> 875212 INFO  (coreLoadExecutor-3746-thread-1) [    x:collection1] o.a.s.r.ManagedResource Notified 2 observers of /schema/analysis/synonyms/englishgraph
   [junit4]   2> 875212 WARN  (coreLoadExecutor-3746-thread-1) [    x:collection1] o.a.s.r.ManagedResource No stored data found for /schema/analysis/synonyms/german
   [junit4]   2> 875212 INFO  (coreLoadExecutor-3746-thread-1) [    x:collection1] o.a.s.r.s.a.ManagedSynonymFilterFactory Loaded 0 synonym mappings for /schema/analysis/synonyms/german
   [junit4]   2> 875212 INFO  (coreLoadExecutor-3746-thread-1) [    x:collection1] o.a.s.r.ManagedResource Notified 1 observers of /schema/analysis/synonyms/german
   [junit4]   2> 875212 WARN  (coreLoadExecutor-3746-thread-1) [    x:collection1] o.a.s.r.ManagedResource No stored data found for /schema/analysis/synonyms/germangraph
   [junit4]   2> 875212 INFO  (coreLoadExecutor-3746-thread-1) [    x:collection1] o.a.s.r.s.a.ManagedSynonymGraphFilterFactory Loaded 0 synonym mappings for /schema/analysis/synonyms/germangraph
   [junit4]   2> 875212 INFO  (coreLoadExecutor-3746-thread-1) [    x:collection1] o.a.s.r.ManagedResource Notified 2 observers of /schema/analysis/synonyms/germangraph
   [junit4]   2> 875212 INFO  (coreLoadExecutor-3746-thread-1) [    x:collection1] o.a.s.h.c.SpellCheckComponent Initializing spell checkers
   [junit4]   2> 875230 INFO  (coreLoadExecutor-3746-thread-1) [    x:collection1] o.a.s.s.DirectSolrSpellChecker init: {name=direct,classname=DirectSolrSpellChecker,field=lowerfilt,minQueryLength=3}
   [junit4]   2> 875315 INFO  (coreLoadExecutor-3746-thread-1) [    x:collection1] o.a.s.h.ReplicationHandler Commits will be reserved for 10000ms.
   [junit4]   2> 875316 INFO  (searcherExecutor-3747-thread-1-processing-x:collection1) [    x:collection1] o.a.s.h.c.SpellCheckComponent Loading spell index for spellchecker: default
   [junit4]   2> 875316 INFO  (coreLoadExecutor-3746-thread-1) [    x:collection1] o.a.s.u.UpdateLog Could not find max version in index or recent updates, using new clock 1588652328687239168
   [junit4]   2> 875318 INFO  (searcherExecutor-3747-thread-1-processing-x:collection1) [    x:collection1] o.a.s.h.c.SpellCheckComponent Loading spell index for spellchecker: direct
   [junit4]   2> 875318 INFO  (searcherExecutor-3747-thread-1-processing-x:collection1) [    x:collection1] o.a.s.h.c.SpellCheckComponent Loading spell index for spellchecker: wordbreak
   [junit4]   2> 875318 INFO  (searcherExecutor-3747-thread-1-processing-x:collection1) [    x:collection1] o.a.s.h.c.SpellCheckComponent Loading spell index for spellchecker: multipleFields
   [junit4]   2> 875319 INFO  (SUITE-TestFieldTypeResource-seed#[24F6D41EE9EF49EC]-worker) [    ] o.a.s.SolrJettyTestBase Jetty Assigned Port#61886
   [junit4]   2> 875319 INFO  (searcherExecutor-3747-thread-1-processing-x:collection1) [    x:collection1] o.a.s.h.c.SpellCheckComponent Loading spell index for spellchecker: jarowinkler
   [junit4]   2> 875320 INFO  (searcherExecutor-3747-thread-1-processing-x:collection1) [    x:collection1] o.a.s.h.c.SpellCheckComponent Loading spell index for spellchecker: external
   [junit4]   2> 875323 INFO  (searcherExecutor-3747-thread-1-processing-x:collection1) [    x:collection1] o.a.s.h.c.SpellCheckComponent Loading spell index for spellchecker: freq
   [junit4]   2> 875326 INFO  (TEST-TestFieldTypeResource.testXMLGetNotFoundFieldType-seed#[24F6D41EE9EF49EC]) [    ] o.a.s.SolrTestCaseJ4 ###Starting testXMLGetNotFoundFieldType
   [junit4]   2> 875326 INFO  (searcherExecutor-3747-thread-1-processing-x:collection1) [    x:collection1] o.a.s.h.c.SpellCheckComponent Loading spell index for spellchecker: fqcn
   [junit4]   2> 875330 INFO  (searcherExecutor-3747-thread-1-processing-x:collection1) [    x:collection1] o.a.s.h.c.SpellCheckComponent Loading spell index for spellchecker: perDict
   [junit4]   2> 875333 INFO  (searcherExecutor-3747-thread-1-processing-x:collection1) [    x:collection1] o.a.s.c.SolrCore [collection1] Registered new searcher Searcher@336554f0[collection1] main{ExitableDirectoryReader(UninvertingDirectoryReader())}
   [junit4]   2> 875348 INFO  (qtp1171918685-9212) [    x:collection1] o.a.s.c.S.Request [collection1]  webapp=/solr path=/schema/fieldtypes/not_in_there params={indent=on&wt=xml} status=404 QTime=15
   [junit4]   2> 875351 INFO  (TEST-TestFieldTypeResource.testXMLGetNotFoundFieldType-seed#[24F6D41EE9EF49EC]) [    ] o.a.s.SolrTestCaseJ4 ###Ending testXMLGetNotFoundFieldType
   [junit4]   2> 875358 INFO  (TEST-TestFieldTypeResource.testXMLGetFieldTypeDontShowDefaults-seed#[24F6D41EE9EF49EC]) [    ] o.a.s.SolrTestCaseJ4 ###Starting testXMLGetFieldTypeDontShowDefaults
   [junit4]   2> 875360 INFO  (qtp1171918685-9213) [    x:collection1] o.a.s.c.S.Request [collection1]  webapp=/solr path=/schema/fieldtypes/teststop params={indent=on&wt=xml} status=0 QTime=0
   [junit4]   2> 875363 INFO  (TEST-TestFieldTypeResource.testXMLGetFieldTypeDontShowDefaults-seed#[24F6D41EE9EF49EC]) [    ] o.a.s.SolrTestCaseJ4 ###Ending testXMLGetFieldTypeDontShowDefaults
   [junit4]   2> 875372 INFO  (TEST-TestFieldTypeResource.testXMLGetFieldType-seed#[24F6D41EE9EF49EC]) [    ] o.a.s.SolrTestCaseJ4 ###Starting testXMLGetFieldType
   [junit4]   2> 875378 INFO  (qtp1171918685-9213) [    x:collection1] o.a.s.c.S.Request [collection1]  webapp=/solr path=/schema/fieldtypes/float params={showDefaults=true&indent=on&wt=xml} status=0 QTime=5
   [junit4]   2> 875380 INFO  (TEST-TestFieldTypeResource.testXMLGetFieldType-seed#[24F6D41EE9EF49EC]) [    ] o.a.s.SolrTestCaseJ4 ###Ending testXMLGetFieldType
   [junit4]   2> 875387 INFO  (TEST-TestFieldTypeResource.testJsonGetFieldType-seed#[24F6D41EE9EF49EC]) [    ] o.a.s.SolrTestCaseJ4 ###Starting testJsonGetFieldType
   [junit4]   2> 875389 INFO  (qtp1171918685-9213) [    x:collection1] o.a.s.c.S.Request [collection1]  webapp=/solr path=/schema/fieldtypes/float params={showDefaults=on&indent=on&wt=json} status=0 QTime=0
   [junit4]   2> 875409 INFO  (TEST-TestFieldTypeResource.testJsonGetFieldType-seed#[24F6D41EE9EF49EC]) [    ] o.a.s.SolrTestCaseJ4 ###Ending testJsonGetFieldType
   [junit4]   2> 875414 INFO  (SUITE-TestFieldTypeResource-seed#[24F6D41EE9EF49EC]-worker) [    ] o.e.j.s.AbstractConnector Stopped ServerConnector@6f5528bb{HTTP/1.1,[http/1.1]}{127.0.0.1:0}
   [junit4]   2> 875414 INFO  (SUITE-TestFieldTypeResource-seed#[24F6D41EE9EF49EC]-worker) [    ] o.a.s.c.CoreContainer Shutting down CoreContainer instance=1342829079
   [junit4]   2> 875414 INFO  (SUITE-TestFieldTypeResource-seed#[24F6D41EE9EF49EC]-worker) [    ] o.a.s.m.SolrMetricManager Closing metric reporters for registry=solr.node, tag=null
   [junit4]   2> 875414 INFO  (SUITE-TestFieldTypeResource-seed#[24F6D41EE9EF49EC]-worker) [    ] o.a.s.m.r.SolrJmxReporter Closing reporter [org.apache.solr.metrics.reporters.SolrJmxReporter@2f55bd36: rootName = null, domain = solr.node, service url = null, agent id = null] for registry solr.node / com.codahale.metrics.MetricRegistry@32393246
   [junit4]   2> 875422 INFO  (SUITE-TestFieldTypeResource-seed#[24F6D41EE9EF49EC]-worker) [    ] o.a.s.m.SolrMetricManager Closing metric reporters for registry=solr.jvm, tag=null
   [junit4]   2> 875422 INFO  (SUITE-TestFieldTypeResource-seed#[24F6D41EE9EF49EC]-worker) [    ] o.a.s.m.r.SolrJmxReporter Closing reporter [org.apache.solr.metrics.reporters.SolrJmxReporter@7d39578c: rootName = null, domain = solr.jvm, service url = null, agent id = null] for registry solr.jvm / com.codahale.metrics.MetricRegistry@3804fcc4
   [junit4]   2> 875428 INFO  (SUITE-TestFieldTypeResource-seed#[24F6D41EE9EF49EC]-worker) [    ] o.a.s.m.SolrMetricManager Closing metric reporters for registry=solr.jetty, tag=null
   [junit4]   2> 875428 INFO  (SUITE-TestFieldTypeResource-seed#[24F6D41EE9EF49EC]-worker) [    ] o.a.s.m.r.SolrJmxReporter Closing reporter [org.apache.solr.metrics.reporters.SolrJmxReporter@6bf705aa: rootName = null, domain = solr.jetty, service url = null, agent id = null] for registry solr.jetty / com.codahale.metrics.MetricRegistry@5eb2b9fc
   [junit4]   2> 875429 INFO  (coreCloseExecutor-3752-thread-1) [    x:collection1] o.a.s.c.SolrCore [collection1]  CLOSING SolrCore org.apache.solr.core.SolrCore@343187ca
   [junit4]   2> 875429 INFO  (coreCloseExecutor-3752-thread-1) [    x:collection1] o.a.s.m.SolrMetricManager Closing metric reporters for registry=solr.core.collection1, tag=875661258
   [junit4]   2> 875429 INFO  (coreCloseExecutor-3752-thread-1) [    x:collection1] o.a.s.m.r.SolrJmxReporter Closing reporter [org.apache.solr.metrics.reporters.SolrJmxReporter@56e42cba: rootName = null, domain = solr.core.collection1, service url = null, agent id = null] for registry solr.core.collection1 / com.codahale.metrics.MetricRegistry@235ffca8
   [junit4]   2> 875448 INFO  (SUITE-TestFieldTypeResource-seed#[24F6D41EE9EF49EC]-worker) [    ] o.e.j.s.h.ContextHandler Stopped o.e.j.s.ServletContextHandler@3022899e{/solr,null,UNAVAILABLE}
   [junit4]   2> 875450 INFO  (SUITE-TestFieldTypeResource-seed#[24F6D41EE9EF49EC]-worker) [    ] o.a.s.SolrTestCaseJ4 ------------------------------------------------------- Done waiting for tracked resources to be released
   [junit4]   2> NOTE: test params are: codec=Asserting(Lucene70): {}, docValues:{}, maxPointsInLeafNode=769, maxMBSortInHeap=5.512964904251971, sim=RandomSimilarity(queryNorm=false): {}, locale=nn-NO, timezone=Asia/Hovd
   [junit4]   2> NOTE: Windows 10 10.0 amd64/Oracle Corporation 9.0.1 (64-bit)/cpus=3,threads=1,free=48198944,total=499822592
   [junit4]   2> NOTE: All tests run in this JVM: [RegexBytesRefFilterTest, TestCollectionsAPIViaSolrCloudCluster, TestCopyFieldCollectionResource, OpenExchangeRatesOrgProviderTest, ExternalFileFieldSortTest, TestCollationFieldDocValues, CollectionStateFormat2Test, TestUtilizeNode, TestLegacyFieldCache, TestImpersonationWithHadoopAuth, TolerantUpdateProcessorTest, SpellCheckCollatorWithCollapseTest, TestSolrCloudSnapshots, TestZkChroot, SolrCoreCheckLockOnStartupTest, TestSolrConfigHandlerConcurrent, TestCollapseQParserPlugin, OverseerCollectionConfigSetProcessorTest, TestFunctionQuery, TestGeoJSONResponseWriter, HighlighterMaxOffsetTest, TestCharFilters, TestDocSet, TestDistributedStatsComponentCardinality, TestGraphTermsQParserPlugin, TestMaxTokenLenTokenizer, TestConfigSetsAPIExclusivity, CdcrUpdateLogTest, MoreLikeThisHandlerTest, TestUniqueKeyFieldResource, FileUtilsTest, TestCorePropertiesReload, RequestLoggingTest, TestDocBasedVersionConstraints, HdfsWriteToMultipleCollectionsTest, SolrPluginUtilsTest, AtomicUpdateProcessorFactoryTest, TestRTimerTree, SpellingQueryConverterTest, DocExpirationUpdateProcessorFactoryTest, TestConfigOverlay, PreAnalyzedFieldManagedSchemaCloudTest, TestNumericRangeQuery64, TestLargeCluster, TestSimpleTrackingShardHandler, TestComponentsName, CollectionsAPIAsyncDistributedZkTest, TestLeaderElectionWithEmptyReplica, TestClusterStateMutator, TestManagedSchema, TestValueSourceCache, TestRandomFaceting, DistributedIntervalFacetingTest, TestFaceting, JsonLoaderTest, TestStressCloudBlindAtomicUpdates, ShufflingReplicaListTransformerTest, DocValuesMultiTest, DeleteLastCustomShardedReplicaTest, HttpPartitionTest, TestDynamicLoading, TestBM25SimilarityFactory, TestNumericTerms64, TestConfig, TestBadConfig, DeleteReplicaTest, TestStressLucene, CopyFieldTest, TermVectorComponentTest, ComputePlanActionTest, TestInitQParser, ZkFailoverTest, TestClassicSimilarityFactory, TestReload, TestSuggestSpellingConverter, SolrIndexSplitterTest, TestAuthenticationFramework, TestExactStatsCache, TestJavabinTupleStreamParser, TestFieldCacheSort, RuleEngineTest, TestConfigSetProperties, LeaderInitiatedRecoveryOnCommitTest, TestNamedUpdateProcessors, TestPayloadScoreQParserPlugin, HdfsSyncSliceTest, SuggestComponentContextFilterQueryTest, HdfsLockFactoryTest, PolyFieldTest, VersionInfoTest, BlobRepositoryCloudTest, CustomCollectionTest, CoreSorterTest, BlockJoinFacetRandomTest, TestSimDistributedQueue, TestRawResponseWriter, TestAnalyzedSuggestions, EnumFieldTest, TestCryptoKeys, TestFieldTypeResource]
   [junit4]   2> NOTE: reproduce with: ant test  -Dtestcase=TestFieldTypeResource -Dtests.seed=24F6D41EE9EF49EC -Dtests.slow=true -Dtests.locale=nn-NO -Dtests.timezone=Asia/Hovd -Dtests.asserts=true -Dtests.file.encoding=UTF-8
   [junit4] ERROR   0.00s J1 | TestFieldTypeResource (suite) <<<
   [junit4]    > Throwable #1: java.io.IOException: Could not remove the following files (in the order of attempts):
   [junit4]    >    C:\Users\jenkins\workspace\Lucene-Solr-7.x-Windows\solr\build\solr-core\test\J1\temp\solr.rest.schema.TestFieldTypeResource_24F6D41EE9EF49EC-001\tempDir-001\cores: java.nio.file.DirectoryNotEmptyException: C:\Users\jenkins\workspace\Lucene-Solr-7.x-Windows\solr\build\solr-core\test\J1\temp\solr.rest.schema.TestFieldTypeResource_24F6D41EE9EF49EC-001\tempDir-001\cores
   [junit4]    >    C:\Users\jenkins\workspace\Lucene-Solr-7.x-Windows\solr\build\solr-core\test\J1\temp\solr.rest.schema.TestFieldTypeResource_24F6D41EE9EF49EC-001\tempDir-001: java.nio.file.DirectoryNotEmptyException: C:\Users\jenkins\workspace\Lucene-Solr-7.x-Windows\solr\build\solr-core\test\J1\temp\solr.rest.schema.TestFieldTypeResource_24F6D41EE9EF49EC-001\tempDir-001
   [junit4]    >    C:\Users\jenkins\workspace\Lucene-Solr-7.x-Windows\solr\build\solr-core\test\J1\temp\solr.rest.schema.TestFieldTypeResource_24F6D41EE9EF49EC-001\tempDir-001\cores\core: java.nio.file.AccessDeniedException: C:\Users\jenkins\workspace\Lucene-Solr-7.x-Windows\solr\build\solr-core\test\J1\temp\solr.rest.schema.TestFieldTypeResource_24F6D41EE9EF49EC-001\tempDir-001\cores\core
   [junit4]    >    C:\Users\jenkins\workspace\Lucene-Solr-7.x-Windows\solr\build\solr-core\test\J1\temp\solr.rest.schema.TestFieldTypeResource_24F6D41EE9EF49EC-001: java.nio.file.DirectoryNotEmptyException: C:\Users\jenkins\workspace\Lucene-Solr-7.x-Windows\solr\build\solr-core\test\J1\temp\solr.rest.schema.TestFieldTypeResource_24F6D41EE9EF49EC-001
   [junit4]    > 	at __randomizedtesting.SeedInfo.seed([24F6D41EE9EF49EC]:0)
   [junit4]    > 	at org.apache.lucene.util.IOUtils.rm(IOUtils.java:329)
   [junit4]    > 	at java.base/java.lang.Thread.run(Thread.java:844)
   [junit4] Completed [187/764 (2!)] on J1 in 1.21s, 4 tests, 1 error <<< FAILURES!

[...truncated 227 lines...]
   [junit4] Suite: org.apache.solr.search.facet.DistributedFacetSimpleRefinementLongTailTest
   [junit4]   2> 1108972 INFO  (SUITE-DistributedFacetSimpleRefinementLongTailTest-seed#[24F6D41EE9EF49EC]-worker) [    ] o.a.s.SolrTestCaseJ4 SecureRandom sanity checks: test.solr.allowed.securerandom=null & java.security.egd=file:/dev/./urandom
   [junit4]   2> Creating dataDir: C:\Users\jenkins\workspace\Lucene-Solr-7.x-Windows\solr\build\solr-core\test\J1\temp\solr.search.facet.DistributedFacetSimpleRefinementLongTailTest_24F6D41EE9EF49EC-001\init-core-data-001
   [junit4]   2> 1108973 WARN  (SUITE-DistributedFacetSimpleRefinementLongTailTest-seed#[24F6D41EE9EF49EC]-worker) [    ] o.a.s.SolrTestCaseJ4 startTrackingSearchers: numOpens=1 numCloses=1
   [junit4]   2> 1108974 INFO  (SUITE-DistributedFacetSimpleRefinementLongTailTest-seed#[24F6D41EE9EF49EC]-worker) [    ] o.a.s.SolrTestCaseJ4 Using PointFields (NUMERIC_POINTS_SYSPROP=true) w/NUMERIC_DOCVALUES_SYSPROP=true
   [junit4]   2> 1108977 INFO  (SUITE-DistributedFacetSimpleRefinementLongTailTest-seed#[24F6D41EE9EF49EC]-worker) [    ] o.a.s.SolrTestCaseJ4 Randomized ssl (false) and clientAuth (true) via: @org.apache.solr.util.RandomizeSSL(reason="", value=0.0/0.0, ssl=0.0/0.0, clientAuth=0.0/0.0)
   [junit4]   2> 1108977 INFO  (SUITE-DistributedFacetSimpleRefinementLongTailTest-seed#[24F6D41EE9EF49EC]-worker) [    ] o.a.s.BaseDistributedSearchTestCase Setting hostContext system property: /
   [junit4]   2> 1109577 INFO  (TEST-DistributedFacetSimpleRefinementLongTailTest.test-seed#[24F6D41EE9EF49EC]) [    ] o.a.s.SolrTestCaseJ4 Writing core.properties file to C:\Users\jenkins\workspace\Lucene-Solr-7.x-Windows\solr\build\solr-core\test\J1\temp\solr.search.facet.DistributedFacetSimpleRefinementLongTailTest_24F6D41EE9EF49EC-001\tempDir-001\control\cores\collection1
   [junit4]   2> 1109580 INFO  (TEST-DistributedFacetSimpleRefinementLongTailTest.test-seed#[24F6D41EE9EF49EC]) [    ] o.e.j.s.Server jetty-9.3.20.v20170531
   [junit4]   2> 1109581 INFO  (TEST-DistributedFacetSimpleRefinementLongTailTest.test-seed#[24F6D41EE9EF49EC]) [    ] o.e.j.s.h.ContextHandler Started o.e.j.s.ServletContextHandler@ed423d5{/,null,AVAILABLE}
   [junit4]   2> 1109584 INFO  (TEST-DistributedFacetSimpleRefinementLongTailTest.test-seed#[24F6D41EE9EF49EC]) [    ] o.e.j.s.AbstractConnector Started ServerConnector@2bd8dfe4{HTTP/1.1,[http/1.1]}{127.0.0.1:63231}
   [junit4]   2> 1109584 INFO  (TEST-DistributedFacetSimpleRefinementLongTailTest.test-seed#[24F6D41EE9EF49EC]) [    ] o.e.j.s.Server Started @1120418ms
   [junit4]   2> 1109584 INFO  (TEST-DistributedFacetSimpleRefinementLongTailTest.test-seed#[24F6D41EE9EF49EC]) [    ] o.a.s.c.s.e.JettySolrRunner Jetty properties: {hostContext=/, hostPort=63231, coreRootDirectory=C:\Users\jenkins\workspace\Lucene-Solr-7.x-Windows\solr\build\solr-core\test\J1\temp\solr.search.facet.DistributedFacetSimpleRefinementLongTailTest_24F6D41EE9EF49EC-001\tempDir-001\control\cores}
   [junit4]   2> 1109584 ERROR (TEST-DistributedFacetSimpleRefinementLongTailTest.test-seed#[24F6D41EE9EF49EC]) [    ] o.a.s.u.StartupLoggingUtils Missing Java Option solr.log.dir. Logging may be missing or incomplete.
   [junit4]   2> 1109585 INFO  (TEST-DistributedFacetSimpleRefinementLongTailTest.test-seed#[24F6D41EE9EF49EC]) [    ] o.a.s.s.SolrDispatchFilter  ___      _       Welcome to Apache Solr™ version 7.3.0
   [junit4]   2> 1109585 INFO  (TEST-DistributedFacetSimpleRefinementLongTailTest.test-seed#[24F6D41EE9EF49EC]) [    ] o.a.s.s.SolrDispatchFilter / __| ___| |_ _   Starting in standalone mode on port null
   [junit4]   2> 1109585 INFO  (TEST-DistributedFacetSimpleRefinementLongTailTest.test-seed#[24F6D41EE9EF49EC]) [    ] o.a.s.s.SolrDispatchFilter \__ \/ _ \ | '_|  Install dir: null
   [junit4]   2> 1109585 INFO  (TEST-DistributedFacetSimpleRefinementLongTailTest.test-seed#[24F6D41EE9EF49EC]) [    ] o.a.s.s.SolrDispatchFilter |___/\___/_|_|    Start time: 2018-01-04T09:12:37.837897700Z
   [junit4]   2> 1109585 INFO  (TEST-DistributedFacetSimpleRefinementLongTailTest.test-seed#[24F6D41EE9EF49EC]) [    ] o.a.s.c.SolrXmlConfig Loading container configuration from C:\Users\jenkins\workspace\Lucene-Solr-7.x-Windows\solr\build\solr-core\test\J1\temp\solr.search.facet.DistributedFacetSimpleRefinementLongTailTest_24F6D41EE9EF49EC-001\tempDir-001\control\solr.xml
   [junit4]   2> 1109594 INFO  (TEST-DistributedFacetSimpleRefinementLongTailTest.test-seed#[24F6D41EE9EF49EC]) [    ] o.a.s.c.SolrXmlConfig Configuration parameter autoReplicaFailoverWorkLoopDelay is ignored
   [junit4]   2> 1109594 INFO  (TEST-DistributedFacetSimpleRefinementLongTailTest.test-seed#[24F6D41EE9EF49EC]) [    ] o.a.s.c.SolrXmlConfig Configur

[...truncated too long message...]

questLoggingTest, TestDocBasedVersionConstraints, HdfsWriteToMultipleCollectionsTest, SolrPluginUtilsTest, AtomicUpdateProcessorFactoryTest, TestRTimerTree, SpellingQueryConverterTest, DocExpirationUpdateProcessorFactoryTest, TestConfigOverlay, PreAnalyzedFieldManagedSchemaCloudTest, TestNumericRangeQuery64, TestLargeCluster, TestSimpleTrackingShardHandler, TestComponentsName, CollectionsAPIAsyncDistributedZkTest, TestLeaderElectionWithEmptyReplica, TestClusterStateMutator, TestManagedSchema, TestValueSourceCache, TestRandomFaceting, DistributedIntervalFacetingTest, TestFaceting, JsonLoaderTest, TestStressCloudBlindAtomicUpdates, ShufflingReplicaListTransformerTest, DocValuesMultiTest, DeleteLastCustomShardedReplicaTest, HttpPartitionTest, TestDynamicLoading, TestBM25SimilarityFactory, TestNumericTerms64, TestConfig, TestBadConfig, DeleteReplicaTest, TestStressLucene, CopyFieldTest, TermVectorComponentTest, ComputePlanActionTest, TestInitQParser, ZkFailoverTest, TestClassicSimilarityFactory, TestReload, TestSuggestSpellingConverter, SolrIndexSplitterTest, TestAuthenticationFramework, TestExactStatsCache, TestJavabinTupleStreamParser, TestFieldCacheSort, RuleEngineTest, TestConfigSetProperties, LeaderInitiatedRecoveryOnCommitTest, TestNamedUpdateProcessors, TestPayloadScoreQParserPlugin, HdfsSyncSliceTest, SuggestComponentContextFilterQueryTest, HdfsLockFactoryTest, PolyFieldTest, VersionInfoTest, BlobRepositoryCloudTest, CustomCollectionTest, CoreSorterTest, BlockJoinFacetRandomTest, TestSimDistributedQueue, TestRawResponseWriter, TestAnalyzedSuggestions, EnumFieldTest, TestCryptoKeys, TestFieldTypeResource, SolrMetricsIntegrationTest, TestFastLRUCache, ConcurrentDeleteAndCreateCollectionTest, PluginInfoTest, EchoParamsTest, TestApiFramework, TestSolr4Spatial2, TestMacros, TestManagedSynonymFilterFactory, SmileWriterTest, TestComputePlanAction, FieldMutatingUpdateProcessorTest, AutoAddReplicasPlanActionTest, CacheHeaderTest, LukeRequestHandlerTest, TestExclusionRuleCollectionAccess, ResponseHeaderTest, SpellPossibilityIteratorTest, UpdateParamsTest, DebugComponentTest, FullSolrCloudDistribCmdsTest, TestSolrCloudWithKerberosAlt, ConnectionManagerTest, TestSimpleQParserPlugin, TestRandomCollapseQParserPlugin, IndexSchemaRuntimeFieldTest, LegacyCloudClusterPropTest, TestCloudRecovery, SparseHLLTest, TestDocumentBuilder, FileBasedSpellCheckerTest, DocValuesTest, DistributedFacetExistsSmallTest, TestPerFieldSimilarity, DistributedFacetSimpleRefinementLongTailTest]
   [junit4]   2> NOTE: reproduce with: ant test  -Dtestcase=DistributedFacetSimpleRefinementLongTailTest -Dtests.seed=24F6D41EE9EF49EC -Dtests.slow=true -Dtests.locale=kea-CV -Dtests.timezone=Europe/Vilnius -Dtests.asserts=true -Dtests.file.encoding=UTF-8
   [junit4] ERROR   0.00s J1 | DistributedFacetSimpleRefinementLongTailTest (suite) <<<
   [junit4]    > Throwable #1: java.io.IOException: Could not remove the following files (in the order of attempts):
   [junit4]    >    C:\Users\jenkins\workspace\Lucene-Solr-7.x-Windows\solr\build\solr-core\test\J1\temp\solr.search.facet.DistributedFacetSimpleRefinementLongTailTest_24F6D41EE9EF49EC-001\tempDir-001\shard2\collection1: java.nio.file.DirectoryNotEmptyException: C:\Users\jenkins\workspace\Lucene-Solr-7.x-Windows\solr\build\solr-core\test\J1\temp\solr.search.facet.DistributedFacetSimpleRefinementLongTailTest_24F6D41EE9EF49EC-001\tempDir-001\shard2\collection1
   [junit4]    >    C:\Users\jenkins\workspace\Lucene-Solr-7.x-Windows\solr\build\solr-core\test\J1\temp\solr.search.facet.DistributedFacetSimpleRefinementLongTailTest_24F6D41EE9EF49EC-001\tempDir-001\shard2: java.nio.file.DirectoryNotEmptyException: C:\Users\jenkins\workspace\Lucene-Solr-7.x-Windows\solr\build\solr-core\test\J1\temp\solr.search.facet.DistributedFacetSimpleRefinementLongTailTest_24F6D41EE9EF49EC-001\tempDir-001\shard2
   [junit4]    >    C:\Users\jenkins\workspace\Lucene-Solr-7.x-Windows\solr\build\solr-core\test\J1\temp\solr.search.facet.DistributedFacetSimpleRefinementLongTailTest_24F6D41EE9EF49EC-001\tempDir-001: java.nio.file.DirectoryNotEmptyException: C:\Users\jenkins\workspace\Lucene-Solr-7.x-Windows\solr\build\solr-core\test\J1\temp\solr.search.facet.DistributedFacetSimpleRefinementLongTailTest_24F6D41EE9EF49EC-001\tempDir-001
   [junit4]    > 	at __randomizedtesting.SeedInfo.seed([24F6D41EE9EF49EC]:0)
   [junit4]    > 	at org.apache.lucene.util.IOUtils.rm(IOUtils.java:329)
   [junit4]    > 	at java.base/java.lang.Thread.run(Thread.java:844)
   [junit4] Completed [260/764 (3!)] on J1 in 11.94s, 1 test, 1 error <<< FAILURES!

[...truncated 4070 lines...]
   [junit4] Suite: org.apache.solr.update.processor.TestOpenNLPExtractNamedEntitiesUpdateProcessorFactory
   [junit4]   2> Creating dataDir: C:\Users\jenkins\workspace\Lucene-Solr-7.x-Windows\solr\build\contrib\solr-analysis-extras\test\J0\temp\solr.update.processor.TestOpenNLPExtractNamedEntitiesUpdateProcessorFactory_6866BEE959AE9AE5-001\init-core-data-001
   [junit4]   2> NOTE: test params are: codec=Asserting(Lucene70): {}, docValues:{}, maxPointsInLeafNode=1410, maxMBSortInHeap=5.140532382268076, sim=RandomSimilarity(queryNorm=false): {}, locale=mt-MT, timezone=Africa/Accra
   [junit4]   2> NOTE: Windows 10 10.0 amd64/Oracle Corporation 9.0.1 (64-bit)/cpus=3,threads=1,free=47048760,total=97386496
   [junit4]   2> NOTE: All tests run in this JVM: [TestICUCollationField, TestICUCollationFieldDocValues, TestOpenNLPExtractNamedEntitiesUpdateProcessorFactory]
   [junit4]   2> NOTE: reproduce with: ant test  -Dtestcase=TestOpenNLPExtractNamedEntitiesUpdateProcessorFactory -Dtests.seed=6866BEE959AE9AE5 -Dtests.slow=true -Dtests.locale=mt-MT -Dtests.timezone=Africa/Accra -Dtests.asserts=true -Dtests.file.encoding=UTF-8
   [junit4] ERROR   0.00s J0 | TestOpenNLPExtractNamedEntitiesUpdateProcessorFactory (suite) <<<
   [junit4]    > Throwable #1: java.io.IOException: Could not remove the following files (in the order of attempts):
   [junit4]    >    C:\Users\jenkins\workspace\Lucene-Solr-7.x-Windows\solr\build\contrib\solr-analysis-extras\test\J0\temp\solr.update.processor.TestOpenNLPExtractNamedEntitiesUpdateProcessorFactory_6866BEE959AE9AE5-001\tempDir-001\collection1\conf: java.nio.file.DirectoryNotEmptyException: C:\Users\jenkins\workspace\Lucene-Solr-7.x-Windows\solr\build\contrib\solr-analysis-extras\test\J0\temp\solr.update.processor.TestOpenNLPExtractNamedEntitiesUpdateProcessorFactory_6866BEE959AE9AE5-001\tempDir-001\collection1\conf
   [junit4]    >    C:\Users\jenkins\workspace\Lucene-Solr-7.x-Windows\solr\build\contrib\solr-analysis-extras\test\J0\temp\solr.update.processor.TestOpenNLPExtractNamedEntitiesUpdateProcessorFactory_6866BEE959AE9AE5-001\tempDir-001\collection1: java.nio.file.DirectoryNotEmptyException: C:\Users\jenkins\workspace\Lucene-Solr-7.x-Windows\solr\build\contrib\solr-analysis-extras\test\J0\temp\solr.update.processor.TestOpenNLPExtractNamedEntitiesUpdateProcessorFactory_6866BEE959AE9AE5-001\tempDir-001\collection1
   [junit4]    >    C:\Users\jenkins\workspace\Lucene-Solr-7.x-Windows\solr\build\contrib\solr-analysis-extras\test\J0\temp\solr.update.processor.TestOpenNLPExtractNamedEntitiesUpdateProcessorFactory_6866BEE959AE9AE5-001\tempDir-001: java.nio.file.DirectoryNotEmptyException: C:\Users\jenkins\workspace\Lucene-Solr-7.x-Windows\solr\build\contrib\solr-analysis-extras\test\J0\temp\solr.update.processor.TestOpenNLPExtractNamedEntitiesUpdateProcessorFactory_6866BEE959AE9AE5-001\tempDir-001
   [junit4]    >    C:\Users\jenkins\workspace\Lucene-Solr-7.x-Windows\solr\build\contrib\solr-analysis-extras\test\J0\temp\solr.update.processor.TestOpenNLPExtractNamedEntitiesUpdateProcessorFactory_6866BEE959AE9AE5-001\tempDir-001\collection1\conf\en-test-ner-person.bin: java.nio.file.AccessDeniedException: C:\Users\jenkins\workspace\Lucene-Solr-7.x-Windows\solr\build\contrib\solr-analysis-extras\test\J0\temp\solr.update.processor.TestOpenNLPExtractNamedEntitiesUpdateProcessorFactory_6866BEE959AE9AE5-001\tempDir-001\collection1\conf\en-test-ner-person.bin
   [junit4]    >    C:\Users\jenkins\workspace\Lucene-Solr-7.x-Windows\solr\build\contrib\solr-analysis-extras\test\J0\temp\solr.update.processor.TestOpenNLPExtractNamedEntitiesUpdateProcessorFactory_6866BEE959AE9AE5-001\tempDir-001\collection1\conf\en-test-sent.bin: java.nio.file.AccessDeniedException: C:\Users\jenkins\workspace\Lucene-Solr-7.x-Windows\solr\build\contrib\solr-analysis-extras\test\J0\temp\solr.update.processor.TestOpenNLPExtractNamedEntitiesUpdateProcessorFactory_6866BEE959AE9AE5-001\tempDir-001\collection1\conf\en-test-sent.bin
   [junit4]    >    C:\Users\jenkins\workspace\Lucene-Solr-7.x-Windows\solr\build\contrib\solr-analysis-extras\test\J0\temp\solr.update.processor.TestOpenNLPExtractNamedEntitiesUpdateProcessorFactory_6866BEE959AE9AE5-001\tempDir-001\collection1\conf\en-test-tokenizer.bin: java.nio.file.AccessDeniedException: C:\Users\jenkins\workspace\Lucene-Solr-7.x-Windows\solr\build\contrib\solr-analysis-extras\test\J0\temp\solr.update.processor.TestOpenNLPExtractNamedEntitiesUpdateProcessorFactory_6866BEE959AE9AE5-001\tempDir-001\collection1\conf\en-test-tokenizer.bin
   [junit4]    >    C:\Users\jenkins\workspace\Lucene-Solr-7.x-Windows\solr\build\contrib\solr-analysis-extras\test\J0\temp\solr.update.processor.TestOpenNLPExtractNamedEntitiesUpdateProcessorFactory_6866BEE959AE9AE5-001: java.nio.file.DirectoryNotEmptyException: C:\Users\jenkins\workspace\Lucene-Solr-7.x-Windows\solr\build\contrib\solr-analysis-extras\test\J0\temp\solr.update.processor.TestOpenNLPExtractNamedEntitiesUpdateProcessorFactory_6866BEE959AE9AE5-001
   [junit4]    > 	at __randomizedtesting.SeedInfo.seed([6866BEE959AE9AE5]:0)
   [junit4]    > 	at org.apache.lucene.util.IOUtils.rm(IOUtils.java:329)
   [junit4]    > 	at java.base/java.lang.Thread.run(Thread.java:844)
   [junit4] Completed [5/5 (1!)] on J0 in 0.59s, 8 tests, 1 error <<< FAILURES!

[...truncated 38468 lines...]

Mime
View raw message