lucene-dev mailing list archives

Site index · List index
Message view « Date » · « Thread »
Top « Date » · « Thread »
From Policeman Jenkins Server <jenk...@thetaphi.de>
Subject [JENKINS] Lucene-Solr-7.x-Solaris (64bit/jdk1.8.0) - Build # 415 - Still Unstable!
Date Sat, 27 Jan 2018 06:18:26 GMT
Build: https://jenkins.thetaphi.de/job/Lucene-Solr-7.x-Solaris/415/
Java: 64bit/jdk1.8.0 -XX:-UseCompressedOops -XX:+UseParallelGC

4 tests failed.
FAILED:  junit.framework.TestSuite.org.apache.solr.cloud.TestSolrCloudWithSecureImpersonation

Error Message:
2 threads leaked from SUITE scope at org.apache.solr.cloud.TestSolrCloudWithSecureImpersonation:     1) Thread[id=28510, name=jetty-launcher-5585-thread-2-EventThread, state=TIMED_WAITING, group=TGRP-TestSolrCloudWithSecureImpersonation]         at sun.misc.Unsafe.park(Native Method)         at java.util.concurrent.locks.LockSupport.parkNanos(LockSupport.java:215)         at java.util.concurrent.locks.AbstractQueuedSynchronizer.doAcquireSharedNanos(AbstractQueuedSynchronizer.java:1037)         at java.util.concurrent.locks.AbstractQueuedSynchronizer.tryAcquireSharedNanos(AbstractQueuedSynchronizer.java:1328)         at java.util.concurrent.CountDownLatch.await(CountDownLatch.java:277)         at org.apache.curator.CuratorZookeeperClient.internalBlockUntilConnectedOrTimedOut(CuratorZookeeperClient.java:323)         at org.apache.curator.RetryLoop.callWithRetry(RetryLoop.java:105)         at org.apache.curator.framework.imps.GetDataBuilderImpl.pathInForeground(GetDataBuilderImpl.java:288)         at org.apache.curator.framework.imps.GetDataBuilderImpl.forPath(GetDataBuilderImpl.java:279)         at org.apache.curator.framework.imps.GetDataBuilderImpl.forPath(GetDataBuilderImpl.java:41)         at org.apache.curator.framework.recipes.shared.SharedValue.readValue(SharedValue.java:244)         at org.apache.curator.framework.recipes.shared.SharedValue.access$100(SharedValue.java:44)         at org.apache.curator.framework.recipes.shared.SharedValue$1.process(SharedValue.java:61)         at org.apache.curator.framework.imps.NamespaceWatcher.process(NamespaceWatcher.java:67)         at org.apache.zookeeper.ClientCnxn$EventThread.processEvent(ClientCnxn.java:530)         at org.apache.zookeeper.ClientCnxn$EventThread.run(ClientCnxn.java:505)    2) Thread[id=28500, name=jetty-launcher-5585-thread-1-EventThread, state=TIMED_WAITING, group=TGRP-TestSolrCloudWithSecureImpersonation]         at sun.misc.Unsafe.park(Native Method)         at java.util.concurrent.locks.LockSupport.parkNanos(LockSupport.java:215)         at java.util.concurrent.locks.AbstractQueuedSynchronizer.doAcquireSharedNanos(AbstractQueuedSynchronizer.java:1037)         at java.util.concurrent.locks.AbstractQueuedSynchronizer.tryAcquireSharedNanos(AbstractQueuedSynchronizer.java:1328)         at java.util.concurrent.CountDownLatch.await(CountDownLatch.java:277)         at org.apache.curator.CuratorZookeeperClient.internalBlockUntilConnectedOrTimedOut(CuratorZookeeperClient.java:323)         at org.apache.curator.RetryLoop.callWithRetry(RetryLoop.java:105)         at org.apache.curator.framework.imps.GetDataBuilderImpl.pathInForeground(GetDataBuilderImpl.java:288)         at org.apache.curator.framework.imps.GetDataBuilderImpl.forPath(GetDataBuilderImpl.java:279)         at org.apache.curator.framework.imps.GetDataBuilderImpl.forPath(GetDataBuilderImpl.java:41)         at org.apache.curator.framework.recipes.shared.SharedValue.readValue(SharedValue.java:244)         at org.apache.curator.framework.recipes.shared.SharedValue.access$100(SharedValue.java:44)         at org.apache.curator.framework.recipes.shared.SharedValue$1.process(SharedValue.java:61)         at org.apache.curator.framework.imps.NamespaceWatcher.process(NamespaceWatcher.java:67)         at org.apache.zookeeper.ClientCnxn$EventThread.processEvent(ClientCnxn.java:530)         at org.apache.zookeeper.ClientCnxn$EventThread.run(ClientCnxn.java:505)

Stack Trace:
com.carrotsearch.randomizedtesting.ThreadLeakError: 2 threads leaked from SUITE scope at org.apache.solr.cloud.TestSolrCloudWithSecureImpersonation: 
   1) Thread[id=28510, name=jetty-launcher-5585-thread-2-EventThread, state=TIMED_WAITING, group=TGRP-TestSolrCloudWithSecureImpersonation]
        at sun.misc.Unsafe.park(Native Method)
        at java.util.concurrent.locks.LockSupport.parkNanos(LockSupport.java:215)
        at java.util.concurrent.locks.AbstractQueuedSynchronizer.doAcquireSharedNanos(AbstractQueuedSynchronizer.java:1037)
        at java.util.concurrent.locks.AbstractQueuedSynchronizer.tryAcquireSharedNanos(AbstractQueuedSynchronizer.java:1328)
        at java.util.concurrent.CountDownLatch.await(CountDownLatch.java:277)
        at org.apache.curator.CuratorZookeeperClient.internalBlockUntilConnectedOrTimedOut(CuratorZookeeperClient.java:323)
        at org.apache.curator.RetryLoop.callWithRetry(RetryLoop.java:105)
        at org.apache.curator.framework.imps.GetDataBuilderImpl.pathInForeground(GetDataBuilderImpl.java:288)
        at org.apache.curator.framework.imps.GetDataBuilderImpl.forPath(GetDataBuilderImpl.java:279)
        at org.apache.curator.framework.imps.GetDataBuilderImpl.forPath(GetDataBuilderImpl.java:41)
        at org.apache.curator.framework.recipes.shared.SharedValue.readValue(SharedValue.java:244)
        at org.apache.curator.framework.recipes.shared.SharedValue.access$100(SharedValue.java:44)
        at org.apache.curator.framework.recipes.shared.SharedValue$1.process(SharedValue.java:61)
        at org.apache.curator.framework.imps.NamespaceWatcher.process(NamespaceWatcher.java:67)
        at org.apache.zookeeper.ClientCnxn$EventThread.processEvent(ClientCnxn.java:530)
        at org.apache.zookeeper.ClientCnxn$EventThread.run(ClientCnxn.java:505)
   2) Thread[id=28500, name=jetty-launcher-5585-thread-1-EventThread, state=TIMED_WAITING, group=TGRP-TestSolrCloudWithSecureImpersonation]
        at sun.misc.Unsafe.park(Native Method)
        at java.util.concurrent.locks.LockSupport.parkNanos(LockSupport.java:215)
        at java.util.concurrent.locks.AbstractQueuedSynchronizer.doAcquireSharedNanos(AbstractQueuedSynchronizer.java:1037)
        at java.util.concurrent.locks.AbstractQueuedSynchronizer.tryAcquireSharedNanos(AbstractQueuedSynchronizer.java:1328)
        at java.util.concurrent.CountDownLatch.await(CountDownLatch.java:277)
        at org.apache.curator.CuratorZookeeperClient.internalBlockUntilConnectedOrTimedOut(CuratorZookeeperClient.java:323)
        at org.apache.curator.RetryLoop.callWithRetry(RetryLoop.java:105)
        at org.apache.curator.framework.imps.GetDataBuilderImpl.pathInForeground(GetDataBuilderImpl.java:288)
        at org.apache.curator.framework.imps.GetDataBuilderImpl.forPath(GetDataBuilderImpl.java:279)
        at org.apache.curator.framework.imps.GetDataBuilderImpl.forPath(GetDataBuilderImpl.java:41)
        at org.apache.curator.framework.recipes.shared.SharedValue.readValue(SharedValue.java:244)
        at org.apache.curator.framework.recipes.shared.SharedValue.access$100(SharedValue.java:44)
        at org.apache.curator.framework.recipes.shared.SharedValue$1.process(SharedValue.java:61)
        at org.apache.curator.framework.imps.NamespaceWatcher.process(NamespaceWatcher.java:67)
        at org.apache.zookeeper.ClientCnxn$EventThread.processEvent(ClientCnxn.java:530)
        at org.apache.zookeeper.ClientCnxn$EventThread.run(ClientCnxn.java:505)
	at __randomizedtesting.SeedInfo.seed([259BA6F5F68887BB]:0)


FAILED:  org.apache.solr.cloud.autoscaling.TriggerIntegrationTest.testMetricTrigger

Error Message:


Stack Trace:
java.lang.AssertionError
	at __randomizedtesting.SeedInfo.seed([259BA6F5F68887BB:9F97917AA96051F4]:0)
	at org.junit.Assert.fail(Assert.java:92)
	at org.junit.Assert.assertTrue(Assert.java:43)
	at org.junit.Assert.assertNull(Assert.java:551)
	at org.junit.Assert.assertNull(Assert.java:562)
	at org.apache.solr.cloud.autoscaling.TriggerIntegrationTest.testMetricTrigger(TriggerIntegrationTest.java:1575)
	at sun.reflect.NativeMethodAccessorImpl.invoke0(Native Method)
	at sun.reflect.NativeMethodAccessorImpl.invoke(NativeMethodAccessorImpl.java:62)
	at sun.reflect.DelegatingMethodAccessorImpl.invoke(DelegatingMethodAccessorImpl.java:43)
	at java.lang.reflect.Method.invoke(Method.java:498)
	at com.carrotsearch.randomizedtesting.RandomizedRunner.invoke(RandomizedRunner.java:1737)
	at com.carrotsearch.randomizedtesting.RandomizedRunner$8.evaluate(RandomizedRunner.java:934)
	at com.carrotsearch.randomizedtesting.RandomizedRunner$9.evaluate(RandomizedRunner.java:970)
	at com.carrotsearch.randomizedtesting.RandomizedRunner$10.evaluate(RandomizedRunner.java:984)
	at com.carrotsearch.randomizedtesting.rules.SystemPropertiesRestoreRule$1.evaluate(SystemPropertiesRestoreRule.java:57)
	at org.apache.lucene.util.TestRuleSetupTeardownChained$1.evaluate(TestRuleSetupTeardownChained.java:49)
	at org.apache.lucene.util.AbstractBeforeAfterRule$1.evaluate(AbstractBeforeAfterRule.java:45)
	at org.apache.lucene.util.TestRuleThreadAndTestName$1.evaluate(TestRuleThreadAndTestName.java:48)
	at org.apache.lucene.util.TestRuleIgnoreAfterMaxFailures$1.evaluate(TestRuleIgnoreAfterMaxFailures.java:64)
	at org.apache.lucene.util.TestRuleMarkFailure$1.evaluate(TestRuleMarkFailure.java:47)
	at com.carrotsearch.randomizedtesting.rules.StatementAdapter.evaluate(StatementAdapter.java:36)
	at com.carrotsearch.randomizedtesting.ThreadLeakControl$StatementRunner.run(ThreadLeakControl.java:368)
	at com.carrotsearch.randomizedtesting.ThreadLeakControl.forkTimeoutingTask(ThreadLeakControl.java:817)
	at com.carrotsearch.randomizedtesting.ThreadLeakControl$3.evaluate(ThreadLeakControl.java:468)
	at com.carrotsearch.randomizedtesting.RandomizedRunner.runSingleTest(RandomizedRunner.java:943)
	at com.carrotsearch.randomizedtesting.RandomizedRunner$5.evaluate(RandomizedRunner.java:829)
	at com.carrotsearch.randomizedtesting.RandomizedRunner$6.evaluate(RandomizedRunner.java:879)
	at com.carrotsearch.randomizedtesting.RandomizedRunner$7.evaluate(RandomizedRunner.java:890)
	at com.carrotsearch.randomizedtesting.rules.StatementAdapter.evaluate(StatementAdapter.java:36)
	at com.carrotsearch.randomizedtesting.rules.SystemPropertiesRestoreRule$1.evaluate(SystemPropertiesRestoreRule.java:57)
	at org.apache.lucene.util.AbstractBeforeAfterRule$1.evaluate(AbstractBeforeAfterRule.java:45)
	at com.carrotsearch.randomizedtesting.rules.StatementAdapter.evaluate(StatementAdapter.java:36)
	at org.apache.lucene.util.TestRuleStoreClassName$1.evaluate(TestRuleStoreClassName.java:41)
	at com.carrotsearch.randomizedtesting.rules.NoShadowingOrOverridesOnMethodsRule$1.evaluate(NoShadowingOrOverridesOnMethodsRule.java:40)
	at com.carrotsearch.randomizedtesting.rules.NoShadowingOrOverridesOnMethodsRule$1.evaluate(NoShadowingOrOverridesOnMethodsRule.java:40)
	at com.carrotsearch.randomizedtesting.rules.StatementAdapter.evaluate(StatementAdapter.java:36)
	at com.carrotsearch.randomizedtesting.rules.StatementAdapter.evaluate(StatementAdapter.java:36)
	at com.carrotsearch.randomizedtesting.rules.StatementAdapter.evaluate(StatementAdapter.java:36)
	at org.apache.lucene.util.TestRuleAssertionsRequired$1.evaluate(TestRuleAssertionsRequired.java:53)
	at org.apache.lucene.util.TestRuleMarkFailure$1.evaluate(TestRuleMarkFailure.java:47)
	at org.apache.lucene.util.TestRuleIgnoreAfterMaxFailures$1.evaluate(TestRuleIgnoreAfterMaxFailures.java:64)
	at org.apache.lucene.util.TestRuleIgnoreTestSuites$1.evaluate(TestRuleIgnoreTestSuites.java:54)
	at com.carrotsearch.randomizedtesting.rules.StatementAdapter.evaluate(StatementAdapter.java:36)
	at com.carrotsearch.randomizedtesting.ThreadLeakControl$StatementRunner.run(ThreadLeakControl.java:368)
	at java.lang.Thread.run(Thread.java:748)


FAILED:  org.apache.solr.security.BasicAuthIntegrationTest.testBasicAuth

Error Message:
must have failed

Stack Trace:
java.lang.AssertionError: must have failed
	at __randomizedtesting.SeedInfo.seed([259BA6F5F68887BB:99F5D0E752DB04C1]:0)
	at org.junit.Assert.fail(Assert.java:93)
	at org.apache.solr.security.BasicAuthIntegrationTest.testBasicAuth(BasicAuthIntegrationTest.java:171)
	at sun.reflect.NativeMethodAccessorImpl.invoke0(Native Method)
	at sun.reflect.NativeMethodAccessorImpl.invoke(NativeMethodAccessorImpl.java:62)
	at sun.reflect.DelegatingMethodAccessorImpl.invoke(DelegatingMethodAccessorImpl.java:43)
	at java.lang.reflect.Method.invoke(Method.java:498)
	at com.carrotsearch.randomizedtesting.RandomizedRunner.invoke(RandomizedRunner.java:1737)
	at com.carrotsearch.randomizedtesting.RandomizedRunner$8.evaluate(RandomizedRunner.java:934)
	at com.carrotsearch.randomizedtesting.RandomizedRunner$9.evaluate(RandomizedRunner.java:970)
	at com.carrotsearch.randomizedtesting.RandomizedRunner$10.evaluate(RandomizedRunner.java:984)
	at com.carrotsearch.randomizedtesting.rules.SystemPropertiesRestoreRule$1.evaluate(SystemPropertiesRestoreRule.java:57)
	at org.apache.lucene.util.TestRuleSetupTeardownChained$1.evaluate(TestRuleSetupTeardownChained.java:49)
	at org.apache.lucene.util.AbstractBeforeAfterRule$1.evaluate(AbstractBeforeAfterRule.java:45)
	at org.apache.lucene.util.TestRuleThreadAndTestName$1.evaluate(TestRuleThreadAndTestName.java:48)
	at org.apache.lucene.util.TestRuleIgnoreAfterMaxFailures$1.evaluate(TestRuleIgnoreAfterMaxFailures.java:64)
	at org.apache.lucene.util.TestRuleMarkFailure$1.evaluate(TestRuleMarkFailure.java:47)
	at com.carrotsearch.randomizedtesting.rules.StatementAdapter.evaluate(StatementAdapter.java:36)
	at com.carrotsearch.randomizedtesting.ThreadLeakControl$StatementRunner.run(ThreadLeakControl.java:368)
	at com.carrotsearch.randomizedtesting.ThreadLeakControl.forkTimeoutingTask(ThreadLeakControl.java:817)
	at com.carrotsearch.randomizedtesting.ThreadLeakControl$3.evaluate(ThreadLeakControl.java:468)
	at com.carrotsearch.randomizedtesting.RandomizedRunner.runSingleTest(RandomizedRunner.java:943)
	at com.carrotsearch.randomizedtesting.RandomizedRunner$5.evaluate(RandomizedRunner.java:829)
	at com.carrotsearch.randomizedtesting.RandomizedRunner$6.evaluate(RandomizedRunner.java:879)
	at com.carrotsearch.randomizedtesting.RandomizedRunner$7.evaluate(RandomizedRunner.java:890)
	at com.carrotsearch.randomizedtesting.rules.StatementAdapter.evaluate(StatementAdapter.java:36)
	at com.carrotsearch.randomizedtesting.rules.SystemPropertiesRestoreRule$1.evaluate(SystemPropertiesRestoreRule.java:57)
	at org.apache.lucene.util.AbstractBeforeAfterRule$1.evaluate(AbstractBeforeAfterRule.java:45)
	at com.carrotsearch.randomizedtesting.rules.StatementAdapter.evaluate(StatementAdapter.java:36)
	at org.apache.lucene.util.TestRuleStoreClassName$1.evaluate(TestRuleStoreClassName.java:41)
	at com.carrotsearch.randomizedtesting.rules.NoShadowingOrOverridesOnMethodsRule$1.evaluate(NoShadowingOrOverridesOnMethodsRule.java:40)
	at com.carrotsearch.randomizedtesting.rules.NoShadowingOrOverridesOnMethodsRule$1.evaluate(NoShadowingOrOverridesOnMethodsRule.java:40)
	at com.carrotsearch.randomizedtesting.rules.StatementAdapter.evaluate(StatementAdapter.java:36)
	at com.carrotsearch.randomizedtesting.rules.StatementAdapter.evaluate(StatementAdapter.java:36)
	at com.carrotsearch.randomizedtesting.rules.StatementAdapter.evaluate(StatementAdapter.java:36)
	at org.apache.lucene.util.TestRuleAssertionsRequired$1.evaluate(TestRuleAssertionsRequired.java:53)
	at org.apache.lucene.util.TestRuleMarkFailure$1.evaluate(TestRuleMarkFailure.java:47)
	at org.apache.lucene.util.TestRuleIgnoreAfterMaxFailures$1.evaluate(TestRuleIgnoreAfterMaxFailures.java:64)
	at org.apache.lucene.util.TestRuleIgnoreTestSuites$1.evaluate(TestRuleIgnoreTestSuites.java:54)
	at com.carrotsearch.randomizedtesting.rules.StatementAdapter.evaluate(StatementAdapter.java:36)
	at com.carrotsearch.randomizedtesting.ThreadLeakControl$StatementRunner.run(ThreadLeakControl.java:368)
	at java.lang.Thread.run(Thread.java:748)


FAILED:  org.apache.solr.cloud.autoscaling.TriggerIntegrationTest.testCooldown

Error Message:


Stack Trace:
java.lang.AssertionError
	at __randomizedtesting.SeedInfo.seed([259BA6F5F68887BB:1425CB118822F249]:0)
	at org.junit.Assert.fail(Assert.java:92)
	at org.junit.Assert.assertTrue(Assert.java:43)
	at org.junit.Assert.assertTrue(Assert.java:54)
	at org.apache.solr.cloud.autoscaling.TriggerIntegrationTest.testCooldown(TriggerIntegrationTest.java:1177)
	at sun.reflect.NativeMethodAccessorImpl.invoke0(Native Method)
	at sun.reflect.NativeMethodAccessorImpl.invoke(NativeMethodAccessorImpl.java:62)
	at sun.reflect.DelegatingMethodAccessorImpl.invoke(DelegatingMethodAccessorImpl.java:43)
	at java.lang.reflect.Method.invoke(Method.java:498)
	at com.carrotsearch.randomizedtesting.RandomizedRunner.invoke(RandomizedRunner.java:1737)
	at com.carrotsearch.randomizedtesting.RandomizedRunner$8.evaluate(RandomizedRunner.java:934)
	at com.carrotsearch.randomizedtesting.RandomizedRunner$9.evaluate(RandomizedRunner.java:970)
	at com.carrotsearch.randomizedtesting.RandomizedRunner$10.evaluate(RandomizedRunner.java:984)
	at com.carrotsearch.randomizedtesting.rules.SystemPropertiesRestoreRule$1.evaluate(SystemPropertiesRestoreRule.java:57)
	at org.apache.lucene.util.TestRuleSetupTeardownChained$1.evaluate(TestRuleSetupTeardownChained.java:49)
	at org.apache.lucene.util.AbstractBeforeAfterRule$1.evaluate(AbstractBeforeAfterRule.java:45)
	at org.apache.lucene.util.TestRuleThreadAndTestName$1.evaluate(TestRuleThreadAndTestName.java:48)
	at org.apache.lucene.util.TestRuleIgnoreAfterMaxFailures$1.evaluate(TestRuleIgnoreAfterMaxFailures.java:64)
	at org.apache.lucene.util.TestRuleMarkFailure$1.evaluate(TestRuleMarkFailure.java:47)
	at com.carrotsearch.randomizedtesting.rules.StatementAdapter.evaluate(StatementAdapter.java:36)
	at com.carrotsearch.randomizedtesting.ThreadLeakControl$StatementRunner.run(ThreadLeakControl.java:368)
	at com.carrotsearch.randomizedtesting.ThreadLeakControl.forkTimeoutingTask(ThreadLeakControl.java:817)
	at com.carrotsearch.randomizedtesting.ThreadLeakControl$3.evaluate(ThreadLeakControl.java:468)
	at com.carrotsearch.randomizedtesting.RandomizedRunner.runSingleTest(RandomizedRunner.java:943)
	at com.carrotsearch.randomizedtesting.RandomizedRunner$5.evaluate(RandomizedRunner.java:829)
	at com.carrotsearch.randomizedtesting.RandomizedRunner$6.evaluate(RandomizedRunner.java:879)
	at com.carrotsearch.randomizedtesting.RandomizedRunner$7.evaluate(RandomizedRunner.java:890)
	at com.carrotsearch.randomizedtesting.rules.StatementAdapter.evaluate(StatementAdapter.java:36)
	at com.carrotsearch.randomizedtesting.rules.SystemPropertiesRestoreRule$1.evaluate(SystemPropertiesRestoreRule.java:57)
	at org.apache.lucene.util.AbstractBeforeAfterRule$1.evaluate(AbstractBeforeAfterRule.java:45)
	at com.carrotsearch.randomizedtesting.rules.StatementAdapter.evaluate(StatementAdapter.java:36)
	at org.apache.lucene.util.TestRuleStoreClassName$1.evaluate(TestRuleStoreClassName.java:41)
	at com.carrotsearch.randomizedtesting.rules.NoShadowingOrOverridesOnMethodsRule$1.evaluate(NoShadowingOrOverridesOnMethodsRule.java:40)
	at com.carrotsearch.randomizedtesting.rules.NoShadowingOrOverridesOnMethodsRule$1.evaluate(NoShadowingOrOverridesOnMethodsRule.java:40)
	at com.carrotsearch.randomizedtesting.rules.StatementAdapter.evaluate(StatementAdapter.java:36)
	at com.carrotsearch.randomizedtesting.rules.StatementAdapter.evaluate(StatementAdapter.java:36)
	at com.carrotsearch.randomizedtesting.rules.StatementAdapter.evaluate(StatementAdapter.java:36)
	at org.apache.lucene.util.TestRuleAssertionsRequired$1.evaluate(TestRuleAssertionsRequired.java:53)
	at org.apache.lucene.util.TestRuleMarkFailure$1.evaluate(TestRuleMarkFailure.java:47)
	at org.apache.lucene.util.TestRuleIgnoreAfterMaxFailures$1.evaluate(TestRuleIgnoreAfterMaxFailures.java:64)
	at org.apache.lucene.util.TestRuleIgnoreTestSuites$1.evaluate(TestRuleIgnoreTestSuites.java:54)
	at com.carrotsearch.randomizedtesting.rules.StatementAdapter.evaluate(StatementAdapter.java:36)
	at com.carrotsearch.randomizedtesting.ThreadLeakControl$StatementRunner.run(ThreadLeakControl.java:368)
	at java.lang.Thread.run(Thread.java:748)




Build Log:
[...truncated 12434 lines...]
   [junit4] Suite: org.apache.solr.security.BasicAuthIntegrationTest
   [junit4]   2> 1340749 INFO  (SUITE-BasicAuthIntegrationTest-seed#[259BA6F5F68887BB]-worker) [    ] o.a.s.SolrTestCaseJ4 SecureRandom sanity checks: test.solr.allowed.securerandom=null & java.security.egd=file:/dev/./urandom
   [junit4]   2> Creating dataDir: /export/home/jenkins/workspace/Lucene-Solr-7.x-Solaris/solr/build/solr-core/test/J1/temp/solr.security.BasicAuthIntegrationTest_259BA6F5F68887BB-001/init-core-data-001
   [junit4]   2> 1340750 WARN  (SUITE-BasicAuthIntegrationTest-seed#[259BA6F5F68887BB]-worker) [    ] o.a.s.SolrTestCaseJ4 startTrackingSearchers: numOpens=7 numCloses=7
   [junit4]   2> 1340750 INFO  (SUITE-BasicAuthIntegrationTest-seed#[259BA6F5F68887BB]-worker) [    ] o.a.s.SolrTestCaseJ4 Using PointFields (NUMERIC_POINTS_SYSPROP=true) w/NUMERIC_DOCVALUES_SYSPROP=true
   [junit4]   2> 1340752 INFO  (SUITE-BasicAuthIntegrationTest-seed#[259BA6F5F68887BB]-worker) [    ] o.a.s.SolrTestCaseJ4 Randomized ssl (false) and clientAuth (false) via: @org.apache.solr.util.RandomizeSSL(reason=, value=NaN, ssl=NaN, clientAuth=NaN)
   [junit4]   2> 1340752 INFO  (SUITE-BasicAuthIntegrationTest-seed#[259BA6F5F68887BB]-worker) [    ] o.a.s.c.MiniSolrCloudCluster Starting cluster of 3 servers in /export/home/jenkins/workspace/Lucene-Solr-7.x-Solaris/solr/build/solr-core/test/J1/temp/solr.security.BasicAuthIntegrationTest_259BA6F5F68887BB-001/tempDir-001
   [junit4]   2> 1340752 INFO  (SUITE-BasicAuthIntegrationTest-seed#[259BA6F5F68887BB]-worker) [    ] o.a.s.c.ZkTestServer STARTING ZK TEST SERVER
   [junit4]   2> 1340753 INFO  (Thread-2883) [    ] o.a.s.c.ZkTestServer client port:0.0.0.0/0.0.0.0:0
   [junit4]   2> 1340753 INFO  (Thread-2883) [    ] o.a.s.c.ZkTestServer Starting server
   [junit4]   2> 1340754 ERROR (Thread-2883) [    ] o.a.z.s.ZooKeeperServer ZKShutdownHandler is not registered, so ZooKeeper server won't take any action on ERROR or SHUTDOWN server state changes
   [junit4]   2> 1340854 INFO  (SUITE-BasicAuthIntegrationTest-seed#[259BA6F5F68887BB]-worker) [    ] o.a.s.c.ZkTestServer start zk server on port:58907
   [junit4]   2> 1340870 INFO  (zkConnectionManagerCallback-2220-thread-1) [    ] o.a.s.c.c.ConnectionManager zkClient has connected
   [junit4]   2> 1340878 INFO  (jetty-launcher-2217-thread-1) [    ] o.e.j.s.Server jetty-9.4.8.v20171121, build timestamp: 2017-11-22T08:27:37+11:00, git hash: 82b8fb23f757335bb3329d540ce37a2a2615f0a8
   [junit4]   2> 1340879 INFO  (jetty-launcher-2217-thread-1) [    ] o.e.j.s.session DefaultSessionIdManager workerName=node0
   [junit4]   2> 1340879 INFO  (jetty-launcher-2217-thread-1) [    ] o.e.j.s.session No SessionScavenger set, using defaults
   [junit4]   2> 1340879 INFO  (jetty-launcher-2217-thread-1) [    ] o.e.j.s.session Scavenging every 600000ms
   [junit4]   2> 1340879 INFO  (jetty-launcher-2217-thread-1) [    ] o.e.j.s.h.ContextHandler Started o.e.j.s.ServletContextHandler@391a3ac8{/solr,null,AVAILABLE}
   [junit4]   2> 1340880 INFO  (jetty-launcher-2217-thread-1) [    ] o.e.j.s.AbstractConnector Started ServerConnector@5b00d968{HTTP/1.1,[http/1.1]}{127.0.0.1:50741}
   [junit4]   2> 1340880 INFO  (jetty-launcher-2217-thread-1) [    ] o.e.j.s.Server Started @1345564ms
   [junit4]   2> 1340880 INFO  (jetty-launcher-2217-thread-1) [    ] o.a.s.c.s.e.JettySolrRunner Jetty properties: {hostContext=/solr, hostPort=50741}
   [junit4]   2> 1340880 ERROR (jetty-launcher-2217-thread-1) [    ] o.a.s.u.StartupLoggingUtils Missing Java Option solr.log.dir. Logging may be missing or incomplete.
   [junit4]   2> 1340880 INFO  (jetty-launcher-2217-thread-1) [    ] o.a.s.s.SolrDispatchFilter  ___      _       Welcome to Apache Solr™ version 7.3.0
   [junit4]   2> 1340880 INFO  (jetty-launcher-2217-thread-1) [    ] o.a.s.s.SolrDispatchFilter / __| ___| |_ _   Starting in cloud mode on port null
   [junit4]   2> 1340880 INFO  (jetty-launcher-2217-thread-1) [    ] o.a.s.s.SolrDispatchFilter \__ \/ _ \ | '_|  Install dir: null
   [junit4]   2> 1340881 INFO  (jetty-launcher-2217-thread-3) [    ] o.e.j.s.Server jetty-9.4.8.v20171121, build timestamp: 2017-11-22T08:27:37+11:00, git hash: 82b8fb23f757335bb3329d540ce37a2a2615f0a8
   [junit4]   2> 1340882 INFO  (jetty-launcher-2217-thread-3) [    ] o.e.j.s.session DefaultSessionIdManager workerName=node0
   [junit4]   2> 1340882 INFO  (jetty-launcher-2217-thread-3) [    ] o.e.j.s.session No SessionScavenger set, using defaults
   [junit4]   2> 1340882 INFO  (jetty-launcher-2217-thread-3) [    ] o.e.j.s.session Scavenging every 660000ms
   [junit4]   2> 1340882 INFO  (jetty-launcher-2217-thread-3) [    ] o.e.j.s.h.ContextHandler Started o.e.j.s.ServletContextHandler@1860039b{/solr,null,AVAILABLE}
   [junit4]   2> 1340883 INFO  (jetty-launcher-2217-thread-3) [    ] o.e.j.s.AbstractConnector Started ServerConnector@6d029b1a{HTTP/1.1,[http/1.1]}{127.0.0.1:48640}
   [junit4]   2> 1340883 INFO  (jetty-launcher-2217-thread-3) [    ] o.e.j.s.Server Started @1345567ms
   [junit4]   2> 1340883 INFO  (jetty-launcher-2217-thread-3) [    ] o.a.s.c.s.e.JettySolrRunner Jetty properties: {hostContext=/solr, hostPort=48640}
   [junit4]   2> 1340883 ERROR (jetty-launcher-2217-thread-3) [    ] o.a.s.u.StartupLoggingUtils Missing Java Option solr.log.dir. Logging may be missing or incomplete.
   [junit4]   2> 1340883 INFO  (jetty-launcher-2217-thread-3) [    ] o.a.s.s.SolrDispatchFilter  ___      _       Welcome to Apache Solr™ version 7.3.0
   [junit4]   2> 1340883 INFO  (jetty-launcher-2217-thread-3) [    ] o.a.s.s.SolrDispatchFilter / __| ___| |_ _   Starting in cloud mode on port null
   [junit4]   2> 1340883 INFO  (jetty-launcher-2217-thread-3) [    ] o.a.s.s.SolrDispatchFilter \__ \/ _ \ | '_|  Install dir: null
   [junit4]   2> 1340885 INFO  (jetty-launcher-2217-thread-3) [    ] o.a.s.s.SolrDispatchFilter |___/\___/_|_|    Start time: 2018-01-27T05:11:22.079Z
   [junit4]   2> 1340886 INFO  (jetty-launcher-2217-thread-1) [    ] o.a.s.s.SolrDispatchFilter |___/\___/_|_|    Start time: 2018-01-27T05:11:22.076Z
   [junit4]   2> 1340915 INFO  (jetty-launcher-2217-thread-2) [    ] o.e.j.s.Server jetty-9.4.8.v20171121, build timestamp: 2017-11-22T08:27:37+11:00, git hash: 82b8fb23f757335bb3329d540ce37a2a2615f0a8
   [junit4]   2> 1340916 INFO  (jetty-launcher-2217-thread-2) [    ] o.e.j.s.session DefaultSessionIdManager workerName=node0
   [junit4]   2> 1340916 INFO  (jetty-launcher-2217-thread-2) [    ] o.e.j.s.session No SessionScavenger set, using defaults
   [junit4]   2> 1340917 INFO  (jetty-launcher-2217-thread-2) [    ] o.e.j.s.session Scavenging every 660000ms
   [junit4]   2> 1340917 INFO  (jetty-launcher-2217-thread-2) [    ] o.e.j.s.h.ContextHandler Started o.e.j.s.ServletContextHandler@77561fcd{/solr,null,AVAILABLE}
   [junit4]   2> 1340917 INFO  (jetty-launcher-2217-thread-2) [    ] o.e.j.s.AbstractConnector Started ServerConnector@202163c{HTTP/1.1,[http/1.1]}{127.0.0.1:58708}
   [junit4]   2> 1340917 INFO  (jetty-launcher-2217-thread-2) [    ] o.e.j.s.Server Started @1345602ms
   [junit4]   2> 1340917 INFO  (jetty-launcher-2217-thread-2) [    ] o.a.s.c.s.e.JettySolrRunner Jetty properties: {hostContext=/solr, hostPort=58708}
   [junit4]   2> 1340918 ERROR (jetty-launcher-2217-thread-2) [    ] o.a.s.u.StartupLoggingUtils Missing Java Option solr.log.dir. Logging may be missing or incomplete.
   [junit4]   2> 1340918 INFO  (jetty-launcher-2217-thread-2) [    ] o.a.s.s.SolrDispatchFilter  ___      _       Welcome to Apache Solr™ version 7.3.0
   [junit4]   2> 1340918 INFO  (jetty-launcher-2217-thread-2) [    ] o.a.s.s.SolrDispatchFilter / __| ___| |_ _   Starting in cloud mode on port null
   [junit4]   2> 1340918 INFO  (jetty-launcher-2217-thread-2) [    ] o.a.s.s.SolrDispatchFilter \__ \/ _ \ | '_|  Install dir: null
   [junit4]   2> 1340918 INFO  (jetty-launcher-2217-thread-2) [    ] o.a.s.s.SolrDispatchFilter |___/\___/_|_|    Start time: 2018-01-27T05:11:22.114Z
   [junit4]   2> 1340922 INFO  (zkConnectionManagerCallback-2226-thread-1) [    ] o.a.s.c.c.ConnectionManager zkClient has connected
   [junit4]   2> 1340923 INFO  (jetty-launcher-2217-thread-2) [    ] o.a.s.s.SolrDispatchFilter solr.xml found in ZooKeeper. Loading...
   [junit4]   2> 1340927 INFO  (zkConnectionManagerCallback-2222-thread-1) [    ] o.a.s.c.c.ConnectionManager zkClient has connected
   [junit4]   2> 1340928 WARN  (NIOServerCxn.Factory:0.0.0.0/0.0.0.0:0) [    ] o.a.z.s.NIOServerCnxn caught end of stream exception
   [junit4]   2> EndOfStreamException: Unable to read additional data from client sessionid 0x1613606f85e0002, likely client has closed socket
   [junit4]   2> 	at org.apache.zookeeper.server.NIOServerCnxn.doIO(NIOServerCnxn.java:239)
   [junit4]   2> 	at org.apache.zookeeper.server.NIOServerCnxnFactory.run(NIOServerCnxnFactory.java:203)
   [junit4]   2> 	at java.lang.Thread.run(Thread.java:748)
   [junit4]   2> 1340928 INFO  (zkConnectionManagerCallback-2224-thread-1) [    ] o.a.s.c.c.ConnectionManager zkClient has connected
   [junit4]   2> 1340928 INFO  (jetty-launcher-2217-thread-1) [    ] o.a.s.s.SolrDispatchFilter solr.xml found in ZooKeeper. Loading...
   [junit4]   2> 1340931 INFO  (jetty-launcher-2217-thread-2) [    ] o.a.s.c.ZkContainer Zookeeper client=127.0.0.1:58907/solr
   [junit4]   2> 1340932 INFO  (jetty-launcher-2217-thread-3) [    ] o.a.s.s.SolrDispatchFilter solr.xml found in ZooKeeper. Loading...
   [junit4]   2> 1340937 INFO  (zkConnectionManagerCallback-2230-thread-1) [    ] o.a.s.c.c.ConnectionManager zkClient has connected
   [junit4]   2> 1340943 INFO  (jetty-launcher-2217-thread-1) [    ] o.a.s.c.ZkContainer Zookeeper client=127.0.0.1:58907/solr
   [junit4]   2> 1340943 INFO  (jetty-launcher-2217-thread-3) [    ] o.a.s.c.ZkContainer Zookeeper client=127.0.0.1:58907/solr
   [junit4]   2> 1340945 INFO  (zkConnectionManagerCallback-2232-thread-1-processing-n:127.0.0.1:58708_solr) [n:127.0.0.1:58708_solr    ] o.a.s.c.c.ConnectionManager zkClient has connected
   [junit4]   2> 1340947 INFO  (zkConnectionManagerCallback-2240-thread-1) [    ] o.a.s.c.c.ConnectionManager zkClient has connected
   [junit4]   2> 1340950 WARN  (NIOServerCxn.Factory:0.0.0.0/0.0.0.0:0) [    ] o.a.z.s.NIOServerCnxn caught end of stream exception
   [junit4]   2> EndOfStreamException: Unable to read additional data from client sessionid 0x1613606f85e0007, likely client has closed socket
   [junit4]   2> 	at org.apache.zookeeper.server.NIOServerCnxn.doIO(NIOServerCnxn.java:239)
   [junit4]   2> 	at org.apache.zookeeper.server.NIOServerCnxnFactory.run(NIOServerCnxnFactory.java:203)
   [junit4]   2> 	at java.lang.Thread.run(Thread.java:748)
   [junit4]   2> 1340957 INFO  (zkConnectionManagerCallback-2238-thread-1) [    ] o.a.s.c.c.ConnectionManager zkClient has connected
   [junit4]   2> 1340960 INFO  (zkConnectionManagerCallback-2242-thread-1-processing-n:127.0.0.1:48640_solr) [n:127.0.0.1:48640_solr    ] o.a.s.c.c.ConnectionManager zkClient has connected
   [junit4]   2> 1340962 INFO  (zkConnectionManagerCallback-2244-thread-1-processing-n:127.0.0.1:50741_solr) [n:127.0.0.1:50741_solr    ] o.a.s.c.c.ConnectionManager zkClient has connected
   [junit4]   2> 1341249 INFO  (jetty-launcher-2217-thread-2) [n:127.0.0.1:58708_solr    ] o.a.s.c.Overseer Overseer (id=null) closing
   [junit4]   2> 1341250 INFO  (jetty-launcher-2217-thread-2) [n:127.0.0.1:58708_solr    ] o.a.s.c.OverseerElectionContext I am going to be the leader 127.0.0.1:58708_solr
   [junit4]   2> 1341252 INFO  (jetty-launcher-2217-thread-2) [n:127.0.0.1:58708_solr    ] o.a.s.c.Overseer Overseer (id=99420070343475205-127.0.0.1:58708_solr-n_0000000000) starting
   [junit4]   2> 1341293 INFO  (jetty-launcher-2217-thread-2) [n:127.0.0.1:58708_solr    ] o.a.s.c.ZkController Register node as live in ZooKeeper:/live_nodes/127.0.0.1:58708_solr
   [junit4]   2> 1341310 INFO  (OverseerStateUpdate-99420070343475205-127.0.0.1:58708_solr-n_0000000000) [n:127.0.0.1:58708_solr    ] o.a.s.c.c.ZkStateReader Updated live nodes from ZooKeeper... (0) -> (1)
   [junit4]   2> 1341340 INFO  (jetty-launcher-2217-thread-3) [n:127.0.0.1:48640_solr    ] o.a.s.c.c.ZkStateReader Updated live nodes from ZooKeeper... (0) -> (1)
   [junit4]   2> 1341343 INFO  (jetty-launcher-2217-thread-3) [n:127.0.0.1:48640_solr    ] o.a.s.c.Overseer Overseer (id=null) closing
   [junit4]   2> 1341349 INFO  (jetty-launcher-2217-thread-3) [n:127.0.0.1:48640_solr    ] o.a.s.c.ZkController Register node as live in ZooKeeper:/live_nodes/127.0.0.1:48640_solr
   [junit4]   2> 1341364 INFO  (zkCallback-2231-thread-1-processing-n:127.0.0.1:58708_solr) [n:127.0.0.1:58708_solr    ] o.a.s.c.c.ZkStateReader Updated live nodes from ZooKeeper... (1) -> (2)
   [junit4]   2> 1341364 INFO  (zkCallback-2241-thread-1-processing-n:127.0.0.1:48640_solr) [n:127.0.0.1:48640_solr    ] o.a.s.c.c.ZkStateReader Updated live nodes from ZooKeeper... (1) -> (2)
   [junit4]   2> 1341375 INFO  (jetty-launcher-2217-thread-1) [n:127.0.0.1:50741_solr    ] o.a.s.c.c.ZkStateReader Updated live nodes from ZooKeeper... (0) -> (2)
   [junit4]   2> 1341378 INFO  (jetty-launcher-2217-thread-1) [n:127.0.0.1:50741_solr    ] o.a.s.c.Overseer Overseer (id=null) closing
   [junit4]   2> 1341380 INFO  (jetty-launcher-2217-thread-1) [n:127.0.0.1:50741_solr    ] o.a.s.c.ZkController Register node as live in ZooKeeper:/live_nodes/127.0.0.1:50741_solr
   [junit4]   2> 1341386 INFO  (zkCallback-2241-thread-1-processing-n:127.0.0.1:48640_solr) [n:127.0.0.1:48640_solr    ] o.a.s.c.c.ZkStateReader Updated live nodes from ZooKeeper... (2) -> (3)
   [junit4]   2> 1341386 INFO  (zkCallback-2231-thread-1-processing-n:127.0.0.1:58708_solr) [n:127.0.0.1:58708_solr    ] o.a.s.c.c.ZkStateReader Updated live nodes from ZooKeeper... (2) -> (3)
   [junit4]   2> 1341388 INFO  (zkCallback-2243-thread-1-processing-n:127.0.0.1:50741_solr) [n:127.0.0.1:50741_solr    ] o.a.s.c.c.ZkStateReader Updated live nodes from ZooKeeper... (2) -> (3)
   [junit4]   2> 1341440 INFO  (jetty-launcher-2217-thread-3) [n:127.0.0.1:48640_solr    ] o.a.s.m.r.SolrJmxReporter JMX monitoring for 'solr_48640.solr.node' (registry 'solr.node') enabled at server: com.sun.jmx.mbeanserver.JmxMBeanServer@3be3b6c1
   [junit4]   2> 1341449 INFO  (jetty-launcher-2217-thread-3) [n:127.0.0.1:48640_solr    ] o.a.s.m.r.SolrJmxReporter JMX monitoring for 'solr_48640.solr.jvm' (registry 'solr.jvm') enabled at server: com.sun.jmx.mbeanserver.JmxMBeanServer@3be3b6c1
   [junit4]   2> 1341449 INFO  (jetty-launcher-2217-thread-3) [n:127.0.0.1:48640_solr    ] o.a.s.m.r.SolrJmxReporter JMX monitoring for 'solr_48640.solr.jetty' (registry 'solr.jetty') enabled at server: com.sun.jmx.mbeanserver.JmxMBeanServer@3be3b6c1
   [junit4]   2> 1341450 INFO  (jetty-launcher-2217-thread-3) [n:127.0.0.1:48640_solr    ] o.a.s.c.CorePropertiesLocator Found 0 core definitions underneath /export/home/jenkins/workspace/Lucene-Solr-7.x-Solaris/solr/build/solr-core/test/J1/temp/solr.security.BasicAuthIntegrationTest_259BA6F5F68887BB-001/tempDir-001/node2/.
   [junit4]   2> 1341528 INFO  (jetty-launcher-2217-thread-2) [n:127.0.0.1:58708_solr    ] o.a.s.m.r.SolrJmxReporter JMX monitoring for 'solr_58708.solr.node' (registry 'solr.node') enabled at server: com.sun.jmx.mbeanserver.JmxMBeanServer@3be3b6c1
   [junit4]   2> 1341535 INFO  (jetty-launcher-2217-thread-2) [n:127.0.0.1:58708_solr    ] o.a.s.m.r.SolrJmxReporter JMX monitoring for 'solr_58708.solr.jvm' (registry 'solr.jvm') enabled at server: com.sun.jmx.mbeanserver.JmxMBeanServer@3be3b6c1
   [junit4]   2> 1341536 INFO  (jetty-launcher-2217-thread-2) [n:127.0.0.1:58708_solr    ] o.a.s.m.r.SolrJmxReporter JMX monitoring for 'solr_58708.solr.jetty' (registry 'solr.jetty') enabled at server: com.sun.jmx.mbeanserver.JmxMBeanServer@3be3b6c1
   [junit4]   2> 1341537 INFO  (jetty-launcher-2217-thread-2) [n:127.0.0.1:58708_solr    ] o.a.s.c.CorePropertiesLocator Found 0 core definitions underneath /export/home/jenkins/workspace/Lucene-Solr-7.x-Solaris/solr/build/solr-core/test/J1/temp/solr.security.BasicAuthIntegrationTest_259BA6F5F68887BB-001/tempDir-001/node3/.
   [junit4]   2> 1341705 INFO  (jetty-launcher-2217-thread-1) [n:127.0.0.1:50741_solr    ] o.a.s.m.r.SolrJmxReporter JMX monitoring for 'solr_50741.solr.node' (registry 'solr.node') enabled at server: com.sun.jmx.mbeanserver.JmxMBeanServer@3be3b6c1
   [junit4]   2> 1341714 INFO  (jetty-launcher-2217-thread-1) [n:127.0.0.1:50741_solr    ] o.a.s.m.r.SolrJmxReporter JMX monitoring for 'solr_50741.solr.jvm' (registry 'solr.jvm') enabled at server: com.sun.jmx.mbeanserver.JmxMBeanServer@3be3b6c1
   [junit4]   2> 1341715 INFO  (jetty-launcher-2217-thread-1) [n:127.0.0.1:50741_solr    ] o.a.s.m.r.SolrJmxReporter JMX monitoring for 'solr_50741.solr.jetty' (registry 'solr.jetty') enabled at server: com.sun.jmx.mbeanserver.JmxMBeanServer@3be3b6c1
   [junit4]   2> 1341716 INFO  (jetty-launcher-2217-thread-1) [n:127.0.0.1:50741_solr    ] o.a.s.c.CorePropertiesLocator Found 0 core definitions underneath /export/home/jenkins/workspace/Lucene-Solr-7.x-Solaris/solr/build/solr-core/test/J1/temp/solr.security.BasicAuthIntegrationTest_259BA6F5F68887BB-001/tempDir-001/node1/.
   [junit4]   2> 1341761 INFO  (zkConnectionManagerCallback-2252-thread-1) [    ] o.a.s.c.c.ConnectionManager zkClient has connected
   [junit4]   2> 1341819 WARN  (NIOServerCxn.Factory:0.0.0.0/0.0.0.0:0) [    ] o.a.z.s.NIOServerCnxn caught end of stream exception
   [junit4]   2> EndOfStreamException: Unable to read additional data from client sessionid 0x1613606f85e000a, likely client has closed socket
   [junit4]   2> 	at org.apache.zookeeper.server.NIOServerCnxn.doIO(NIOServerCnxn.java:239)
   [junit4]   2> 	at org.apache.zookeeper.server.NIOServerCnxnFactory.run(NIOServerCnxnFactory.java:203)
   [junit4]   2> 	at java.lang.Thread.run(Thread.java:748)
   [junit4]   2> 1341823 INFO  (zkConnectionManagerCallback-2256-thread-1) [    ] o.a.s.c.c.ConnectionManager zkClient has connected
   [junit4]   2> 1341826 INFO  (SUITE-BasicAuthIntegrationTest-seed#[259BA6F5F68887BB]-worker) [    ] o.a.s.c.c.ZkStateReader Updated live nodes from ZooKeeper... (0) -> (3)
   [junit4]   2> 1341828 INFO  (SUITE-BasicAuthIntegrationTest-seed#[259BA6F5F68887BB]-worker) [    ] o.a.s.c.s.i.ZkClientClusterStateProvider Cluster at 127.0.0.1:58907/solr ready
   [junit4]   2> 1341844 INFO  (qtp1177329877-11585) [n:127.0.0.1:58708_solr    ] o.a.s.h.a.CollectionsHandler Invoked Collection Action :create with params replicationFactor=1&collection.configName=conf&name=authCollection&nrtReplicas=1&action=CREATE&numShards=3&wt=javabin&version=2 and sendToOCPQueue=true
   [junit4]   2> 1341849 INFO  (OverseerThreadFactory-4764-thread-1-processing-n:127.0.0.1:58708_solr) [n:127.0.0.1:58708_solr    ] o.a.s.c.a.c.CreateCollectionCmd Create collection authCollection
   [junit4]   2> 1341991 INFO  (OverseerStateUpdate-99420070343475205-127.0.0.1:58708_solr-n_0000000000) [n:127.0.0.1:58708_solr    ] o.a.s.c.o.SliceMutator createReplica() {
   [junit4]   2>   "operation":"ADDREPLICA",
   [junit4]   2>   "collection":"authCollection",
   [junit4]   2>   "shard":"shard1",
   [junit4]   2>   "core":"authCollection_shard1_replica_n1",
   [junit4]   2>   "state":"down",
   [junit4]   2>   "base_url":"http://127.0.0.1:50741/solr",
   [junit4]   2>   "type":"NRT",
   [junit4]   2>   "waitForFinalState":"false"} 
   [junit4]   2> 1342006 INFO  (OverseerStateUpdate-99420070343475205-127.0.0.1:58708_solr-n_0000000000) [n:127.0.0.1:58708_solr    ] o.a.s.c.o.SliceMutator createReplica() {
   [junit4]   2>   "operation":"ADDREPLICA",
   [junit4]   2>   "collection":"authCollection",
   [junit4]   2>   "shard":"shard2",
   [junit4]   2>   "core":"authCollection_shard2_replica_n2",
   [junit4]   2>   "state":"down",
   [junit4]   2>   "base_url":"http://127.0.0.1:58708/solr",
   [junit4]   2>   "type":"NRT",
   [junit4]   2>   "waitForFinalState":"false"} 
   [junit4]   2> 1342055 INFO  (OverseerStateUpdate-99420070343475205-127.0.0.1:58708_solr-n_0000000000) [n:127.0.0.1:58708_solr    ] o.a.s.c.o.SliceMutator createReplica() {
   [junit4]   2>   "operation":"ADDREPLICA",
   [junit4]   2>   "collection":"authCollection",
   [junit4]   2>   "shard":"shard3",
   [junit4]   2>   "core":"authCollection_shard3_replica_n4",
   [junit4]   2>   "state":"down",
   [junit4]   2>   "base_url":"http://127.0.0.1:48640/solr",
   [junit4]   2>   "type":"NRT",
   [junit4]   2>   "waitForFinalState":"false"} 
   [junit4]   2> 1342215 INFO  (qtp1177329877-11597) [n:127.0.0.1:58708_solr    ] o.a.s.h.a.CoreAdminOperation core create command qt=/admin/cores&coreNodeName=core_node5&collection.configName=conf&newCollection=true&name=authCollection_shard2_replica_n2&action=CREATE&numShards=3&collection=authCollection&shard=shard2&wt=javabin&version=2&replicaType=NRT
   [junit4]   2> 1342215 INFO  (qtp1177329877-11597) [n:127.0.0.1:58708_solr    ] o.a.s.c.TransientSolrCoreCacheDefault Allocating transient cache for 2147483647 transient cores
   [junit4]   2> 1342215 INFO  (qtp1238297355-11566) [n:127.0.0.1:48640_solr    ] o.a.s.h.a.CoreAdminOperation core create command qt=/admin/cores&coreNodeName=core_node6&collection.configName=conf&newCollection=true&name=authCollection_shard3_replica_n4&action=CREATE&numShards=3&collection=authCollection&shard=shard3&wt=javabin&version=2&replicaType=NRT
   [junit4]   2> 1342216 INFO  (qtp2118624543-11557) [n:127.0.0.1:50741_solr    ] o.a.s.h.a.CoreAdminOperation core create command qt=/admin/cores&coreNodeName=core_node3&collection.configName=conf&newCollection=true&name=authCollection_shard1_replica_n1&action=CREATE&numShards=3&collection=authCollection&shard=shard1&wt=javabin&version=2&replicaType=NRT
   [junit4]   2> 1342216 INFO  (qtp1238297355-11566) [n:127.0.0.1:48640_solr    ] o.a.s.c.TransientSolrCoreCacheDefault Allocating transient cache for 2147483647 transient cores
   [junit4]   2> 1342216 INFO  (qtp2118624543-11557) [n:127.0.0.1:50741_solr    ] o.a.s.c.TransientSolrCoreCacheDefault Allocating transient cache for 2147483647 transient cores
   [junit4]   2> 1342332 INFO  (zkCallback-2241-thread-1-processing-n:127.0.0.1:48640_solr) [n:127.0.0.1:48640_solr    ] o.a.s.c.c.ZkStateReader A cluster state change: [WatchedEvent state:SyncConnected type:NodeDataChanged path:/collections/authCollection/state.json] for collection [authCollection] has occurred - updating... (live nodes size: [3])
   [junit4]   2> 1342332 INFO  (zkCallback-2243-thread-1-processing-n:127.0.0.1:50741_solr) [n:127.0.0.1:50741_solr    ] o.a.s.c.c.ZkStateReader A cluster state change: [WatchedEvent state:SyncConnected type:NodeDataChanged path:/collections/authCollection/state.json] for collection [authCollection] has occurred - updating... (live nodes size: [3])
   [junit4]   2> 1342333 INFO  (zkCallback-2231-thread-1-processing-n:127.0.0.1:58708_solr) [n:127.0.0.1:58708_solr    ] o.a.s.c.c.ZkStateReader A cluster state change: [WatchedEvent state:SyncConnected type:NodeDataChanged path:/collections/authCollection/state.json] for collection [authCollection] has occurred - updating... (live nodes size: [3])
   [junit4]   2> 1342333 INFO  (zkCallback-2231-thread-2-processing-n:127.0.0.1:58708_solr) [n:127.0.0.1:58708_solr    ] o.a.s.c.c.ZkStateReader A cluster state change: [WatchedEvent state:SyncConnected type:NodeDataChanged path:/collections/authCollection/state.json] for collection [authCollection] has occurred - updating... (live nodes size: [3])
   [junit4]   2> 1342333 INFO  (zkCallback-2241-thread-2-processing-n:127.0.0.1:48640_solr) [n:127.0.0.1:48640_solr    ] o.a.s.c.c.ZkStateReader A cluster state change: [WatchedEvent state:SyncConnected type:NodeDataChanged path:/collections/authCollection/state.json] for collection [authCollection] has occurred - updating... (live nodes size: [3])
   [junit4]   2> 1342333 INFO  (zkCallback-2243-thread-2-processing-n:127.0.0.1:50741_solr) [n:127.0.0.1:50741_solr    ] o.a.s.c.c.ZkStateReader A cluster state change: [WatchedEvent state:SyncConnected type:NodeDataChanged path:/collections/authCollection/state.json] for collection [authCollection] has occurred - updating... (live nodes size: [3])
   [junit4]   2> 1343249 INFO  (qtp1238297355-11566) [n:127.0.0.1:48640_solr c:authCollection s:shard3 r:core_node6 x:authCollection_shard3_replica_n4] o.a.s.c.SolrConfig Using Lucene MatchVersion: 7.3.0
   [junit4]   2> 1343250 INFO  (qtp1177329877-11597) [n:127.0.0.1:58708_solr c:authCollection s:shard2 r:core_node5 x:authCollection_shard2_replica_n2] o.a.s.c.SolrConfig Using Lucene MatchVersion: 7.3.0
   [junit4]   2> 1343254 INFO  (qtp2118624543-11557) [n:127.0.0.1:50741_solr c:authCollection s:shard1 r:core_node3 x:authCollection_shard1_replica_n1] o.a.s.c.SolrConfig Using Lucene MatchVersion: 7.3.0
   [junit4]   2> 1343272 INFO  (qtp1238297355-11566) [n:127.0.0.1:48640_solr c:authCollection s:shard3 r:core_node6 x:authCollection_shard3_replica_n4] o.a.s.s.IndexSchema [authCollection_shard3_replica_n4] Schema name=minimal
   [junit4]   2> 1343276 INFO  (qtp1238297355-11566) [n:127.0.0.1:48640_solr c:authCollection s:shard3 r:core_node6 x:authCollection_shard3_replica_n4] o.a.s.s.IndexSchema Loaded schema minimal/1.1 with uniqueid field id
   [junit4]   2> 1343276 INFO  (qtp1238297355-11566) [n:127.0.0.1:48640_solr c:authCollection s:shard3 r:core_node6 x:authCollection_shard3_replica_n4] o.a.s.c.CoreContainer Creating SolrCore 'authCollection_shard3_replica_n4' using configuration from collection authCollection, trusted=true
   [junit4]   2> 1343277 INFO  (qtp1238297355-11566) [n:127.0.0.1:48640_solr c:authCollection s:shard3 r:core_node6 x:authCollection_shard3_replica_n4] o.a.s.m.r.SolrJmxReporter JMX monitoring for 'solr_48640.solr.core.authCollection.shard3.replica_n4' (registry 'solr.core.authCollection.shard3.replica_n4') enabled at server: com.sun.jmx.mbeanserver.JmxMBeanServer@3be3b6c1
   [junit4]   2> 1343278 INFO  (qtp1238297355-11566) [n:127.0.0.1:48640_solr c:authCollection s:shard3 r:core_node6 x:authCollection_shard3_replica_n4] o.a.s.c.SolrCore solr.RecoveryStrategy.Builder
   [junit4]   2> 1343278 INFO  (qtp1238297355-11566) [n:127.0.0.1:48640_solr c:authCollection s:shard3 r:core_node6 x:authCollection_shard3_replica_n4] o.a.s.c.SolrCore [[authCollection_shard3_replica_n4] ] Opening new SolrCore at [/export/home/jenkins/workspace/Lucene-Solr-7.x-Solaris/solr/build/solr-core/test/J1/temp/solr.security.BasicAuthIntegrationTest_259BA6F5F68887BB-001/tempDir-001/node2/authCollection_shard3_replica_n4], dataDir=[/export/home/jenkins/workspace/Lucene-Solr-7.x-Solaris/solr/build/solr-core/test/J1/temp/solr.security.BasicAuthIntegrationTest_259BA6F5F68887BB-001/tempDir-001/node2/./authCollection_shard3_replica_n4/data/]
   [junit4]   2> 1343281 INFO  (qtp1177329877-11597) [n:127.0.0.1:58708_solr c:authCollection s:shard2 r:core_node5 x:authCollection_shard2_replica_n2] o.a.s.s.IndexSchema [authCollection_shard2_replica_n2] Schema name=minimal
   [junit4]   2> 1343282 INFO  (qtp2118624543-11557) [n:127.0.0.1:50741_solr c:authCollection s:shard1 r:core_node3 x:authCollection_shard1_replica_n1] o.a.s.s.IndexSchema [authCollection_shard1_replica_n1] Schema name=minimal
   [junit4]   2> 1343284 INFO  (qtp2118624543-11557) [n:127.0.0.1:50741_solr c:authCollection s:shard1 r:core_node3 x:authCollection_shard1_replica_n1] o.a.s.s.IndexSchema Loaded schema minimal/1.1 with uniqueid field id
   [junit4]   2> 1343284 INFO  (qtp2118624543-11557) [n:127.0.0.1:50741_solr c:authCollection s:shard1 r:core_node3 x:authCollection_shard1_replica_n1] o.a.s.c.CoreContainer Creating SolrCore 'authCollection_shard1_replica_n1' using configuration from collection authCollection, trusted=true
   [junit4]   2> 1343284 INFO  (qtp2118624543-11557) [n:127.0.0.1:50741_solr c:authCollection s:shard1 r:core_node3 x:authCollection_shard1_replica_n1] o.a.s.m.r.SolrJmxReporter JMX monitoring for 'solr_50741.solr.core.authCollection.shard1.replica_n1' (registry 'solr.core.authCollection.shard1.replica_n1') enabled at server: com.sun.jmx.mbeanserver.JmxMBeanServer@3be3b6c1
   [junit4]   2> 1343285 INFO  (qtp2118624543-11557) [n:127.0.0.1:50741_solr c:authCollection s:shard1 r:core_node3 x:authCollection_shard1_replica_n1] o.a.s.c.SolrCore solr.RecoveryStrategy.Builder
   [junit4]   2> 1343285 INFO  (qtp2118624543-11557) [n:127.0.0.1:50741_solr c:authCollection s:shard1 r:core_node3 x:authCollection_shard1_replica_n1] o.a.s.c.SolrCore [[authCollection_shard1_replica_n1] ] Opening new SolrCore at [/export/home/jenkins/workspace/Lucene-Solr-7.x-Solaris/solr/build/solr-core/test/J1/temp/solr.security.BasicAuthIntegrationTest_259BA6F5F68887BB-001/tempDir-001/node1/authCollection_shard1_replica_n1], dataDir=[/export/home/jenkins/workspace/Lucene-Solr-7.x-Solaris/solr/build/solr-core/test/J1/temp/solr.security.BasicAuthIntegrationTest_259BA6F5F68887BB-001/tempDir-001/node1/./authCollection_shard1_replica_n1/data/]
   [junit4]   2> 1343302 INFO  (qtp1177329877-11597) [n:127.0.0.1:58708_solr c:authCollection s:shard2 r:core_node5 x:authCollection_shard2_replica_n2] o.a.s.s.IndexSchema Loaded schema minimal/1.1 with uniqueid field id
   [junit4]   2> 1343302 INFO  (qtp1177329877-11597) [n:127.0.0.1:58708_solr c:authCollection s:shard2 r:core_node5 x:authCollection_shard2_replica_n2] o.a.s.c.CoreContainer Creating SolrCore 'authCollection_shard2_replica_n2' using configuration from collection authCollection, trusted=true
   [junit4]   2> 1343303 INFO  (qtp1177329877-11597) [n:127.0.0.1:58708_solr c:authCollection s:shard2 r:core_node5 x:authCollection_shard2_replica_n2] o.a.s.m.r.SolrJmxReporter JMX monitoring for 'solr_58708.solr.core.authCollection.shard2.replica_n2' (registry 'solr.core.authCollection.shard2.replica_n2') enabled at server: com.sun.jmx.mbeanserver.JmxMBeanServer@3be3b6c1
   [junit4]   2> 1343303 INFO  (qtp1177329877-11597) [n:127.0.0.1:58708_solr c:authCollection s:shard2 r:core_node5 x:authCollection_shard2_replica_n2] o.a.s.c.SolrCore solr.RecoveryStrategy.Builder
   [junit4]   2> 1343303 INFO  (qtp1177329877-11597) [n:127.0.0.1:58708_solr c:authCollection s:shard2 r:core_node5 x:authCollection_shard2_replica_n2] o.a.s.c.SolrCore [[authCollection_shard2_replica_n2] ] Opening new SolrCore at [/export/home/jenkins/workspace/Lucene-Solr-7.x-Solaris/solr/build/solr-core/test/J1/temp/solr.security.BasicAuthIntegrationTest_259BA6F5F68887BB-001/tempDir-001/node3/authCollection_shard2_replica_n2], dataDir=[/export/home/jenkins/workspace/Lucene-Solr-7.x-Solaris/solr/build/solr-core/test/J1/temp/solr.security.BasicAuthIntegrationTest_259BA6F5F68887BB-001/tempDir-001/node3/./authCollection_shard2_replica_n2/data/]
   [junit4]   2> 1343356 INFO  (qtp1238297355-11566) [n:127.0.0.1:48640_solr c:authCollection s:shard3 r:core_node6 x:authCollection_shard3_replica_n4] o.a.s.u.UpdateHandler Using UpdateLog implementation: org.apache.solr.update.UpdateLog
   [junit4]   2> 1343356 INFO  (qtp1238297355-11566) [n:127.0.0.1:48640_solr c:authCollection s:shard3 r:core_node6 x:authCollection_shard3_replica_n4] o.a.s.u.UpdateLog Initializing UpdateLog: dataDir=null defaultSyncLevel=FLUSH numRecordsToKeep=100 maxNumLogsToKeep=10 numVersionBuckets=65536
   [junit4]   2> 1343357 INFO  (qtp1238297355-11566) [n:127.0.0.1:48640_solr c:authCollection s:shard3 r:core_node6 x:authCollection_shard3_replica_n4] o.a.s.u.CommitTracker Hard AutoCommit: disabled
   [junit4]   2> 1343357 INFO  (qtp1238297355-11566) [n:127.0.0.1:48640_solr c:authCollection s:shard3 r:core_node6 x:authCollection_shard3_replica_n4] o.a.s.u.CommitTracker Soft AutoCommit: disabled
   [junit4]   2> 1343358 INFO  (qtp2118624543-11557) [n:127.0.0.1:50741_solr c:authCollection s:shard1 r:core_node3 x:authCollection_shard1_replica_n1] o.a.s.u.UpdateHandler Using UpdateLog implementation: org.apache.solr.update.UpdateLog
   [junit4]   2> 1343358 INFO  (qtp2118624543-11557) [n:127.0.0.1:50741_solr c:authCollection s:shard1 r:core_node3 x:authCollection_shard1_replica_n1] o.a.s.u.UpdateLog Initializing UpdateLog: dataDir=null defaultSyncLevel=FLUSH numRecordsToKeep=100 maxNumLogsToKeep=10 numVersionBuckets=65536
   [junit4]   2> 1343359 INFO  (qtp1238297355-11566) [n:127.0.0.1:48640_solr c:authCollection s:shard3 r:core_node6 x:authCollection_shard3_replica_n4] o.a.s.s.SolrIndexSearcher Opening [Searcher@1f2f9663[authCollection_shard3_replica_n4] main]
   [junit4]   2> 1343359 INFO  (qtp2118624543-11557) [n:127.0.0.1:50741_solr c:authCollection s:shard1 r:core_node3 x:authCollection_shard1_replica_n1] o.a.s.u.CommitTracker Hard AutoCommit: disabled
   [junit4]   2> 1343359 INFO  (qtp2118624543-11557) [n:127.0.0.1:50741_solr c:authCollection s:shard1 r:core_node3 x:authCollection_shard1_replica_n1] o.a.s.u.CommitTracker Soft AutoCommit: disabled
   [junit4]   2> 1343361 INFO  (qtp1238297355-11566) [n:127.0.0.1:48640_solr c:authCollection s:shard3 r:core_node6 x:authCollection_shard3_replica_n4] o.a.s.r.ManagedResourceStorage Configured ZooKeeperStorageIO with znodeBase: /configs/conf
   [junit4]   2> 1343361 INFO  (qtp1238297355-11566) [n:127.0.0.1:48640_solr c:authCollection s:shard3 r:core_node6 x:authCollection_shard3_replica_n4] o.a.s.r.ManagedResourceStorage Loaded null at path _rest_managed.json using ZooKeeperStorageIO:path=/configs/conf
   [junit4]   2> 1343362 INFO  (qtp1238297355-11566) [n:127.0.0.1:48640_solr c:authCollection s:shard3 r:core_node6 x:authCollection_shard3_replica_n4] o.a.s.h.ReplicationHandler Commits will be reserved for 10000ms.
   [junit4]   2> 1343362 INFO  (qtp1238297355-11566) [n:127.0.0.1:48640_solr c:authCollection s:shard3 r:core_node6 x:authCollection_shard3_replica_n4] o.a.s.u.UpdateLog Could not find max version in index or recent updates, using new clock 1590721128230289408
   [junit4]   2> 1343363 INFO  (qtp2118624543-11557) [n:127.0.0.1:50741_solr c:authCollection s:shard1 r:core_node3 x:authCollection_shard1_replica_n1] o.a.s.s.SolrIndexSearcher Opening [Searcher@6f8dc78e[authCollection_shard1_replica_n1] main]
   [junit4]   2> 1343365 INFO  (searcherExecutor-4771-thread-1-processing-n:127.0.0.1:48640_solr x:authCollection_shard3_replica_n4 s:shard3 c:authCollection r:core_node6) [n:127.0.0.1:48640_solr c:authCollection s:shard3 r:core_node6 x:authCollection_shard3_replica_n4] o.a.s.c.SolrCore [authCollection_shard3_replica_n4] Registered new searcher Searcher@1f2f9663[authCollection_shard3_replica_n4] main{ExitableDirectoryReader(UninvertingDirectoryReader())}
   [junit4]   2> 1343365 INFO  (qtp2118624543-11557) [n:127.0.0.1:50741_solr c:authCollection s:shard1 r:core_node3 x:authCollection_shard1_replica_n1] o.a.s.r.ManagedResourceStorage Configured ZooKeeperStorageIO with znodeBase: /configs/conf
   [junit4]   2> 1343365 INFO  (qtp2118624543-11557) [n:127.0.0.1:50741_solr c:authCollection s:shard1 r:core_node3 x:authCollection_shard1_replica_n1] o.a.s.r.ManagedResourceStorage Loaded null at path _rest_managed.json using ZooKeeperStorageIO:path=/configs/conf
   [junit4]   2> 1343366 INFO  (qtp2118624543-11557) [n:127.0.0.1:50741_solr c:authCollection s:shard1 r:core_node3 x:authCollection_shard1_replica_n1] o.a.s.h.ReplicationHandler Commits will be reserved for 10000ms.
   [junit4]   2> 1343367 INFO  (searcherExecutor-4772-thread-1-processing-n:127.0.0.1:50741_solr x:authCollection_shard1_replica_n1 s:shard1 c:authCollection r:core_node3) [n:127.0.0.1:50741_solr c:authCollection s:shard1 r:core_node3 x:authCollection_shard1_replica_n1] o.a.s.c.SolrCore [authCollection_shard1_replica_n1] Registered new searcher Searcher@6f8dc78e[authCollection_shard1_replica_n1] main{ExitableDirectoryReader(UninvertingDirectoryReader())}
   [junit4]   2> 1343369 INFO  (qtp2118624543-11557) [n:127.0.0.1:50741_solr c:authCollection s:shard1 r:core_node3 x:authCollection_shard1_replica_n1] o.a.s.u.UpdateLog Could not find max version in index or recent updates, using new clock 1590721128237629440
   [junit4]   2> 1343375 INFO  (qtp1238297355-11566) [n:127.0.0.1:48640_solr c:authCollection s:shard3 r:core_node6 x:authCollection_shard3_replica_n4] o.a.s.c.ShardLeaderElectionContext Enough replicas found to continue.
   [junit4]   2> 1343375 INFO  (qtp1238297355-11566) [n:127.0.0.1:48640_solr c:authCollection s:shard3 r:core_node6 x:authCollection_shard3_replica_n4] o.a.s.c.ShardLeaderElectionContext I may be the new leader - try and sync
   [junit4]   2> 1343375 INFO  (qtp1238297355-11566) [n:127.0.0.1:48640_solr c:authCollection s:shard3 r:core_node6 x:authCollection_shard3_replica_n4] o.a.s.c.SyncStrategy Sync replicas to http://127.0.0.1:48640/solr/authCollection_shard3_replica_n4/
   [junit4]   2> 1343376 INFO  (qtp1238297355-11566) [n:127.0.0.1:48640_solr c:authCollection s:shard3 r:core_node6 x:authCollection_shard3_replica_n4] o.a.s.c.SyncStrategy Sync Success - now sync replicas to me
   [junit4]   2> 1343376 INFO  (qtp1238297355-11566) [n:127.0.0.1:48640_solr c:authCollection s:shard3 r:core_node6 x:authCollection_shard3_replica_n4] o.a.s.c.SyncStrategy http://127.0.0.1:48640/solr/authCollection_shard3_replica_n4/ has no replicas
   [junit4]   2> 1343376 INFO  (qtp1238297355-11566) [n:127.0.0.1:48640_solr c:authCollection s:shard3 r:core_node6 x:authCollection_shard3_replica_n4] o.a.s.c.ShardLeaderElectionContext Found all replicas participating in election, clear LIR
   [junit4]   2> 1343379 INFO  (qtp1177329877-11597) [n:127.0.0.1:58708_solr c:authCollection s:shard2 r:core_node5 x:authCollection_shard2_replica_n2] o.a.s.u.UpdateHandler Using UpdateLog implementation: org.apache.solr.update.UpdateLog
   [junit4]   2> 1343379 INFO  (qtp1177329877-11597) [n:127.0.0.1:58708_solr c:authCollection s:shard2 r:core_node5 x:authCollection_shard2_replica_n2] o.a.s.u.UpdateLog Initializing UpdateLog: dataDir=null defaultSyncLevel=FLUSH numRecordsToKeep=100 maxNumLogsToKeep=10 numVersionBuckets=65536
   [junit4]   2> 1343380 INFO  (qtp1238297355-11566) [n:127.0.0.1:48640_solr c:authCollection s:shard3 r:core_node6 x:authCollection_shard3_replica_n4] o.a.s.c.ShardLeaderElectionContext I am the new leader: http://127.0.0.1:48640/solr/authCollection_shard3_replica_n4/ shard3
   [junit4]   2> 1343381 INFO  (qtp1177329877-11597) [n:127.0.0.1:58708_solr c:authCollection s:shard2 r:core_node5 x:authCollection_shard2_replica_n2] o.a.s.u.CommitTracker Hard AutoCommit: disabled
   [junit4]   2> 1343381 INFO  (qtp1177329877-11597) [n:127.0.0.1:58708_solr c:authCollection s:shard2 r:core_node5 x:authCollection_shard2_replica_n2] o.a.s.u.CommitTracker Soft AutoCommit: disabled
   [junit4]   2> 1343382 INFO  (qtp1177329877-11597) [n:127.0.0.1:58708_solr c:authCollection s:shard2 r:core_node5 x:authCollection_shard2_replica_n2] o.a.s.s.SolrIndexSearcher Opening [Searcher@73fc2624[authCollection_shard2_replica_n2] main]
   [junit4]   2> 1343385 INFO  (qtp1177329877-11597) [n:127.0.0.1:58708_solr c:authCollection s:shard2 r:core_node5 x:authCollection_shard2_replica_n2] o.a.s.r.ManagedResourceStorage Configured ZooKeeperStorageIO with znodeBase: /configs/conf
   [junit4]   2> 1343386 INFO  (qtp1177329877-11597) [n:127.0.0.1:58708_solr c:authCollection s:shard2 r:core_node5 x:authCollection_shard2_replica_n2] o.a.s.r.ManagedResourceStorage Loaded null at path _rest_managed.json using ZooKeeperStorageIO:path=/configs/conf
   [junit4]   2> 1343387 INFO  (qtp2118624543-11557) [n:127.0.0.1:50741_solr c:authCollection s:shard1 r:core_node3 x:authCollection_shard1_replica_n1] o.a.s.c.ShardLeaderElectionContext Enough replicas found to continue.
   [junit4]   2> 1343387 INFO  (qtp1177329877-11597) [n:127.0.0.1:58708_solr c:authCollection s:shard2 r:core_node5 x:authCollection_shard2_replica_n2] o.a.s.h.ReplicationHandler Commits will be reserved for 10000ms.
   [junit4]   2> 1343387 INFO  (qtp2118624543-11557) [n:127.0.0.1:50741_solr c:authCollection s:shard1 r:core_node3 x:authCollection_shard1_replica_n1] o.a.s.c.ShardLeaderElectionContext I may be the new leader - try and sync
   [junit4]   2> 1343387 INFO  (qtp2118624543-11557) [n:127.0.0.1:50741_solr c:authCollection s:shard1 r:core_node3 x:authCollection_shard1_replica_n1] o.a.s.c.SyncStrategy Sync replicas to http://127.0.0.1:50741/solr/authCollection_shard1_replica_n1/
   [junit4]   2> 1343388 INFO  (qtp2118624543-11557) [n:127.0.0.1:50741_solr c:authCollection s:shard1 r:core_node3 x:authCollection_shard1_replica_n1] o.a.s.c.SyncStrategy Sync Success - now sync replicas to me
   [junit4]   2> 1343388 INFO  (qtp2118624543-11557) [n:127.0.0.1:50741_solr c:authCollection s:shard1 r:core_node3 x:authCollection_shard1_replica_n1] o.a.s.c.SyncStrategy http://127.0.0.1:50741/solr/authCollection_shard1_replica_n1/ has no replicas
   [junit4]   2> 1343388 INFO  (qtp2118624543-11557) [n:127.0.0.1:50741_solr c:authCollection s:shard1 r:core_node3 x:authCollection_shard1_replica_n1] o.a.s.c.ShardLeaderElectionContext Found all replicas participating in election, clear LIR
   [junit4]   2> 1343388 INFO  (qtp1177329877-11597) [n:127.0.0.1:58708_solr c:authCollection s:shard2 r:core_node5 x:authCollection_shard2_replica_n2] o.a.s.u.UpdateLog Could not find max version in index or recent updates, using new clock 1590721128257552384
   [junit4]   2> 1343389 INFO  (searcherExecutor-4773-thread-1-processing-n:127.0.0.1:58708_solr x:authCollection_shard2_replica_n2 s:shard2 c:authCollection r:core_node5) [n:127.0.0.1:58708_solr c:authCollection s:shard2 r:core_node5 x:authCollection_shard2_replica_n2] o.a.s.c.SolrCore [authCollection_shard2_replica_n2] Registered new searcher Searcher@73fc2624[authCollection_shard2_replica_n2] main{ExitableDirectoryReader(UninvertingDirectoryReader())}
   [junit4]   2> 1343398 INFO  (qtp1177329877-11597) [n:127.0.0.1:58708_solr c:authCollection s:shard2 r:core_node5 x:authCollection_shard2_replica_n2] o.a.s.c.ShardLeaderElectionContext Enough replicas found to continue.
   [junit4]   2> 1343398 INFO  (qtp1177329877-11597) [n:127.0.0.1:58708_solr c:authCollection s:shard2 r:core_node5 x:authCollection_shard2_replica_n2] o.a.s.c.ShardLeaderElectionContext I may be the new leader - try and sync
   [junit4]   2> 1343398 INFO  (qtp1177329877-11597) [n:127.0.0.1:58708_solr c:authCollection s:shard2 r:core_node5 x:authCollection_shard2_replica_n2] o.a.s.c.SyncStrategy Sync replicas to http://127.0.0.1:58708/solr/authCollection_shard2_replica_n2/
   [junit4]   2> 1343398 INFO  (qtp1177329877-11597) [n:127.0.0.1:58708_solr c:authCollection s:shard2 r:core_node5 x:authCollection_shard2_replica_n2] o.a.s.c.SyncStrategy Sync Success - now sync replicas to me
   [junit4]   2> 1343398 INFO  (qtp1177329877-11597) [n:127.0.0.1:58708_solr c:authCollection s:shard2 r:core_node5 x:authCollection_shard2_replica_n2] o.a.s.c.SyncStrategy http://127.0.0.1:58708/solr/authCollection_shard2_replica_n2/ has no replicas
   [junit4]   2> 1343398 INFO  (qtp1177329877-11597) [n:127.0.0.1:58708_solr c:authCollection s:shard2 r:core_node5 x:authCollection_shard2_replica_n2] o.a.s.c.ShardLeaderElectionContext Found all replicas participating in election, clear LIR
   [junit4]   2> 1343400 INFO  (qtp2118624543-11557) [n:127.0.0.1:50741_solr c:authCollection s:shard1 r:core_node3 x:authCollection_shard1_replica_n1] o.a.s.c.ShardLeaderElectionContext I am the new leader: http://127.0.0.1:50741/solr/authCollection_shard1_replica_n1/ shard1
   [junit4]   2> 1343406 INFO  (qtp1177329877-11597) [n:127.0.0.1:58708_solr c:authCollection s:shard2 r:core_node5 x:authCollection_shard2_replica_n2] o.a.s.c.ShardLeaderElectionContext I am the new leader: http://127.0.0.1:58708/solr/authCollection_shard2_replica_n2/ shard2
   [junit4]   2> 1343510 INFO  (zkCallback-2231-thread-3-processing-n:127.0.0.1:58708_solr) [n:127.0.0.1:58708_solr    ] o.a.s.c.c.ZkStateReader A cluster state change: [WatchedEvent state:SyncConnected type:NodeDataChanged path:/collections/authCollection/state.json] for collection [authCollection] has occurred - updating... (live nodes size: [3])
   [junit4]   2> 1343510 INFO  (zkCallback-2241-thread-2-processing-n:127.0.0.1:48640_solr) [n:127.0.0.1:48640_solr    ] o.a.s.c.c.ZkStateReader A cluster state change: [WatchedEvent state:SyncConnected type:NodeDataChanged path:/collections/authCollection/state.json] for collection [authCollection] has occurred - updating... (live nodes size: [3])
   [junit4]   2> 1343511 INFO  (zkCallback-2243-thread-2-processing-n:127.0.0.1:50741_solr) [n:127.0.0.1:50741_solr    ] o.a.s.c.c.ZkStateReader A cluster state change: [WatchedEvent state:SyncConnected type:NodeDataChanged path:/collections/authCollection/state.json] for collection [authCollection] has occurred - updating... (live nodes size: [3])
   [junit4]   2> 1343511 INFO  (zkCallback-2243-thread-1-processing-n:127.0.0.1:50741_solr) [n:127.0.0.1:50741_solr    ] o.a.s.c.c.ZkStateReader A cluster state change: [WatchedEvent state:SyncConnected type:NodeDataChanged path:/collections/authCollection/state.json] for collection [authCollection] has occurred - updating... (live nodes size: [3])
   [junit4]   2> 1343511 INFO  (zkCallback-2241-thread-1-processing-n:127.0.0.1:48640_solr) [n:127.0.0.1:48640_solr    ] o.a.s.c.c.ZkStateReader A cluster state change: [WatchedEvent state:SyncConnected type:NodeDataChanged path:/collections/authCollection/state.json] for collection [authCollection] has occurred - updating... (live nodes size: [3])
   [junit4]   2> 1343512 INFO  (zkCallback-2231-thread-1-processing-n:127.0.0.1:58708_solr) [n:127.0.0.1:58708_solr    ] o.a.s.c.c.ZkStateReader A cluster state change: [WatchedEvent state:SyncConnected type:NodeDataChanged path:/collections/authCollection/state.json] for collection [authCollection] has occurred - updating... (live nodes size: [3])
   [junit4]   2> 1343518 INFO  (qtp1177329877-11597) [n:127.0.0.1:58708_solr c:authCollection s:shard2 r:core_node5 x:authCollection_shard2_replica_n2] o.a.s.c.ZkController I am the leader, no recovery necessary
   [junit4]   2> 1343524 INFO  (qtp1177329877-11597) [n:127.0.0.1:58708_solr c:authCollection s:shard2 r:core_node5 x:authCollection_shard2_replica_n2] o.a.s.s.HttpSolrCall [admin] webapp=null path=/admin/cores params={qt=/admin/cores&coreNodeName=core_node5&collection.configName=conf&newCollection=true&name=authCollection_shard2_replica_n2&action=CREATE&numShards=3&collection=authCollection&shard=shard2&wt=javabin&version=2&replicaType=NRT} status=0 QTime=1309
   [junit4]   2> 1343533 INFO  (qtp1238297355-11566) [n:127.0.0.1:48640_solr c:authCollection s:shard3 r:core_node6 x:authCollection_shard3_replica_n4] o.a.s.c.ZkController I am the leader, no recovery necessary
   [junit4]   2> 1343537 INFO  (qtp1238297355-11566) [n:127.0.0.1:48640_solr c:authCollection s:shard3 r:core_node6 x:authCollection_shard3_replica_n4] o.a.s.s.HttpSolrCall [admin] webapp=null path=/admin/cores params={qt=/admin/cores&coreNodeName=core_node6&collection.configName=conf&newCollection=true&name=authCollection_shard3_replica_n4&action=CREATE&numShards=3&collection=authCollection&shard=shard3&wt=javabin&version=2&replicaType=NRT} status=0 QTime=1322
   [junit4]   2> 1343561 INFO  (qtp2118624543-11557) [n:127.0.0.1:50741_solr c:authCollection s:shard1 r:core_node3 x:authCollection_shard1_replica_n1] o.a.s.c.ZkController I am the leader, no recovery necessary
   [junit4]   2> 1343566 INFO  (qtp2118624543-11557) [n:127.0.0.1:50741_solr c:authCollection s:shard1 r:core_node3 x:authCollection_shard1_replica_n1] o.a.s.s.HttpSolrCall [admin] webapp=null path=/admin/cores params={qt=/admin/cores&coreNodeName=core_node3&collection.configName=conf&newCollection=true&name=authCollection_shard1_replica_n1&action=CREATE&numShards=3&collection=authCollection&shard=shard1&wt=javabin&version=2&replicaType=NRT} status=0 QTime=1350
   [junit4]   2> 1343574 INFO  (qtp1177329877-11585) [n:127.0.0.1:58708_solr    ] o.a.s.h.a.CollectionsHandler Wait for new collection to be active for at most 30 seconds. Check all shard replicas
   [junit4]   2> 1343670 INFO  (zkCallback-2241-thread-2-processing-n:127.0.0.1:48640_solr) [n:127.0.0.1:48640_solr    ] o.a.s.c.c.ZkStateReader A cluster state change: [WatchedEvent state:SyncConnected type:NodeDataChanged path:/collections/authCollection/state.json] for collection [authCollection] has occurred - updating... (live nodes size: [3])
   [junit4]   2> 1343672 INFO  (zkCallback-2231-thread-3-processing-n:127.0.0.1:58708_solr) [n:127.0.0.1:58708_solr    ] o.a.s.c.c.ZkStateReader A cluster state change: [WatchedEvent state:SyncConnected type:NodeDataChanged path:/collections/authCollection/state.json] for collection [authCollection] has occurred - updating... (live nodes size: [3])
   [junit4]   2> 1343672 INFO  (zkCallback-2231-thread-1-processing-n:127.0.0.1:58708_solr) [n:127.0.0.1:58708_solr    ] o.a.s.c.c.ZkStateReader A cluster state change: [WatchedEvent state:SyncConnected type:NodeDataChanged path:/collections/authCollection/state.json] for collection [authCollection] has occurred - updating... (live nodes size: [3])
   [junit4]   2> 1343675 INFO  (zkCallback-2241-thread-1-processing-n:127.0.0.1:48640_solr) [n:127.0.0.1:48640_solr    ] o.a.s.c.c.ZkStateReader A cluster state change: [WatchedEvent state:SyncConnected type:NodeDataChanged path:/collections/authCollection/state.json] for collection [authCollection] has occurred - updating... (live nodes size: [3])
   [junit4]   2> 1343676 INFO  (zkCallback-2243-thread-1-processing-n:127.0.0.1:50741_solr) [n:127.0.0.1:50741_solr    ] o.a.s.c.c.ZkStateReader A cluster state change: [WatchedEvent state:SyncConnected type:NodeDataChanged path:/collections/authCollection/state.json] for collection [authCollection] has occurred - updating... (live nodes size: [3])
   [junit4]   2> 1343676 INFO  (zkCallback-2243-thread-2-processing-n:127.0.0.1:50741_solr) [n:127.0.0.1:50741_solr    ] o.a.s.c.c.ZkStateReader A cluster state change: [WatchedEvent state:SyncConnected type:NodeDataChanged path:/collections/authCollection/state.json] for collection [authCollection] has occurred - updating... (live nodes size: [3])
   [junit4]   2> 1343853 INFO  (OverseerCollectionConfigSetProcessor-99420070343475205-127.0.0.1:58708_solr-n_0000000000) [n:127.0.0.1:58708_solr    ] o.a.s.c.OverseerTaskQueue Response ZK path: /overseer/collection-queue-work/qnr-0000000000 doesn't exist.  Requestor may have disconnected from ZooKeeper
   [junit4]   2> 1344579 INFO  (qtp1177329877-11585) [n:127.0.0.1:58708_solr    ] o.a.s.s.HttpSolrCall [admin] webapp=null path=/admin/collections params={replicationFactor=1&collection.configName=conf&name=authCollection&nrtReplicas=1&action=CREATE&numShards=3&wt=javabin&version=2} status=0 QTime=2735
   [junit4]   2> 1344645 INFO  (TEST-BasicAuthIntegrationTest.testBasicAuth-seed#[259BA6F5F68887BB]) [    ] o.a.s.SolrTestCaseJ4 ###Starting testBasicAuth
   [junit4]   2> 1344658 INFO  (qtp2118624543-11564) [n:127.0.0.1:50741_solr    ] o.a.s.s.HttpSolrCall [admin] webapp=null path=/admin/authentication params={} status=0 QTime=0
   [junit4]   2> 1344661 INFO  (qtp2118624543-11558) [n:127.0.0.1:50741_solr    ] o.a.s.s.HttpSolrCall [admin] webapp=null path=/admin/authentication params={} status=0 QTime=0
   [junit4]   2> 1344661 INFO  (zkCallback-2241-thread-1-processing-n:127.0.0.1:48640_solr) [n:127.0.0.1:48640_solr    ] o.a.s.c.CoreContainer Security node changed, reloading security.json
   [junit4]   2> 1344661 INFO  (zkCallback-2241-thread-1-processing-n:127.0.0.1:48640_solr) [n:127.0.0.1:48640_solr    ] o.a.s.c.CoreContainer Initializing authorization plugin: solr.RuleBasedAuthorizationPlugin
   [junit4]   2> 1344662 INFO  (zkCallback-2231-thread-1-processing-n:127.0.0.1:58708_solr) [n:127.0.0.1:58708_solr    ] o.a.s.c.CoreContainer Security node changed, reloading security.json
   [junit4]   2> 1344662 INFO  (zkCallback-2231-thread-1-processing-n:127.0.0.1:58708_solr) [n:127.0.0.1:58708_solr    ] o.a.s.c.CoreContainer Initializing authorization plugin: solr.RuleBasedAuthorizationPlugin
   [junit4]   2> 1344663 INFO  (zkCallback-2243-thread-1-processing-n:127.0.0.1:50741_solr) [n:127.0.0.1:50741_solr    ] o.a.s.c.CoreContainer Security node changed, reloading security.json
   [junit4]   2> 1344663 INFO  (zkCallback-2243-thread-1-processing-n:127.0.0.1:50741_solr) [n:127.0.0.1:50741_solr    ] o.a.s.c.CoreContainer Initializing authorization plugin: solr.RuleBasedAuthorizationPlugin
   [junit4]   2> 1344731 INFO  (qtp2118624543-11564) [n:127.0.0.1:50741_solr    ] o.a.s.s.HttpSolrCall [admin] webapp=null path=/admin/authentication params={} status=0 QTime=0
   [junit4]   2> 1344735 INFO  (TEST-BasicAuthIntegrationTest.testBasicAuth-seed#[259BA6F5F68887BB]) [    ] o.e.j.s.AbstractConnector Stopped ServerConnector@5b00d968{HTTP/1.1,[http/1.1]}{127.0.0.1:0}
   [junit4]   2> 1344736 INFO  (TEST-BasicAuthIntegrationTest.testBasicAuth-seed#[259BA6F5F68887BB]) [    ] o.a.s.c.CoreContainer Shutting down CoreContainer instance=1824305026
   [junit4]   2> 1344737 INFO  (TEST-BasicAuthIntegrationTest.testBasicAuth-seed#[259BA6F5F68887BB]) [    ] o.a.s.m.SolrMetricManager Closing metric reporters for registry=solr.node, tag=null
   [junit4]   2> 1344737 INFO  (TEST-BasicAuthIntegrationTest.testBasicAuth-seed#[259BA6F5F68887BB]) [    ] o.a.s.m.r.SolrJmxReporter Closing reporter [org.apache.solr.metrics.reporters.SolrJmxReporter@7d54bc31: rootName = solr_50741, domain = solr.node, service url = null, agent id = null] for registry solr.node / com.codahale.metrics.MetricRegistry@7a1108e
   [junit4]   2> 1344746 INFO  (TEST-BasicAuthIntegrationTest.testBasicAuth-seed#[259BA6F5F68887BB]) [    ] o.a.s.m.SolrMetricManager Closing metric reporters for registry=solr.jvm, tag=null
   [junit4]   2> 1344746 INFO  (TEST-BasicAuthIntegrationTest.testBasicAuth-seed#[259BA6F5F68887BB]) [    ] o.a.s.m.r.SolrJmxReporter Closing reporter [org.apache.solr.metrics.reporters.SolrJmxReporter@588cbbdd: rootName = solr_50741, domain = solr.jvm, service url = null, agent id = null] for registry solr.jvm / com.codahale.metrics.MetricRegistry@6ad0f513
   [junit4]   2> 1344749 INFO  (zkCallback-2243-thread-1-processing-n:127.0.0.1:50741_solr) [n:127.0.0.1:50741_solr    ] o.a.s.c.CoreContainer Initializing authentication plugin: solr.BasicAuthPlugin
   [junit4]   2> 1344749 INFO  (zkCallback-2231-thread-1-processing-n:127.0.0.1:58708_solr) [n:127.0.0.1:58708_solr    ] o.a.s.c.CoreContainer Initializing authentication plugin: solr.BasicAuthPlugin
   [junit4]   2> 1344750 INFO  (zkCallback-2241-thread-1-processing-n:127.0.0.1:48640_solr) [n:127.0.0.1:48640_solr    ] o.a.s.c.CoreContainer Initializing authentication plugin: solr.BasicAuthPlugin
   [junit4]   2> 1344752 INFO  (TEST-BasicAuthIntegrationTest.testBasicAuth-seed#[259BA6F5F68887BB]) [    ] o.a.s.m.SolrMetricManager Closing metric reporters for registry=solr.jetty, tag=null
   [junit4]   2> 1344752 INFO  (TEST-BasicAuthIntegrationTest.testBasicAuth-seed#[259BA6F5F68887BB]) [    ] o.a.s.m.r.SolrJmxReporter Closing reporter [org.apache.solr.metrics.reporters.SolrJmxReporter@5254c838: rootName = solr_50741, domain = solr.jetty, service url = null, agent id = null] for registry solr.jetty / com.codahale.metrics.MetricRegistry@357f3fa
   [junit4]   2> 1344755 INFO  (TEST-BasicAuthIntegrationTest.testBasicAuth-seed#[259BA6F5F68887BB]) [    ] o.a.s.c.ZkController Remove node as live in ZooKeeper:/live_nodes/127.0.0.1:50741_solr
   [junit4]   2> 1344758 INFO  (zkCallback-2255-thread-1) [    ] o.a.s.c.c.ZkStateReader Updated live nodes from ZooKeeper... (3) -> (2)
   [junit4]   2> 1344758 INFO  (TEST-BasicAuthIntegrationTest.testBasicAuth-seed#[259BA6F5F68887BB]) [    ] o.a.s.m.SolrMetricManager Closing metric reporters for registry=solr.cluster, tag=null
   [junit4]   2> 1344762 INFO  (coreCloseExecutor-4786-thread-1) [n:127.0.0.1:50741_solr c:authCollection s:shard1 r:core_node3 x:authCollection_shard1_replica_n1] o.a.s.c.SolrCore [authCollection_shard1_replica_n1]  CLOSING SolrCore org.apache.solr.core.SolrCore@702f7339
   [junit4]   2> 1344762 INFO  (coreCloseExecutor-4786-thread-1) [n:127.0.0.1:50741_solr c:authCollection s:shard1 r:core_node3 x:authCollection_shard1_replica_n1] o.a.s.m.SolrMetricManager Closing metric reporters for registry=solr.core.authCollection.shard1.replica_n1, tag=1882157881
   [junit4]   2> 1344762 INFO  (coreCloseExecutor-4786-thread-1) [n:127.0.0.1:50741_solr c:authCollection s:shard1 r:core_node3 x:authCollection_shard1_replica_n1] o.a.s.m.r.SolrJmxReporter Closing reporter [org.apache.solr.metrics.reporters.SolrJmxReporter@28517aca: rootName = solr_50741, domain = solr.core.authCollection.shard1.replica_n1, service url = null, agent id = null] for registry solr.core.authCollection.shard1.replica_n1 / com.codahale.metrics.MetricRegistry@54e7ab9d
   [junit4]   2> 1344785 INFO  (coreCloseExecutor-4786-thread-1) [n:127.0.0.1:50741_solr c:authCollection s:shard1 r:core_node3 x:authCollection_shard1_replica_n1] o.a.s.m.SolrMetricManager Closing metric reporters for registry=solr.collection.authCollection.shard1.leader, tag=1882157881
   [junit4]   2> 1344790 INFO  (zkCallback-2243-thread-1-processing-n:127.0.0.1:50741_solr) [n:127.0.0.1:50741_solr    ] o.a.s.c.CoreContainer PKIAuthenticationPlugin is managing internode requests
   [junit4]   2> 1344790 INFO  (zkCallback-2243-thread-2-processing-n:127.0.0.1:50741_solr) [n:127.0.0.1:50741_solr    ] o.a.s.c.c.ZkStateReader Updated live nodes from ZooKeeper... (3) -> (2)
   [junit4]   2> 1344790 INFO  (zkCallback-2241-thread-1-processing-n:127.0.0.1:48640_solr) [n:127.0.0.1:48640_solr    ] o.a.s.c.CoreContainer PKIAuthenticationPlugin is managing internode requests
   [junit4]   2> 1344791 INFO  (zkCallback-2241-thread-2-processing-n:127.0.0.1:48640_solr) [n:127.0.0.1:48640_solr    ] o.a.s.c.c.ZkStateReader Updated live nodes from ZooKeeper... (3) -> (2)
   [junit4]   2> 1344791 INFO  (zkCallback-2231-thread-1-processing-n:127.0.0.1:58708_solr) [n:127.0.0.1:58708_solr    ] o.a.s.c.CoreContainer PKIAuthenticationPlugin is managing internode requests
   [junit4]   2> 1344792 INFO  (TEST-BasicAuthIntegrationTest.testBasicAuth-seed#[259BA6F5F68887BB]) [    ] o.e.j.s.h.ContextHandler Stopped o.e.j.s.ServletContextHandler@391a3ac8{/solr,null,UNAVAILABLE}
   [junit4]   2> 1344792 INFO  (zkCallback-2231-thread-3-processing-n:127.0.0.1:58708_solr) [n:127.0.0.1:58708_solr    ] o.a.s.c.c.ZkStateReader Updated live nodes from ZooKeeper... (3) -> (2)
   [junit4]   2> 1344792 INFO  (TEST-BasicAuthIntegrationTest.testBasicAuth-seed#[259BA6F5F68887BB]) [    ] o.e.j.s.session Stopped scavenging
   [junit4]   2> 1344794 INFO  (TEST-BasicAuthIntegrationTest.testBasicAuth-seed#[259BA6F5F68887BB]) [    ] o.e.j.s.Server jetty-9.4.8.v20171121, build timestamp: 2017-11-22T08:27:37+11:00, git hash: 82b8fb23f757335bb3329d540ce37a2a2615f0a8
   [junit4]   2> 1344795 INFO  (TEST-BasicAuthIntegrationTest.testBasicAuth-seed#[259BA6F5F68887BB]) [    ] o.e.j.s.session DefaultSessionIdManager workerName=node0
   [junit4]   2> 1344795 INFO  (TEST-BasicAuthIntegrationTest.testBasicAuth-seed#[259BA6F5F68887BB]) [    ] o.e.j.s.session No SessionScavenger set, using defaults
   [junit4]   2> 1344795 INFO  (TEST-BasicAuthIntegrationTest.testBasicAuth-seed#[259BA6F5F68887BB]) [    ] o.e.j.s.session Scavenging every 600000ms
   [junit4]   2> 1344795 INFO  (TEST-BasicAuthIntegrationTest.testBasicAuth-seed#[259BA6F5F68887BB]) [    ] o.e.j.s.h.ContextHandler Started o.e.j.s.ServletContextHandler@6648bdd6{/solr,null,AVAILABLE}
   [junit4]   2> 1344795 INFO  (TEST-BasicAuthIntegrationTest.testBasicAuth-seed#[259BA6F5F68887BB]) [    ] o.e.j.s.AbstractConnector Started ServerConnector@446a6502{HTTP/1.1,[http/1.1]}{127.0.0.1:45981}
   [junit4]   2> 1344795 INFO  (TEST-BasicAuthIntegrationTest.testBasicAuth-seed#[259BA6F5F68887BB]) [    ] o.e.j.s.Server Started @1349481ms
   [junit4]   2> 1344795 INFO  (TEST-BasicAuthIntegrationTest.testBasicAuth-seed#[259BA6F5F68887BB]) [    ] o.a.s.c.s.e.JettySolrRunner Jetty properties: {hostContext=/solr, hostPort=45981}
   [junit4]   2> 1344796 ERROR (TEST-BasicAuthIntegrationTest.testBasicAuth-seed#[259BA6F5F68887BB]) [    ] o.a.s.u.StartupLoggingUtils Missing Java Option solr.log.dir. Logging may be missing or incomplete.
   [junit4]   2> 1344796 INFO  (TEST-BasicAuthIntegrationTest.testBasicAuth-seed#[259BA6F5F68887BB]) [    ] o.a.s.s.SolrDispatchFilter  ___      _       Welcome to Apache Solr™ version 7.3.0
   [junit4]   2> 1344796 INFO  (TEST-BasicAuthIntegrationTest.testBasicAuth-seed#[259BA6F5F68887BB]) [    ] o.a.s.s.SolrDispatchFilter / __| ___| |_ _   Starting in cloud mode on port null
   [junit4]   2> 1344796 INFO  (TEST-BasicAuthIntegrationTest.testBasicAuth-seed#[259BA6F5F68887BB]) [    ] o.a.s.s.SolrDispatchFilter \__ \/ _ \ | '_|  Install dir: null
   [junit4]   2> 1344796 INFO  (TEST-BasicAuthIntegrationTest.testBasicAuth-seed#[259BA6F5F68887BB]) [    ] o.a.s.s.SolrDispatchFilter |___/\___/_|_|    Start time: 2018-01-27T05:11:25.992Z
   [junit4]   2> 1344798 INFO  (zkConnectionManagerCallback-2258-thread-1) [    ] o.a.s.c.c.ConnectionManager zkClient has connected
   [junit4]   2> 1344799 INFO  (TEST-BasicAuthIntegrationTest.testBasicAuth-seed#[259BA6F5F68887BB]) [    ] o.a.s.s.SolrDispatchFilter solr.xml found in ZooKeeper. Loading...
   [junit4]   2> 1344815 INFO  (TEST-BasicAuthIntegrationTest.testBasicAuth-seed#[259BA6F5F68887BB]) [    ] o.a.s.c.ZkContainer Zookeeper client=127.0.0.1:58907/solr
   [junit4]   2> 1344821 INFO  (zkConnectionManagerCallback-2262-thread-1) [    ] o.a.s.c.c.ConnectionManager zkClient has connected
   [junit4]   2> 1344824 INFO  (zkConnectionManagerCallback-2264-thread-1-processing-n:127.0.0.1:45981_solr) [n:127.0.0.1:45981_solr    ] o.a.s.c.c.ConnectionManager zkClient has connected
   [junit4]   2> 1344858 INFO  (zkCallback-2241-thread-1-processing-n:127.0.0.1:48640_solr) [n:127.0.0.1:48640_solr    ] o.a.s.c.c.ZkStateReader A cluster state change: [WatchedEvent state:SyncConnected type:NodeDataChanged path:/collections/authCollection/state.json] for collection [authCollection] has occurred - updating... (live nodes size: [2])
   [junit4]   2> 1344858 INFO  (zkCallback-2241-thread-2-processing-n:127.0.0.1:48640_solr) [n:127.0.0.1:48640_solr    ] o.a.s.c.c.ZkStateReader A cluster state change: [WatchedEvent state:SyncConnected type:NodeDataChanged path:/collections/authCollection/state.json] for collection [authCollection] has occurred - updating... (live nodes size: [2])
   [junit4]   2> 1344859 INFO  (zkCallback-2231-thread-1-processing-n:127.0.0.1:58708_solr) [n:127.0.0.1:58708_solr    ] o.a.s.c.c.ZkStateReader A cluster state change: [WatchedEvent state:SyncConnected type:NodeDataChanged path:/collections/authCollection/state.json] for collection [authCollection] has occurred - updating... (live nodes size: [2])
   [junit4]   2> 1344860 INFO  (zkCallback-2231-thread-3-processing-n:127.0.0.1:58708_solr) [n:127.0.0.1:58708_solr    ] o.a.s.c.c.ZkStateReader A cluster state change: [WatchedEvent state:SyncConnected type:NodeDataChanged path:/collections/authCollection/state.json] for collection [authCollection] has occurred - updating... (live nodes size: [2])
   [junit4]   2> 1344861 INFO  (TEST-BasicAuthIntegrationTest.testBasicAuth-seed#[259BA6F5F68887BB]) [n:127.0.0.1:45981_solr    ] o.a.s.c.c.ZkStateReader Updated live nodes from ZooKeeper... (0) -> (2)
   [junit4]   2> 1344894 INFO  (TEST-BasicAuthIntegrationTest.testBasicAuth-seed#[259BA6F5F68887BB]) [n:127.0.0.1:45981_solr    ] o.a.s.c.Overseer Overseer (id=null) closing
   [junit4]   2> 1344900 INFO  (TEST-BasicAuthIntegrationTest.testBasicAuth-seed#[259BA6F5F68887BB]) [n:127.0.0.1:45981_solr    ] o.a.s.c.ZkController Register node as live in ZooKeeper:/live_nodes/127.0.0.1:45981_solr
   [junit4]   2> 1344905 INFO  (zkCallback-2255-thread-1) [    ] o.a.s.c.c.ZkStateReader Updated live nodes from ZooKeeper... (2) -> (3)
   [junit4]   2> 1344905 INFO  (zkCallback-2231-thread-1-processing-n:127.0.0.1:58708_solr) [n:127.0.0.1:58708_solr    ] o.a.s.c.c.ZkStateReader Updated live nodes from ZooKeeper... (2) -> (3)
   [junit4]   2> 1344906 INFO  (zkCallback-2241-thread-1-processing-n:127.0.0.1:48640_solr) [n:127.0.0.1:48640_solr    ] o.a.s.c.c.ZkStateReader Updated live nodes from ZooKeeper... (2) -> (3)
   [junit4]   2> 1344906 INFO  (zkCallback-2263-thread-1-processing-n:127.0.0.1:45981_solr) [n:127.0.0.1:45981_solr    ] o.a.s.c.c.ZkStateReader Updated live nodes from ZooKeeper... (2) -> (3)
   [junit4]   2> 1344973 INFO  (TEST-BasicAuthIntegrationTest.testBasicAuth-seed#[259BA6F5F68887BB]) [n:127.0.0.1:45981_solr    ] o.a.s.c.CoreContainer Initializing authorization plugin: solr.RuleBasedAuthorizationPlugin
   [junit4]   2> 1344973 INFO  (TEST-BasicAuthIntegrationTest.testBasicAuth-seed#[259BA6F5F68887BB]) [n:127.0.0.1:45981_solr    ] o.a.s.c.CoreContainer Initializing authentication plugin: solr.BasicAuthPlugin
   [junit4]   2> 1344973 INFO  (TEST-BasicAuthIntegrationTest.testBasicAuth-seed#[259BA6F5F68887BB]) [n:127.0.0.1:45981_solr    ] o.a.s.c.CoreContainer PKIAuthenticationPlugin is managing internode requests
   [junit4]   2> 1345027 INFO  (TEST-BasicAuthIntegrationTest.testBasicAuth-seed#[259BA6F5F68887BB]) [n:127.0.0.1:45981_solr    ] o.a.s.m.r.SolrJmxReporter JMX monitoring for 'solr_45981.solr.node' (registry 'solr.node') enabled at server: com.sun.jmx.mbeanserver.JmxMBeanServer@3be3b6c1
   [junit4]   2> 1345040 INFO  (TEST-BasicAuthIntegrationTest.testBasicAuth-seed#[259BA6F5F68887BB]) [n:127.0.0.1:45981_solr    ] o.a.s.m.r.SolrJmxReporter JMX monitoring for 'solr_45981.solr.jvm' (registry 'solr.jvm') enabled at server: com.sun.jmx.mbeanserver.JmxMBeanServer@3be3b6c1
   [junit4]   2> 1345041 INFO  (TEST-BasicAuthIntegrationTest.testBasicAuth-seed#[259BA6F5F68887BB]) [n:127.0.0.1:45981_solr    ] o.a.s.m.r.SolrJmxReporter JMX monitoring for 'solr_45981.solr.jetty' (registry 'solr.jetty') enabled at server: com.sun.jmx.mbeanserver.JmxMBeanServer@3be3b6c1
   [junit4]   2> 1345044 INFO  (TEST-BasicAuthIntegrationTest.testBasicAuth-seed#[259BA6F5F68887BB]) [n:127.0.0.1:45981_solr    ] o.a.s.c.CorePropertiesLocator Found 1 core definitions underneath /export/home/jenkins/workspace/Lucene-Solr-7.x-Solaris/solr/build/solr-core/test/J1/temp/solr.security.BasicAuthIntegrationTest_259BA6F5F68887BB-001/tempDir-001/node1/.
   [junit4]   2> 1345044 INFO  (TEST-BasicAuthIntegrationTest.testBasicAuth-seed#[259BA6F5F68887BB]) [n:127.0.0.1:45981_solr    ] o.a.s.c.CorePropertiesLocator Cores are: [authCollection_shard1_replica_n1]
   [junit4]   2> 1345054 INFO  (coreLoadExecutor-4793-thread-1-processing-n:127.0.0.1:45981_solr) [n:127.0.0.1:45981_solr    ] o.a.s.c.TransientSolrCoreCacheDefault Allocating transient cache for 2147483647 transient cores
   [junit4]   2> 1345074 INFO  (coreLoadExecutor-4793-thread-1-processing-n:127.0.0.1:45981_solr) [n:127.0.0.1:45981_solr    ] o.a.s.c.SolrConfig Using Lucene MatchVersion: 7.3.0
   [junit4]   2> 1345084 INFO  (coreLoadExecutor-4793-thread-1-processing-n:127.0.0.1:45981_solr) [n:127.0.0.1:45981_solr    ] o.a.s.s.IndexSchema [authCollection_shard1_replica_n1] Schema name=minimal
   [junit4]   2> 1345088 INFO  (coreLoadExecutor-4793-thread-1-processing-n:127.0.0.1:45981_solr) [n:127.0.0.1:45981_solr    ] o.a.s.s.IndexSchema Loaded schema minimal/1.1 with uniqueid field id
   [junit4]   2> 1345199 INFO  (zkCallback-2241-thread-2-processing-n:127.0.0.1:48640_solr) [n:127.0.0.1:48640_solr    ] o.a.s.c.c.ZkStateReader A cluster state change: [WatchedEvent state:SyncConnected type:NodeDataChanged path:/collections/authCollection/state.json] for collection [authCollection] has occurred - updating... (live nodes size: [3])
   [junit4]   2> 1345199 INFO  (zkCallback-2231-thread-1-processing-n:127.0.0.1:58708_solr) [n:127.0.0.1:58708_solr    ] o.a.s.c.c.ZkStateReader A cluster state change: [WatchedEvent state:SyncConnected type:NodeDataChanged path:/collections/authCollection/state.json] for collection [authCollection] has occurred - updating... (live nodes size: [3])
   [junit4]   2> 1345199 INFO  (zkCallback-2231-thread-3-processing-n:127.0.0.1:58708_solr) [n:127.0.0.1:58708_solr    ] o.a.s.c.c.ZkStateReader A cluster state change: [WatchedEvent state:SyncConnected type:NodeDataChanged path:/collections/authCollection/state.json] for collection [authCollection] has occurred - updating... (live nodes size: [3])
   [junit4]   2> 1345200 INFO  (zkCallback-2263-thread-1-processing-n:127.0.0.1:45981_solr) [n:127.0.0.1:45981_solr    ] o.a.s.c.c.ZkStateReader A cluster state change: [WatchedEvent state:SyncConnected type:NodeDataChanged path:/collections/authCollection/state.json] for collection [authCollection] has occurred - updating... (live nodes size: [3])
   [junit4]   2> 1345200 INFO  (zkCallback-2241-thread-1-processing-n:127.0.0.1:48640_solr) [n:127.0.0.1:48640_solr    ] o.a.s.c.c.ZkStateReader A cluster state change: [WatchedEvent state:SyncConnected type:NodeDataChanged path:/collections/authCollection/state.json] for collection [authCollection] has occurred - updating... (live nodes size: [3])
   [junit4]   2> 1345201 INFO  (zkCallback-2263-thread-2-processing-n:127.0.0.1:45981_solr) [n:127.0.0.1:45981_solr    ] o.a.s.c.c.ZkStateReader A cluster state change: [WatchedEvent state:SyncConnected type:NodeDataChanged path:/collections/authCollection/state.json] for collection [authCollection] has occurred - updating... (live nodes size: [3])
   [junit4]   2> 1346118 INFO  (coreLoadExecutor-4793-thread-1-processing-n:127.0.0.1:45981_solr) [n:127.0.0.1:45981_solr c:authCollection s:shard1 r:core_node3 x:authCollection_shard1_replica_n1] o.a.s.c.SolrConfig Using Lucene MatchVersion: 7.3.0
   [junit4]   2> 1346887 INFO  (coreLoadExecutor-4793-thread-1-processing-n:127.0.0.1:45981_solr) [n:127.0.0.1:45981_solr c:authCollection s:shard1 r:core_node3 x:authCollection_shard1_replica_n1] o.a.s.s.IndexSchema [authCollection_shard1_replica_n1] Schema name=minimal
   [

[...truncated too long message...]

agingTest, AlternateDirectoryTest, SuggestComponentTest, TestRemoteStreaming, TestSizeLimitedDistributedMap, TestTriggerIntegration, MBeansHandlerTest, CdcrRequestHandlerTest, DateMathParserTest, AutoScalingHandlerTest, CdcrReplicationDistributedZkTest, QueryResultKeyTest, UUIDUpdateProcessorFallbackTest, TestHashQParserPlugin, BasicZkTest, TestIntervalFaceting, TestNodeAddedTrigger, HdfsSyncSliceTest, TestMacroExpander, TestLegacyTerms, SolrPluginUtilsTest, AddReplicaTest, QueryElevationComponentTest, TestCoreContainer, TestSchemaNameResource, TestQueryWrapperFilter, RuleEngineTest, TestHighlightDedupGrouping, TestRangeQuery, TestDeleteCollectionOnDownNodes, TestPushWriter, TestUninvertingReader, InfoHandlerTest, MoveReplicaHDFSFailoverTest, DistribCursorPagingTest, ShardSplitTest, TestSolrJ, TestPayloadCheckQParserPlugin, LeaderElectionTest, TestSolrCloudWithDelegationTokens, CustomCollectionTest, TestBinaryField, ConnectionReuseTest, TestInfoStreamLogging, BitVectorTest, TestExpandComponent, UninvertDocValuesMergePolicyTest, ConvertedLegacyTest, MigrateRouteKeyTest, SynonymTokenizerTest, DistributedVersionInfoTest, TestFastOutputStream, TestLeaderInitiatedRecoveryThread, TestLegacyNumericRangeQueryBuilder, TestJoin, TermsComponentTest, DistributedFacetPivotWhiteBoxTest, SearchHandlerTest, HLLUtilTest, TestSerializedLuceneMatchVersion, TestFileDictionaryLookup, FacetPivotSmallTest, SolrIndexSplitterTest, TestConfigSetProperties, TestSolrConfigHandler, CoreSorterTest, TestMissingGroups, DistributedFacetPivotSmallAdvancedTest, TestRestoreCore, TestMiniSolrCloudClusterSSL, IgnoreCommitOptimizeUpdateProcessorFactoryTest, ReplicationFactorTest, JvmMetricsTest, TestCloudSearcherWarming, PeerSyncReplicationTest, SolrInfoBeanTest, TestPullReplicaErrorHandling, StatsComponentTest, LukeRequestHandlerTest, TestFilteredDocIdSet, SaslZkACLProviderTest, TestFoldingMultitermQuery, TestAnalyzeInfixSuggestions, TestPivotHelperCode, AtomicUpdatesTest, DataDrivenBlockJoinTest, TestQuerySenderNoQuery, TestStandardQParsers, SignatureUpdateProcessorFactoryTest, TimeRoutedAliasUpdateProcessorTest, TestSweetSpotSimilarityFactory, FieldMutatingUpdateProcessorTest, TestPerFieldSimilarityWithDefaultOverride, TestManagedSchemaThreadSafety, TestFaceting, HdfsNNFailoverTest, TestLRUStatsCache, TestElisionMultitermQuery, DirectSolrConnectionTest, SubstringBytesRefFilterTest, TestMergePolicyConfig, AutoAddReplicasIntegrationTest, BasicAuthStandaloneTest, TestNumericTerms32, BlockJoinFacetSimpleTest, TestExactSharedStatsCache, SchemaApiFailureTest, BinaryUpdateRequestHandlerTest, FastVectorHighlighterTest, TestXmlQParserPlugin, SolrXmlInZkTest, TestFieldCacheSortRandom, SolrIndexConfigTest, RequiredFieldsTest, TestQueryUtils, JSONWriterTest, CheckHdfsIndexTest, TestSchemaManager, TestDelegationWithHadoopAuth, LargeFieldTest, SolrGangliaReporterTest, DocValuesMissingTest, TestBulkSchemaAPI, TestDocTermOrds, ExecutePlanActionTest, TestGroupingSearch, HttpSolrCallGetCoreTest, TestRuleBasedAuthorizationPlugin, TestUnifiedSolrHighlighter, StatelessScriptUpdateProcessorFactoryTest, ReplicaListTransformerTest, UnloadDistributedZkTest, ClassificationUpdateProcessorIntegrationTest, TestLFUCache, TestFunctionQuery, TestIBSimilarityFactory, ZkCLITest, TestJsonRequest, PropertiesRequestHandlerTest, BooleanFieldTest, HdfsDirectoryTest, ConfigSetsAPITest, TestCloudJSONFacetJoinDomain, TestFieldCacheReopen, RemoteQueryErrorTest, TestCursorMarkWithoutUniqueKey, TestTlogReplica, AnalysisErrorHandlingTest, TestFiltering, CurrencyFieldTypeTest, DateFieldTest, SolrJmxReporterCloudTest, TestRealTimeGet, BasicDistributedZkTest, LeaderElectionIntegrationTest, ShardRoutingTest, TestReplicationHandler, TestZkChroot, TestDistributedSearch, DistributedSpellCheckComponentTest, ZkControllerTest, BadIndexSchemaTest, BasicFunctionalityTest, TestLazyCores, TestIndexSearcher, AnalysisAfterCoreReloadTest, SpellCheckCollatorTest, SuggesterFSTTest, SolrRequestParserTest, DocValuesTest, TestPseudoReturnFields, QueryEqualityTest, DefaultValueUpdateProcessorTest, DistanceFunctionTest, CacheHeaderTest, TestWriterPerf, TestOmitPositions, DocumentBuilderTest, TestSolrQueryParser, LoggingHandlerTest, TestJmxIntegration, QueryParsingTest, UniqFieldsUpdateProcessorFactoryTest, PingRequestHandlerTest, TestSystemIdResolver, TestSuggestSpellingConverter, SpellingQueryConverterTest, DOMUtilTest, RAMDirectoryFactoryTest, ClusterStateTest, ZkNodePropsTest, SliceStateTest, FileUtilsTest, DistributedMLTComponentTest, SolrTestCaseJ4Test, TestSimpleTrackingShardHandler, TestTolerantSearch, TestEmbeddedSolrServerAdminHandler, TestEmbeddedSolrServerConstructors, AssignBackwardCompatibilityTest, CleanupOldIndexTest, CloudExitableDirectoryReaderTest, CollectionStateFormat2Test, CollectionsAPISolrJTest, DeleteReplicaTest, LeaderFailureAfterFreshStartTest, LeaderInitiatedRecoveryOnCommitTest, LeaderInitiatedRecoveryOnShardRestartTest, LegacyCloudClusterPropTest, MoveReplicaTest, NodeMutatorTest, OutOfBoxZkACLAndCredentialsProvidersTest, OverriddenZkACLAndCredentialsProvidersTest, SSLMigrationTest, SolrCLIZkUtilsTest, TestCloudDeleteByQuery, TestCloudRecovery, TestLeaderElectionZkExpiry, TestOnReconnectListenerSupport, TestRandomFlRTGCloud, TestRandomRequestDistribution, TestRebalanceLeaders, TestShortCircuitedRequests, TestSolrCloudWithKerberosAlt, TestSolrCloudWithSecureImpersonation]
   [junit4]   2> NOTE: reproduce with: ant test  -Dtestcase=TestSolrCloudWithSecureImpersonation -Dtests.seed=259BA6F5F68887BB -Dtests.slow=true -Dtests.locale=zh -Dtests.timezone=Greenwich -Dtests.asserts=true -Dtests.file.encoding=UTF-8
   [junit4] ERROR   0.00s J0 | TestSolrCloudWithSecureImpersonation (suite) <<<
   [junit4]    > Throwable #1: com.carrotsearch.randomizedtesting.ThreadLeakError: 2 threads leaked from SUITE scope at org.apache.solr.cloud.TestSolrCloudWithSecureImpersonation: 
   [junit4]    >    1) Thread[id=28510, name=jetty-launcher-5585-thread-2-EventThread, state=TIMED_WAITING, group=TGRP-TestSolrCloudWithSecureImpersonation]
   [junit4]    >         at sun.misc.Unsafe.park(Native Method)
   [junit4]    >         at java.util.concurrent.locks.LockSupport.parkNanos(LockSupport.java:215)
   [junit4]    >         at java.util.concurrent.locks.AbstractQueuedSynchronizer.doAcquireSharedNanos(AbstractQueuedSynchronizer.java:1037)
   [junit4]    >         at java.util.concurrent.locks.AbstractQueuedSynchronizer.tryAcquireSharedNanos(AbstractQueuedSynchronizer.java:1328)
   [junit4]    >         at java.util.concurrent.CountDownLatch.await(CountDownLatch.java:277)
   [junit4]    >         at org.apache.curator.CuratorZookeeperClient.internalBlockUntilConnectedOrTimedOut(CuratorZookeeperClient.java:323)
   [junit4]    >         at org.apache.curator.RetryLoop.callWithRetry(RetryLoop.java:105)
   [junit4]    >         at org.apache.curator.framework.imps.GetDataBuilderImpl.pathInForeground(GetDataBuilderImpl.java:288)
   [junit4]    >         at org.apache.curator.framework.imps.GetDataBuilderImpl.forPath(GetDataBuilderImpl.java:279)
   [junit4]    >         at org.apache.curator.framework.imps.GetDataBuilderImpl.forPath(GetDataBuilderImpl.java:41)
   [junit4]    >         at org.apache.curator.framework.recipes.shared.SharedValue.readValue(SharedValue.java:244)
   [junit4]    >         at org.apache.curator.framework.recipes.shared.SharedValue.access$100(SharedValue.java:44)
   [junit4]    >         at org.apache.curator.framework.recipes.shared.SharedValue$1.process(SharedValue.java:61)
   [junit4]    >         at org.apache.curator.framework.imps.NamespaceWatcher.process(NamespaceWatcher.java:67)
   [junit4]    >         at org.apache.zookeeper.ClientCnxn$EventThread.processEvent(ClientCnxn.java:530)
   [junit4]    >         at org.apache.zookeeper.ClientCnxn$EventThread.run(ClientCnxn.java:505)
   [junit4]    >    2) Thread[id=28500, name=jetty-launcher-5585-thread-1-EventThread, state=TIMED_WAITING, group=TGRP-TestSolrCloudWithSecureImpersonation]
   [junit4]    >         at sun.misc.Unsafe.park(Native Method)
   [junit4]    >         at java.util.concurrent.locks.LockSupport.parkNanos(LockSupport.java:215)
   [junit4]    >         at java.util.concurrent.locks.AbstractQueuedSynchronizer.doAcquireSharedNanos(AbstractQueuedSynchronizer.java:1037)
   [junit4]    >         at java.util.concurrent.locks.AbstractQueuedSynchronizer.tryAcquireSharedNanos(AbstractQueuedSynchronizer.java:1328)
   [junit4]    >         at java.util.concurrent.CountDownLatch.await(CountDownLatch.java:277)
   [junit4]    >         at org.apache.curator.CuratorZookeeperClient.internalBlockUntilConnectedOrTimedOut(CuratorZookeeperClient.java:323)
   [junit4]    >         at org.apache.curator.RetryLoop.callWithRetry(RetryLoop.java:105)
   [junit4]    >         at org.apache.curator.framework.imps.GetDataBuilderImpl.pathInForeground(GetDataBuilderImpl.java:288)
   [junit4]    >         at org.apache.curator.framework.imps.GetDataBuilderImpl.forPath(GetDataBuilderImpl.java:279)
   [junit4]    >         at org.apache.curator.framework.imps.GetDataBuilderImpl.forPath(GetDataBuilderImpl.java:41)
   [junit4]    >         at org.apache.curator.framework.recipes.shared.SharedValue.readValue(SharedValue.java:244)
   [junit4]    >         at org.apache.curator.framework.recipes.shared.SharedValue.access$100(SharedValue.java:44)
   [junit4]    >         at org.apache.curator.framework.recipes.shared.SharedValue$1.process(SharedValue.java:61)
   [junit4]    >         at org.apache.curator.framework.imps.NamespaceWatcher.process(NamespaceWatcher.java:67)
   [junit4]    >         at org.apache.zookeeper.ClientCnxn$EventThread.processEvent(ClientCnxn.java:530)
   [junit4]    >         at org.apache.zookeeper.ClientCnxn$EventThread.run(ClientCnxn.java:505)
   [junit4]    > 	at __randomizedtesting.SeedInfo.seed([259BA6F5F68887BB]:0)
   [junit4] Completed [558/769 (3!)] on J0 in 58.05s, 12 tests, 1 error <<< FAILURES!

[...truncated 48854 lines...]

Mime
View raw message