lucene-dev mailing list archives

Site index · List index
Message view « Date » · « Thread »
Top « Date » · « Thread »
From Policeman Jenkins Server <jenk...@thetaphi.de>
Subject [JENKINS] Lucene-Solr-master-Solaris (64bit/jdk1.8.0) - Build # 1604 - Still Unstable!
Date Thu, 04 Jan 2018 02:52:39 GMT
Build: https://jenkins.thetaphi.de/job/Lucene-Solr-master-Solaris/1604/
Java: 64bit/jdk1.8.0 -XX:-UseCompressedOops -XX:+UseConcMarkSweepGC

2 tests failed.
FAILED:  junit.framework.TestSuite.org.apache.solr.cloud.TestSolrCloudWithSecureImpersonation

Error Message:
2 threads leaked from SUITE scope at org.apache.solr.cloud.TestSolrCloudWithSecureImpersonation:     1) Thread[id=32229, name=jetty-launcher-6067-thread-2-EventThread, state=TIMED_WAITING, group=TGRP-TestSolrCloudWithSecureImpersonation]         at sun.misc.Unsafe.park(Native Method)         at java.util.concurrent.locks.LockSupport.parkNanos(LockSupport.java:215)         at java.util.concurrent.locks.AbstractQueuedSynchronizer.doAcquireSharedNanos(AbstractQueuedSynchronizer.java:1037)         at java.util.concurrent.locks.AbstractQueuedSynchronizer.tryAcquireSharedNanos(AbstractQueuedSynchronizer.java:1328)         at java.util.concurrent.CountDownLatch.await(CountDownLatch.java:277)         at org.apache.curator.CuratorZookeeperClient.internalBlockUntilConnectedOrTimedOut(CuratorZookeeperClient.java:323)         at org.apache.curator.RetryLoop.callWithRetry(RetryLoop.java:105)         at org.apache.curator.framework.imps.GetDataBuilderImpl.pathInForeground(GetDataBuilderImpl.java:288)         at org.apache.curator.framework.imps.GetDataBuilderImpl.forPath(GetDataBuilderImpl.java:279)         at org.apache.curator.framework.imps.GetDataBuilderImpl.forPath(GetDataBuilderImpl.java:41)         at org.apache.curator.framework.recipes.shared.SharedValue.readValue(SharedValue.java:244)         at org.apache.curator.framework.recipes.shared.SharedValue.access$100(SharedValue.java:44)         at org.apache.curator.framework.recipes.shared.SharedValue$1.process(SharedValue.java:61)         at org.apache.curator.framework.imps.NamespaceWatcher.process(NamespaceWatcher.java:67)         at org.apache.zookeeper.ClientCnxn$EventThread.processEvent(ClientCnxn.java:530)         at org.apache.zookeeper.ClientCnxn$EventThread.run(ClientCnxn.java:505)    2) Thread[id=32241, name=jetty-launcher-6067-thread-1-EventThread, state=TIMED_WAITING, group=TGRP-TestSolrCloudWithSecureImpersonation]         at sun.misc.Unsafe.park(Native Method)         at java.util.concurrent.locks.LockSupport.parkNanos(LockSupport.java:215)         at java.util.concurrent.locks.AbstractQueuedSynchronizer.doAcquireSharedNanos(AbstractQueuedSynchronizer.java:1037)         at java.util.concurrent.locks.AbstractQueuedSynchronizer.tryAcquireSharedNanos(AbstractQueuedSynchronizer.java:1328)         at java.util.concurrent.CountDownLatch.await(CountDownLatch.java:277)         at org.apache.curator.CuratorZookeeperClient.internalBlockUntilConnectedOrTimedOut(CuratorZookeeperClient.java:323)         at org.apache.curator.RetryLoop.callWithRetry(RetryLoop.java:105)         at org.apache.curator.framework.imps.GetDataBuilderImpl.pathInForeground(GetDataBuilderImpl.java:288)         at org.apache.curator.framework.imps.GetDataBuilderImpl.forPath(GetDataBuilderImpl.java:279)         at org.apache.curator.framework.imps.GetDataBuilderImpl.forPath(GetDataBuilderImpl.java:41)         at org.apache.curator.framework.recipes.shared.SharedValue.readValue(SharedValue.java:244)         at org.apache.curator.framework.recipes.shared.SharedValue.access$100(SharedValue.java:44)         at org.apache.curator.framework.recipes.shared.SharedValue$1.process(SharedValue.java:61)         at org.apache.curator.framework.imps.NamespaceWatcher.process(NamespaceWatcher.java:67)         at org.apache.zookeeper.ClientCnxn$EventThread.processEvent(ClientCnxn.java:530)         at org.apache.zookeeper.ClientCnxn$EventThread.run(ClientCnxn.java:505)

Stack Trace:
com.carrotsearch.randomizedtesting.ThreadLeakError: 2 threads leaked from SUITE scope at org.apache.solr.cloud.TestSolrCloudWithSecureImpersonation: 
   1) Thread[id=32229, name=jetty-launcher-6067-thread-2-EventThread, state=TIMED_WAITING, group=TGRP-TestSolrCloudWithSecureImpersonation]
        at sun.misc.Unsafe.park(Native Method)
        at java.util.concurrent.locks.LockSupport.parkNanos(LockSupport.java:215)
        at java.util.concurrent.locks.AbstractQueuedSynchronizer.doAcquireSharedNanos(AbstractQueuedSynchronizer.java:1037)
        at java.util.concurrent.locks.AbstractQueuedSynchronizer.tryAcquireSharedNanos(AbstractQueuedSynchronizer.java:1328)
        at java.util.concurrent.CountDownLatch.await(CountDownLatch.java:277)
        at org.apache.curator.CuratorZookeeperClient.internalBlockUntilConnectedOrTimedOut(CuratorZookeeperClient.java:323)
        at org.apache.curator.RetryLoop.callWithRetry(RetryLoop.java:105)
        at org.apache.curator.framework.imps.GetDataBuilderImpl.pathInForeground(GetDataBuilderImpl.java:288)
        at org.apache.curator.framework.imps.GetDataBuilderImpl.forPath(GetDataBuilderImpl.java:279)
        at org.apache.curator.framework.imps.GetDataBuilderImpl.forPath(GetDataBuilderImpl.java:41)
        at org.apache.curator.framework.recipes.shared.SharedValue.readValue(SharedValue.java:244)
        at org.apache.curator.framework.recipes.shared.SharedValue.access$100(SharedValue.java:44)
        at org.apache.curator.framework.recipes.shared.SharedValue$1.process(SharedValue.java:61)
        at org.apache.curator.framework.imps.NamespaceWatcher.process(NamespaceWatcher.java:67)
        at org.apache.zookeeper.ClientCnxn$EventThread.processEvent(ClientCnxn.java:530)
        at org.apache.zookeeper.ClientCnxn$EventThread.run(ClientCnxn.java:505)
   2) Thread[id=32241, name=jetty-launcher-6067-thread-1-EventThread, state=TIMED_WAITING, group=TGRP-TestSolrCloudWithSecureImpersonation]
        at sun.misc.Unsafe.park(Native Method)
        at java.util.concurrent.locks.LockSupport.parkNanos(LockSupport.java:215)
        at java.util.concurrent.locks.AbstractQueuedSynchronizer.doAcquireSharedNanos(AbstractQueuedSynchronizer.java:1037)
        at java.util.concurrent.locks.AbstractQueuedSynchronizer.tryAcquireSharedNanos(AbstractQueuedSynchronizer.java:1328)
        at java.util.concurrent.CountDownLatch.await(CountDownLatch.java:277)
        at org.apache.curator.CuratorZookeeperClient.internalBlockUntilConnectedOrTimedOut(CuratorZookeeperClient.java:323)
        at org.apache.curator.RetryLoop.callWithRetry(RetryLoop.java:105)
        at org.apache.curator.framework.imps.GetDataBuilderImpl.pathInForeground(GetDataBuilderImpl.java:288)
        at org.apache.curator.framework.imps.GetDataBuilderImpl.forPath(GetDataBuilderImpl.java:279)
        at org.apache.curator.framework.imps.GetDataBuilderImpl.forPath(GetDataBuilderImpl.java:41)
        at org.apache.curator.framework.recipes.shared.SharedValue.readValue(SharedValue.java:244)
        at org.apache.curator.framework.recipes.shared.SharedValue.access$100(SharedValue.java:44)
        at org.apache.curator.framework.recipes.shared.SharedValue$1.process(SharedValue.java:61)
        at org.apache.curator.framework.imps.NamespaceWatcher.process(NamespaceWatcher.java:67)
        at org.apache.zookeeper.ClientCnxn$EventThread.processEvent(ClientCnxn.java:530)
        at org.apache.zookeeper.ClientCnxn$EventThread.run(ClientCnxn.java:505)
	at __randomizedtesting.SeedInfo.seed([19B1402007EFAAAD]:0)


FAILED:  org.apache.solr.cloud.autoscaling.sim.TestDistribStateManager.testGetSetRemoveData

Error Message:
Node watch should have fired!

Stack Trace:
java.lang.AssertionError: Node watch should have fired!
	at __randomizedtesting.SeedInfo.seed([19B1402007EFAAAD:3F21AF7253616CA7]:0)
	at org.junit.Assert.fail(Assert.java:93)
	at org.apache.solr.cloud.autoscaling.sim.TestDistribStateManager.testGetSetRemoveData(TestDistribStateManager.java:256)
	at sun.reflect.NativeMethodAccessorImpl.invoke0(Native Method)
	at sun.reflect.NativeMethodAccessorImpl.invoke(NativeMethodAccessorImpl.java:62)
	at sun.reflect.DelegatingMethodAccessorImpl.invoke(DelegatingMethodAccessorImpl.java:43)
	at java.lang.reflect.Method.invoke(Method.java:498)
	at com.carrotsearch.randomizedtesting.RandomizedRunner.invoke(RandomizedRunner.java:1737)
	at com.carrotsearch.randomizedtesting.RandomizedRunner$8.evaluate(RandomizedRunner.java:934)
	at com.carrotsearch.randomizedtesting.RandomizedRunner$9.evaluate(RandomizedRunner.java:970)
	at com.carrotsearch.randomizedtesting.RandomizedRunner$10.evaluate(RandomizedRunner.java:984)
	at com.carrotsearch.randomizedtesting.rules.SystemPropertiesRestoreRule$1.evaluate(SystemPropertiesRestoreRule.java:57)
	at org.apache.lucene.util.TestRuleSetupTeardownChained$1.evaluate(TestRuleSetupTeardownChained.java:49)
	at org.apache.lucene.util.AbstractBeforeAfterRule$1.evaluate(AbstractBeforeAfterRule.java:45)
	at org.apache.lucene.util.TestRuleThreadAndTestName$1.evaluate(TestRuleThreadAndTestName.java:48)
	at org.apache.lucene.util.TestRuleIgnoreAfterMaxFailures$1.evaluate(TestRuleIgnoreAfterMaxFailures.java:64)
	at org.apache.lucene.util.TestRuleMarkFailure$1.evaluate(TestRuleMarkFailure.java:47)
	at com.carrotsearch.randomizedtesting.rules.StatementAdapter.evaluate(StatementAdapter.java:36)
	at com.carrotsearch.randomizedtesting.ThreadLeakControl$StatementRunner.run(ThreadLeakControl.java:368)
	at com.carrotsearch.randomizedtesting.ThreadLeakControl.forkTimeoutingTask(ThreadLeakControl.java:817)
	at com.carrotsearch.randomizedtesting.ThreadLeakControl$3.evaluate(ThreadLeakControl.java:468)
	at com.carrotsearch.randomizedtesting.RandomizedRunner.runSingleTest(RandomizedRunner.java:943)
	at com.carrotsearch.randomizedtesting.RandomizedRunner$5.evaluate(RandomizedRunner.java:829)
	at com.carrotsearch.randomizedtesting.RandomizedRunner$6.evaluate(RandomizedRunner.java:879)
	at com.carrotsearch.randomizedtesting.RandomizedRunner$7.evaluate(RandomizedRunner.java:890)
	at com.carrotsearch.randomizedtesting.rules.StatementAdapter.evaluate(StatementAdapter.java:36)
	at com.carrotsearch.randomizedtesting.rules.SystemPropertiesRestoreRule$1.evaluate(SystemPropertiesRestoreRule.java:57)
	at org.apache.lucene.util.AbstractBeforeAfterRule$1.evaluate(AbstractBeforeAfterRule.java:45)
	at com.carrotsearch.randomizedtesting.rules.StatementAdapter.evaluate(StatementAdapter.java:36)
	at org.apache.lucene.util.TestRuleStoreClassName$1.evaluate(TestRuleStoreClassName.java:41)
	at com.carrotsearch.randomizedtesting.rules.NoShadowingOrOverridesOnMethodsRule$1.evaluate(NoShadowingOrOverridesOnMethodsRule.java:40)
	at com.carrotsearch.randomizedtesting.rules.NoShadowingOrOverridesOnMethodsRule$1.evaluate(NoShadowingOrOverridesOnMethodsRule.java:40)
	at com.carrotsearch.randomizedtesting.rules.StatementAdapter.evaluate(StatementAdapter.java:36)
	at com.carrotsearch.randomizedtesting.rules.StatementAdapter.evaluate(StatementAdapter.java:36)
	at com.carrotsearch.randomizedtesting.rules.StatementAdapter.evaluate(StatementAdapter.java:36)
	at org.apache.lucene.util.TestRuleAssertionsRequired$1.evaluate(TestRuleAssertionsRequired.java:53)
	at org.apache.lucene.util.TestRuleMarkFailure$1.evaluate(TestRuleMarkFailure.java:47)
	at org.apache.lucene.util.TestRuleIgnoreAfterMaxFailures$1.evaluate(TestRuleIgnoreAfterMaxFailures.java:64)
	at org.apache.lucene.util.TestRuleIgnoreTestSuites$1.evaluate(TestRuleIgnoreTestSuites.java:54)
	at com.carrotsearch.randomizedtesting.rules.StatementAdapter.evaluate(StatementAdapter.java:36)
	at com.carrotsearch.randomizedtesting.ThreadLeakControl$StatementRunner.run(ThreadLeakControl.java:368)
	at java.lang.Thread.run(Thread.java:748)




Build Log:
[...truncated 11706 lines...]
   [junit4] Suite: org.apache.solr.cloud.autoscaling.sim.TestDistribStateManager
   [junit4]   2> Creating dataDir: /export/home/jenkins/workspace/Lucene-Solr-master-Solaris/solr/build/solr-core/test/J1/temp/solr.cloud.autoscaling.sim.TestDistribStateManager_19B1402007EFAAAD-001/init-core-data-001
   [junit4]   2> 142373 WARN  (SUITE-TestDistribStateManager-seed#[19B1402007EFAAAD]-worker) [    ] o.a.s.SolrTestCaseJ4 startTrackingSearchers: numOpens=4 numCloses=4
   [junit4]   2> 142373 INFO  (SUITE-TestDistribStateManager-seed#[19B1402007EFAAAD]-worker) [    ] o.a.s.SolrTestCaseJ4 Using PointFields (NUMERIC_POINTS_SYSPROP=true) w/NUMERIC_DOCVALUES_SYSPROP=true
   [junit4]   2> 142375 INFO  (SUITE-TestDistribStateManager-seed#[19B1402007EFAAAD]-worker) [    ] o.a.s.SolrTestCaseJ4 Randomized ssl (true) and clientAuth (false) via: @org.apache.solr.util.RandomizeSSL(reason=, value=NaN, ssl=NaN, clientAuth=NaN)
   [junit4]   2> 142376 INFO  (SUITE-TestDistribStateManager-seed#[19B1402007EFAAAD]-worker) [    ] o.a.s.SolrTestCaseJ4 SecureRandom sanity checks: test.solr.allowed.securerandom=null & java.security.egd=file:/dev/./urandom
   [junit4]   2> 142380 INFO  (TEST-TestDistribStateManager.testListData-seed#[19B1402007EFAAAD]) [    ] o.a.s.SolrTestCaseJ4 ###Starting testListData
   [junit4]   2> 142384 INFO  (TEST-TestDistribStateManager.testListData-seed#[19B1402007EFAAAD]) [    ] o.a.s.c.a.s.TestDistribStateManager Using org.apache.solr.cloud.autoscaling.sim.SimDistribStateManager
   [junit4]   2> 142384 INFO  (TEST-TestDistribStateManager.testListData-seed#[19B1402007EFAAAD]) [    ] o.a.s.SolrTestCaseJ4 ###Ending testListData
   [junit4]   2> 142385 INFO  (TEST-TestDistribStateManager.testCreateMode-seed#[19B1402007EFAAAD]) [    ] o.a.s.SolrTestCaseJ4 ###Starting testCreateMode
   [junit4]   2> 142386 INFO  (TEST-TestDistribStateManager.testCreateMode-seed#[19B1402007EFAAAD]) [    ] o.a.s.c.ZkTestServer STARTING ZK TEST SERVER
   [junit4]   2> 142386 INFO  (Thread-221) [    ] o.a.s.c.ZkTestServer client port:0.0.0.0/0.0.0.0:0
   [junit4]   2> 142386 INFO  (Thread-221) [    ] o.a.s.c.ZkTestServer Starting server
   [junit4]   2> 142392 ERROR (Thread-221) [    ] o.a.z.s.ZooKeeperServer ZKShutdownHandler is not registered, so ZooKeeper server won't take any action on ERROR or SHUTDOWN server state changes
   [junit4]   2> 142486 INFO  (TEST-TestDistribStateManager.testCreateMode-seed#[19B1402007EFAAAD]) [    ] o.a.s.c.ZkTestServer start zk server on port:40023
   [junit4]   2> 142489 INFO  (zkConnectionManagerCallback-252-thread-1) [    ] o.a.s.c.c.ConnectionManager zkClient has connected
   [junit4]   2> 142489 INFO  (TEST-TestDistribStateManager.testCreateMode-seed#[19B1402007EFAAAD]) [    ] o.a.s.c.a.s.TestDistribStateManager Using org.apache.solr.client.solrj.impl.ZkDistribStateManager
   [junit4]   2> 142525 INFO  (zkConnectionManagerCallback-254-thread-1) [    ] o.a.s.c.c.ConnectionManager zkClient has connected
   [junit4]   2> 142525 INFO  (TEST-TestDistribStateManager.testCreateMode-seed#[19B1402007EFAAAD]) [    ] o.a.s.c.a.s.TestDistribStateManager Using org.apache.solr.client.solrj.impl.ZkDistribStateManager
   [junit4]   2> 142532 ERROR (TEST-TestDistribStateManager.testCreateMode-seed#[19B1402007EFAAAD]) [    ] o.a.z.s.ZooKeeperServer ZKShutdownHandler is not registered, so ZooKeeper server won't take any action on ERROR or SHUTDOWN server state changes
   [junit4]   2> 142532 INFO  (TEST-TestDistribStateManager.testCreateMode-seed#[19B1402007EFAAAD]) [    ] o.a.s.c.ZkTestServer connecting to 127.0.0.1:40023 40023
   [junit4]   2> 145522 INFO  (Thread-221) [    ] o.a.s.c.ZkTestServer connecting to 127.0.0.1:40023 40023
   [junit4]   2> 145523 INFO  (TEST-TestDistribStateManager.testCreateMode-seed#[19B1402007EFAAAD]) [    ] o.a.s.SolrTestCaseJ4 ###Ending testCreateMode
   [junit4]   2> 145524 INFO  (TEST-TestDistribStateManager.testMulti-seed#[19B1402007EFAAAD]) [    ] o.a.s.SolrTestCaseJ4 ###Starting testMulti
   [junit4]   2> 145524 INFO  (TEST-TestDistribStateManager.testMulti-seed#[19B1402007EFAAAD]) [    ] o.a.s.c.ZkTestServer STARTING ZK TEST SERVER
   [junit4]   2> 145524 INFO  (Thread-222) [    ] o.a.s.c.ZkTestServer client port:0.0.0.0/0.0.0.0:0
   [junit4]   2> 145524 INFO  (Thread-222) [    ] o.a.s.c.ZkTestServer Starting server
   [junit4]   2> 145526 ERROR (Thread-222) [    ] o.a.z.s.ZooKeeperServer ZKShutdownHandler is not registered, so ZooKeeper server won't take any action on ERROR or SHUTDOWN server state changes
   [junit4]   2> 145625 INFO  (TEST-TestDistribStateManager.testMulti-seed#[19B1402007EFAAAD]) [    ] o.a.s.c.ZkTestServer start zk server on port:52369
   [junit4]   2> 145629 INFO  (zkConnectionManagerCallback-256-thread-1) [    ] o.a.s.c.c.ConnectionManager zkClient has connected
   [junit4]   2> 145629 INFO  (TEST-TestDistribStateManager.testMulti-seed#[19B1402007EFAAAD]) [    ] o.a.s.c.a.s.TestDistribStateManager Using org.apache.solr.client.solrj.impl.ZkDistribStateManager
   [junit4]   2> 145632 ERROR (TEST-TestDistribStateManager.testMulti-seed#[19B1402007EFAAAD]) [    ] o.a.z.s.ZooKeeperServer ZKShutdownHandler is not registered, so ZooKeeper server won't take any action on ERROR or SHUTDOWN server state changes
   [junit4]   2> 145633 INFO  (TEST-TestDistribStateManager.testMulti-seed#[19B1402007EFAAAD]) [    ] o.a.s.c.ZkTestServer connecting to 127.0.0.1:52369 52369
   [junit4]   2> 146846 INFO  (Thread-222) [    ] o.a.s.c.ZkTestServer connecting to 127.0.0.1:52369 52369
   [junit4]   2> 146848 INFO  (TEST-TestDistribStateManager.testMulti-seed#[19B1402007EFAAAD]) [    ] o.a.s.SolrTestCaseJ4 ###Ending testMulti
   [junit4]   2> 146849 INFO  (TEST-TestDistribStateManager.testGetSetRemoveData-seed#[19B1402007EFAAAD]) [    ] o.a.s.SolrTestCaseJ4 ###Starting testGetSetRemoveData
   [junit4]   2> 146850 INFO  (TEST-TestDistribStateManager.testGetSetRemoveData-seed#[19B1402007EFAAAD]) [    ] o.a.s.c.ZkTestServer STARTING ZK TEST SERVER
   [junit4]   2> 146850 INFO  (Thread-223) [    ] o.a.s.c.ZkTestServer client port:0.0.0.0/0.0.0.0:0
   [junit4]   2> 146850 INFO  (Thread-223) [    ] o.a.s.c.ZkTestServer Starting server
   [junit4]   2> 146851 ERROR (Thread-223) [    ] o.a.z.s.ZooKeeperServer ZKShutdownHandler is not registered, so ZooKeeper server won't take any action on ERROR or SHUTDOWN server state changes
   [junit4]   2> 146950 INFO  (TEST-TestDistribStateManager.testGetSetRemoveData-seed#[19B1402007EFAAAD]) [    ] o.a.s.c.ZkTestServer start zk server on port:50165
   [junit4]   2> 146955 INFO  (zkConnectionManagerCallback-258-thread-1) [    ] o.a.s.c.c.ConnectionManager zkClient has connected
   [junit4]   2> 146955 INFO  (TEST-TestDistribStateManager.testGetSetRemoveData-seed#[19B1402007EFAAAD]) [    ] o.a.s.c.a.s.TestDistribStateManager Using org.apache.solr.client.solrj.impl.ZkDistribStateManager
   [junit4]   2> 147053 INFO  (zkConnectionManagerCallback-260-thread-1) [    ] o.a.s.c.c.ConnectionManager zkClient has connected
   [junit4]   2> 147053 INFO  (TEST-TestDistribStateManager.testGetSetRemoveData-seed#[19B1402007EFAAAD]) [    ] o.a.s.c.a.s.TestDistribStateManager Using org.apache.solr.client.solrj.impl.ZkDistribStateManager
   [junit4]   2> 152055 ERROR (TEST-TestDistribStateManager.testGetSetRemoveData-seed#[19B1402007EFAAAD]) [    ] o.a.z.s.ZooKeeperServer ZKShutdownHandler is not registered, so ZooKeeper server won't take any action on ERROR or SHUTDOWN server state changes
   [junit4]   2> 152055 INFO  (TEST-TestDistribStateManager.testGetSetRemoveData-seed#[19B1402007EFAAAD]) [    ] o.a.s.c.ZkTestServer connecting to 127.0.0.1:50165 50165
   [junit4]   2> 153415 INFO  (Thread-223) [    ] o.a.s.c.ZkTestServer connecting to 127.0.0.1:50165 50165
   [junit4]   2> 153418 INFO  (TEST-TestDistribStateManager.testGetSetRemoveData-seed#[19B1402007EFAAAD]) [    ] o.a.s.SolrTestCaseJ4 ###Ending testGetSetRemoveData
   [junit4]   2> NOTE: reproduce with: ant test  -Dtestcase=TestDistribStateManager -Dtests.method=testGetSetRemoveData -Dtests.seed=19B1402007EFAAAD -Dtests.slow=true -Dtests.locale=es-GT -Dtests.timezone=NET -Dtests.asserts=true -Dtests.file.encoding=US-ASCII
   [junit4] FAILURE 6.57s J1 | TestDistribStateManager.testGetSetRemoveData <<<
   [junit4]    > Throwable #1: java.lang.AssertionError: Node watch should have fired!
   [junit4]    > 	at __randomizedtesting.SeedInfo.seed([19B1402007EFAAAD:3F21AF7253616CA7]:0)
   [junit4]    > 	at org.apache.solr.cloud.autoscaling.sim.TestDistribStateManager.testGetSetRemoveData(TestDistribStateManager.java:256)
   [junit4]    > 	at java.lang.Thread.run(Thread.java:748)
   [junit4]   2> 153424 INFO  (TEST-TestDistribStateManager.testHasData-seed#[19B1402007EFAAAD]) [    ] o.a.s.SolrTestCaseJ4 ###Starting testHasData
   [junit4]   2> 153425 INFO  (TEST-TestDistribStateManager.testHasData-seed#[19B1402007EFAAAD]) [    ] o.a.s.c.ZkTestServer STARTING ZK TEST SERVER
   [junit4]   2> 153425 INFO  (Thread-224) [    ] o.a.s.c.ZkTestServer client port:0.0.0.0/0.0.0.0:0
   [junit4]   2> 153425 INFO  (Thread-224) [    ] o.a.s.c.ZkTestServer Starting server
   [junit4]   2> 153428 ERROR (Thread-224) [    ] o.a.z.s.ZooKeeperServer ZKShutdownHandler is not registered, so ZooKeeper server won't take any action on ERROR or SHUTDOWN server state changes
   [junit4]   2> 153525 INFO  (TEST-TestDistribStateManager.testHasData-seed#[19B1402007EFAAAD]) [    ] o.a.s.c.ZkTestServer start zk server on port:64581
   [junit4]   2> 153530 INFO  (zkConnectionManagerCallback-262-thread-1) [    ] o.a.s.c.c.ConnectionManager zkClient has connected
   [junit4]   2> 153531 INFO  (TEST-TestDistribStateManager.testHasData-seed#[19B1402007EFAAAD]) [    ] o.a.s.c.a.s.TestDistribStateManager Using org.apache.solr.client.solrj.impl.ZkDistribStateManager
   [junit4]   2> 153544 ERROR (TEST-TestDistribStateManager.testHasData-seed#[19B1402007EFAAAD]) [    ] o.a.z.s.ZooKeeperServer ZKShutdownHandler is not registered, so ZooKeeper server won't take any action on ERROR or SHUTDOWN server state changes
   [junit4]   2> 153546 INFO  (TEST-TestDistribStateManager.testHasData-seed#[19B1402007EFAAAD]) [    ] o.a.s.c.ZkTestServer connecting to 127.0.0.1:64581 64581
   [junit4]   2> 153934 INFO  (Thread-224) [    ] o.a.s.c.ZkTestServer connecting to 127.0.0.1:64581 64581
   [junit4]   2> 153935 INFO  (TEST-TestDistribStateManager.testHasData-seed#[19B1402007EFAAAD]) [    ] o.a.s.SolrTestCaseJ4 ###Ending testHasData
   [junit4]   2> NOTE: leaving temporary files on disk at: /export/home/jenkins/workspace/Lucene-Solr-master-Solaris/solr/build/solr-core/test/J1/temp/solr.cloud.autoscaling.sim.TestDistribStateManager_19B1402007EFAAAD-001
   [junit4]   2> NOTE: test params are: codec=Asserting(Lucene70): {}, docValues:{}, maxPointsInLeafNode=222, maxMBSortInHeap=6.480718701559791, sim=Asserting(org.apache.lucene.search.similarities.AssertingSimilarity@1f607094), locale=es-GT, timezone=NET
   [junit4]   2> NOTE: SunOS 5.11 amd64/Oracle Corporation 1.8.0_152 (64-bit)/cpus=3,threads=1,free=61336000,total=239714304
   [junit4]   2> NOTE: All tests run in this JVM: [TestFastLRUCache, TestBadConfig, TestSchemaSimilarityResource, TestSearcherReuse, TimeRoutedAliasUpdateProcessorTest, TestEmbeddedSolrServerConstructors, BlockJoinFacetSimpleTest, LukeRequestHandlerTest, HdfsChaosMonkeyNothingIsSafeTest, TestFieldTypeCollectionResource, ConfigureRecoveryStrategyTest, TestFunctionQuery, BlockDirectoryTest, TestLegacyTerms, TestRawTransformer, IndexSchemaRuntimeFieldTest, SaslZkACLProviderTest, TestBinaryResponseWriter, TestNoOpRegenerator, TestRandomRequestDistribution, TestBulkSchemaConcurrent, TestLegacyFieldReuse, ZkNodePropsTest, TestDFISimilarityFactory, CoreAdminCreateDiscoverTest, TestConfigSetImmutable, DocValuesTest, TlogReplayBufferedWhileIndexingTest, TestConfigSets, TestDistribStateManager]
   [junit4] Completed [43/765 (1!)] on J1 in 11.60s, 5 tests, 1 failure <<< FAILURES!

[...truncated 1732 lines...]
   [junit4] Suite: org.apache.solr.cloud.TestSolrCloudWithSecureImpersonation
   [junit4]   2> Creating dataDir: /export/home/jenkins/workspace/Lucene-Solr-master-Solaris/solr/build/solr-core/test/J0/temp/solr.cloud.TestSolrCloudWithSecureImpersonation_19B1402007EFAAAD-001/init-core-data-001
   [junit4]   2> 3696246 INFO  (SUITE-TestSolrCloudWithSecureImpersonation-seed#[19B1402007EFAAAD]-worker) [    ] o.a.s.SolrTestCaseJ4 Using PointFields (NUMERIC_POINTS_SYSPROP=true) w/NUMERIC_DOCVALUES_SYSPROP=true
   [junit4]   2> 3696248 INFO  (SUITE-TestSolrCloudWithSecureImpersonation-seed#[19B1402007EFAAAD]-worker) [    ] o.a.s.SolrTestCaseJ4 Randomized ssl (false) and clientAuth (false) via: @org.apache.solr.util.RandomizeSSL(reason=, value=NaN, ssl=NaN, clientAuth=NaN)
   [junit4]   2> 3696248 INFO  (SUITE-TestSolrCloudWithSecureImpersonation-seed#[19B1402007EFAAAD]-worker) [    ] o.a.s.SolrTestCaseJ4 SecureRandom sanity checks: test.solr.allowed.securerandom=null & java.security.egd=file:/dev/./urandom
   [junit4]   2> 3696280 INFO  (SUITE-TestSolrCloudWithSecureImpersonation-seed#[19B1402007EFAAAD]-worker) [    ] o.a.s.c.MiniSolrCloudCluster Starting cluster of 2 servers in /export/home/jenkins/workspace/Lucene-Solr-master-Solaris/solr/build/solr-core/test/J0/temp/solr.cloud.TestSolrCloudWithSecureImpersonation_19B1402007EFAAAD-001/tempDir-001
   [junit4]   2> 3696280 INFO  (SUITE-TestSolrCloudWithSecureImpersonation-seed#[19B1402007EFAAAD]-worker) [    ] o.a.s.c.ZkTestServer STARTING ZK TEST SERVER
   [junit4]   2> 3696281 INFO  (Thread-7987) [    ] o.a.s.c.ZkTestServer client port:0.0.0.0/0.0.0.0:0
   [junit4]   2> 3696281 INFO  (Thread-7987) [    ] o.a.s.c.ZkTestServer Starting server
   [junit4]   2> 3696283 ERROR (Thread-7987) [    ] o.a.z.s.ZooKeeperServer ZKShutdownHandler is not registered, so ZooKeeper server won't take any action on ERROR or SHUTDOWN server state changes
   [junit4]   2> 3696381 INFO  (SUITE-TestSolrCloudWithSecureImpersonation-seed#[19B1402007EFAAAD]-worker) [    ] o.a.s.c.ZkTestServer start zk server on port:44730
   [junit4]   2> 3696384 INFO  (zkConnectionManagerCallback-6070-thread-1) [    ] o.a.s.c.c.ConnectionManager zkClient has connected
   [junit4]   2> 3696389 INFO  (jetty-launcher-6067-thread-1) [    ] o.e.j.s.Server jetty-9.3.20.v20170531
   [junit4]   2> 3696389 INFO  (jetty-launcher-6067-thread-2) [    ] o.e.j.s.Server jetty-9.3.20.v20170531
   [junit4]   2> 3696391 INFO  (jetty-launcher-6067-thread-1) [    ] o.e.j.s.h.ContextHandler Started o.e.j.s.ServletContextHandler@40ddf679{/solr,null,AVAILABLE}
   [junit4]   2> 3696391 INFO  (jetty-launcher-6067-thread-2) [    ] o.e.j.s.h.ContextHandler Started o.e.j.s.ServletContextHandler@7d327cb0{/solr,null,AVAILABLE}
   [junit4]   2> 3696391 INFO  (jetty-launcher-6067-thread-1) [    ] o.e.j.s.AbstractConnector Started ServerConnector@41a10d00{HTTP/1.1,[http/1.1]}{127.0.0.1:48557}
   [junit4]   2> 3696391 INFO  (jetty-launcher-6067-thread-1) [    ] o.e.j.s.Server Started @3700679ms
   [junit4]   2> 3696392 INFO  (jetty-launcher-6067-thread-1) [    ] o.a.s.c.s.e.JettySolrRunner Jetty properties: {hostContext=/solr, hostPort=48557}
   [junit4]   2> 3696392 INFO  (jetty-launcher-6067-thread-2) [    ] o.e.j.s.AbstractConnector Started ServerConnector@1ef848d4{HTTP/1.1,[http/1.1]}{127.0.0.1:45905}
   [junit4]   2> 3696392 INFO  (jetty-launcher-6067-thread-2) [    ] o.e.j.s.Server Started @3700680ms
   [junit4]   2> 3696392 INFO  (jetty-launcher-6067-thread-2) [    ] o.a.s.c.s.e.JettySolrRunner Jetty properties: {hostContext=/solr, hostPort=45905}
   [junit4]   2> 3696393 ERROR (jetty-launcher-6067-thread-2) [    ] o.a.s.u.StartupLoggingUtils Missing Java Option solr.log.dir. Logging may be missing or incomplete.
   [junit4]   2> 3696394 ERROR (jetty-launcher-6067-thread-1) [    ] o.a.s.u.StartupLoggingUtils Missing Java Option solr.log.dir. Logging may be missing or incomplete.
   [junit4]   2> 3696394 INFO  (jetty-launcher-6067-thread-2) [    ] o.a.s.s.SolrDispatchFilter  ___      _       Welcome to Apache Solr? version 8.0.0
   [junit4]   2> 3696394 INFO  (jetty-launcher-6067-thread-1) [    ] o.a.s.s.SolrDispatchFilter  ___      _       Welcome to Apache Solr? version 8.0.0
   [junit4]   2> 3696394 INFO  (jetty-launcher-6067-thread-2) [    ] o.a.s.s.SolrDispatchFilter / __| ___| |_ _   Starting in cloud mode on port null
   [junit4]   2> 3696394 INFO  (jetty-launcher-6067-thread-1) [    ] o.a.s.s.SolrDispatchFilter / __| ___| |_ _   Starting in cloud mode on port null
   [junit4]   2> 3696394 INFO  (jetty-launcher-6067-thread-2) [    ] o.a.s.s.SolrDispatchFilter \__ \/ _ \ | '_|  Install dir: null
   [junit4]   2> 3696394 INFO  (jetty-launcher-6067-thread-1) [    ] o.a.s.s.SolrDispatchFilter \__ \/ _ \ | '_|  Install dir: null
   [junit4]   2> 3696394 INFO  (jetty-launcher-6067-thread-2) [    ] o.a.s.s.SolrDispatchFilter |___/\___/_|_|    Start time: 2018-01-04T02:13:54.227Z
   [junit4]   2> 3696394 INFO  (jetty-launcher-6067-thread-1) [    ] o.a.s.s.SolrDispatchFilter |___/\___/_|_|    Start time: 2018-01-04T02:13:54.227Z
   [junit4]   2> 3696396 INFO  (zkConnectionManagerCallback-6074-thread-1) [    ] o.a.s.c.c.ConnectionManager zkClient has connected
   [junit4]   2> 3696397 INFO  (zkConnectionManagerCallback-6072-thread-1) [    ] o.a.s.c.c.ConnectionManager zkClient has connected
   [junit4]   2> 3696397 INFO  (jetty-launcher-6067-thread-1) [    ] o.a.s.s.SolrDispatchFilter solr.xml found in ZooKeeper. Loading...
   [junit4]   2> 3696397 INFO  (jetty-launcher-6067-thread-2) [    ] o.a.s.s.SolrDispatchFilter solr.xml found in ZooKeeper. Loading...
   [junit4]   2> 3696408 INFO  (jetty-launcher-6067-thread-1) [    ] o.a.s.c.ZkContainer Zookeeper client=127.0.0.1:44730/solr
   [junit4]   2> 3696408 INFO  (jetty-launcher-6067-thread-2) [    ] o.a.s.c.ZkContainer Zookeeper client=127.0.0.1:44730/solr
   [junit4]   2> 3696415 INFO  (zkConnectionManagerCallback-6082-thread-1) [    ] o.a.s.c.c.ConnectionManager zkClient has connected
   [junit4]   2> 3696421 INFO  (zkConnectionManagerCallback-6080-thread-1) [    ] o.a.s.c.c.ConnectionManager zkClient has connected
   [junit4]   2> 3696425 INFO  (zkConnectionManagerCallback-6086-thread-1-processing-n:127.0.0.1:48557_solr) [n:127.0.0.1:48557_solr    ] o.a.s.c.c.ConnectionManager zkClient has connected
   [junit4]   2> 3696430 INFO  (zkConnectionManagerCallback-6084-thread-1-processing-n:127.0.0.1:45905_solr) [n:127.0.0.1:45905_solr    ] o.a.s.c.c.ConnectionManager zkClient has connected
   [junit4]   2> 3696743 INFO  (jetty-launcher-6067-thread-2) [n:127.0.0.1:45905_solr    ] o.a.s.c.Overseer Overseer (id=null) closing
   [junit4]   2> 3696744 INFO  (jetty-launcher-6067-thread-2) [n:127.0.0.1:45905_solr    ] o.a.s.c.OverseerElectionContext I am going to be the leader 127.0.0.1:45905_solr
   [junit4]   2> 3696746 INFO  (jetty-launcher-6067-thread-2) [n:127.0.0.1:45905_solr    ] o.a.s.c.Overseer Overseer (id=99289139387760645-127.0.0.1:45905_solr-n_0000000000) starting
   [junit4]   2> 3696758 INFO  (jetty-launcher-6067-thread-2) [n:127.0.0.1:45905_solr    ] o.a.s.c.ZkController Register node as live in ZooKeeper:/live_nodes/127.0.0.1:45905_solr
   [junit4]   2> 3696762 INFO  (zkCallback-6085-thread-1-processing-n:127.0.0.1:48557_solr) [n:127.0.0.1:48557_solr    ] o.a.s.c.c.ZkStateReader Updated live nodes from ZooKeeper... (0) -> (1)
   [junit4]   2> 3696762 INFO  (OverseerStateUpdate-99289139387760645-127.0.0.1:45905_solr-n_0000000000) [n:127.0.0.1:45905_solr    ] o.a.s.c.c.ZkStateReader Updated live nodes from ZooKeeper... (0) -> (1)
   [junit4]   2> 3696763 INFO  (jetty-launcher-6067-thread-1) [n:127.0.0.1:48557_solr    ] o.a.s.c.Overseer Overseer (id=null) closing
   [junit4]   2> 3696767 INFO  (jetty-launcher-6067-thread-1) [n:127.0.0.1:48557_solr    ] o.a.s.c.ZkController Register node as live in ZooKeeper:/live_nodes/127.0.0.1:48557_solr
   [junit4]   2> 3696769 INFO  (zkCallback-6085-thread-1-processing-n:127.0.0.1:48557_solr) [n:127.0.0.1:48557_solr    ] o.a.s.c.c.ZkStateReader Updated live nodes from ZooKeeper... (1) -> (2)
   [junit4]   2> 3696769 INFO  (zkCallback-6083-thread-1-processing-n:127.0.0.1:45905_solr) [n:127.0.0.1:45905_solr    ] o.a.s.c.c.ZkStateReader Updated live nodes from ZooKeeper... (1) -> (2)
   [junit4]   2> 3696868 INFO  (jetty-launcher-6067-thread-2) [n:127.0.0.1:45905_solr    ] o.a.s.c.CoreContainer Initializing authentication plugin: org.apache.solr.security.HttpParamDelegationTokenPlugin
   [junit4]   2> 3696869 WARN  (jetty-launcher-6067-thread-2) [n:127.0.0.1:45905_solr    ] o.a.s.c.s.i.Krb5HttpClientBuilder org.apache.solr.client.solrj.impl.Krb5HttpClientBuilder is configured without specifying system property 'java.security.auth.login.config'
   [junit4]   2> 3696869 INFO  (jetty-launcher-6067-thread-2) [n:127.0.0.1:45905_solr    ] o.a.s.s.KerberosPlugin Params: {solr.kerberos.impersonator.user.noGroups.hosts=*, solr.kerberos.impersonator.user.bogusGroup.groups=__some_bogus_group, token.valid=30, cookie.domain=127.0.0.1, solr.kerberos.impersonator.user.anyHostAnyUser.groups=*, solr.kerberos.impersonator.user.bogusGroup.hosts=*, solr.kerberos.impersonator.user.anyHostAnyUser.hosts=*, token.validity=36000, solr.kerberos.impersonator.user.noHosts.groups=*, type=kerberos, solr.kerberos.impersonator.user.localHostAnyGroup.groups=*, delegation-token.token-kind=solr-dt, solr.kerberos.impersonator.user.wrongHost.hosts=1.1.1.1.1.1, cookie.path=/, zk-dt-secret-manager.znodeWorkingPath=solr/security/zkdtsm, solr.kerberos.impersonator.user.localHostAnyGroup.hosts=serv1-vm3,localhost,127.0.0.1, signer.secret.provider.zookeeper.path=/token, solr.kerberos.impersonator.user.anyHostUsersGroup.groups=staff, zk-dt-secret-manager.enable=true, solr.kerberos.impersonator.user.wrongHost.groups=*, kerberos.name.rules=DEFAULT, signer.secret.provider=zookeeper, solr.kerberos.impersonator.user.anyHostUsersGroup.hosts=*}
   [junit4]   2> 3696872 INFO  (jetty-launcher-6067-thread-2) [n:127.0.0.1:45905_solr    ] o.a.c.f.i.CuratorFrameworkImpl Starting
   [junit4]   2> 3696876 INFO  (jetty-launcher-6067-thread-2-EventThread) [n:127.0.0.1:45905_solr    ] o.a.c.f.s.ConnectionStateManager State change: CONNECTED
   [junit4]   2> 3696904 WARN  (jetty-launcher-6067-thread-2) [n:127.0.0.1:45905_solr    ] o.a.s.c.s.i.Krb5HttpClientBuilder org.apache.solr.client.solrj.impl.Krb5HttpClientBuilder is configured without specifying system property 'java.security.auth.login.config'
   [junit4]   2> 3696955 INFO  (jetty-launcher-6067-thread-2) [n:127.0.0.1:45905_solr    ] o.a.s.m.r.SolrJmxReporter JMX monitoring for 'solr_45905.solr.node' (registry 'solr.node') enabled at server: com.sun.jmx.mbeanserver.JmxMBeanServer@15e34403
   [junit4]   2> 3696963 INFO  (jetty-launcher-6067-thread-2) [n:127.0.0.1:45905_solr    ] o.a.s.m.r.SolrJmxReporter JMX monitoring for 'solr_45905.solr.jvm' (registry 'solr.jvm') enabled at server: com.sun.jmx.mbeanserver.JmxMBeanServer@15e34403
   [junit4]   2> 3696963 INFO  (jetty-launcher-6067-thread-2) [n:127.0.0.1:45905_solr    ] o.a.s.m.r.SolrJmxReporter JMX monitoring for 'solr_45905.solr.jetty' (registry 'solr.jetty') enabled at server: com.sun.jmx.mbeanserver.JmxMBeanServer@15e34403
   [junit4]   2> 3696964 INFO  (jetty-launcher-6067-thread-2) [n:127.0.0.1:45905_solr    ] o.a.s.c.CorePropertiesLocator Found 0 core definitions underneath /export/home/jenkins/workspace/Lucene-Solr-master-Solaris/solr/build/solr-core/test/J0/temp/solr.cloud.TestSolrCloudWithSecureImpersonation_19B1402007EFAAAD-001/tempDir-001/node2/.
   [junit4]   2> 3697065 INFO  (jetty-launcher-6067-thread-1) [n:127.0.0.1:48557_solr    ] o.a.s.c.CoreContainer Initializing authentication plugin: org.apache.solr.security.HttpParamDelegationTokenPlugin
   [junit4]   2> 3697065 WARN  (jetty-launcher-6067-thread-1) [n:127.0.0.1:48557_solr    ] o.a.s.c.s.i.Krb5HttpClientBuilder org.apache.solr.client.solrj.impl.Krb5HttpClientBuilder is configured without specifying system property 'java.security.auth.login.config'
   [junit4]   2> 3697067 INFO  (jetty-launcher-6067-thread-1) [n:127.0.0.1:48557_solr    ] o.a.s.s.KerberosPlugin Params: {solr.kerberos.impersonator.user.noGroups.hosts=*, solr.kerberos.impersonator.user.bogusGroup.groups=__some_bogus_group, token.valid=30, cookie.domain=127.0.0.1, solr.kerberos.impersonator.user.anyHostAnyUser.groups=*, solr.kerberos.impersonator.user.bogusGroup.hosts=*, solr.kerberos.impersonator.user.anyHostAnyUser.hosts=*, token.validity=36000, solr.kerberos.impersonator.user.noHosts.groups=*, type=kerberos, solr.kerberos.impersonator.user.localHostAnyGroup.groups=*, delegation-token.token-kind=solr-dt, solr.kerberos.impersonator.user.wrongHost.hosts=1.1.1.1.1.1, cookie.path=/, zk-dt-secret-manager.znodeWorkingPath=solr/security/zkdtsm, solr.kerberos.impersonator.user.localHostAnyGroup.hosts=serv1-vm3,localhost,127.0.0.1, signer.secret.provider.zookeeper.path=/token, solr.kerberos.impersonator.user.anyHostUsersGroup.groups=staff, zk-dt-secret-manager.enable=true, solr.kerberos.impersonator.user.wrongHost.groups=*, kerberos.name.rules=DEFAULT, signer.secret.provider=zookeeper, solr.kerberos.impersonator.user.anyHostUsersGroup.hosts=*}
   [junit4]   2> 3697068 INFO  (jetty-launcher-6067-thread-1) [n:127.0.0.1:48557_solr    ] o.a.c.f.i.CuratorFrameworkImpl Starting
   [junit4]   2> 3697070 INFO  (jetty-launcher-6067-thread-1-EventThread) [n:127.0.0.1:48557_solr    ] o.a.c.f.s.ConnectionStateManager State change: CONNECTED
   [junit4]   2> 3697087 WARN  (jetty-launcher-6067-thread-1) [n:127.0.0.1:48557_solr    ] o.a.s.c.s.i.Krb5HttpClientBuilder org.apache.solr.client.solrj.impl.Krb5HttpClientBuilder is configured without specifying system property 'java.security.auth.login.config'
   [junit4]   2> 3697125 INFO  (jetty-launcher-6067-thread-1) [n:127.0.0.1:48557_solr    ] o.a.s.m.r.SolrJmxReporter JMX monitoring for 'solr_48557.solr.node' (registry 'solr.node') enabled at server: com.sun.jmx.mbeanserver.JmxMBeanServer@15e34403
   [junit4]   2> 3697131 INFO  (jetty-launcher-6067-thread-1) [n:127.0.0.1:48557_solr    ] o.a.s.m.r.SolrJmxReporter JMX monitoring for 'solr_48557.solr.jvm' (registry 'solr.jvm') enabled at server: com.sun.jmx.mbeanserver.JmxMBeanServer@15e34403
   [junit4]   2> 3697131 INFO  (jetty-launcher-6067-thread-1) [n:127.0.0.1:48557_solr    ] o.a.s.m.r.SolrJmxReporter JMX monitoring for 'solr_48557.solr.jetty' (registry 'solr.jetty') enabled at server: com.sun.jmx.mbeanserver.JmxMBeanServer@15e34403
   [junit4]   2> 3697132 INFO  (jetty-launcher-6067-thread-1) [n:127.0.0.1:48557_solr    ] o.a.s.c.CorePropertiesLocator Found 0 core definitions underneath /export/home/jenkins/workspace/Lucene-Solr-master-Solaris/solr/build/solr-core/test/J0/temp/solr.cloud.TestSolrCloudWithSecureImpersonation_19B1402007EFAAAD-001/tempDir-001/node1/.
   [junit4]   2> 3697158 INFO  (zkConnectionManagerCallback-6092-thread-1) [    ] o.a.s.c.c.ConnectionManager zkClient has connected
   [junit4]   2> 3697179 INFO  (TEST-TestSolrCloudWithSecureImpersonation.testProxyInvalidGroup-seed#[19B1402007EFAAAD]) [    ] o.a.s.SolrTestCaseJ4 ###Starting testProxyInvalidGroup
   [junit4]   2> 3697205 WARN  (qtp1963864737-32190) [    ] o.a.h.s.ShellBasedUnixGroupsMapping got exception trying to get groups for user bar: id: invalid user name: "bar"
   [junit4]   2> id: invalid user name: "bar"
   [junit4]   2> 
   [junit4]   2> 3697206 INFO  (TEST-TestSolrCloudWithSecureImpersonation.testProxyInvalidGroup-seed#[19B1402007EFAAAD]) [    ] o.a.s.SolrTestCaseJ4 ###Ending testProxyInvalidGroup
   [junit4]   2> 3697227 INFO  (TEST-TestSolrCloudWithSecureImpersonation.testForwarding-seed#[19B1402007EFAAAD]) [    ] o.a.s.SolrTestCaseJ4 ###Starting testForwarding
   [junit4]   2> 3697229 INFO  (zkConnectionManagerCallback-6095-thread-1) [    ] o.a.s.c.c.ConnectionManager zkClient has connected
   [junit4]   2> 3698482 WARN  (NIOServerCxn.Factory:0.0.0.0/0.0.0.0:0) [    ] o.a.z.s.NIOServerCnxn caught end of stream exception
   [junit4]   2> EndOfStreamException: Unable to read additional data from client sessionid 0x160bef23b43000a, likely client has closed socket
   [junit4]   2> 	at org.apache.zookeeper.server.NIOServerCnxn.doIO(NIOServerCnxn.java:239)
   [junit4]   2> 	at org.apache.zookeeper.server.NIOServerCnxnFactory.run(NIOServerCnxnFactory.java:203)
   [junit4]   2> 	at java.lang.Thread.run(Thread.java:748)
   [junit4]   2> 3698485 INFO  (zkConnectionManagerCallback-6098-thread-1) [    ] o.a.s.c.c.ConnectionManager zkClient has connected
   [junit4]   2> 3698486 INFO  (TEST-TestSolrCloudWithSecureImpersonation.testForwarding-seed#[19B1402007EFAAAD]) [    ] o.a.s.c.c.ZkStateReader Updated live nodes from ZooKeeper... (0) -> (2)
   [junit4]   2> 3698539 INFO  (TEST-TestSolrCloudWithSecureImpersonation.testForwarding-seed#[19B1402007EFAAAD]) [    ] o.a.s.c.s.i.ZkClientClusterStateProvider Cluster at 127.0.0.1:44730/solr ready
   [junit4]   2> 3698541 INFO  (qtp1963864737-32193) [n:127.0.0.1:45905_solr    ] o.a.s.h.a.CollectionsHandler Invoked Collection Action :create with params pullReplicas=0&replicationFactor=1&collection.configName=conf1&maxShardsPerNode=1&name=forwardingCollection&nrtReplicas=1&action=CREATE&numShards=1&tlogReplicas=0&wt=javabin&version=2 and sendToOCPQueue=true
   [junit4]   2> 3698611 INFO  (OverseerThreadFactory-10222-thread-1-processing-n:127.0.0.1:45905_solr) [n:127.0.0.1:45905_solr    ] o.a.s.c.CreateCollectionCmd Create collection forwardingCollection
   [junit4]   2> 3698727 INFO  (OverseerStateUpdate-99289139387760645-127.0.0.1:45905_solr-n_0000000000) [n:127.0.0.1:45905_solr    ] o.a.s.c.o.SliceMutator createReplica() {
   [junit4]   2>   "operation":"ADDREPLICA",
   [junit4]   2>   "collection":"forwardingCollection",
   [junit4]   2>   "shard":"shard1",
   [junit4]   2>   "core":"forwardingCollection_shard1_replica_n1",
   [junit4]   2>   "state":"down",
   [junit4]   2>   "base_url":"http://127.0.0.1:48557/solr",
   [junit4]   2>   "type":"NRT",
   [junit4]   2>   "waitForFinalState":"false"} 
   [junit4]   2> 3698930 INFO  (qtp630348360-32182) [n:127.0.0.1:48557_solr    ] o.a.s.h.a.CoreAdminOperation core create command qt=/admin/cores&coreNodeName=core_node2&collection.configName=conf1&newCollection=true&name=forwardingCollection_shard1_replica_n1&action=CREATE&numShards=1&collection=forwardingCollection&shard=shard1&wt=javabin&version=2&replicaType=NRT
   [junit4]   2> 3698931 INFO  (qtp630348360-32182) [n:127.0.0.1:48557_solr    ] o.a.s.c.TransientSolrCoreCacheDefault Allocating transient cache for 2147483647 transient cores
   [junit4]   2> 3699037 INFO  (zkCallback-6085-thread-1-processing-n:127.0.0.1:48557_solr) [n:127.0.0.1:48557_solr    ] o.a.s.c.c.ZkStateReader A cluster state change: [WatchedEvent state:SyncConnected type:NodeDataChanged path:/collections/forwardingCollection/state.json] for collection [forwardingCollection] has occurred - updating... (live nodes size: [2])
   [junit4]   2> 3699037 INFO  (zkCallback-6085-thread-2-processing-n:127.0.0.1:48557_solr) [n:127.0.0.1:48557_solr    ] o.a.s.c.c.ZkStateReader A cluster state change: [WatchedEvent state:SyncConnected type:NodeDataChanged path:/collections/forwardingCollection/state.json] for collection [forwardingCollection] has occurred - updating... (live nodes size: [2])
   [junit4]   2> 3699963 INFO  (qtp630348360-32182) [n:127.0.0.1:48557_solr c:forwardingCollection s:shard1 r:core_node2 x:forwardingCollection_shard1_replica_n1] o.a.s.c.SolrConfig Using Lucene MatchVersion: 8.0.0
   [junit4]   2> 3699979 INFO  (qtp630348360-32182) [n:127.0.0.1:48557_solr c:forwardingCollection s:shard1 r:core_node2 x:forwardingCollection_shard1_replica_n1] o.a.s.s.IndexSchema [forwardingCollection_shard1_replica_n1] Schema name=test
   [junit4]   2> 3700096 INFO  (qtp630348360-32182) [n:127.0.0.1:48557_solr c:forwardingCollection s:shard1 r:core_node2 x:forwardingCollection_shard1_replica_n1] o.a.s.s.IndexSchema Loaded schema test/1.0 with uniqueid field id
   [junit4]   2> 3700121 INFO  (qtp630348360-32182) [n:127.0.0.1:48557_solr c:forwardingCollection s:shard1 r:core_node2 x:forwardingCollection_shard1_replica_n1] o.a.s.c.CoreContainer Creating SolrCore 'forwardingCollection_shard1_replica_n1' using configuration from collection forwardingCollection, trusted=true
   [junit4]   2> 3700121 INFO  (qtp630348360-32182) [n:127.0.0.1:48557_solr c:forwardingCollection s:shard1 r:core_node2 x:forwardingCollection_shard1_replica_n1] o.a.s.m.r.SolrJmxReporter JMX monitoring for 'solr_48557.solr.core.forwardingCollection.shard1.replica_n1' (registry 'solr.core.forwardingCollection.shard1.replica_n1') enabled at server: com.sun.jmx.mbeanserver.JmxMBeanServer@15e34403
   [junit4]   2> 3700121 INFO  (qtp630348360-32182) [n:127.0.0.1:48557_solr c:forwardingCollection s:shard1 r:core_node2 x:forwardingCollection_shard1_replica_n1] o.a.s.c.SolrCore solr.RecoveryStrategy.Builder
   [junit4]   2> 3700121 INFO  (qtp630348360-32182) [n:127.0.0.1:48557_solr c:forwardingCollection s:shard1 r:core_node2 x:forwardingCollection_shard1_replica_n1] o.a.s.c.SolrCore [[forwardingCollection_shard1_replica_n1] ] Opening new SolrCore at [/export/home/jenkins/workspace/Lucene-Solr-master-Solaris/solr/build/solr-core/test/J0/temp/solr.cloud.TestSolrCloudWithSecureImpersonation_19B1402007EFAAAD-001/tempDir-001/node1/forwardingCollection_shard1_replica_n1], dataDir=[/export/home/jenkins/workspace/Lucene-Solr-master-Solaris/solr/build/solr-core/test/J0/temp/solr.cloud.TestSolrCloudWithSecureImpersonation_19B1402007EFAAAD-001/tempDir-001/node1/./forwardingCollection_shard1_replica_n1/data/]
   [junit4]   2> 3700123 INFO  (qtp630348360-32182) [n:127.0.0.1:48557_solr c:forwardingCollection s:shard1 r:core_node2 x:forwardingCollection_shard1_replica_n1] o.a.s.u.RandomMergePolicy RandomMergePolicy wrapping class org.apache.lucene.index.LogDocMergePolicy: [LogDocMergePolicy: minMergeSize=1000, mergeFactor=39, maxMergeSize=9223372036854775807, maxMergeSizeForForcedMerge=9223372036854775807, calibrateSizeByDeletes=true, maxMergeDocs=2147483647, maxCFSSegmentSizeMB=8.796093022207999E12, noCFSRatio=1.0]
   [junit4]   2> 3700195 INFO  (qtp630348360-32182) [n:127.0.0.1:48557_solr c:forwardingCollection s:shard1 r:core_node2 x:forwardingCollection_shard1_replica_n1] o.a.s.u.UpdateHandler Using UpdateLog implementation: org.apache.solr.update.UpdateLog
   [junit4]   2> 3700195 INFO  (qtp630348360-32182) [n:127.0.0.1:48557_solr c:forwardingCollection s:shard1 r:core_node2 x:forwardingCollection_shard1_replica_n1] o.a.s.u.UpdateLog Initializing UpdateLog: dataDir= defaultSyncLevel=FLUSH numRecordsToKeep=100 maxNumLogsToKeep=10 numVersionBuckets=65536
   [junit4]   2> 3700196 INFO  (qtp630348360-32182) [n:127.0.0.1:48557_solr c:forwardingCollection s:shard1 r:core_node2 x:forwardingCollection_shard1_replica_n1] o.a.s.u.CommitTracker Hard AutoCommit: disabled
   [junit4]   2> 3700196 INFO  (qtp630348360-32182) [n:127.0.0.1:48557_solr c:forwardingCollection s:shard1 r:core_node2 x:forwardingCollection_shard1_replica_n1] o.a.s.u.CommitTracker Soft AutoCommit: disabled
   [junit4]   2> 3700197 INFO  (qtp630348360-32182) [n:127.0.0.1:48557_solr c:forwardingCollection s:shard1 r:core_node2 x:forwardingCollection_shard1_replica_n1] o.a.s.u.RandomMergePolicy RandomMergePolicy wrapping class org.apache.lucene.index.TieredMergePolicy: [TieredMergePolicy: maxMergeAtOnce=42, maxMergeAtOnceExplicit=43, maxMergedSegmentMB=64.8642578125, floorSegmentMB=2.1484375, forceMergeDeletesPctAllowed=13.109142658471475, segmentsPerTier=39.0, maxCFSSegmentSizeMB=8.796093022207999E12, noCFSRatio=0.6990575651257467
   [junit4]   2> 3700197 INFO  (qtp630348360-32182) [n:127.0.0.1:48557_solr c:forwardingCollection s:shard1 r:core_node2 x:forwardingCollection_shard1_replica_n1] o.a.s.s.SolrIndexSearcher Opening [Searcher@63bad6e[forwardingCollection_shard1_replica_n1] main]
   [junit4]   2> 3700199 INFO  (qtp630348360-32182) [n:127.0.0.1:48557_solr c:forwardingCollection s:shard1 r:core_node2 x:forwardingCollection_shard1_replica_n1] o.a.s.h.c.SpellCheckComponent Initializing spell checkers
   [junit4]   2> 3700207 INFO  (qtp630348360-32182) [n:127.0.0.1:48557_solr c:forwardingCollection s:shard1 r:core_node2 x:forwardingCollection_shard1_replica_n1] o.a.s.s.DirectSolrSpellChecker init: {name=direct,classname=DirectSolrSpellChecker,field=lowerfilt,minQueryLength=3}
   [junit4]   2> 3700228 INFO  (qtp630348360-32182) [n:127.0.0.1:48557_solr c:forwardingCollection s:shard1 r:core_node2 x:forwardingCollection_shard1_replica_n1] o.a.s.h.ReplicationHandler Commits will be reserved for 10000ms.
   [junit4]   2> 3700229 INFO  (qtp630348360-32182) [n:127.0.0.1:48557_solr c:forwardingCollection s:shard1 r:core_node2 x:forwardingCollection_shard1_replica_n1] o.a.s.u.UpdateLog Could not find max version in index or recent updates, using new clock 1588626234342899712
   [junit4]   2> 3700229 INFO  (searcherExecutor-10227-thread-1-processing-n:127.0.0.1:48557_solr x:forwardingCollection_shard1_replica_n1 s:shard1 c:forwardingCollection r:core_node2) [n:127.0.0.1:48557_solr c:forwardingCollection s:shard1 r:core_node2 x:forwardingCollection_shard1_replica_n1] o.a.s.h.c.SpellCheckComponent Loading spell index for spellchecker: default
   [junit4]   2> 3700234 INFO  (searcherExecutor-10227-thread-1-processing-n:127.0.0.1:48557_solr x:forwardingCollection_shard1_replica_n1 s:shard1 c:forwardingCollection r:core_node2) [n:127.0.0.1:48557_solr c:forwardingCollection s:shard1 r:core_node2 x:forwardingCollection_shard1_replica_n1] o.a.s.h.c.SpellCheckComponent Loading spell index for spellchecker: direct
   [junit4]   2> 3700235 INFO  (searcherExecutor-10227-thread-1-processing-n:127.0.0.1:48557_solr x:forwardingCollection_shard1_replica_n1 s:shard1 c:forwardingCollection r:core_node2) [n:127.0.0.1:48557_solr c:forwardingCollection s:shard1 r:core_node2 x:forwardingCollection_shard1_replica_n1] o.a.s.h.c.SpellCheckComponent Loading spell index for spellchecker: wordbreak
   [junit4]   2> 3700235 INFO  (searcherExecutor-10227-thread-1-processing-n:127.0.0.1:48557_solr x:forwardingCollection_shard1_replica_n1 s:shard1 c:forwardingCollection r:core_node2) [n:127.0.0.1:48557_solr c:forwardingCollection s:shard1 r:core_node2 x:forwardingCollection_shard1_replica_n1] o.a.s.h.c.SpellCheckComponent Loading spell index for spellchecker: multipleFields
   [junit4]   2> 3700235 INFO  (searcherExecutor-10227-thread-1-processing-n:127.0.0.1:48557_solr x:forwardingCollection_shard1_replica_n1 s:shard1 c:forwardingCollection r:core_node2) [n:127.0.0.1:48557_solr c:forwardingCollection s:shard1 r:core_node2 x:forwardingCollection_shard1_replica_n1] o.a.s.h.c.SpellCheckComponent Loading spell index for spellchecker: jarowinkler
   [junit4]   2> 3700236 INFO  (searcherExecutor-10227-thread-1-processing-n:127.0.0.1:48557_solr x:forwardingCollection_shard1_replica_n1 s:shard1 c:forwardingCollection r:core_node2) [n:127.0.0.1:48557_solr c:forwardingCollection s:shard1 r:core_node2 x:forwardingCollection_shard1_replica_n1] o.a.s.h.c.SpellCheckComponent Loading spell index for spellchecker: external
   [junit4]   2> 3700236 INFO  (searcherExecutor-10227-thread-1-processing-n:127.0.0.1:48557_solr x:forwardingCollection_shard1_replica_n1 s:shard1 c:forwardingCollection r:core_node2) [n:127.0.0.1:48557_solr c:forwardingCollection s:shard1 r:core_node2 x:forwardingCollection_shard1_replica_n1] o.a.s.h.c.SpellCheckComponent Loading spell index for spellchecker: freq
   [junit4]   2> 3700236 INFO  (searcherExecutor-10227-thread-1-processing-n:127.0.0.1:48557_solr x:forwardingCollection_shard1_replica_n1 s:shard1 c:forwardingCollection r:core_node2) [n:127.0.0.1:48557_solr c:forwardingCollection s:shard1 r:core_node2 x:forwardingCollection_shard1_replica_n1] o.a.s.h.c.SpellCheckComponent Loading spell index for spellchecker: fqcn
   [junit4]   2> 3700237 INFO  (searcherExecutor-10227-thread-1-processing-n:127.0.0.1:48557_solr x:forwardingCollection_shard1_replica_n1 s:shard1 c:forwardingCollection r:core_node2) [n:127.0.0.1:48557_solr c:forwardingCollection s:shard1 r:core_node2 x:forwardingCollection_shard1_replica_n1] o.a.s.h.c.SpellCheckComponent Loading spell index for spellchecker: perDict
   [junit4]   2> 3700238 INFO  (searcherExecutor-10227-thread-1-processing-n:127.0.0.1:48557_solr x:forwardingCollection_shard1_replica_n1 s:shard1 c:forwardingCollection r:core_node2) [n:127.0.0.1:48557_solr c:forwardingCollection s:shard1 r:core_node2 x:forwardingCollection_shard1_replica_n1] o.a.s.c.SolrCore [forwardingCollection_shard1_replica_n1] Registered new searcher Searcher@63bad6e[forwardingCollection_shard1_replica_n1] main{ExitableDirectoryReader(UninvertingDirectoryReader())}
   [junit4]   2> 3700261 INFO  (qtp630348360-32182) [n:127.0.0.1:48557_solr c:forwardingCollection s:shard1 r:core_node2 x:forwardingCollection_shard1_replica_n1] o.a.s.c.ShardLeaderElectionContext Enough replicas found to continue.
   [junit4]   2> 3700261 INFO  (qtp630348360-32182) [n:127.0.0.1:48557_solr c:forwardingCollection s:shard1 r:core_node2 x:forwardingCollection_shard1_replica_n1] o.a.s.c.ShardLeaderElectionContext I may be the new leader - try and sync
   [junit4]   2> 3700261 INFO  (qtp630348360-32182) [n:127.0.0.1:48557_solr c:forwardingCollection s:shard1 r:core_node2 x:forwardingCollection_shard1_replica_n1] o.a.s.c.SyncStrategy Sync replicas to http://127.0.0.1:48557/solr/forwardingCollection_shard1_replica_n1/
   [junit4]   2> 3700261 INFO  (qtp630348360-32182) [n:127.0.0.1:48557_solr c:forwardingCollection s:shard1 r:core_node2 x:forwardingCollection_shard1_replica_n1] o.a.s.c.SyncStrategy Sync Success - now sync replicas to me
   [junit4]   2> 3700261 INFO  (qtp630348360-32182) [n:127.0.0.1:48557_solr c:forwardingCollection s:shard1 r:core_node2 x:forwardingCollection_shard1_replica_n1] o.a.s.c.SyncStrategy http://127.0.0.1:48557/solr/forwardingCollection_shard1_replica_n1/ has no replicas
   [junit4]   2> 3700261 INFO  (qtp630348360-32182) [n:127.0.0.1:48557_solr c:forwardingCollection s:shard1 r:core_node2 x:forwardingCollection_shard1_replica_n1] o.a.s.c.ShardLeaderElectionContext Found all replicas participating in election, clear LIR
   [junit4]   2> 3700272 INFO  (qtp630348360-32182) [n:127.0.0.1:48557_solr c:forwardingCollection s:shard1 r:core_node2 x:forwardingCollection_shard1_replica_n1] o.a.s.c.ShardLeaderElectionContext I am the new leader: http://127.0.0.1:48557/solr/forwardingCollection_shard1_replica_n1/ shard1
   [junit4]   2> 3700375 INFO  (zkCallback-6085-thread-1-processing-n:127.0.0.1:48557_solr) [n:127.0.0.1:48557_solr    ] o.a.s.c.c.ZkStateReader A cluster state change: [WatchedEvent state:SyncConnected type:NodeDataChanged path:/collections/forwardingCollection/state.json] for collection [forwardingCollection] has occurred - updating... (live nodes size: [2])
   [junit4]   2> 3700375 INFO  (zkCallback-6085-thread-2-processing-n:127.0.0.1:48557_solr) [n:127.0.0.1:48557_solr    ] o.a.s.c.c.ZkStateReader A cluster state change: [WatchedEvent state:SyncConnected type:NodeDataChanged path:/collections/forwardingCollection/state.json] for collection [forwardingCollection] has occurred - updating... (live nodes size: [2])
   [junit4]   2> 3700424 INFO  (qtp630348360-32182) [n:127.0.0.1:48557_solr c:forwardingCollection s:shard1 r:core_node2 x:forwardingCollection_shard1_replica_n1] o.a.s.c.ZkController I am the leader, no recovery necessary
   [junit4]   2> 3700427 INFO  (qtp630348360-32182) [n:127.0.0.1:48557_solr c:forwardingCollection s:shard1 r:core_node2 x:forwardingCollection_shard1_replica_n1] o.a.s.s.HttpSolrCall [admin] webapp=null path=/admin/cores params={qt=/admin/cores&coreNodeName=core_node2&collection.configName=conf1&newCollection=true&name=forwardingCollection_shard1_replica_n1&action=CREATE&numShards=1&collection=forwardingCollection&shard=shard1&wt=javabin&version=2&replicaType=NRT} status=0 QTime=1497
   [junit4]   2> 3700431 INFO  (qtp1963864737-32193) [n:127.0.0.1:45905_solr    ] o.a.s.h.a.CollectionsHandler Wait for new collection to be active for at most 30 seconds. Check all shard replicas
   [junit4]   2> 3700531 INFO  (zkCallback-6085-thread-2-processing-n:127.0.0.1:48557_solr) [n:127.0.0.1:48557_solr    ] o.a.s.c.c.ZkStateReader A cluster state change: [WatchedEvent state:SyncConnected type:NodeDataChanged path:/collections/forwardingCollection/state.json] for collection [forwardingCollection] has occurred - updating... (live nodes size: [2])
   [junit4]   2> 3700531 INFO  (zkCallback-6085-thread-1-processing-n:127.0.0.1:48557_solr) [n:127.0.0.1:48557_solr    ] o.a.s.c.c.ZkStateReader A cluster state change: [WatchedEvent state:SyncConnected type:NodeDataChanged path:/collections/forwardingCollection/state.json] for collection [forwardingCollection] has occurred - updating... (live nodes size: [2])
   [junit4]   2> 3700614 INFO  (OverseerCollectionConfigSetProcessor-99289139387760645-127.0.0.1:45905_solr-n_0000000000) [n:127.0.0.1:45905_solr    ] o.a.s.c.OverseerTaskQueue Response ZK path: /overseer/collection-queue-work/qnr-0000000000 doesn't exist.  Requestor may have disconnected from ZooKeeper
   [junit4]   2> 3701435 INFO  (qtp1963864737-32193) [n:127.0.0.1:45905_solr    ] o.a.s.s.HttpSolrCall [admin] webapp=null path=/admin/collections params={pullReplicas=0&replicationFactor=1&collection.configName=conf1&maxShardsPerNode=1&name=forwardingCollection&nrtReplicas=1&action=CREATE&numShards=1&tlogReplicas=0&wt=javabin&version=2} status=0 QTime=2895
   [junit4]   2> 3701436 INFO  (TEST-TestSolrCloudWithSecureImpersonation.testForwarding-seed#[19B1402007EFAAAD]) [    ] o.a.s.c.AbstractDistribZkTestBase Wait for recoveries to finish - collection: forwardingCollection failOnTimeout:true timeout (sec):100
   [junit4]   2> 3701436 INFO  (TEST-TestSolrCloudWithSecureImpersonation.testForwarding-seed#[19B1402007EFAAAD]) [    ] o.a.s.c.AbstractDistribZkTestBase Recoveries finished - collection: forwardingCollection
   [junit4]   2> 3701439 INFO  (qtp1963864737-32195) [n:127.0.0.1:45905_solr    ] o.a.s.c.TransientSolrCoreCacheDefault Allocating transient cache for 2147483647 transient cores
   [junit4]   2> 3701443 INFO  (qtp630348360-32184) [n:127.0.0.1:48557_solr c:forwardingCollection s:shard1 r:core_node2 x:forwardingCollection_shard1_replica_n1] o.a.s.c.S.Request [forwardingCollection_shard1_replica_n1]  webapp=/solr path=/select params={q=*:*&wt=javabin&version=2} hits=0 status=0 QTime=0
   [junit4]   2> 3701446 INFO  (qtp630348360-32187) [n:127.0.0.1:48557_solr c:forwardingCollection s:shard1 r:core_node2 x:forwardingCollection_shard1_replica_n1] o.a.s.c.S.Request [forwardingCollection_shard1_replica_n1]  webapp=/solr path=/select params={q=*:*&wt=javabin&version=2} hits=0 status=0 QTime=0
   [junit4]   2> 3701446 INFO  (TEST-TestSolrCloudWithSecureImpersonation.testForwarding-seed#[19B1402007EFAAAD]) [    ] o.a.s.SolrTestCaseJ4 ###Ending testForwarding
   [junit4]   2> 3701482 INFO  (TEST-TestSolrCloudWithSecureImpersonation.testProxyUnknownRemote-seed#[19B1402007EFAAAD]) [    ] o.a.s.SolrTestCaseJ4 ###Starting testProxyUnknownRemote
   [junit4]   2> 3711635 WARN  (TEST-TestSolrCloudWithSecureImpersonation.testForwarding-seed#[19B1402007EFAAAD]-SendThread(127.0.0.1:44730)) [    ] o.a.z.ClientCnxn Client session timed out, have not heard from server in 10199ms for sessionid 0x160bef23b43000b
   [junit4]   2> 3711638 WARN  (jetty-launcher-6067-thread-2-SendThread(127.0.0.1:44730)) [n:127.0.0.1:45905_solr    ] o.a.z.ClientCnxn Client session timed out, have not heard from server in 14544ms for sessionid 0x160bef23b430007
   [junit4]   2> 3711639 WARN  (jetty-launcher-6067-thread-1-SendThread(127.0.0.1:44730)) [n:127.0.0.1:48557_solr    ] o.a.z.ClientCnxn Client session timed out, have not heard from server in 14544ms for sessionid 0x160bef23b430008
   [junit4]   2> 3711638 WARN  (NIOServerCxn.Factory:0.0.0.0/0.0.0.0:0) [    ] o.a.z.s.NIOServerCnxn caught end of stream exception
   [junit4]   2> EndOfStreamException: Unable to read additional data from client sessionid 0x160bef23b43000b, likely client has closed socket
   [junit4]   2> 	at org.apache.zookeeper.server.NIOServerCnxn.doIO(NIOServerCnxn.java:239)
   [junit4]   2> 	at org.apache.zookeeper.server.NIOServerCnxnFactory.run(NIOServerCnxnFactory.java:203)
   [junit4]   2> 	at java.lang.Thread.run(Thread.java:748)
   [junit4]   2> 3711641 INFO  (TEST-TestSolrCloudWithSecureImpersonation.testProxyUnknownRemote-seed#[19B1402007EFAAAD]) [    ] o.a.s.SolrTestCaseJ4 ###Ending testProxyUnknownRemote
   [junit4]   2> 3711641 WARN  (NIOServerCxn.Factory:0.0.0.0/0.0.0.0:0) [    ] o.a.z.s.NIOServerCnxn caught end of stream exception
   [junit4]   2> EndOfStreamException: Unable to read additional data from client sessionid 0x160bef23b430007, likely client has closed socket
   [junit4]   2> 	at org.apache.zookeeper.server.NIOServerCnxn.doIO(NIOServerCnxn.java:239)
   [junit4]   2> 	at org.apache.zookeeper.server.NIOServerCnxnFactory.run(NIOServerCnxnFactory.java:203)
   [junit4]   2> 	at java.lang.Thread.run(Thread.java:748)
   [junit4]   2> 3711641 WARN  (NIOServerCxn.Factory:0.0.0.0/0.0.0.0:0) [    ] o.a.z.s.NIOServerCnxn caught end of stream exception
   [junit4]   2> EndOfStreamException: Unable to read additional data from client sessionid 0x160bef23b430008, likely client has closed socket
   [junit4]   2> 	at org.apache.zookeeper.server.NIOServerCnxn.doIO(NIOServerCnxn.java:239)
   [junit4]   2> 	at org.apache.zookeeper.server.NIOServerCnxnFactory.run(NIOServerCnxnFactory.java:203)
   [junit4]   2> 	at java.lang.Thread.run(Thread.java:748)
   [junit4]   2> 3711679 INFO  (TEST-TestSolrCloudWithSecureImpersonation.testProxyNoConfigGroups-seed#[19B1402007EFAAAD]) [    ] o.a.s.SolrTestCaseJ4 ###Starting testProxyNoConfigGroups
   [junit4]   2> 3711681 INFO  (TEST-TestSolrCloudWithSecureImpersonation.testProxyNoConfigGroups-seed#[19B1402007EFAAAD]) [    ] o.a.s.SolrTestCaseJ4 ###Ending testProxyNoConfigGroups
   [junit4]   2> 3711720 INFO  (TEST-TestSolrCloudWithSecureImpersonation.testProxyInvalidRemote-seed#[19B1402007EFAAAD]) [    ] o.a.s.SolrTestCaseJ4 ###Starting testProxyInvalidRemote
   [junit4]   2> 3711727 INFO  (TEST-TestSolrCloudWithSecureImpersonation.testProxyInvalidRemote-seed#[19B1402007EFAAAD]) [    ] o.a.s.SolrTestCaseJ4 ###Ending testProxyInvalidRemote
   [junit4]   2> 3711737 WARN  (zkConnectionManagerCallback-6098-thread-1) [    ] o.a.s.c.c.ConnectionManager Watcher org.apache.solr.common.cloud.ConnectionManager@204734ff name: ZooKeeperConnection Watcher:127.0.0.1:44730/solr got event WatchedEvent state:Disconnected type:None path:null path: null type: None
   [junit4]   2> 3711737 WARN  (zkConnectionManagerCallback-6098-thread-1) [    ] o.a.s.c.c.ConnectionManager zkClient has disconnected
   [junit4]   2> 3711739 INFO  (jetty-launcher-6067-thread-1-EventThread) [n:127.0.0.1:48557_solr    ] o.a.c.f.s.ConnectionStateManager State change: SUSPENDED
   [junit4]   2> 3711739 INFO  (jetty-launcher-6067-thread-2-EventThread) [n:127.0.0.1:45905_solr    ] o.a.c.f.s.ConnectionStateManager State change: SUSPENDED
   [junit4]   2> 3711803 INFO  (TEST-TestSolrCloudWithSecureImpersonation.testProxyValidateGroup-seed#[19B1402007EFAAAD]) [    ] o.a.s.SolrTestCaseJ4 ###Starting testProxyValidateGroup
   [junit4]   2> 3711804 INFO  (qtp1963864737-32193) [n:127.0.0.1:45905_solr    ] o.a.s.h.a.CollectionsHandler Invoked Collection Action :list with params doAs=jenkins&action=LIST&wt=javabin&version=2 and sendToOCPQueue=true
   [junit4]   2> 3711805 INFO  (qtp1963864737-32193) [n:127.0.0.1:45905_solr    ] o.a.s.s.HttpSolrCall [admin] webapp=null path=/admin/collections params={doAs=jenkins&action=LIST&wt=javabin&version=2} status=0 QTime=1
   [junit4]   2> 3711806 INFO  (TEST-TestSolrCloudWithSecureImpersonation.testProxyValidateGroup-seed#[19B1402007EFAAAD]) [    ] o.a.s.SolrTestCaseJ4 ###Ending testProxyValidateGroup
   [junit4]   2> 3711857 INFO  (TEST-TestSolrCloudWithSecureImpersonation.testProxyValidateHost-seed#[19B1402007EFAAAD]) [    ] o.a.s.SolrTestCaseJ4 ###Starting testProxyValidateHost
   [junit4]   2> 3711859 INFO  (qtp1963864737-32192) [n:127.0.0.1:45905_solr    ] o.a.s.h.a.CollectionsHandler Invoked Collection Action :list with params doAs=bar&action=LIST&wt=javabin&version=2 and sendToOCPQueue=true
   [junit4]   2> 3711860 INFO  (qtp1963864737-32192) [n:127.0.0.1:45905_solr    ] o.a.s.s.HttpSolrCall [admin] webapp=null path=/admin/collections params={doAs=bar&action=LIST&wt=javabin&version=2} status=0 QTime=1
   [junit4]   2> 3711860 INFO  (TEST-TestSolrCloudWithSecureImpersonation.testProxyValidateHost-seed#[19B1402007EFAAAD]) [    ] o.a.s.SolrTestCaseJ4 ###Ending testProxyValidateHost
   [junit4]   2> 3711912 INFO  (TEST-TestSolrCloudWithSecureImpersonation.testProxyWrongHost-seed#[19B1402007EFAAAD]) [    ] o.a.s.SolrTestCaseJ4 ###Starting testProxyWrongHost
   [junit4]   2> 3711937 INFO  (TEST-TestSolrCloudWithSecureImpersonation.testProxyWrongHost-seed#[19B1402007EFAAAD]) [    ] o.a.s.SolrTestCaseJ4 ###Ending testProxyWrongHost
   [junit4]   2> 3711976 INFO  (TEST-TestSolrCloudWithSecureImpersonation.testProxyValidateAnyHostAnyUser-seed#[19B1402007EFAAAD]) [    ] o.a.s.SolrTestCaseJ4 ###Starting testProxyValidateAnyHostAnyUser
   [junit4]   2> 3711977 INFO  (qtp1963864737-32181) [n:127.0.0.1:45905_solr    ] o.a.s.h.a.CollectionsHandler Invoked Collection Action :list with params doAs=bar&action=LIST&wt=javabin&version=2 and sendToOCPQueue=true
   [junit4]   2> 3711978 INFO  (qtp1963864737-32181) [n:127.0.0.1:45905_solr    ] o.a.s.s.HttpSolrCall [admin] webapp=null path=/admin/collections params={doAs=bar&action=LIST&wt=javabin&version=2} status=0 QTime=0
   [junit4]   2> 3711978 INFO  (TEST-TestSolrCloudWithSecureImpersonation.testProxyValidateAnyHostAnyUser-seed#[19B1402007EFAAAD]) [    ] o.a.s.SolrTestCaseJ4 ###Ending testProxyValidateAnyHostAnyUser
   [junit4]   2> 3712016 INFO  (TEST-TestSolrCloudWithSecureImpersonation.testProxyNoConfigHosts-seed#[19B1402007EFAAAD]) [    ] o.a.s.SolrTestCaseJ4 ###Starting testProxyNoConfigHosts
   [junit4]   2> 3712019 INFO  (TEST-TestSolrCloudWithSecureImpersonation.testProxyNoConfigHosts-seed#[19B1402007EFAAAD]) [    ] o.a.s.SolrTestCaseJ4 ###Ending testProxyNoConfigHosts
   [junit4]   2> 3712052 INFO  (TEST-TestSolrCloudWithSecureImpersonation.testProxyInvalidProxyUser-seed#[19B1402007EFAAAD]) [    ] o.a.s.SolrTestCaseJ4 ###Starting testProxyInvalidProxyUser
   [junit4]   2> 3712055 INFO  (TEST-TestSolrCloudWithSecureImpersonation.testProxyInvalidProxyUser-seed#[19B1402007EFAAAD]) [    ] o.a.s.SolrTestCaseJ4 ###Ending testProxyInvalidProxyUser
   [junit4]   2> 3712087 INFO  (TEST-TestSolrCloudWithSecureImpersonation.testProxyNullProxyUser-seed#[19B1402007EFAAAD]) [    ] o.a.s.SolrTestCaseJ4 ###Starting testProxyNullProxyUser
   [junit4]   2> 3712087 INFO  (qtp1963864737-32191) [    ] o.a.s.s.SolrDispatchFilter Error authenticating
   [junit4]   2> java.lang.IllegalArgumentException: userName is NULL, empty or contains a '&'
   [junit4]   2> 	at org.apache.hadoop.security.authentication.util.AuthToken.checkForIllegalArgument(AuthToken.java:87)
   [junit4]   2> 	at org.apache.hadoop.security.authentication.util.AuthToken.<init>(AuthToken.java:70)
   [junit4]   2> 	at org.apache.hadoop.security.authentication.server.AuthenticationToken.<init>(AuthenticationToken.java:58)
   [junit4]   2> 	at org.apache.solr.security.HttpParamDelegationTokenPlugin$HttpParamDelegationTokenAuthenticationHandler$HttpParamAuthenticationHandler.authenticate(HttpParamDelegationTokenPlugin.java:213)
   [junit4]   2> 	at org.apache.hadoop.security.token.delegation.web.DelegationTokenAuthenticationHandler.authenticate(DelegationTokenAuthenticationHandler.java:348)
   [junit4]   2> 	at org.apache.solr.security.RequestContinuesRecorderAuthenticationHandler.authenticate(RequestContinuesRecorderAuthenticationHandler.java:69)
   [junit4]   2> 	at org.apache.hadoop.security.authentication.server.AuthenticationFilter.doFilter(AuthenticationFilter.java:518)
   [junit4]   2> 	at org.apache.solr.security.DelegationTokenKerberosFilter.doFilter(DelegationTokenKerberosFilter.java:134)
   [junit4]   2> 	at org.apache.solr.security.HttpParamDelegationTokenPlugin$HttpParamToRequestFilter.doFilter(HttpParamDelegationTokenPlugin.java:245)
   [junit4]   2> 	at org.apache.solr.security.KerberosPlugin.doAuthenticate(KerberosPlugin.java:243)
   [junit4]   2> 	at org.apache.solr.servlet.SolrDispatchFilter.authenticateRequest(SolrDispatchFilter.java:451)
   [junit4]   2> 	at org.apache.solr.servlet.SolrDispatchFilter.doFilter(SolrDispatchFilter.java:347)
   [junit4]   2> 	at org.apache.solr.servlet.SolrDispatchFilter.doFilter(SolrDispatchFilter.java:326)
   [junit4]   2> 	at org.eclipse.jetty.servlet.ServletHandler$CachedChain.doFilter(ServletHandler.java:1759)
   [junit4]   2> 	at org.apache.solr.client.solrj.embedded.JettySolrRunner$DebugFilter.doFilter(JettySolrRunner.java:139)
   [junit4]   2> 	at org.eclipse.jetty.servlet.ServletHandler$CachedChain.doFilter(ServletHandler.java:1759)
   [junit4]   2> 	at org.eclipse.jetty.servlet.ServletHandler.doHandle(ServletHandler.java:582)
   [junit4]   2> 	at org.eclipse.jetty.server.session.SessionHandler.doHandle(SessionHandler.java:224)
   [junit4]   2> 	at org.eclipse.jetty.server.handler.ContextHandler.doHandle(ContextHandler.java:1180)
   [junit4]   2> 	at org.eclipse.jetty.servlet.ServletHandler.doScope(ServletHandler.java:512)
   [junit4]   2> 	at org.eclipse.jetty.server.session.SessionHandler.doScope(SessionHandler.java:185)
   [junit4]   2> 	at org.eclipse.jetty.server.handler.ContextHandler.doScope(ContextHandler.java:1112)
   [junit4]   2> 	at org.eclipse.jetty.server.handler.ScopedHandler.handle(ScopedHandler.java:141)
   [junit4]   2> 	at org.eclipse.jetty.server.handler.gzip.GzipHandler.handle(GzipHandler.java:493)
   [junit4]   2> 	at org.eclipse.jetty.server.handler.HandlerWrapper.handle(HandlerWrapper.java:134)
   [junit4]   2> 	at org.eclipse.jetty.server.Server.handle(Server.java:534)
   [junit4]   2> 	at org.eclipse.jetty.server.HttpChannel.handle(HttpChannel.java:320)
   [junit4]   2> 	at org.eclipse.jetty.server.HttpConnection.onFillable(HttpConnection.java:251)
   [junit4]   2> 	at org.eclipse.jetty.io.AbstractConnection$ReadCallback.succeeded(AbstractConnection.java:283)
   [junit4]   2> 	at org.eclipse.jetty.io.FillInterest.fillable(FillInterest.java:108)
   [junit4]   2> 	at org.eclipse.jetty.io.SelectChannelEndPoint$2.run(SelectChannelEndPoint.java:93)
   [junit4]   2> 	at org.eclipse.jetty.util.thread.strategy.ExecuteProduceConsume.executeProduceConsume(ExecuteProduceConsume.java:303)
   [junit4]   2> 	at org.eclipse.jetty.util.thread.strategy.ExecuteProduceConsume.produceConsume(ExecuteProduceConsume.java:148)
   [junit4]   2> 	at org.eclipse.jetty.util.thread.strategy.ExecuteProduceConsume.run(ExecuteProduceConsume.java:136)
   [junit4]   2> 	at org.eclipse.jetty.util.thread.QueuedThreadPool.runJob(QueuedThreadPool.java:671)
   [junit4]   2> 	at org.eclipse.jetty.util.thread.QueuedThreadPool$2.run(QueuedThreadPool.java:589)
   [junit4]   2> 	at java.lang.Thread.run(Thread.java:748)
   [junit4]   2> 3712088 WARN  (qtp1963864737-32191) [    ] o.e.j.s.ServletHandler /solr/admin/collections
   [junit4]   2> org.apache.solr.common.SolrException: Error during request authentication, 
   [junit4]   2> 	at org.apache.solr.servlet.SolrDispatchFilter.authenticateRequest(SolrDispatchFilter.java:457)
   [junit4]   2> 	at org.apache.solr.servlet.SolrDispatchFilter.doFilter(SolrDispatchFilter.java:347)
   [junit4]   2> 	at org.apache.solr.servlet.SolrDispatchFilter.doFilter(SolrDispatchFilter.java:326)
   [junit4]   2> 	at org.eclipse.jetty.servlet.ServletHandler$CachedChain.doFilter(ServletHandler.java:1759)
   [junit4]   2> 	at org.apache.solr.client.solrj.embedded.JettySolrRunner$DebugFilter.doFilter(JettySolrRunner.java:139)
   [junit4]   2> 	at org.eclipse.jetty.servlet.ServletHandler$CachedChain.doFilter(ServletHandler.java:1759)
   [junit4]   2> 	at org.eclipse.jetty.servlet.ServletHandler.doHandle(ServletHandler.java:582)
   [junit4]   2> 	at org.eclipse.jetty.server.session.SessionHandler.doHandle(SessionHandler.java:224)
   [junit4]   2> 	at org.eclipse.jetty.server.handler.ContextHandler.doHandle(ContextHandler.java:1180)
   [junit4]   2> 	at org.eclipse.jetty.servlet.ServletHandler.doScope(ServletHandler.java:512)
   [junit4]   2> 	at org.eclipse.jetty.server.session.SessionHandler.doScope(SessionHandler.java:185)
   [junit4]   2> 	at org.eclipse.jetty.server.handler.ContextHandler.doScope(ContextHandler.java:1112)
   [junit4]   2> 	at org.eclipse.jetty.server.handler.ScopedHandler.handle(ScopedHandler.java:141)
   [junit4]   2> 	at org.eclipse.jetty.server.handler.gzip.GzipHandler.handle(GzipHandler.java:493)
   [junit4]   2> 	at org.eclipse.jetty.server.handler.HandlerWrapper.handle(HandlerWrapper.java:134)
   [junit4]   2> 	at org.eclipse.jetty.server.Server.handle(Server.java:534)
   [junit4]   2> 	at org.eclipse.jetty.server.HttpChannel.handle(HttpChannel.java:320)
   [junit4]   2> 	at org.eclipse.jetty.server.HttpConnection.onFillable(HttpConnection.java:251)
   [junit4]   2> 	at org.eclipse.jetty.io.AbstractConnection$ReadCallback.succeeded(AbstractConnection.java:283)
   [junit4]   2> 	at org.eclipse.jetty.io.FillInterest.fillable(FillInterest.java:108)
   [junit4]   2> 	at org.eclipse.jetty.io.SelectChannelEndPoint$2.run(SelectChannelEndPoint.java:93)
   [junit4]   2> 	at org.eclipse.jetty.util.thread.strategy.ExecuteProduceConsume.executeProduceConsume(ExecuteProduceConsume.java:303)
   [junit4]   2> 	at org.eclipse.jetty.util.thread.strategy.ExecuteProduceConsume.produceConsume(ExecuteProduceConsume.java:148)
   [junit4]   2> 	at org.eclipse.jetty.util.thread.strategy.ExecuteProduceConsume.run(ExecuteProduceConsume.java:136)
   [junit4]   2> 	at org.eclipse.jetty.util.thread.QueuedThreadPool.runJob(QueuedThreadPool.java:671)
   [junit4]   2> 	at org.eclipse.jetty.util.thread.QueuedThreadPool$2.run(QueuedThreadPool.java:589)
   [junit4]   2> 	at java.lang.Thread.run(Thread.java:748)
   [junit4]   2> Caused by: java.lang.IllegalArgumentException: userName is NULL, empty or contains a '&'
   [junit4]   2> 	at org.apache.hadoop.security.authentication.util.AuthToken.checkForIllegalArgument(AuthToken.java:87)
   [junit4]   2> 	at org.apache.hadoop.security.authentication.util.AuthToken.<init>(AuthToken.java:70)
   [junit4]   2> 	at org.apache.hadoop.security.authentication.server.AuthenticationToken.<init>(AuthenticationToken.java:58)
   [junit4]   2> 	at org.apache.solr.security.HttpParamDelegationTokenPlugin$HttpParamDelegationTokenAuthenticationHandler$HttpParamAuthenticationHandler.authenticate(HttpParamDelegationTokenPlugin.java:213)
   [junit4]   2> 	at org.apache.hadoop.security.token.delegation.web.DelegationTokenAuthenticationHandler.authenticate(DelegationTokenAuthenticationHandler.java:348)
   [junit4]   2> 	at org.apache.solr.security.RequestContinuesRecorderAuthenticationHandler.authenticate(RequestContinuesRecorderAuthenticationHandler.java:69)
   [junit4]   2> 	at org.apache.hadoop.security.authentication.server.AuthenticationFilter.doFilter(AuthenticationFilter.java:518)
   [junit4]   2> 	at org.apache.solr.security.DelegationTokenKerberosFilter.doFilter(DelegationTokenKerberosFilter.java:134)
   [junit4]   2> 	at org.apache.solr.security.HttpParamDelegationTokenPlugin$HttpParamToRequestFilter.doFilter(HttpParamDelegationTokenPlugin.java:245)
   [junit4]   2> 	at org.apache.solr.security.KerberosPlugin.doAuthenticate(KerberosPlugin.java:243)
   [junit4]   2> 	at org.apache.solr.servlet.SolrDispatchFilter.authenticateRequest(SolrDispatchFilter.java:451)
   [junit4]   2> 	... 26 more
   [junit4]   2> 3712089 INFO  (TEST-TestSolrCloudWithSecureImpersonation.testProxyNullProxyUser-seed#[19B1402007EFAAAD]) [    ] o.a.s.SolrTestCaseJ4 ###Ending testProxyNullProxyUser
   [junit4]   2> 3712528 INFO  (jetty-closer-6068-thread-1) [    ] o.e.j.s.AbstractConnector Stopped ServerConnector@1ef848d4{HTTP/1.1,[http/1.1]}{127.0.0.1:0}
   [junit4]   2> 3712529 INFO  (jetty-closer-6068-thread-1) [    ] o.a.s.c.CoreContainer Shutting down CoreContainer instance=951851795
   [junit4]   2> 3712530 INFO  (jetty-closer-6068-thread-1) [    ] o.a.s.m.SolrMetricManager Closing metric reporters for registry=solr.node, tag=null
   [junit4]   2> 3712530 INFO  (jetty-closer-6068-thread-1) [    ] o.a.s.m.r.SolrJmxReporter Closing reporter [org.apache.solr.metrics.reporters.SolrJmxReporter@7a2c71ed: rootName = solr_45905, domain = solr.node, service url = null, agent id = null] for registry solr.node / com.codahale.metrics.MetricRegistry@336fecb2
   [junit4]   2> 3712530 INFO  (jetty-closer-6068-thread-2) [    ] o.e.j.s.AbstractConnector Stopped ServerConnector@41a10d00{HTTP/1.1,[http/1.1]}{127.0.0.1:0}
   [junit4]   2> 3712532 INFO  (jetty-closer-6068-thread-2) [    ] o.a.s.c.CoreContainer Shutting down CoreContainer instance=1869991966
   [junit4]   2> 3712532 INFO  (jetty-closer-6068-thread-2) [    ] o.a.s.m.SolrMetricManager Closing metric reporters for registry=solr.node, tag=null
   [junit4]   2> 3712532 INFO  (jetty-closer-6068-thread-2) [    ] o.a.s.m.r.SolrJmxReporter Closing reporter [org.apache.solr.metrics.reporters.SolrJmxReporter@4721ece1: rootName = solr_48557, domain = solr.node, service url = null, agent id = null] for registry solr.node / com.codahale.metrics.MetricRegistry@29e20a34
   [junit4]   2> 3712541 INFO  (jetty-closer-6068-thread-1) [    ] o.a.s.m.SolrMetricManager Closing metric reporters for registry=solr.jvm, tag=null
   [junit4]   2> 3712541 INFO  (jetty-closer-6068-thread-1) [    ] o.a.s.m.r.SolrJmxReporter Closing reporter [org.apache.solr.metrics.reporters.SolrJmxReporter@2a9ed80d: rootName = solr_45905, domain = solr.jvm, service url = null, agent id = null] for registry solr.jvm / com.codahale.metrics.MetricRegistry@38d68d16
   [junit4]   2> 3712541 INFO  (jetty-closer-6068-thread-2) [    ] o.a.s.m.SolrMetricManager Closing metric reporters for registry=solr.jvm, tag=null
   [junit4]   2> 3712541 INFO  (jetty-closer-6068-thread-2) [    ] o.a.s.m.r.SolrJmxReporter Closing reporter [org.apache.solr.metrics.reporters.SolrJmxReporter@2ab25934: rootName = solr_48557, domain = solr.jvm, service url = null, agent id = null] for registry solr.jvm / com.codahale.metrics.MetricRegistry@38d68d16
   [junit4]   2> 3712546 INFO  (jetty-closer-6068-thread-1) [    ] o.a.s.m.SolrMetricManager Closing metric reporters for registry=solr.jetty, tag=null
   [junit4]   2> 3712547 INFO  (jetty-closer-6068-thread-1) [    ] o.a.s.m.r.SolrJmxReporter Closing reporter [org.apache.solr.metrics.reporters.SolrJmxReporter@2d94b82d: rootName = solr_45905, domain = solr.jetty, service url = null, agent id = null] for registry solr.jetty / com.codahale.metrics.MetricRegistry@65b59dec
   [junit4]   2> 3712547 INFO  (jetty-closer-6068-thread-2) [    ] o.a.s.m.SolrMetricManager Closing metric reporters for registry=solr.jetty, tag=null
   [junit4]   2> 3712547 INFO  (jetty-closer-6068-thread-2) [    ] o.a.s.m.r.SolrJmxReporter Closing reporter [org.apache.solr.metrics.reporters.SolrJmxReporter@3363075f: rootName = solr_48557, domain = solr.jetty, service url = null, agent id = null] for registry solr.jetty / com.codahale.metrics.MetricRegistry@65b59dec
   [junit4]   2> 3712550 INFO  (jetty-closer-6068-thread-2) [    ] o.a.s.c.ZkController Remove node as live in ZooKeeper:/live_nodes/127.0.0.1:48557_solr
   [junit4]   2> 3712551 INFO  (jetty-closer-6068-thread-1) [    ] o.a.s.c.ZkController Remove node as live in ZooKeeper:/live_nodes/127.0.0.1:45905_solr
   [junit4]   2> 3712553 INFO  (jetty-closer-6068-thread-2) [    ] o.a.s.m.SolrMetricManager Closing metric reporters for registry=solr.cluster, tag=null
   [junit4]   2> 3712553 INFO  (zkCallback-6085-thread-2-processing-n:127.0.0.1:48557_solr) [n:127.0.0.1:48557_solr    ] o.a.s.c.c.ZkStateReader Updated live nodes from ZooKeeper... (2) -> (0)
   [junit4]   2> 3712553 INFO  (zkCallback-6083-thread-1-processing-n:127.0.0.1:45905_solr) [n:127.0.0.1:45905_solr    ] o.a.s.c.c.ZkStateReader Updated live nodes from ZooKeeper... (2) -> (0)
   [junit4]   2> 3712553 INFO  (jetty-closer-6068-thread-1) [    ] o.a.s.m.SolrMetricManager Closing metric reporters for registry=solr.cluster, tag=null
   [junit4]   2> 3712557 INFO  (zkCallback-6085-thread-1-processing-n:127.0.0.1:48557_solr) [n:127.0.0.1:48557_solr    ] o.a.s.c.c.ZkStateReader A cluster state change: [WatchedEvent state:SyncConnected type:NodeDataChanged path:/collections/forwardingCollection/state.json] for collection [forwardingCollection] has occurred - updating... (live nodes size: [0])
   [junit4]   2> 3712557 INFO  (jetty-closer-6068-thread-1) [    ] o.a.s.c.Overseer Overseer (id=99289139387760645-127.0.0.1:45905_solr-n_0000000000) closing
   [junit4]   2> 3712558 INFO  (OverseerStateUpdate-99289139387760645-127.0.0.1:45905_solr-n_0000000000) [n:127.0.0.1:45905_solr    ] o.a.s.c.Overseer Overseer Loop exiting : 127.0.0.1:45905_solr
   [junit4]   2> 3712559 WARN  (OverseerAutoScalingTriggerThread-99289139387760645-127.0.0.1:45905_solr-n_0000000000) [n:127.0.0.1:45905_solr    ] o.a.s.c.a.OverseerTriggerThread OverseerTriggerThread woken up but we are closed, exiting.
   [junit4]   2> 3712560 INFO  (zkCallback-6085-thread-3-processing-n:127.0.0.1:48557_solr) [n:127.0.0.1:48557_solr    ] o.a.s.c.c.ZkStateReader A cluster state change: [WatchedEvent state:SyncConnected type:NodeDataChanged path:/collections/forwardingCollection/state.json] for collection [forwardingCollection] has occurred - updating... (live nodes size: [0])
   [junit4]   2> 3712561 INFO  (coreCloseExecutor-10233-thread-1) [n:127.0.0.1:48557_solr c:forwardingCollection s:shard1 r:core_node2 x:forwardingCollection_shard1_replica_n1] o.a.s.c.SolrCore [forwardingCollection_shard1_replica_n1]  CLOSING SolrCore org.apache.solr.core.SolrCore@23987a62
   [junit4]   2> 3712561 INFO  (coreCloseExecutor-10233-thread-1) [n:127.0.0.1:48557_solr c:forwardingCollection s:shard1 r:core_node2 x:forwardingCollection_shard1_replica_n1] o.a.s.m.SolrMetricManager Closing metric reporters for registry=solr.core.forwardingCollection.shard1.replica_n1, tag=597195362
   [junit4]   2> 3712561 INFO  (coreCloseExecutor-10233-thread-1) [n:127.0.0.1:48557_solr c:forwardingCollection s:shard1 r:core_node2 x:forwardingCollection_shard1_replica_n1] o.a.s.m.r.SolrJmxReporter Closing reporter [org.apache.solr.metrics.reporters.SolrJmxReporter@510d3602: rootName = solr_48557, domain = solr.core.forwardingCollection.shard1.replica_n1, service url = null, agent id = null] for registry solr.core.forwardingCollection.shard1.replica_n1 / com.codahale.metrics.MetricRegistry@a36f8d1
   [junit4]   2> 3712569 INFO  (zkCallback-6085-thread-3-processing-n:127.0.0.1:48557_solr) [n:127.0.0.1:48557_solr    ] o.a.s.c.OverseerElectionContext I am going to be the leader 127.0.0.1:48557_solr
   [junit4]   2> 3712570 ERROR (Thread[Thread-8004,5,TGRP-TestSolrCloudWithSecureImpersonation]) [n:127.0.0.1:45905_solr    ] o.a.h.s.t.d.AbstractDelegationTokenSecretManager ExpiredTokenRemover received java.lang.InterruptedException: sleep interrupted
   [junit4]   2> 3712591 INFO  (coreCloseExecutor-10233-thread-1) [n:127.0.0.1:48557_solr c:forwardingCollection s:shard1 r:core_node2 x:forwardingCollection_shard1_replica_n1] o.a.s.m.SolrMetricManager Closing metric reporters for registry=solr.collection.forwardingCollection.shard1.leader, tag=597195362
   [junit4]   2> 3712597 ERROR (Thread[Thread-8007,5,TGRP-TestSolrCloudWithSecureImpersonation]) [n:127.0.0.1:48557_solr    ] o.a.h.s.t.d.AbstractDelegationTokenSecretManager ExpiredTokenRemover received java.lang.InterruptedException: sleep interrupted
   [junit4]   2> 3712827 INFO  (jetty-closer-6068-thread-2) [    ] o.e.j.s.h.ContextHandler Stopped o.e.j.s.ServletContextHandler@40ddf679{/solr,null,UNAVAILABLE}
   [junit4]   2> 3713067 INFO  (jetty-closer-6068-thread-1) [    ] o.e.j.s.h.ContextHandler Stopped o.e.j.s.ServletContextHandler@7d327cb0{/solr,null,UNAVAILABLE}
   [junit4]   2> 3713069 ERROR (SUITE-TestSolrCloudWithSecureImpersonation-seed#[19B1402007EFAAAD]-worker) [    ] o.a.z.s.ZooKeeperServer ZKShutdownHandler is not registered, so ZooKeeper server won't take any action on ERROR or SHUTDOWN server state changes
   [junit4]   2> 3713069 INFO  (SUITE-TestSolrCloudWithSecureImpersonation-seed#[19B1402007EFAAAD]-worker) [    ] o.a.s.c.ZkTestServer connecting to 127.0.0.1:44730 44730
   [junit4]   2> 3713208 INFO  (Thread-7987) [    ] o.a.s.c.ZkTestServer connecting to 127.0.0.1:44730 44730
   [junit4]   2> 3713210 WARN  (Thread-7987) [    ] o.a.s.c.ZkTestServer Watch limit violations: 
   [junit4]   2> Maximum concurrent create/delete watches above limit:
   [junit4]   2> 
   [junit4]   2> 	3	/solr/aliases.json
   [junit4]   2> 	3	/solr/clusterprops.json
   [junit4]   2> 	2	/solr/security.json
   [junit4]   2> 
   [junit4]   2> Maximum concurrent data watches above limit:
   [junit4]   2> 
   [junit4]   2> 	6	/solr/collections/forwardingCollection/state.json
   [junit4]   2> 	3	/solr/clusterstate.json
   [junit4]   2> 	2	/solr/security/zkdtsm/ZKDTSMRoot/ZKDTSMKeyIdRoot
   [junit4]   2> 	2	/solr/security/zkdtsm/ZKDTSMRoot/ZKDTSMMasterKeyRoot/DK_1
   [junit4]   2> 	2	/solr/security/zkdtsm/ZKDTSMRoot/ZKDTSMMasterKeyRoot/DK_3
   [junit4]   2> 	2	/solr/security/zkdtsm/ZKDTSMRoot/ZKDTSMMasterKeyRoot/DK_2
   [junit4]   2> 	2	/solr/security/zkdtsm/ZKDTSMRoot/ZKDTSMMasterKeyRoot/DK_4
   [junit4]   2> 	2	/solr/security/zkdtsm/ZKDTSMRoot/ZKDTSMSeqNumRoot
   [junit4]   2> 
   [junit4]   2> Maximum concurrent children watches above limit:
   [junit4]   2> 
   [junit4]   2> 	3	/solr/live_nodes
   [junit4]   2> 	3	/solr/collections
   [junit4]   2> 	2	/solr/security/zkdtsm/ZKDTSMRoot/ZKDTSMMasterKeyRoot
   [junit4]   2> 	2	/solr/security/zkdtsm/ZKDTSMRoot/ZKDTSMTokensRoot
   [junit4]   2> 
   [junit4]   2> 3713239 INFO  (SUITE-TestSolrCloudWithSecureImpersonation-seed#[19B1402007EFAAAD]-worker) [    ] o.a.s.SolrTestCaseJ4 ------------------------------------------------------- Done waiting for tracked resources to be released
   [junit4]   2> Jan 04, 2018 2:14:11 AM com.carrotsearch.randomizedtesting.ThreadLeakControl checkThreadLeaks
   [junit4]   2> WARNING: Will linger awaiting termination of 2 leaked thread(s).
   [junit4]   2> Jan 04, 2018 2:14:31 AM com.carrotsearch.randomizedtesting.ThreadLeakControl checkThreadLeaks
   [junit4]   2> SEVERE: 2 threads leaked from SUITE scope at org.apache.solr.cloud.TestSolrCloudWithSecureImpersonation: 
   [junit4]   2>    1) Thread[id=32229, name=jetty-launcher-6067-thread-2-EventThread, state=TIMED_WAITING, group=TGRP-TestSolrCloudWithSecureImpersonation]
   [junit4]   2>         at sun.misc.Unsafe.park(Native Method)
   [junit4]   2>         at java.util.concurrent.locks.LockSupport.parkNanos(LockSupport.java:215)
   [junit4]   2>         at java.util.concurrent.locks.AbstractQueuedSynchronizer.doAcquireSharedNanos(AbstractQueuedSynchronizer.java:1037)
   [junit4]   2>         at java.util.concurrent.locks.AbstractQueuedSynchronizer.tryAcquireSharedNanos(AbstractQueuedSynchronizer.java:1328)
   [junit4]   2>         at java.util.concurrent.CountDownLatch.await(CountDownLatch.java:277)
   [junit4]   2>         at org.apache.curator.CuratorZookeeperClient.internalBlockUntilConnectedOrTimedOut(CuratorZookeeperClient.java:323)
   [junit4]   2>         at org.apache.curator.RetryLoop.callWithRetry(RetryLoop.java:105)
   [junit4]   2>         at org.apache.curator.framework.imps.GetDataBuilderImpl.pathInForeground(GetDataBuilderImpl.java:288)
   [junit4]   2>         at org.apache.curator.framework.imps.GetDataBuilderImpl.forPath(GetDataBuilderImpl.java:279)
   [junit4]   2>         at org.apache.curator.framework.imps.GetDataBuilderImpl.forPath(GetDataBuilderImpl.java:41)
   [junit4]   2>         at org.apache.curator.framework.recipes.shared.SharedValue.readValue(SharedValue.java:244)
   [junit4]   2>         at org.apache.curator.framework.recipes.shared.SharedValue.access$100(SharedValue.java:44)
   [junit4]   2>         at org.apache.curator.framework.recipes.shared.SharedValue$1.process(SharedValue.java:61)
   [junit4]   2>         at org.apache.curator.framework.imps.NamespaceWatcher.process(NamespaceWatcher.java:67)
   [junit4]   2>         at org.apache.zookeeper.ClientCnxn$EventThread.processEvent(ClientCnxn.java:530)
   [junit4]   2>         at org.apache.zookeeper.ClientCnxn$EventThread.run(ClientCnxn.java:505)
   [junit4]   2>    2) Thread[id=32241, name=jetty-launcher-6067-thread-1-EventThread, state=TIMED_WAITING, group=TGRP-TestSolrCloudWithSecureImpersonation]
   [junit4]   2>         at sun.misc.Unsafe.park(Native Method)
   [junit4]   2>         at java.util.concurrent.locks.LockSupport.parkNanos(LockSupport.java:215)
   [junit4]   2>         at java.util.concurrent.locks.AbstractQueuedSynchronizer.doAcquireSharedNanos(AbstractQueuedSynchronizer.java:1037)
   [junit4]   2>         at java.util.concurrent.locks.AbstractQueuedSynchronizer.tryAcquireSharedNanos(AbstractQueuedSynchronizer.java:1328)
   [junit4]   2>         at java.util.concurrent.CountDownLatch.await(CountDownLatch.java:277)
   [junit4]   2>         at org.apache.curator.CuratorZookeeperClient.internalBlockUntilConnectedOrTimedOut(CuratorZookeeperClient.java:323)
   [junit4]   2>         at org.apache.curator.RetryLoop.callWithRetry(RetryLoop.java:105)
   [junit4]   2>         at org.apache.curator.framework.imps.GetDataBuilderImpl.pathInForeground(GetDataBuilderImpl.java:288)
   [junit4]   2>         at org.apache.curator.framework.imps.GetDataBuilderImpl.forPath(GetDataBuilderImpl.java:279)
   [junit4]   2>         at org.apache.curator.framework.imps.GetDataBuilderImpl.forPath(GetDataBuilderImpl.java:41)
   [junit4]   2>         at org.apache.curator.framework.recipes.shared.SharedValue.readValue(SharedValue.java:244)
   [junit4]   2>         at org.apache.curator.framework.recipes.shared.SharedValue.access$100(SharedValue.java:44)
   [junit4]   2>         at org.apache.curator.framework.recipes.shared.SharedValue$1.process(SharedValue.java:61)
   [junit4]   2>         at org.apache.curator.framework

[...truncated too long message...]

4]   2> NOTE: SunOS 5.11 amd64/Oracle Corporation 1.8.0_152 (64-bit)/cpus=3,threads=1,free=133240568,total=518979584
   [junit4]   2> NOTE: All tests run in this JVM: [XmlUpdateRequestHandlerTest, LegacyCloudClusterPropTest, HdfsRecoveryZkTest, HdfsTlogReplayBufferedWhileIndexingTest, MinimalSchemaTest, TestSlowCompositeReaderWrapper, TestClusterProperties, DirectSolrConnectionTest, TestManagedSchemaThreadSafety, TestCollectionsAPIViaSolrCloudCluster, DistributedFacetExistsSmallTest, NodeLostTriggerTest, SolrCloudExampleTest, AsyncCallRequestStatusResponseTest, TestSolrConfigHandler, SpellCheckComponentTest, TestRequestForwarding, TestComplexPhraseQParserPlugin, TestSolrFieldCacheBean, TestUpdate, TestRealTimeGet, DisMaxRequestHandlerTest, SimpleCollectionCreateDeleteTest, BlobRepositoryCloudTest, ClassificationUpdateProcessorTest, TestSubQueryTransformerCrossCore, TestPayloadScoreQParserPlugin, SortSpecParsingTest, TestNodeLostTrigger, LeaderElectionTest, TestSchemaManager, TestUtilizeNode, ClassificationUpdateProcessorFactoryTest, TestFieldCache, TestRebalanceLeaders, StatsComponentTest, AssignBackwardCompatibilityTest, TestBlobHandler, HdfsWriteToMultipleCollectionsTest, TestDocBasedVersionConstraints, TestUtils, AddBlockUpdateTest, QueryResultKeyTest, BJQParserTest, ClusterStateUpdateTest, TestImpersonationWithHadoopAuth, UniqFieldsUpdateProcessorFactoryTest, TestLockTree, CursorMarkTest, TestSolrCoreProperties, TestConfigSetProperties, CachingDirectoryFactoryTest, OutOfBoxZkACLAndCredentialsProvidersTest, ChangedSchemaMergeTest, SolrGraphiteReporterTest, HdfsChaosMonkeySafeLeaderTest, TestRangeQuery, TestNumericRangeQuery64, TestLeaderInitiatedRecoveryThread, ComputePlanActionTest, TestQuerySenderListener, DateFieldTest, TestMacros, TestLargeCluster, TestSolr4Spatial, TestLazyCores, EnumFieldTest, DistribCursorPagingTest, SpatialRPTFieldTypeTest, MultiTermTest, TestTrackingShardHandlerFactory, TestDFRSimilarityFactory, ZkControllerTest, TestUniqueKeyFieldResource, ConvertedLegacyTest, TestFreeTextSuggestions, MergeStrategyTest, TestPullReplica, CollectionReloadTest, HighlighterConfigTest, TestOmitPositions, BasicDistributedZkTest, ChaosMonkeySafeLeaderWithPullReplicasTest, TestDynamicLoading, TestMaxTokenLenTokenizer, TestSimDistributedQueue, TestOverriddenPrefixQueryForCustomFieldType, SuggesterTest, TestTestInjection, SegmentsInfoRequestHandlerTest, TestExclusionRuleCollectionAccess, SolrCmdDistributorTest, PrimUtilsTest, TestSolr4Spatial2, DateMathParserTest, TestRetrieveFieldsOptimizer, SuggesterFSTTest, TestRestoreCore, ShardSplitTest, SSLMigrationTest, PathHierarchyTokenizerFactoryTest, SuggesterTSTTest, TestGraphTermsQParserPlugin, PeerSyncWithIndexFingerprintCachingTest, ConnectionReuseTest, MoveReplicaHDFSTest, DistribJoinFromCollectionTest, TestCorePropertiesReload, RequestHandlersTest, WrapperMergePolicyFactoryTest, ResourceLoaderTest, TriggerIntegrationTest, RecoveryZkTest, TestReplicationHandlerBackup, PrimitiveFieldTypeTest, TestSolrCloudWithKerberosAlt, TestInPlaceUpdatesStandalone, TestDistribIDF, TestHighlightDedupGrouping, DocExpirationUpdateProcessorFactoryTest, DeleteNodeTest, RAMDirectoryFactoryTest, TestFieldSortValues, TestWriterPerf, TestEmbeddedSolrServerSchemaAPI, TestDistributedSearch, ReplaceNodeTest, TestSha256AuthenticationProvider, ZkCLITest, TestInitQParser, InfixSuggestersTest, NotRequiredUniqueKeyTest, TestNumericTerms64, TestDynamicFieldResource, ScriptEngineTest, NoCacheHeaderTest, BlockCacheTest, HighlighterTest, MissingSegmentRecoveryTest, ConfigSetsAPITest, DateRangeFieldTest, ShardRoutingTest, BaseCdcrDistributedZkTest, TestTolerantUpdateProcessorCloud, TestComputePlanAction, OverseerRolesTest, FieldAnalysisRequestHandlerTest, DistributedSuggestComponentTest, TestClassicSimilarityFactory, PropertiesRequestHandlerTest, TestRandomFlRTGCloud, TestPHPSerializedResponseWriter, TestSkipOverseerOperations, DistributedSpellCheckComponentTest, CollectionTooManyReplicasTest, SuggesterWFSTTest, TestJsonFacets, DefaultValueUpdateProcessorTest, DistributedDebugComponentTest, PKIAuthenticationIntegrationTest, MultiThreadedOCPTest, TestQuerySenderNoQuery, TestJmxIntegration, HdfsSyncSliceTest, TestManagedSynonymFilterFactory, IndexSchemaTest, CdcrBootstrapTest, TestCodecSupport, TestLegacyField, CleanupOldIndexTest, PreAnalyzedFieldManagedSchemaCloudTest, TestScoreJoinQPScore, HLLSerializationTest, TestNamedUpdateProcessors, SliceStateTest, RecoveryAfterSoftCommitTest, DistributedFacetPivotSmallTest, TestMaxScoreQueryParser, TestCollapseQParserPlugin, TestApiFramework, BadIndexSchemaTest, TimeZoneUtilsTest, ShowFileRequestHandlerTest, TestUseDocValuesAsStored, ExitableDirectoryReaderTest, OverseerTest, CoreAdminRequestStatusTest, CollectionsAPISolrJTest, DeleteInactiveReplicaTest, DeleteShardTest, DocValuesNotIndexedTest, ForceLeaderTest, LeaderElectionContextKeyTest, LeaderFailoverAfterPartitionTest, MoveReplicaTest, OverseerCollectionConfigSetProcessorTest, OverseerModifyCollectionTest, OverseerTaskQueueTest, RestartWhileUpdatingTest, RollingRestartTest, SolrCLIZkUtilsTest, SolrXmlInZkTest, TestCloudPseudoReturnFields, TestCloudRecovery, TestDownShardTolerantSearch, TestHdfsCloudBackupRestore, TestMiniSolrCloudClusterSSL, TestReplicaProperties, TestSSLRandomization, TestSegmentSorting, TestSolrCloudWithDelegationTokens, TestSolrCloudWithSecureImpersonation]
   [junit4]   2> NOTE: reproduce with: ant test  -Dtestcase=TestSolrCloudWithSecureImpersonation -Dtests.seed=19B1402007EFAAAD -Dtests.slow=true -Dtests.locale=fr-LU -Dtests.timezone=Etc/GMT-14 -Dtests.asserts=true -Dtests.file.encoding=US-ASCII
   [junit4] ERROR   0.00s J0 | TestSolrCloudWithSecureImpersonation (suite) <<<
   [junit4]    > Throwable #1: com.carrotsearch.randomizedtesting.ThreadLeakError: 2 threads leaked from SUITE scope at org.apache.solr.cloud.TestSolrCloudWithSecureImpersonation: 
   [junit4]    >    1) Thread[id=32229, name=jetty-launcher-6067-thread-2-EventThread, state=TIMED_WAITING, group=TGRP-TestSolrCloudWithSecureImpersonation]
   [junit4]    >         at sun.misc.Unsafe.park(Native Method)
   [junit4]    >         at java.util.concurrent.locks.LockSupport.parkNanos(LockSupport.java:215)
   [junit4]    >         at java.util.concurrent.locks.AbstractQueuedSynchronizer.doAcquireSharedNanos(AbstractQueuedSynchronizer.java:1037)
   [junit4]    >         at java.util.concurrent.locks.AbstractQueuedSynchronizer.tryAcquireSharedNanos(AbstractQueuedSynchronizer.java:1328)
   [junit4]    >         at java.util.concurrent.CountDownLatch.await(CountDownLatch.java:277)
   [junit4]    >         at org.apache.curator.CuratorZookeeperClient.internalBlockUntilConnectedOrTimedOut(CuratorZookeeperClient.java:323)
   [junit4]    >         at org.apache.curator.RetryLoop.callWithRetry(RetryLoop.java:105)
   [junit4]    >         at org.apache.curator.framework.imps.GetDataBuilderImpl.pathInForeground(GetDataBuilderImpl.java:288)
   [junit4]    >         at org.apache.curator.framework.imps.GetDataBuilderImpl.forPath(GetDataBuilderImpl.java:279)
   [junit4]    >         at org.apache.curator.framework.imps.GetDataBuilderImpl.forPath(GetDataBuilderImpl.java:41)
   [junit4]    >         at org.apache.curator.framework.recipes.shared.SharedValue.readValue(SharedValue.java:244)
   [junit4]    >         at org.apache.curator.framework.recipes.shared.SharedValue.access$100(SharedValue.java:44)
   [junit4]    >         at org.apache.curator.framework.recipes.shared.SharedValue$1.process(SharedValue.java:61)
   [junit4]    >         at org.apache.curator.framework.imps.NamespaceWatcher.process(NamespaceWatcher.java:67)
   [junit4]    >         at org.apache.zookeeper.ClientCnxn$EventThread.processEvent(ClientCnxn.java:530)
   [junit4]    >         at org.apache.zookeeper.ClientCnxn$EventThread.run(ClientCnxn.java:505)
   [junit4]    >    2) Thread[id=32241, name=jetty-launcher-6067-thread-1-EventThread, state=TIMED_WAITING, group=TGRP-TestSolrCloudWithSecureImpersonation]
   [junit4]    >         at sun.misc.Unsafe.park(Native Method)
   [junit4]    >         at java.util.concurrent.locks.LockSupport.parkNanos(LockSupport.java:215)
   [junit4]    >         at java.util.concurrent.locks.AbstractQueuedSynchronizer.doAcquireSharedNanos(AbstractQueuedSynchronizer.java:1037)
   [junit4]    >         at java.util.concurrent.locks.AbstractQueuedSynchronizer.tryAcquireSharedNanos(AbstractQueuedSynchronizer.java:1328)
   [junit4]    >         at java.util.concurrent.CountDownLatch.await(CountDownLatch.java:277)
   [junit4]    >         at org.apache.curator.CuratorZookeeperClient.internalBlockUntilConnectedOrTimedOut(CuratorZookeeperClient.java:323)
   [junit4]    >         at org.apache.curator.RetryLoop.callWithRetry(RetryLoop.java:105)
   [junit4]    >         at org.apache.curator.framework.imps.GetDataBuilderImpl.pathInForeground(GetDataBuilderImpl.java:288)
   [junit4]    >         at org.apache.curator.framework.imps.GetDataBuilderImpl.forPath(GetDataBuilderImpl.java:279)
   [junit4]    >         at org.apache.curator.framework.imps.GetDataBuilderImpl.forPath(GetDataBuilderImpl.java:41)
   [junit4]    >         at org.apache.curator.framework.recipes.shared.SharedValue.readValue(SharedValue.java:244)
   [junit4]    >         at org.apache.curator.framework.recipes.shared.SharedValue.access$100(SharedValue.java:44)
   [junit4]    >         at org.apache.curator.framework.recipes.shared.SharedValue$1.process(SharedValue.java:61)
   [junit4]    >         at org.apache.curator.framework.imps.NamespaceWatcher.process(NamespaceWatcher.java:67)
   [junit4]    >         at org.apache.zookeeper.ClientCnxn$EventThread.processEvent(ClientCnxn.java:530)
   [junit4]    >         at org.apache.zookeeper.ClientCnxn$EventThread.run(ClientCnxn.java:505)
   [junit4]    > 	at __randomizedtesting.SeedInfo.seed([19B1402007EFAAAD]:0)
   [junit4] Completed [564/765 (2!)] on J0 in 37.15s, 12 tests, 1 error <<< FAILURES!

[...truncated 48796 lines...]

Mime
View raw message