lucene-dev mailing list archives

Site index · List index
Message view « Date » · « Thread »
Top « Date » · « Thread »
From Policeman Jenkins Server <jenk...@thetaphi.de>
Subject [JENKINS] Lucene-Solr-master-Windows (64bit/jdk1.8.0_144) - Build # 7088 - Still Unstable!
Date Tue, 02 Jan 2018 09:48:19 GMT
Build: https://jenkins.thetaphi.de/job/Lucene-Solr-master-Windows/7088/
Java: 64bit/jdk1.8.0_144 -XX:-UseCompressedOops -XX:+UseParallelGC

8 tests failed.
FAILED:  junit.framework.TestSuite.org.apache.lucene.index.TestBackwardsCompatibility

Error Message:
Could not remove the following files (in the order of attempts):    C:\Users\jenkins\workspace\Lucene-Solr-master-Windows\lucene\build\backward-codecs\test\J1\temp\lucene.index.TestBackwardsCompatibility_25945CC58EE69610-001\4.2.0-nocfs-001: java.nio.file.DirectoryNotEmptyException: C:\Users\jenkins\workspace\Lucene-Solr-master-Windows\lucene\build\backward-codecs\test\J1\temp\lucene.index.TestBackwardsCompatibility_25945CC58EE69610-001\4.2.0-nocfs-001 

Stack Trace:
java.io.IOException: Could not remove the following files (in the order of attempts):
   C:\Users\jenkins\workspace\Lucene-Solr-master-Windows\lucene\build\backward-codecs\test\J1\temp\lucene.index.TestBackwardsCompatibility_25945CC58EE69610-001\4.2.0-nocfs-001: java.nio.file.DirectoryNotEmptyException: C:\Users\jenkins\workspace\Lucene-Solr-master-Windows\lucene\build\backward-codecs\test\J1\temp\lucene.index.TestBackwardsCompatibility_25945CC58EE69610-001\4.2.0-nocfs-001

	at __randomizedtesting.SeedInfo.seed([25945CC58EE69610]:0)
	at org.apache.lucene.util.IOUtils.rm(IOUtils.java:329)
	at org.apache.lucene.util.TestRuleTemporaryFilesCleanup.afterAlways(TestRuleTemporaryFilesCleanup.java:216)
	at com.carrotsearch.randomizedtesting.rules.TestRuleAdapter$1.afterAlways(TestRuleAdapter.java:31)
	at com.carrotsearch.randomizedtesting.rules.StatementAdapter.evaluate(StatementAdapter.java:43)
	at com.carrotsearch.randomizedtesting.rules.StatementAdapter.evaluate(StatementAdapter.java:36)
	at org.apache.lucene.util.TestRuleAssertionsRequired$1.evaluate(TestRuleAssertionsRequired.java:53)
	at org.apache.lucene.util.TestRuleMarkFailure$1.evaluate(TestRuleMarkFailure.java:47)
	at org.apache.lucene.util.TestRuleIgnoreAfterMaxFailures$1.evaluate(TestRuleIgnoreAfterMaxFailures.java:64)
	at org.apache.lucene.util.TestRuleIgnoreTestSuites$1.evaluate(TestRuleIgnoreTestSuites.java:54)
	at com.carrotsearch.randomizedtesting.rules.StatementAdapter.evaluate(StatementAdapter.java:36)
	at com.carrotsearch.randomizedtesting.ThreadLeakControl$StatementRunner.run(ThreadLeakControl.java:368)
	at java.lang.Thread.run(Thread.java:748)


FAILED:  junit.framework.TestSuite.org.apache.solr.EchoParamsTest

Error Message:
Could not remove the following files (in the order of attempts):    C:\Users\jenkins\workspace\Lucene-Solr-master-Windows\solr\build\solr-core\test\J1\temp\solr.EchoParamsTest_546F5921B3825801-001\init-core-data-001: java.nio.file.AccessDeniedException: C:\Users\jenkins\workspace\Lucene-Solr-master-Windows\solr\build\solr-core\test\J1\temp\solr.EchoParamsTest_546F5921B3825801-001\init-core-data-001    C:\Users\jenkins\workspace\Lucene-Solr-master-Windows\solr\build\solr-core\test\J1\temp\solr.EchoParamsTest_546F5921B3825801-001: java.nio.file.DirectoryNotEmptyException: C:\Users\jenkins\workspace\Lucene-Solr-master-Windows\solr\build\solr-core\test\J1\temp\solr.EchoParamsTest_546F5921B3825801-001 

Stack Trace:
java.io.IOException: Could not remove the following files (in the order of attempts):
   C:\Users\jenkins\workspace\Lucene-Solr-master-Windows\solr\build\solr-core\test\J1\temp\solr.EchoParamsTest_546F5921B3825801-001\init-core-data-001: java.nio.file.AccessDeniedException: C:\Users\jenkins\workspace\Lucene-Solr-master-Windows\solr\build\solr-core\test\J1\temp\solr.EchoParamsTest_546F5921B3825801-001\init-core-data-001
   C:\Users\jenkins\workspace\Lucene-Solr-master-Windows\solr\build\solr-core\test\J1\temp\solr.EchoParamsTest_546F5921B3825801-001: java.nio.file.DirectoryNotEmptyException: C:\Users\jenkins\workspace\Lucene-Solr-master-Windows\solr\build\solr-core\test\J1\temp\solr.EchoParamsTest_546F5921B3825801-001

	at __randomizedtesting.SeedInfo.seed([546F5921B3825801]:0)
	at org.apache.lucene.util.IOUtils.rm(IOUtils.java:329)
	at org.apache.lucene.util.TestRuleTemporaryFilesCleanup.afterAlways(TestRuleTemporaryFilesCleanup.java:216)
	at com.carrotsearch.randomizedtesting.rules.TestRuleAdapter$1.afterAlways(TestRuleAdapter.java:31)
	at com.carrotsearch.randomizedtesting.rules.StatementAdapter.evaluate(StatementAdapter.java:43)
	at com.carrotsearch.randomizedtesting.rules.StatementAdapter.evaluate(StatementAdapter.java:36)
	at org.apache.lucene.util.TestRuleAssertionsRequired$1.evaluate(TestRuleAssertionsRequired.java:53)
	at org.apache.lucene.util.TestRuleMarkFailure$1.evaluate(TestRuleMarkFailure.java:47)
	at org.apache.lucene.util.TestRuleIgnoreAfterMaxFailures$1.evaluate(TestRuleIgnoreAfterMaxFailures.java:64)
	at org.apache.lucene.util.TestRuleIgnoreTestSuites$1.evaluate(TestRuleIgnoreTestSuites.java:54)
	at com.carrotsearch.randomizedtesting.rules.StatementAdapter.evaluate(StatementAdapter.java:36)
	at com.carrotsearch.randomizedtesting.ThreadLeakControl$StatementRunner.run(ThreadLeakControl.java:368)
	at java.lang.Thread.run(Thread.java:748)


FAILED:  org.apache.solr.cloud.CollectionsAPIDistributedZkTest.testCollectionsAPI

Error Message:
Error from server at http://127.0.0.1:49729/solr/awhollynewcollection_0_shard1_replica_n1: ClusterState says we are the leader (http://127.0.0.1:49729/solr/awhollynewcollection_0_shard1_replica_n1), but locally we don't think so. Request came from null

Stack Trace:
org.apache.solr.client.solrj.impl.CloudSolrClient$RouteException: Error from server at http://127.0.0.1:49729/solr/awhollynewcollection_0_shard1_replica_n1: ClusterState says we are the leader (http://127.0.0.1:49729/solr/awhollynewcollection_0_shard1_replica_n1), but locally we don't think so. Request came from null
	at __randomizedtesting.SeedInfo.seed([546F5921B3825801:1C1A2D95B5B17794]:0)
	at org.apache.solr.client.solrj.impl.CloudSolrClient.directUpdate(CloudSolrClient.java:550)
	at org.apache.solr.client.solrj.impl.CloudSolrClient.sendRequest(CloudSolrClient.java:1013)
	at org.apache.solr.client.solrj.impl.CloudSolrClient.requestWithRetryOnStaleState(CloudSolrClient.java:884)
	at org.apache.solr.client.solrj.impl.CloudSolrClient.requestWithRetryOnStaleState(CloudSolrClient.java:946)
	at org.apache.solr.client.solrj.impl.CloudSolrClient.requestWithRetryOnStaleState(CloudSolrClient.java:946)
	at org.apache.solr.client.solrj.impl.CloudSolrClient.requestWithRetryOnStaleState(CloudSolrClient.java:946)
	at org.apache.solr.client.solrj.impl.CloudSolrClient.requestWithRetryOnStaleState(CloudSolrClient.java:946)
	at org.apache.solr.client.solrj.impl.CloudSolrClient.requestWithRetryOnStaleState(CloudSolrClient.java:946)
	at org.apache.solr.client.solrj.impl.CloudSolrClient.request(CloudSolrClient.java:817)
	at org.apache.solr.client.solrj.SolrRequest.process(SolrRequest.java:194)
	at org.apache.solr.client.solrj.request.UpdateRequest.commit(UpdateRequest.java:233)
	at org.apache.solr.cloud.CollectionsAPIDistributedZkTest.testCollectionsAPI(CollectionsAPIDistributedZkTest.java:461)
	at sun.reflect.NativeMethodAccessorImpl.invoke0(Native Method)
	at sun.reflect.NativeMethodAccessorImpl.invoke(NativeMethodAccessorImpl.java:62)
	at sun.reflect.DelegatingMethodAccessorImpl.invoke(DelegatingMethodAccessorImpl.java:43)
	at java.lang.reflect.Method.invoke(Method.java:498)
	at com.carrotsearch.randomizedtesting.RandomizedRunner.invoke(RandomizedRunner.java:1737)
	at com.carrotsearch.randomizedtesting.RandomizedRunner$8.evaluate(RandomizedRunner.java:934)
	at com.carrotsearch.randomizedtesting.RandomizedRunner$9.evaluate(RandomizedRunner.java:970)
	at com.carrotsearch.randomizedtesting.RandomizedRunner$10.evaluate(RandomizedRunner.java:984)
	at com.carrotsearch.randomizedtesting.rules.SystemPropertiesRestoreRule$1.evaluate(SystemPropertiesRestoreRule.java:57)
	at org.apache.lucene.util.TestRuleSetupTeardownChained$1.evaluate(TestRuleSetupTeardownChained.java:49)
	at org.apache.lucene.util.AbstractBeforeAfterRule$1.evaluate(AbstractBeforeAfterRule.java:45)
	at org.apache.lucene.util.TestRuleThreadAndTestName$1.evaluate(TestRuleThreadAndTestName.java:48)
	at org.apache.lucene.util.TestRuleIgnoreAfterMaxFailures$1.evaluate(TestRuleIgnoreAfterMaxFailures.java:64)
	at org.apache.lucene.util.TestRuleMarkFailure$1.evaluate(TestRuleMarkFailure.java:47)
	at com.carrotsearch.randomizedtesting.rules.StatementAdapter.evaluate(StatementAdapter.java:36)
	at com.carrotsearch.randomizedtesting.ThreadLeakControl$StatementRunner.run(ThreadLeakControl.java:368)
	at com.carrotsearch.randomizedtesting.ThreadLeakControl.forkTimeoutingTask(ThreadLeakControl.java:817)
	at com.carrotsearch.randomizedtesting.ThreadLeakControl$3.evaluate(ThreadLeakControl.java:468)
	at com.carrotsearch.randomizedtesting.RandomizedRunner.runSingleTest(RandomizedRunner.java:943)
	at com.carrotsearch.randomizedtesting.RandomizedRunner$5.evaluate(RandomizedRunner.java:829)
	at com.carrotsearch.randomizedtesting.RandomizedRunner$6.evaluate(RandomizedRunner.java:879)
	at com.carrotsearch.randomizedtesting.RandomizedRunner$7.evaluate(RandomizedRunner.java:890)
	at com.carrotsearch.randomizedtesting.rules.StatementAdapter.evaluate(StatementAdapter.java:36)
	at com.carrotsearch.randomizedtesting.rules.SystemPropertiesRestoreRule$1.evaluate(SystemPropertiesRestoreRule.java:57)
	at org.apache.lucene.util.AbstractBeforeAfterRule$1.evaluate(AbstractBeforeAfterRule.java:45)
	at com.carrotsearch.randomizedtesting.rules.StatementAdapter.evaluate(StatementAdapter.java:36)
	at org.apache.lucene.util.TestRuleStoreClassName$1.evaluate(TestRuleStoreClassName.java:41)
	at com.carrotsearch.randomizedtesting.rules.NoShadowingOrOverridesOnMethodsRule$1.evaluate(NoShadowingOrOverridesOnMethodsRule.java:40)
	at com.carrotsearch.randomizedtesting.rules.NoShadowingOrOverridesOnMethodsRule$1.evaluate(NoShadowingOrOverridesOnMethodsRule.java:40)
	at com.carrotsearch.randomizedtesting.rules.StatementAdapter.evaluate(StatementAdapter.java:36)
	at com.carrotsearch.randomizedtesting.rules.StatementAdapter.evaluate(StatementAdapter.java:36)
	at com.carrotsearch.randomizedtesting.rules.StatementAdapter.evaluate(StatementAdapter.java:36)
	at org.apache.lucene.util.TestRuleAssertionsRequired$1.evaluate(TestRuleAssertionsRequired.java:53)
	at org.apache.lucene.util.TestRuleMarkFailure$1.evaluate(TestRuleMarkFailure.java:47)
	at org.apache.lucene.util.TestRuleIgnoreAfterMaxFailures$1.evaluate(TestRuleIgnoreAfterMaxFailures.java:64)
	at org.apache.lucene.util.TestRuleIgnoreTestSuites$1.evaluate(TestRuleIgnoreTestSuites.java:54)
	at com.carrotsearch.randomizedtesting.rules.StatementAdapter.evaluate(StatementAdapter.java:36)
	at com.carrotsearch.randomizedtesting.ThreadLeakControl$StatementRunner.run(ThreadLeakControl.java:368)
	at java.lang.Thread.run(Thread.java:748)
Caused by: org.apache.solr.client.solrj.impl.HttpSolrClient$RemoteSolrException: Error from server at http://127.0.0.1:49729/solr/awhollynewcollection_0_shard1_replica_n1: ClusterState says we are the leader (http://127.0.0.1:49729/solr/awhollynewcollection_0_shard1_replica_n1), but locally we don't think so. Request came from null
	at org.apache.solr.client.solrj.impl.HttpSolrClient.executeMethod(HttpSolrClient.java:643)
	at org.apache.solr.client.solrj.impl.HttpSolrClient.request(HttpSolrClient.java:255)
	at org.apache.solr.client.solrj.impl.HttpSolrClient.request(HttpSolrClient.java:244)
	at org.apache.solr.client.solrj.impl.LBHttpSolrClient.doRequest(LBHttpSolrClient.java:483)
	at org.apache.solr.client.solrj.impl.LBHttpSolrClient.request(LBHttpSolrClient.java:413)
	at org.apache.solr.client.solrj.impl.CloudSolrClient.lambda$directUpdate$0(CloudSolrClient.java:527)
	at java.util.concurrent.FutureTask.run(FutureTask.java:266)
	at org.apache.solr.common.util.ExecutorUtil$MDCAwareThreadPoolExecutor.lambda$execute$0(ExecutorUtil.java:188)
	at java.util.concurrent.ThreadPoolExecutor.runWorker(ThreadPoolExecutor.java:1149)
	at java.util.concurrent.ThreadPoolExecutor$Worker.run(ThreadPoolExecutor.java:624)
	... 1 more


FAILED:  junit.framework.TestSuite.org.apache.solr.core.TestCoreDiscovery

Error Message:
Could not remove the following files (in the order of attempts):    C:\Users\jenkins\workspace\Lucene-Solr-master-Windows\solr\build\solr-core\test\J0\temp\solr.core.TestCoreDiscovery_546F5921B3825801-001\tempDir-014\core1: java.nio.file.DirectoryNotEmptyException: C:\Users\jenkins\workspace\Lucene-Solr-master-Windows\solr\build\solr-core\test\J0\temp\solr.core.TestCoreDiscovery_546F5921B3825801-001\tempDir-014\core1    C:\Users\jenkins\workspace\Lucene-Solr-master-Windows\solr\build\solr-core\test\J0\temp\solr.core.TestCoreDiscovery_546F5921B3825801-001\tempDir-014: java.nio.file.DirectoryNotEmptyException: C:\Users\jenkins\workspace\Lucene-Solr-master-Windows\solr\build\solr-core\test\J0\temp\solr.core.TestCoreDiscovery_546F5921B3825801-001\tempDir-014 

Stack Trace:
java.io.IOException: Could not remove the following files (in the order of attempts):
   C:\Users\jenkins\workspace\Lucene-Solr-master-Windows\solr\build\solr-core\test\J0\temp\solr.core.TestCoreDiscovery_546F5921B3825801-001\tempDir-014\core1: java.nio.file.DirectoryNotEmptyException: C:\Users\jenkins\workspace\Lucene-Solr-master-Windows\solr\build\solr-core\test\J0\temp\solr.core.TestCoreDiscovery_546F5921B3825801-001\tempDir-014\core1
   C:\Users\jenkins\workspace\Lucene-Solr-master-Windows\solr\build\solr-core\test\J0\temp\solr.core.TestCoreDiscovery_546F5921B3825801-001\tempDir-014: java.nio.file.DirectoryNotEmptyException: C:\Users\jenkins\workspace\Lucene-Solr-master-Windows\solr\build\solr-core\test\J0\temp\solr.core.TestCoreDiscovery_546F5921B3825801-001\tempDir-014

	at __randomizedtesting.SeedInfo.seed([546F5921B3825801]:0)
	at org.apache.lucene.util.IOUtils.rm(IOUtils.java:329)
	at org.apache.lucene.util.TestRuleTemporaryFilesCleanup.afterAlways(TestRuleTemporaryFilesCleanup.java:216)
	at com.carrotsearch.randomizedtesting.rules.TestRuleAdapter$1.afterAlways(TestRuleAdapter.java:31)
	at com.carrotsearch.randomizedtesting.rules.StatementAdapter.evaluate(StatementAdapter.java:43)
	at com.carrotsearch.randomizedtesting.rules.StatementAdapter.evaluate(StatementAdapter.java:36)
	at org.apache.lucene.util.TestRuleAssertionsRequired$1.evaluate(TestRuleAssertionsRequired.java:53)
	at org.apache.lucene.util.TestRuleMarkFailure$1.evaluate(TestRuleMarkFailure.java:47)
	at org.apache.lucene.util.TestRuleIgnoreAfterMaxFailures$1.evaluate(TestRuleIgnoreAfterMaxFailures.java:64)
	at org.apache.lucene.util.TestRuleIgnoreTestSuites$1.evaluate(TestRuleIgnoreTestSuites.java:54)
	at com.carrotsearch.randomizedtesting.rules.StatementAdapter.evaluate(StatementAdapter.java:36)
	at com.carrotsearch.randomizedtesting.ThreadLeakControl$StatementRunner.run(ThreadLeakControl.java:368)
	at java.lang.Thread.run(Thread.java:748)


FAILED:  junit.framework.TestSuite.org.apache.solr.handler.component.DistributedQueryComponentCustomSortTest

Error Message:
Could not remove the following files (in the order of attempts):    C:\Users\jenkins\workspace\Lucene-Solr-master-Windows\solr\build\solr-core\test\J1\temp\solr.handler.component.DistributedQueryComponentCustomSortTest_546F5921B3825801-001\tempDir-001: java.nio.file.DirectoryNotEmptyException: C:\Users\jenkins\workspace\Lucene-Solr-master-Windows\solr\build\solr-core\test\J1\temp\solr.handler.component.DistributedQueryComponentCustomSortTest_546F5921B3825801-001\tempDir-001 

Stack Trace:
java.io.IOException: Could not remove the following files (in the order of attempts):
   C:\Users\jenkins\workspace\Lucene-Solr-master-Windows\solr\build\solr-core\test\J1\temp\solr.handler.component.DistributedQueryComponentCustomSortTest_546F5921B3825801-001\tempDir-001: java.nio.file.DirectoryNotEmptyException: C:\Users\jenkins\workspace\Lucene-Solr-master-Windows\solr\build\solr-core\test\J1\temp\solr.handler.component.DistributedQueryComponentCustomSortTest_546F5921B3825801-001\tempDir-001

	at __randomizedtesting.SeedInfo.seed([546F5921B3825801]:0)
	at org.apache.lucene.util.IOUtils.rm(IOUtils.java:329)
	at org.apache.lucene.util.TestRuleTemporaryFilesCleanup.afterAlways(TestRuleTemporaryFilesCleanup.java:216)
	at com.carrotsearch.randomizedtesting.rules.TestRuleAdapter$1.afterAlways(TestRuleAdapter.java:31)
	at com.carrotsearch.randomizedtesting.rules.StatementAdapter.evaluate(StatementAdapter.java:43)
	at com.carrotsearch.randomizedtesting.rules.StatementAdapter.evaluate(StatementAdapter.java:36)
	at org.apache.lucene.util.TestRuleAssertionsRequired$1.evaluate(TestRuleAssertionsRequired.java:53)
	at org.apache.lucene.util.TestRuleMarkFailure$1.evaluate(TestRuleMarkFailure.java:47)
	at org.apache.lucene.util.TestRuleIgnoreAfterMaxFailures$1.evaluate(TestRuleIgnoreAfterMaxFailures.java:64)
	at org.apache.lucene.util.TestRuleIgnoreTestSuites$1.evaluate(TestRuleIgnoreTestSuites.java:54)
	at com.carrotsearch.randomizedtesting.rules.StatementAdapter.evaluate(StatementAdapter.java:36)
	at com.carrotsearch.randomizedtesting.ThreadLeakControl$StatementRunner.run(ThreadLeakControl.java:368)
	at java.lang.Thread.run(Thread.java:748)


FAILED:  junit.framework.TestSuite.org.apache.solr.client.solrj.io.graph.GraphExpressionTest

Error Message:
Could not remove the following files (in the order of attempts):    C:\Users\jenkins\workspace\Lucene-Solr-master-Windows\solr\build\solr-solrj\test\J1\temp\solr.client.solrj.io.graph.GraphExpressionTest_2740821AB0D7D9E6-001\tempDir-001\node2\collection1_shard2_replica_n2\data\tlog: java.nio.file.DirectoryNotEmptyException: C:\Users\jenkins\workspace\Lucene-Solr-master-Windows\solr\build\solr-solrj\test\J1\temp\solr.client.solrj.io.graph.GraphExpressionTest_2740821AB0D7D9E6-001\tempDir-001\node2\collection1_shard2_replica_n2\data\tlog    C:\Users\jenkins\workspace\Lucene-Solr-master-Windows\solr\build\solr-solrj\test\J1\temp\solr.client.solrj.io.graph.GraphExpressionTest_2740821AB0D7D9E6-001\tempDir-001\node2\collection1_shard2_replica_n2\data: java.nio.file.DirectoryNotEmptyException: C:\Users\jenkins\workspace\Lucene-Solr-master-Windows\solr\build\solr-solrj\test\J1\temp\solr.client.solrj.io.graph.GraphExpressionTest_2740821AB0D7D9E6-001\tempDir-001\node2\collection1_shard2_replica_n2\data    C:\Users\jenkins\workspace\Lucene-Solr-master-Windows\solr\build\solr-solrj\test\J1\temp\solr.client.solrj.io.graph.GraphExpressionTest_2740821AB0D7D9E6-001\tempDir-001\node2\collection1_shard2_replica_n2: java.nio.file.DirectoryNotEmptyException: C:\Users\jenkins\workspace\Lucene-Solr-master-Windows\solr\build\solr-solrj\test\J1\temp\solr.client.solrj.io.graph.GraphExpressionTest_2740821AB0D7D9E6-001\tempDir-001\node2\collection1_shard2_replica_n2    C:\Users\jenkins\workspace\Lucene-Solr-master-Windows\solr\build\solr-solrj\test\J1\temp\solr.client.solrj.io.graph.GraphExpressionTest_2740821AB0D7D9E6-001\tempDir-001\node2: java.nio.file.DirectoryNotEmptyException: C:\Users\jenkins\workspace\Lucene-Solr-master-Windows\solr\build\solr-solrj\test\J1\temp\solr.client.solrj.io.graph.GraphExpressionTest_2740821AB0D7D9E6-001\tempDir-001\node2    C:\Users\jenkins\workspace\Lucene-Solr-master-Windows\solr\build\solr-solrj\test\J1\temp\solr.client.solrj.io.graph.GraphExpressionTest_2740821AB0D7D9E6-001\tempDir-001: java.nio.file.DirectoryNotEmptyException: C:\Users\jenkins\workspace\Lucene-Solr-master-Windows\solr\build\solr-solrj\test\J1\temp\solr.client.solrj.io.graph.GraphExpressionTest_2740821AB0D7D9E6-001\tempDir-001    C:\Users\jenkins\workspace\Lucene-Solr-master-Windows\solr\build\solr-solrj\test\J1\temp\solr.client.solrj.io.graph.GraphExpressionTest_2740821AB0D7D9E6-001\tempDir-001\node2\collection1_shard2_replica_n2\data\tlog\tlog.0000000000000000003: java.nio.file.AccessDeniedException: C:\Users\jenkins\workspace\Lucene-Solr-master-Windows\solr\build\solr-solrj\test\J1\temp\solr.client.solrj.io.graph.GraphExpressionTest_2740821AB0D7D9E6-001\tempDir-001\node2\collection1_shard2_replica_n2\data\tlog\tlog.0000000000000000003    C:\Users\jenkins\workspace\Lucene-Solr-master-Windows\solr\build\solr-solrj\test\J1\temp\solr.client.solrj.io.graph.GraphExpressionTest_2740821AB0D7D9E6-001: java.nio.file.DirectoryNotEmptyException: C:\Users\jenkins\workspace\Lucene-Solr-master-Windows\solr\build\solr-solrj\test\J1\temp\solr.client.solrj.io.graph.GraphExpressionTest_2740821AB0D7D9E6-001 

Stack Trace:
java.io.IOException: Could not remove the following files (in the order of attempts):
   C:\Users\jenkins\workspace\Lucene-Solr-master-Windows\solr\build\solr-solrj\test\J1\temp\solr.client.solrj.io.graph.GraphExpressionTest_2740821AB0D7D9E6-001\tempDir-001\node2\collection1_shard2_replica_n2\data\tlog: java.nio.file.DirectoryNotEmptyException: C:\Users\jenkins\workspace\Lucene-Solr-master-Windows\solr\build\solr-solrj\test\J1\temp\solr.client.solrj.io.graph.GraphExpressionTest_2740821AB0D7D9E6-001\tempDir-001\node2\collection1_shard2_replica_n2\data\tlog
   C:\Users\jenkins\workspace\Lucene-Solr-master-Windows\solr\build\solr-solrj\test\J1\temp\solr.client.solrj.io.graph.GraphExpressionTest_2740821AB0D7D9E6-001\tempDir-001\node2\collection1_shard2_replica_n2\data: java.nio.file.DirectoryNotEmptyException: C:\Users\jenkins\workspace\Lucene-Solr-master-Windows\solr\build\solr-solrj\test\J1\temp\solr.client.solrj.io.graph.GraphExpressionTest_2740821AB0D7D9E6-001\tempDir-001\node2\collection1_shard2_replica_n2\data
   C:\Users\jenkins\workspace\Lucene-Solr-master-Windows\solr\build\solr-solrj\test\J1\temp\solr.client.solrj.io.graph.GraphExpressionTest_2740821AB0D7D9E6-001\tempDir-001\node2\collection1_shard2_replica_n2: java.nio.file.DirectoryNotEmptyException: C:\Users\jenkins\workspace\Lucene-Solr-master-Windows\solr\build\solr-solrj\test\J1\temp\solr.client.solrj.io.graph.GraphExpressionTest_2740821AB0D7D9E6-001\tempDir-001\node2\collection1_shard2_replica_n2
   C:\Users\jenkins\workspace\Lucene-Solr-master-Windows\solr\build\solr-solrj\test\J1\temp\solr.client.solrj.io.graph.GraphExpressionTest_2740821AB0D7D9E6-001\tempDir-001\node2: java.nio.file.DirectoryNotEmptyException: C:\Users\jenkins\workspace\Lucene-Solr-master-Windows\solr\build\solr-solrj\test\J1\temp\solr.client.solrj.io.graph.GraphExpressionTest_2740821AB0D7D9E6-001\tempDir-001\node2
   C:\Users\jenkins\workspace\Lucene-Solr-master-Windows\solr\build\solr-solrj\test\J1\temp\solr.client.solrj.io.graph.GraphExpressionTest_2740821AB0D7D9E6-001\tempDir-001: java.nio.file.DirectoryNotEmptyException: C:\Users\jenkins\workspace\Lucene-Solr-master-Windows\solr\build\solr-solrj\test\J1\temp\solr.client.solrj.io.graph.GraphExpressionTest_2740821AB0D7D9E6-001\tempDir-001
   C:\Users\jenkins\workspace\Lucene-Solr-master-Windows\solr\build\solr-solrj\test\J1\temp\solr.client.solrj.io.graph.GraphExpressionTest_2740821AB0D7D9E6-001\tempDir-001\node2\collection1_shard2_replica_n2\data\tlog\tlog.0000000000000000003: java.nio.file.AccessDeniedException: C:\Users\jenkins\workspace\Lucene-Solr-master-Windows\solr\build\solr-solrj\test\J1\temp\solr.client.solrj.io.graph.GraphExpressionTest_2740821AB0D7D9E6-001\tempDir-001\node2\collection1_shard2_replica_n2\data\tlog\tlog.0000000000000000003
   C:\Users\jenkins\workspace\Lucene-Solr-master-Windows\solr\build\solr-solrj\test\J1\temp\solr.client.solrj.io.graph.GraphExpressionTest_2740821AB0D7D9E6-001: java.nio.file.DirectoryNotEmptyException: C:\Users\jenkins\workspace\Lucene-Solr-master-Windows\solr\build\solr-solrj\test\J1\temp\solr.client.solrj.io.graph.GraphExpressionTest_2740821AB0D7D9E6-001

	at __randomizedtesting.SeedInfo.seed([2740821AB0D7D9E6]:0)
	at org.apache.lucene.util.IOUtils.rm(IOUtils.java:329)
	at org.apache.lucene.util.TestRuleTemporaryFilesCleanup.afterAlways(TestRuleTemporaryFilesCleanup.java:216)
	at com.carrotsearch.randomizedtesting.rules.TestRuleAdapter$1.afterAlways(TestRuleAdapter.java:31)
	at com.carrotsearch.randomizedtesting.rules.StatementAdapter.evaluate(StatementAdapter.java:43)
	at com.carrotsearch.randomizedtesting.rules.StatementAdapter.evaluate(StatementAdapter.java:36)
	at org.apache.lucene.util.TestRuleAssertionsRequired$1.evaluate(TestRuleAssertionsRequired.java:53)
	at org.apache.lucene.util.TestRuleMarkFailure$1.evaluate(TestRuleMarkFailure.java:47)
	at org.apache.lucene.util.TestRuleIgnoreAfterMaxFailures$1.evaluate(TestRuleIgnoreAfterMaxFailures.java:64)
	at org.apache.lucene.util.TestRuleIgnoreTestSuites$1.evaluate(TestRuleIgnoreTestSuites.java:54)
	at com.carrotsearch.randomizedtesting.rules.StatementAdapter.evaluate(StatementAdapter.java:36)
	at com.carrotsearch.randomizedtesting.ThreadLeakControl$StatementRunner.run(ThreadLeakControl.java:368)
	at java.lang.Thread.run(Thread.java:748)


FAILED:  org.apache.solr.client.solrj.io.stream.StreamExpressionTest.testDistributions

Error Message:


Stack Trace:
java.lang.AssertionError
	at __randomizedtesting.SeedInfo.seed([2740821AB0D7D9E6:98BFC3B06E2D397A]:0)
	at org.junit.Assert.fail(Assert.java:92)
	at org.junit.Assert.assertTrue(Assert.java:43)
	at org.junit.Assert.assertTrue(Assert.java:54)
	at org.apache.solr.client.solrj.io.stream.StreamExpressionTest.testDistributions(StreamExpressionTest.java:6598)
	at sun.reflect.NativeMethodAccessorImpl.invoke0(Native Method)
	at sun.reflect.NativeMethodAccessorImpl.invoke(NativeMethodAccessorImpl.java:62)
	at sun.reflect.DelegatingMethodAccessorImpl.invoke(DelegatingMethodAccessorImpl.java:43)
	at java.lang.reflect.Method.invoke(Method.java:498)
	at com.carrotsearch.randomizedtesting.RandomizedRunner.invoke(RandomizedRunner.java:1737)
	at com.carrotsearch.randomizedtesting.RandomizedRunner$8.evaluate(RandomizedRunner.java:934)
	at com.carrotsearch.randomizedtesting.RandomizedRunner$9.evaluate(RandomizedRunner.java:970)
	at com.carrotsearch.randomizedtesting.RandomizedRunner$10.evaluate(RandomizedRunner.java:984)
	at com.carrotsearch.randomizedtesting.rules.SystemPropertiesRestoreRule$1.evaluate(SystemPropertiesRestoreRule.java:57)
	at org.apache.lucene.util.TestRuleSetupTeardownChained$1.evaluate(TestRuleSetupTeardownChained.java:49)
	at org.apache.lucene.util.AbstractBeforeAfterRule$1.evaluate(AbstractBeforeAfterRule.java:45)
	at org.apache.lucene.util.TestRuleThreadAndTestName$1.evaluate(TestRuleThreadAndTestName.java:48)
	at org.apache.lucene.util.TestRuleIgnoreAfterMaxFailures$1.evaluate(TestRuleIgnoreAfterMaxFailures.java:64)
	at org.apache.lucene.util.TestRuleMarkFailure$1.evaluate(TestRuleMarkFailure.java:47)
	at com.carrotsearch.randomizedtesting.rules.StatementAdapter.evaluate(StatementAdapter.java:36)
	at com.carrotsearch.randomizedtesting.ThreadLeakControl$StatementRunner.run(ThreadLeakControl.java:368)
	at com.carrotsearch.randomizedtesting.ThreadLeakControl.forkTimeoutingTask(ThreadLeakControl.java:817)
	at com.carrotsearch.randomizedtesting.ThreadLeakControl$3.evaluate(ThreadLeakControl.java:468)
	at com.carrotsearch.randomizedtesting.RandomizedRunner.runSingleTest(RandomizedRunner.java:943)
	at com.carrotsearch.randomizedtesting.RandomizedRunner$5.evaluate(RandomizedRunner.java:829)
	at com.carrotsearch.randomizedtesting.RandomizedRunner$6.evaluate(RandomizedRunner.java:879)
	at com.carrotsearch.randomizedtesting.RandomizedRunner$7.evaluate(RandomizedRunner.java:890)
	at com.carrotsearch.randomizedtesting.rules.StatementAdapter.evaluate(StatementAdapter.java:36)
	at com.carrotsearch.randomizedtesting.rules.SystemPropertiesRestoreRule$1.evaluate(SystemPropertiesRestoreRule.java:57)
	at org.apache.lucene.util.AbstractBeforeAfterRule$1.evaluate(AbstractBeforeAfterRule.java:45)
	at com.carrotsearch.randomizedtesting.rules.StatementAdapter.evaluate(StatementAdapter.java:36)
	at org.apache.lucene.util.TestRuleStoreClassName$1.evaluate(TestRuleStoreClassName.java:41)
	at com.carrotsearch.randomizedtesting.rules.NoShadowingOrOverridesOnMethodsRule$1.evaluate(NoShadowingOrOverridesOnMethodsRule.java:40)
	at com.carrotsearch.randomizedtesting.rules.NoShadowingOrOverridesOnMethodsRule$1.evaluate(NoShadowingOrOverridesOnMethodsRule.java:40)
	at com.carrotsearch.randomizedtesting.rules.StatementAdapter.evaluate(StatementAdapter.java:36)
	at com.carrotsearch.randomizedtesting.rules.StatementAdapter.evaluate(StatementAdapter.java:36)
	at com.carrotsearch.randomizedtesting.rules.StatementAdapter.evaluate(StatementAdapter.java:36)
	at org.apache.lucene.util.TestRuleAssertionsRequired$1.evaluate(TestRuleAssertionsRequired.java:53)
	at org.apache.lucene.util.TestRuleMarkFailure$1.evaluate(TestRuleMarkFailure.java:47)
	at org.apache.lucene.util.TestRuleIgnoreAfterMaxFailures$1.evaluate(TestRuleIgnoreAfterMaxFailures.java:64)
	at org.apache.lucene.util.TestRuleIgnoreTestSuites$1.evaluate(TestRuleIgnoreTestSuites.java:54)
	at com.carrotsearch.randomizedtesting.rules.StatementAdapter.evaluate(StatementAdapter.java:36)
	at com.carrotsearch.randomizedtesting.ThreadLeakControl$StatementRunner.run(ThreadLeakControl.java:368)
	at java.lang.Thread.run(Thread.java:748)


FAILED:  junit.framework.TestSuite.org.apache.solr.update.processor.TestOpenNLPExtractNamedEntitiesUpdateProcessorFactory

Error Message:
Could not remove the following files (in the order of attempts):    C:\Users\jenkins\workspace\Lucene-Solr-master-Windows\solr\build\contrib\solr-analysis-extras\test\J1\temp\solr.update.processor.TestOpenNLPExtractNamedEntitiesUpdateProcessorFactory_4136B852E722A32-001\tempDir-001\collection1\conf: java.nio.file.DirectoryNotEmptyException: C:\Users\jenkins\workspace\Lucene-Solr-master-Windows\solr\build\contrib\solr-analysis-extras\test\J1\temp\solr.update.processor.TestOpenNLPExtractNamedEntitiesUpdateProcessorFactory_4136B852E722A32-001\tempDir-001\collection1\conf    C:\Users\jenkins\workspace\Lucene-Solr-master-Windows\solr\build\contrib\solr-analysis-extras\test\J1\temp\solr.update.processor.TestOpenNLPExtractNamedEntitiesUpdateProcessorFactory_4136B852E722A32-001\tempDir-001\collection1: java.nio.file.DirectoryNotEmptyException: C:\Users\jenkins\workspace\Lucene-Solr-master-Windows\solr\build\contrib\solr-analysis-extras\test\J1\temp\solr.update.processor.TestOpenNLPExtractNamedEntitiesUpdateProcessorFactory_4136B852E722A32-001\tempDir-001\collection1    C:\Users\jenkins\workspace\Lucene-Solr-master-Windows\solr\build\contrib\solr-analysis-extras\test\J1\temp\solr.update.processor.TestOpenNLPExtractNamedEntitiesUpdateProcessorFactory_4136B852E722A32-001\tempDir-001: java.nio.file.DirectoryNotEmptyException: C:\Users\jenkins\workspace\Lucene-Solr-master-Windows\solr\build\contrib\solr-analysis-extras\test\J1\temp\solr.update.processor.TestOpenNLPExtractNamedEntitiesUpdateProcessorFactory_4136B852E722A32-001\tempDir-001    C:\Users\jenkins\workspace\Lucene-Solr-master-Windows\solr\build\contrib\solr-analysis-extras\test\J1\temp\solr.update.processor.TestOpenNLPExtractNamedEntitiesUpdateProcessorFactory_4136B852E722A32-001\tempDir-001\collection1\conf\en-test-sent.bin: java.nio.file.AccessDeniedException: C:\Users\jenkins\workspace\Lucene-Solr-master-Windows\solr\build\contrib\solr-analysis-extras\test\J1\temp\solr.update.processor.TestOpenNLPExtractNamedEntitiesUpdateProcessorFactory_4136B852E722A32-001\tempDir-001\collection1\conf\en-test-sent.bin    C:\Users\jenkins\workspace\Lucene-Solr-master-Windows\solr\build\contrib\solr-analysis-extras\test\J1\temp\solr.update.processor.TestOpenNLPExtractNamedEntitiesUpdateProcessorFactory_4136B852E722A32-001\tempDir-001\collection1\conf\en-test-tokenizer.bin: java.nio.file.AccessDeniedException: C:\Users\jenkins\workspace\Lucene-Solr-master-Windows\solr\build\contrib\solr-analysis-extras\test\J1\temp\solr.update.processor.TestOpenNLPExtractNamedEntitiesUpdateProcessorFactory_4136B852E722A32-001\tempDir-001\collection1\conf\en-test-tokenizer.bin    C:\Users\jenkins\workspace\Lucene-Solr-master-Windows\solr\build\contrib\solr-analysis-extras\test\J1\temp\solr.update.processor.TestOpenNLPExtractNamedEntitiesUpdateProcessorFactory_4136B852E722A32-001\tempDir-001\collection1\conf\en-test-ner-person.bin: java.nio.file.AccessDeniedException: C:\Users\jenkins\workspace\Lucene-Solr-master-Windows\solr\build\contrib\solr-analysis-extras\test\J1\temp\solr.update.processor.TestOpenNLPExtractNamedEntitiesUpdateProcessorFactory_4136B852E722A32-001\tempDir-001\collection1\conf\en-test-ner-person.bin    C:\Users\jenkins\workspace\Lucene-Solr-master-Windows\solr\build\contrib\solr-analysis-extras\test\J1\temp\solr.update.processor.TestOpenNLPExtractNamedEntitiesUpdateProcessorFactory_4136B852E722A32-001: java.nio.file.DirectoryNotEmptyException: C:\Users\jenkins\workspace\Lucene-Solr-master-Windows\solr\build\contrib\solr-analysis-extras\test\J1\temp\solr.update.processor.TestOpenNLPExtractNamedEntitiesUpdateProcessorFactory_4136B852E722A32-001 

Stack Trace:
java.io.IOException: Could not remove the following files (in the order of attempts):
   C:\Users\jenkins\workspace\Lucene-Solr-master-Windows\solr\build\contrib\solr-analysis-extras\test\J1\temp\solr.update.processor.TestOpenNLPExtractNamedEntitiesUpdateProcessorFactory_4136B852E722A32-001\tempDir-001\collection1\conf: java.nio.file.DirectoryNotEmptyException: C:\Users\jenkins\workspace\Lucene-Solr-master-Windows\solr\build\contrib\solr-analysis-extras\test\J1\temp\solr.update.processor.TestOpenNLPExtractNamedEntitiesUpdateProcessorFactory_4136B852E722A32-001\tempDir-001\collection1\conf
   C:\Users\jenkins\workspace\Lucene-Solr-master-Windows\solr\build\contrib\solr-analysis-extras\test\J1\temp\solr.update.processor.TestOpenNLPExtractNamedEntitiesUpdateProcessorFactory_4136B852E722A32-001\tempDir-001\collection1: java.nio.file.DirectoryNotEmptyException: C:\Users\jenkins\workspace\Lucene-Solr-master-Windows\solr\build\contrib\solr-analysis-extras\test\J1\temp\solr.update.processor.TestOpenNLPExtractNamedEntitiesUpdateProcessorFactory_4136B852E722A32-001\tempDir-001\collection1
   C:\Users\jenkins\workspace\Lucene-Solr-master-Windows\solr\build\contrib\solr-analysis-extras\test\J1\temp\solr.update.processor.TestOpenNLPExtractNamedEntitiesUpdateProcessorFactory_4136B852E722A32-001\tempDir-001: java.nio.file.DirectoryNotEmptyException: C:\Users\jenkins\workspace\Lucene-Solr-master-Windows\solr\build\contrib\solr-analysis-extras\test\J1\temp\solr.update.processor.TestOpenNLPExtractNamedEntitiesUpdateProcessorFactory_4136B852E722A32-001\tempDir-001
   C:\Users\jenkins\workspace\Lucene-Solr-master-Windows\solr\build\contrib\solr-analysis-extras\test\J1\temp\solr.update.processor.TestOpenNLPExtractNamedEntitiesUpdateProcessorFactory_4136B852E722A32-001\tempDir-001\collection1\conf\en-test-sent.bin: java.nio.file.AccessDeniedException: C:\Users\jenkins\workspace\Lucene-Solr-master-Windows\solr\build\contrib\solr-analysis-extras\test\J1\temp\solr.update.processor.TestOpenNLPExtractNamedEntitiesUpdateProcessorFactory_4136B852E722A32-001\tempDir-001\collection1\conf\en-test-sent.bin
   C:\Users\jenkins\workspace\Lucene-Solr-master-Windows\solr\build\contrib\solr-analysis-extras\test\J1\temp\solr.update.processor.TestOpenNLPExtractNamedEntitiesUpdateProcessorFactory_4136B852E722A32-001\tempDir-001\collection1\conf\en-test-tokenizer.bin: java.nio.file.AccessDeniedException: C:\Users\jenkins\workspace\Lucene-Solr-master-Windows\solr\build\contrib\solr-analysis-extras\test\J1\temp\solr.update.processor.TestOpenNLPExtractNamedEntitiesUpdateProcessorFactory_4136B852E722A32-001\tempDir-001\collection1\conf\en-test-tokenizer.bin
   C:\Users\jenkins\workspace\Lucene-Solr-master-Windows\solr\build\contrib\solr-analysis-extras\test\J1\temp\solr.update.processor.TestOpenNLPExtractNamedEntitiesUpdateProcessorFactory_4136B852E722A32-001\tempDir-001\collection1\conf\en-test-ner-person.bin: java.nio.file.AccessDeniedException: C:\Users\jenkins\workspace\Lucene-Solr-master-Windows\solr\build\contrib\solr-analysis-extras\test\J1\temp\solr.update.processor.TestOpenNLPExtractNamedEntitiesUpdateProcessorFactory_4136B852E722A32-001\tempDir-001\collection1\conf\en-test-ner-person.bin
   C:\Users\jenkins\workspace\Lucene-Solr-master-Windows\solr\build\contrib\solr-analysis-extras\test\J1\temp\solr.update.processor.TestOpenNLPExtractNamedEntitiesUpdateProcessorFactory_4136B852E722A32-001: java.nio.file.DirectoryNotEmptyException: C:\Users\jenkins\workspace\Lucene-Solr-master-Windows\solr\build\contrib\solr-analysis-extras\test\J1\temp\solr.update.processor.TestOpenNLPExtractNamedEntitiesUpdateProcessorFactory_4136B852E722A32-001

	at __randomizedtesting.SeedInfo.seed([4136B852E722A32]:0)
	at org.apache.lucene.util.IOUtils.rm(IOUtils.java:329)
	at org.apache.lucene.util.TestRuleTemporaryFilesCleanup.afterAlways(TestRuleTemporaryFilesCleanup.java:216)
	at com.carrotsearch.randomizedtesting.rules.TestRuleAdapter$1.afterAlways(TestRuleAdapter.java:31)
	at com.carrotsearch.randomizedtesting.rules.StatementAdapter.evaluate(StatementAdapter.java:43)
	at com.carrotsearch.randomizedtesting.rules.StatementAdapter.evaluate(StatementAdapter.java:36)
	at org.apache.lucene.util.TestRuleAssertionsRequired$1.evaluate(TestRuleAssertionsRequired.java:53)
	at org.apache.lucene.util.TestRuleMarkFailure$1.evaluate(TestRuleMarkFailure.java:47)
	at org.apache.lucene.util.TestRuleIgnoreAfterMaxFailures$1.evaluate(TestRuleIgnoreAfterMaxFailures.java:64)
	at org.apache.lucene.util.TestRuleIgnoreTestSuites$1.evaluate(TestRuleIgnoreTestSuites.java:54)
	at com.carrotsearch.randomizedtesting.rules.StatementAdapter.evaluate(StatementAdapter.java:36)
	at com.carrotsearch.randomizedtesting.ThreadLeakControl$StatementRunner.run(ThreadLeakControl.java:368)
	at java.lang.Thread.run(Thread.java:748)




Build Log:
[...truncated 4771 lines...]
   [junit4] Suite: org.apache.lucene.index.TestBackwardsCompatibility
   [junit4] IGNOR/A 0.00s J1 | TestBackwardsCompatibility.testCreateMoreTermsIndex
   [junit4]    > Assumption #1: backcompat creation tests must be run with -Dtests.bwcdir=/path/to/write/indexes
   [junit4] IGNOR/A 0.00s J1 | TestBackwardsCompatibility.testCreateSingleSegmentCFS
   [junit4]    > Assumption #1: backcompat creation tests must be run with -Dtests.bwcdir=/path/to/write/indexes
   [junit4] IGNOR/A 0.00s J1 | TestBackwardsCompatibility.testCreateEmptyIndex
   [junit4]    > Assumption #1: backcompat creation tests must be run with -Dtests.bwcdir=/path/to/write/indexes
   [junit4] IGNOR/A 0.00s J1 | TestBackwardsCompatibility.testCreateNoCFS
   [junit4]    > Assumption #1: backcompat creation tests must be run with -Dtests.bwcdir=/path/to/write/indexes
   [junit4] IGNOR/A 0.00s J1 | TestBackwardsCompatibility.testCreateIndexWithDocValuesUpdates
   [junit4]    > Assumption #1: backcompat creation tests must be run with -Dtests.bwcdir=/path/to/write/indexes
   [junit4] IGNOR/A 0.00s J1 | TestBackwardsCompatibility.testCreateCFS
   [junit4]    > Assumption #1: backcompat creation tests must be run with -Dtests.bwcdir=/path/to/write/indexes
   [junit4] IGNOR/A 0.00s J1 | TestBackwardsCompatibility.testCreateSortedIndex
   [junit4]    > Assumption #1: backcompat creation tests must be run with -Dtests.bwcdir=/path/to/write/indexes
   [junit4] IGNOR/A 0.00s J1 | TestBackwardsCompatibility.testCreateSingleSegmentNoCFS
   [junit4]    > Assumption #1: backcompat creation tests must be run with -Dtests.bwcdir=/path/to/write/indexes
   [junit4]   2> NOTE: test params are: codec=Asserting(Lucene70): {content6=PostingsFormat(name=Asserting), content5=FSTOrd50, content4=PostingsFormat(name=Direct), content3=PostingsFormat(name=LuceneFixedGap), content2=PostingsFormat(name=Asserting), fie?ld=PostingsFormat(name=Asserting), utf8=PostingsFormat(name=Direct), id=PostingsFormat(name=Asserting), content=PostingsFormat(name=Direct), autf8=PostingsFormat(name=LuceneFixedGap)}, docValues:{ndv2=DocValuesFormat(name=Memory), ndv1=DocValuesFormat(name=Lucene70), utf8=DocValuesFormat(name=Lucene70), fie?ld=DocValuesFormat(name=Asserting), dvShort=DocValuesFormat(name=Memory), dvInt=DocValuesFormat(name=Lucene70), longPoint2d=DocValuesFormat(name=Memory), dvBytesSortedVar=DocValuesFormat(name=Asserting), dvSortedSet=DocValuesFormat(name=Asserting), content=DocValuesFormat(name=Lucene70), floatPoint1d=DocValuesFormat(name=Asserting), bdv2=DocValuesFormat(name=Memory), bdv2_c=DocValuesFormat(name=Memory), intPoint1d=DocValuesFormat(name=Direct), bdv1=DocValuesFormat(name=Lucene70), bdv1_c=DocValuesFormat(name=Asserting), doublePoint2d=DocValuesFormat(name=Asserting), dvBytesDerefVar=DocValuesFormat(name=Memory), id=DocValuesFormat(name=Asserting), binaryPoint2d=DocValuesFormat(name=Lucene70), dvSortedNumeric=DocValuesFormat(name=Memory), dvBytesDerefFixed=DocValuesFormat(name=Lucene70), autf8=DocValuesFormat(name=Memory), dvBytesSortedFixed=DocValuesFormat(name=Memory), dvBytesStraightVar=DocValuesFormat(name=Direct), dvBytesStraightFixed=DocValuesFormat(name=Asserting), dvLong=DocValuesFormat(name=Memory), longPoint1d=DocValuesFormat(name=Lucene70), floatPoint2d=DocValuesFormat(name=Memory), dvDouble=DocValuesFormat(name=Asserting), dvFloat=DocValuesFormat(name=Memory), content6=DocValuesFormat(name=Asserting), content5=DocValuesFormat(name=Direct), dvPacked=DocValuesFormat(name=Memory), intPoint2d=DocValuesFormat(name=Asserting), content4=DocValuesFormat(name=Lucene70), content3=DocValuesFormat(name=Memory), content2=DocValuesFormat(name=Asserting), doublePoint1d=DocValuesFormat(name=Memory), dvByte=DocValuesFormat(name=Memory), ndv1_c=DocValuesFormat(name=Asserting), ndv2_c=DocValuesFormat(name=Memory), binaryPoint1d=DocValuesFormat(name=Memory)}, maxPointsInLeafNode=1231, maxMBSortInHeap=5.436589191893273, sim=Asserting(org.apache.lucene.search.similarities.AssertingSimilarity@753c67d6), locale=sr-CS, timezone=America/Port_of_Spain
   [junit4]   2> NOTE: Windows 10 10.0 amd64/Oracle Corporation 1.8.0_144 (64-bit)/cpus=3,threads=1,free=93655496,total=187170816
   [junit4]   2> NOTE: All tests run in this JVM: [TestManyPointsInOldIndex, TestBackwardsCompatibility]
   [junit4]   2> NOTE: reproduce with: ant test  -Dtestcase=TestBackwardsCompatibility -Dtests.seed=25945CC58EE69610 -Dtests.slow=true -Dtests.locale=sr-CS -Dtests.timezone=America/Port_of_Spain -Dtests.asserts=true -Dtests.file.encoding=ISO-8859-1
   [junit4] ERROR   0.00s J1 | TestBackwardsCompatibility (suite) <<<
   [junit4]    > Throwable #1: java.io.IOException: Could not remove the following files (in the order of attempts):
   [junit4]    >    C:\Users\jenkins\workspace\Lucene-Solr-master-Windows\lucene\build\backward-codecs\test\J1\temp\lucene.index.TestBackwardsCompatibility_25945CC58EE69610-001\4.2.0-nocfs-001: java.nio.file.DirectoryNotEmptyException: C:\Users\jenkins\workspace\Lucene-Solr-master-Windows\lucene\build\backward-codecs\test\J1\temp\lucene.index.TestBackwardsCompatibility_25945CC58EE69610-001\4.2.0-nocfs-001
   [junit4]    > 	at __randomizedtesting.SeedInfo.seed([25945CC58EE69610]:0)
   [junit4]    > 	at org.apache.lucene.util.IOUtils.rm(IOUtils.java:329)
   [junit4]    > 	at java.lang.Thread.run(Thread.java:748)
   [junit4] Completed [3/3 (1!)] on J1 in 10.44s, 30 tests, 1 error, 8 skipped <<< FAILURES!

[...truncated 6906 lines...]
   [junit4] Suite: org.apache.solr.EchoParamsTest
   [junit4]   2> 89163 INFO  (SUITE-EchoParamsTest-seed#[546F5921B3825801]-worker) [    ] o.a.s.SolrTestCaseJ4 SecureRandom sanity checks: test.solr.allowed.securerandom=null & java.security.egd=file:/dev/./urandom
   [junit4]   2> Creating dataDir: C:\Users\jenkins\workspace\Lucene-Solr-master-Windows\solr\build\solr-core\test\J1\temp\solr.EchoParamsTest_546F5921B3825801-001\init-core-data-001
   [junit4]   2> 89165 WARN  (SUITE-EchoParamsTest-seed#[546F5921B3825801]-worker) [    ] o.a.s.SolrTestCaseJ4 startTrackingSearchers: numOpens=1 numCloses=1
   [junit4]   2> 89165 INFO  (SUITE-EchoParamsTest-seed#[546F5921B3825801]-worker) [    ] o.a.s.SolrTestCaseJ4 Using PointFields (NUMERIC_POINTS_SYSPROP=true) w/NUMERIC_DOCVALUES_SYSPROP=false
   [junit4]   2> 89169 INFO  (SUITE-EchoParamsTest-seed#[546F5921B3825801]-worker) [    ] o.a.s.SolrTestCaseJ4 Randomized ssl (false) and clientAuth (false) via: @org.apache.solr.util.RandomizeSSL(reason=, value=NaN, ssl=NaN, clientAuth=NaN)
   [junit4]   2> 89170 INFO  (SUITE-EchoParamsTest-seed#[546F5921B3825801]-worker) [    ] o.a.s.SolrTestCaseJ4 ####initCore
   [junit4]   2> 89171 INFO  (SUITE-EchoParamsTest-seed#[546F5921B3825801]-worker) [    ] o.a.s.c.SolrResourceLoader [null] Added 2 libs to classloader, from paths: [/C:/Users/jenkins/workspace/Lucene-Solr-master-Windows/solr/core/src/test-files/solr/collection1/lib, /C:/Users/jenkins/workspace/Lucene-Solr-master-Windows/solr/core/src/test-files/solr/collection1/lib/classes]
   [junit4]   2> 89214 INFO  (SUITE-EchoParamsTest-seed#[546F5921B3825801]-worker) [    ] o.a.s.c.SolrConfig Using Lucene MatchVersion: 8.0.0
   [junit4]   2> 89222 INFO  (SUITE-EchoParamsTest-seed#[546F5921B3825801]-worker) [    ] o.a.s.s.IndexSchema [null] Schema name=test
   [junit4]   2> 89225 INFO  (SUITE-EchoParamsTest-seed#[546F5921B3825801]-worker) [    ] o.a.s.s.IndexSchema Loaded schema test/1.0 with uniqueid field id
   [junit4]   2> 89288 INFO  (SUITE-EchoParamsTest-seed#[546F5921B3825801]-worker) [    ] o.a.s.m.r.SolrJmxReporter JMX monitoring for 'solr.node' (registry 'solr.node') enabled at server: com.sun.jmx.mbeanserver.JmxMBeanServer@49be7146
   [junit4]   2> 89293 INFO  (SUITE-EchoParamsTest-seed#[546F5921B3825801]-worker) [    ] o.a.s.m.r.SolrJmxReporter JMX monitoring for 'solr.jvm' (registry 'solr.jvm') enabled at server: com.sun.jmx.mbeanserver.JmxMBeanServer@49be7146
   [junit4]   2> 89293 INFO  (SUITE-EchoParamsTest-seed#[546F5921B3825801]-worker) [    ] o.a.s.m.r.SolrJmxReporter JMX monitoring for 'solr.jetty' (registry 'solr.jetty') enabled at server: com.sun.jmx.mbeanserver.JmxMBeanServer@49be7146
   [junit4]   2> 89305 INFO  (coreLoadExecutor-153-thread-1) [    ] o.a.s.c.TransientSolrCoreCacheDefault Allocating transient cache for 2147483647 transient cores
   [junit4]   2> 89307 INFO  (coreLoadExecutor-153-thread-1) [    x:collection1] o.a.s.c.SolrResourceLoader [null] Added 2 libs to classloader, from paths: [/C:/Users/jenkins/workspace/Lucene-Solr-master-Windows/solr/core/src/test-files/solr/collection1/lib, /C:/Users/jenkins/workspace/Lucene-Solr-master-Windows/solr/core/src/test-files/solr/collection1/lib/classes]
   [junit4]   2> 89356 INFO  (coreLoadExecutor-153-thread-1) [    x:collection1] o.a.s.c.SolrConfig Using Lucene MatchVersion: 8.0.0
   [junit4]   2> 89374 INFO  (coreLoadExecutor-153-thread-1) [    x:collection1] o.a.s.s.IndexSchema [collection1] Schema name=test
   [junit4]   2> 89378 INFO  (coreLoadExecutor-153-thread-1) [    x:collection1] o.a.s.s.IndexSchema Loaded schema test/1.0 with uniqueid field id
   [junit4]   2> 89378 INFO  (coreLoadExecutor-153-thread-1) [    x:collection1] o.a.s.c.CoreContainer Creating SolrCore 'collection1' using configuration from instancedir C:\Users\jenkins\workspace\Lucene-Solr-master-Windows\solr\core\src\test-files\solr\collection1, trusted=true
   [junit4]   2> 89378 INFO  (coreLoadExecutor-153-thread-1) [    x:collection1] o.a.s.m.r.SolrJmxReporter JMX monitoring for 'solr.core.collection1' (registry 'solr.core.collection1') enabled at server: com.sun.jmx.mbeanserver.JmxMBeanServer@49be7146
   [junit4]   2> 89378 INFO  (coreLoadExecutor-153-thread-1) [    x:collection1] o.a.s.c.SolrCore solr.RecoveryStrategy.Builder
   [junit4]   2> 89378 INFO  (coreLoadExecutor-153-thread-1) [    x:collection1] o.a.s.c.SolrCore [[collection1] ] Opening new SolrCore at [C:\Users\jenkins\workspace\Lucene-Solr-master-Windows\solr\core\src\test-files\solr\collection1], dataDir=[C:\Users\jenkins\workspace\Lucene-Solr-master-Windows\solr\build\solr-core\test\J1\temp\solr.EchoParamsTest_546F5921B3825801-001\init-core-data-001\]
   [junit4]   2> 89382 INFO  (coreLoadExecutor-153-thread-1) [    x:collection1] o.a.s.u.RandomMergePolicy RandomMergePolicy wrapping class org.apache.lucene.index.LogByteSizeMergePolicy: [LogByteSizeMergePolicy: minMergeSize=1677721, mergeFactor=24, maxMergeSize=2147483648, maxMergeSizeForForcedMerge=9223372036854775807, calibrateSizeByDeletes=false, maxMergeDocs=2147483647, maxCFSSegmentSizeMB=8.796093022207999E12, noCFSRatio=0.0]
   [junit4]   2> 89410 INFO  (coreLoadExecutor-153-thread-1) [    x:collection1] o.a.s.r.XSLTResponseWriter xsltCacheLifetimeSeconds=60
   [junit4]   2> 89476 INFO  (coreLoadExecutor-153-thread-1) [    x:collection1] o.a.s.u.CommitTracker Hard AutoCommit: disabled
   [junit4]   2> 89476 INFO  (coreLoadExecutor-153-thread-1) [    x:collection1] o.a.s.u.CommitTracker Soft AutoCommit: disabled
   [junit4]   2> 89478 INFO  (coreLoadExecutor-153-thread-1) [    x:collection1] o.a.s.u.RandomMergePolicy RandomMergePolicy wrapping class org.apache.lucene.index.TieredMergePolicy: [TieredMergePolicy: maxMergeAtOnce=33, maxMergeAtOnceExplicit=13, maxMergedSegmentMB=29.5078125, floorSegmentMB=0.6845703125, forceMergeDeletesPctAllowed=9.893677765616001, segmentsPerTier=33.0, maxCFSSegmentSizeMB=8.796093022207999E12, noCFSRatio=0.0
   [junit4]   2> 89481 INFO  (coreLoadExecutor-153-thread-1) [    x:collection1] o.a.s.s.SolrIndexSearcher Opening [Searcher@62ebaa05[collection1] main]
   [junit4]   2> 89482 WARN  (coreLoadExecutor-153-thread-1) [    x:collection1] o.a.s.r.ManagedResourceStorage Cannot write to config directory C:\Users\jenkins\workspace\Lucene-Solr-master-Windows\solr\core\src\test-files\solr\collection1\conf; switching to use InMemory storage instead.
   [junit4]   2> 89482 INFO  (coreLoadExecutor-153-thread-1) [    x:collection1] o.a.s.h.ReplicationHandler Commits will be reserved for 10000ms.
   [junit4]   2> 89484 INFO  (SUITE-EchoParamsTest-seed#[546F5921B3825801]-worker) [    ] o.a.s.SolrTestCaseJ4 ####initCore end
   [junit4]   2> 89486 INFO  (TEST-EchoParamsTest.test-seed#[546F5921B3825801]) [    ] o.a.s.SolrTestCaseJ4 ###Starting test
   [junit4]   2> 89497 INFO  (searcherExecutor-154-thread-1-processing-x:collection1) [    x:collection1] o.a.s.c.SolrCore [collection1] Registered new searcher Searcher@62ebaa05[collection1] main{ExitableDirectoryReader(UninvertingDirectoryReader())}
   [junit4]   2> 89498 INFO  (TEST-EchoParamsTest.test-seed#[546F5921B3825801]) [    ] o.a.s.c.S.Request [collection1]  webapp=null path=null params={q=foo&qt=&start=0&rows=20&version=2.2&wt=xml} hits=0 status=0 QTime=11
   [junit4]   2> 89507 INFO  (TEST-EchoParamsTest.test-seed#[546F5921B3825801]) [    ] o.a.s.c.S.Request [collection1]  webapp=null path=null params={q=foo&qt=&start=0&rows=20&version=2.2&wt=xml} hits=0 status=0 QTime=0
   [junit4]   2> 89508 INFO  (TEST-EchoParamsTest.test-seed#[546F5921B3825801]) [    ] o.a.s.c.S.Request [collection1]  webapp=null path=null params={q=foo&qt=&start=0&rows=20&wt=xml} hits=0 status=0 QTime=0
   [junit4]   2> 89508 INFO  (TEST-EchoParamsTest.test-seed#[546F5921B3825801]) [    ] o.a.s.c.S.Request [collection1]  webapp=null path=null params={q=foo&qt=&start=0&rows=20&wt=xml} hits=0 status=0 QTime=1
   [junit4]   2> 89514 INFO  (TEST-EchoParamsTest.test-seed#[546F5921B3825801]) [    ] o.a.s.c.S.Request [collection1]  webapp=null path=null params={q=foo&qt=&echoParams=explicit&start=0&rows=20&wt=xml&version=2.2} hits=0 status=0 QTime=0
   [junit4]   2> 89516 INFO  (TEST-EchoParamsTest.test-seed#[546F5921B3825801]) [    ] o.a.s.c.S.Request [collection1]  webapp=null path=null params={q=foo&qt=&echoParams=explicit&start=0&rows=20&wt=xml&version=2.2} hits=0 status=0 QTime=0
   [junit4]   2> 89518 INFO  (TEST-EchoParamsTest.test-seed#[546F5921B3825801]) [    ] o.a.s.c.S.Request [collection1]  webapp=null path=null params={q=foo&qt=&echoParams=explicit&start=0&rows=20&wt=xml&version=2.2} hits=0 status=0 QTime=1
   [junit4]   2> 89519 INFO  (TEST-EchoParamsTest.test-seed#[546F5921B3825801]) [    ] o.a.s.c.S.Request [collection1]  webapp=null path=null params={echoHandler=true&q=foo&qt=/crazy_custom_qt&echoParams=all&start=0&rows=20&version=2.2&wt=xml} hits=0 status=0 QTime=0
   [junit4]   2> 89520 INFO  (TEST-EchoParamsTest.test-seed#[546F5921B3825801]) [    ] o.a.s.c.S.Request [collection1]  webapp=null path=null params={echoHandler=true&q=foo&qt=/crazy_custom_qt&echoParams=all&start=0&rows=20&version=2.2&wt=xml} hits=0 status=0 QTime=0
   [junit4]   2> 89520 INFO  (TEST-EchoParamsTest.test-seed#[546F5921B3825801]) [    ] o.a.s.SolrTestCaseJ4 ###Ending test
   [junit4]   2> 89522 INFO  (SUITE-EchoParamsTest-seed#[546F5921B3825801]-worker) [    ] o.a.s.SolrTestCaseJ4 ###deleteCore
   [junit4]   2> 89522 INFO  (SUITE-EchoParamsTest-seed#[546F5921B3825801]-worker) [    ] o.a.s.c.CoreContainer Shutting down CoreContainer instance=382463223
   [junit4]   2> 89522 INFO  (SUITE-EchoParamsTest-seed#[546F5921B3825801]-worker) [    ] o.a.s.m.SolrMetricManager Closing metric reporters for registry=solr.node, tag=null
   [junit4]   2> 89522 INFO  (SUITE-EchoParamsTest-seed#[546F5921B3825801]-worker) [    ] o.a.s.m.r.SolrJmxReporter Closing reporter [org.apache.solr.metrics.reporters.SolrJmxReporter@7aaded21: rootName = null, domain = solr.node, service url = null, agent id = null] for registry solr.node / com.codahale.metrics.MetricRegistry@25fa38fb
   [junit4]   2> 89525 INFO  (SUITE-EchoParamsTest-seed#[546F5921B3825801]-worker) [    ] o.a.s.m.SolrMetricManager Closing metric reporters for registry=solr.jvm, tag=null
   [junit4]   2> 89525 INFO  (SUITE-EchoParamsTest-seed#[546F5921B3825801]-worker) [    ] o.a.s.m.r.SolrJmxReporter Closing reporter [org.apache.solr.metrics.reporters.SolrJmxReporter@5bfdb3a: rootName = null, domain = solr.jvm, service url = null, agent id = null] for registry solr.jvm / com.codahale.metrics.MetricRegistry@7b9d7170
   [junit4]   2> 89527 INFO  (SUITE-EchoParamsTest-seed#[546F5921B3825801]-worker) [    ] o.a.s.m.SolrMetricManager Closing metric reporters for registry=solr.jetty, tag=null
   [junit4]   2> 89527 INFO  (SUITE-EchoParamsTest-seed#[546F5921B3825801]-worker) [    ] o.a.s.m.r.SolrJmxReporter Closing reporter [org.apache.solr.metrics.reporters.SolrJmxReporter@3a3f396: rootName = null, domain = solr.jetty, service url = null, agent id = null] for registry solr.jetty / com.codahale.metrics.MetricRegistry@4b6b20f4
   [junit4]   2> 89532 INFO  (coreCloseExecutor-158-thread-1) [    x:collection1] o.a.s.c.SolrCore [collection1]  CLOSING SolrCore org.apache.solr.core.SolrCore@22a6b809
   [junit4]   2> 89532 INFO  (coreCloseExecutor-158-thread-1) [    x:collection1] o.a.s.m.SolrMetricManager Closing metric reporters for registry=solr.core.collection1, tag=581351433
   [junit4]   2> 89532 INFO  (coreCloseExecutor-158-thread-1) [    x:collection1] o.a.s.m.r.SolrJmxReporter Closing reporter [org.apache.solr.metrics.reporters.SolrJmxReporter@3f42620c: rootName = null, domain = solr.core.collection1, service url = null, agent id = null] for registry solr.core.collection1 / com.codahale.metrics.MetricRegistry@24fac7ba
   [junit4]   2> 89540 INFO  (SUITE-EchoParamsTest-seed#[546F5921B3825801]-worker) [    ] o.a.s.SolrTestCaseJ4 ------------------------------------------------------- Done waiting for tracked resources to be released
   [junit4]   2> NOTE: test params are: codec=Asserting(Lucene70): {}, docValues:{}, maxPointsInLeafNode=1714, maxMBSortInHeap=6.720123039499312, sim=Asserting(org.apache.lucene.search.similarities.AssertingSimilarity@2036b6cd), locale=ar-SY, timezone=Pacific/Pitcairn
   [junit4]   2> NOTE: Windows 10 10.0 amd64/Oracle Corporation 1.8.0_144 (64-bit)/cpus=3,threads=1,free=124867152,total=281542656
   [junit4]   2> NOTE: All tests run in this JVM: [TestBinaryResponseWriter, CoreAdminHandlerTest, TestFieldCacheReopen, TlogReplayBufferedWhileIndexingTest, ChaosMonkeyNothingIsSafeWithPullReplicasTest, UUIDUpdateProcessorFallbackTest, EchoParamsTest]
   [junit4]   2> NOTE: reproduce with: ant test  -Dtestcase=EchoParamsTest -Dtests.seed=546F5921B3825801 -Dtests.slow=true -Dtests.locale=ar-SY -Dtests.timezone=Pacific/Pitcairn -Dtests.asserts=true -Dtests.file.encoding=ISO-8859-1
   [junit4] ERROR   0.00s J1 | EchoParamsTest (suite) <<<
   [junit4]    > Throwable #1: java.io.IOException: Could not remove the following files (in the order of attempts):
   [junit4]    >    C:\Users\jenkins\workspace\Lucene-Solr-master-Windows\solr\build\solr-core\test\J1\temp\solr.EchoParamsTest_546F5921B3825801-001\init-core-data-001: java.nio.file.AccessDeniedException: C:\Users\jenkins\workspace\Lucene-Solr-master-Windows\solr\build\solr-core\test\J1\temp\solr.EchoParamsTest_546F5921B3825801-001\init-core-data-001
   [junit4]    >    C:\Users\jenkins\workspace\Lucene-Solr-master-Windows\solr\build\solr-core\test\J1\temp\solr.EchoParamsTest_546F5921B3825801-001: java.nio.file.DirectoryNotEmptyException: C:\Users\jenkins\workspace\Lucene-Solr-master-Windows\solr\build\solr-core\test\J1\temp\solr.EchoParamsTest_546F5921B3825801-001
   [junit4]    > 	at __randomizedtesting.SeedInfo.seed([546F5921B3825801]:0)
   [junit4]    > 	at org.apache.lucene.util.IOUtils.rm(IOUtils.java:329)
   [junit4]    > 	at java.lang.Thread.run(Thread.java:748)
   [junit4] Completed [18/765 (1!)] on J1 in 0.39s, 1 test, 1 error <<< FAILURES!

[...truncated 951 lines...]
   [junit4] Suite: org.apache.solr.core.TestCoreDiscovery
   [junit4]   2> 1382538 INFO  (SUITE-TestCoreDiscovery-seed#[546F5921B3825801]-worker) [    ] o.a.s.SolrTestCaseJ4 SecureRandom sanity checks: test.solr.allowed.securerandom=null & java.security.egd=file:/dev/./urandom
   [junit4]   2> Creating dataDir: C:\Users\jenkins\workspace\Lucene-Solr-master-Windows\solr\build\solr-core\test\J0\temp\solr.core.TestCoreDiscovery_546F5921B3825801-001\init-core-data-001
   [junit4]   2> 1382539 INFO  (SUITE-TestCoreDiscovery-seed#[546F5921B3825801]-worker) [    ] o.a.s.SolrTestCaseJ4 Using TrieFields (NUMERIC_POINTS_SYSPROP=false) w/NUMERIC_DOCVALUES_SYSPROP=true
   [junit4]   2> 1382540 INFO  (SUITE-TestCoreDiscovery-seed#[546F5921B3825801]-worker) [    ] o.a.s.SolrTestCaseJ4 Randomized ssl (true) and clientAuth (true) via: @org.apache.solr.util.RandomizeSSL(reason=, value=NaN, ssl=NaN, clientAuth=NaN)
   [junit4]   2> 1382541 INFO  (SUITE-TestCoreDiscovery-seed#[546F5921B3825801]-worker) [    ] o.a.s.SolrTestCaseJ4 ####initCore
   [junit4]   2> 1382541 INFO  (SUITE-TestCoreDiscovery-seed#[546F5921B3825801]-worker) [    ] o.a.s.SolrTestCaseJ4 ####initCore end
   [junit4]   2> 1382544 INFO  (TEST-TestCoreDiscovery.testAlternateRelativeCoreDir-seed#[546F5921B3825801]) [    ] o.a.s.SolrTestCaseJ4 ###Starting testAlternateRelativeCoreDir
   [junit4]   2> 1382562 INFO  (TEST-TestCoreDiscovery.testAlternateRelativeCoreDir-seed#[546F5921B3825801]) [    ] o.a.s.c.SolrXmlConfig Loading container configuration from C:\Users\jenkins\workspace\Lucene-Solr-master-Windows\solr\build\solr-core\test\J0\temp\solr.core.TestCoreDiscovery_546F5921B3825801-001\tempDir-001\solr.xml
   [junit4]   2> 1382573 INFO  (TEST-TestCoreDiscovery.testAlternateRelativeCoreDir-seed#[546F5921B3825801]) [    ] o.a.s.c.SolrXmlConfig MBean server found: com.sun.jmx.mbeanserver.JmxMBeanServer@5d6a9f0d, but no JMX reporters were configured - adding default JMX reporter.
   [junit4]   2> 1382677 INFO  (TEST-TestCoreDiscovery.testAlternateRelativeCoreDir-seed#[546F5921B3825801]) [    ] o.a.s.m.r.SolrJmxReporter JMX monitoring for 'solr.node' (registry 'solr.node') enabled at server: com.sun.jmx.mbeanserver.JmxMBeanServer@5d6a9f0d
   [junit4]   2> 1382682 INFO  (TEST-TestCoreDiscovery.testAlternateRelativeCoreDir-seed#[546F5921B3825801]) [    ] o.a.s.m.r.SolrJmxReporter JMX monitoring for 'solr.jvm' (registry 'solr.jvm') enabled at server: com.sun.jmx.mbeanserver.JmxMBeanServer@5d6a9f0d
   [junit4]   2> 1382682 INFO  (TEST-TestCoreDiscovery.testAlternateRelativeCoreDir-seed#[546F5921B3825801]) [    ] o.a.s.m.r.SolrJmxReporter JMX monitoring for 'solr.jetty' (registry 'solr.jetty') enabled at server: com.sun.jmx.mbeanserver.JmxMBeanServer@5d6a9f0d
   [junit4]   2> 1382689 INFO  (TEST-TestCoreDiscovery.testAlternateRelativeCoreDir-seed#[546F5921B3825801]) [    ] o.a.s.c.CorePropertiesLocator Found 2 core definitions underneath C:\Users\jenkins\workspace\Lucene-Solr-master-Windows\solr\build\solr-core\test\J0\temp\solr.core.TestCoreDiscovery_546F5921B3825801-001\tempDir-001\relativeCoreDir
   [junit4]   2> 1382689 INFO  (TEST-TestCoreDiscovery.testAlternateRelativeCoreDir-seed#[546F5921B3825801]) [    ] o.a.s.c.CorePropertiesLocator Cores are: [core1, core2]
   [junit4]   2> 1382689 INFO  (coreLoadExecutor-5904-thread-1) [    ] o.a.s.c.TransientSolrCoreCacheDefault Allocating transient cache for 2 transient cores
   [junit4]   2> 1382723 INFO  (coreLoadExecutor-5904-thread-1) [    x:core1] o.a.s.c.SolrConfig Using Lucene MatchVersion: 8.0.0
   [junit4]   2> 1382733 INFO  (coreLoadExecutor-5904-thread-1) [    x:core1] o.a.s.s.IndexSchema [core1] Schema name=tiny
   [junit4]   2> 1382740 INFO  (coreLoadExecutor-5904-thread-1) [    x:core1] o.a.s.s.IndexSchema Loaded schema tiny/1.1 with uniqueid field id
   [junit4]   2> 1382740 INFO  (coreLoadExecutor-5904-thread-1) [    x:core1] o.a.s.c.CoreContainer Creating SolrCore 'core1' using configuration from instancedir C:\Users\jenkins\workspace\Lucene-Solr-master-Windows\solr\build\solr-core\test\J0\temp\solr.core.TestCoreDiscovery_546F5921B3825801-001\tempDir-001\relativeCoreDir\core1, trusted=true
   [junit4]   2> 1382740 INFO  (coreLoadExecutor-5904-thread-1) [    x:core1] o.a.s.m.r.SolrJmxReporter JMX monitoring for 'solr.core.core1' (registry 'solr.core.core1') enabled at server: com.sun.jmx.mbeanserver.JmxMBeanServer@5d6a9f0d
   [junit4]   2> 1382740 INFO  (coreLoadExecutor-5904-thread-1) [    x:core1] o.a.s.c.SolrCore solr.RecoveryStrategy.Builder
   [junit4]   2> 1382740 INFO  (coreLoadExecutor-5904-thread-1) [    x:core1] o.a.s.c.SolrCore [[core1] ] Opening new SolrCore at [C:\Users\jenkins\workspace\Lucene-Solr-master-Windows\solr\build\solr-core\test\J0\temp\solr.core.TestCoreDiscovery_546F5921B3825801-001\tempDir-001\relativeCoreDir\core1], dataDir=[C:\Users\jenkins\workspace\Lucene-Solr-master-Windows\solr\build\solr-core\test\J0\temp\solr.core.TestCoreDiscovery_546F5921B3825801-001\tempDir-001\relativeCoreDir\core1\core1\]
   [junit4]   2> 1382742 INFO  (coreLoadExecutor-5904-thread-1) [    x:core1] o.a.s.u.RandomMergePolicy RandomMergePolicy wrapping class org.apache.lucene.index.TieredMergePolicy: [TieredMergePolicy: maxMergeAtOnce=49, maxMergeAtOnceExplicit=30, maxMergedSegmentMB=16.7060546875, floorSegmentMB=0.6865234375, forceMergeDeletesPctAllowed=5.183039795461898, segmentsPerTier=23.0, maxCFSSegmentSizeMB=8.796093022207999E12, noCFSRatio=0.6335061190704153
   [junit4]   2> 1382830 INFO  (coreLoadExecutor-5904-thread-1) [    x:core1] o.a.s.u.CommitTracker Hard AutoCommit: disabled
   [junit4]   2> 1382830 INFO  (coreLoadExecutor-5904-thread-1) [    x:core1] o.a.s.u.CommitTracker Soft AutoCommit: disabled
   [junit4]   2> 1382831 INFO  (coreLoadExecutor-5904-thread-1) [    x:core1] o.a.s.u.RandomMergePolicy RandomMergePolicy wrapping class org.apache.lucene.index.LogByteSizeMergePolicy: [LogByteSizeMergePolicy: minMergeSize=1677721, mergeFactor=44, maxMergeSize=2147483648, maxMergeSizeForForcedMerge=9223372036854775807, calibrateSizeByDeletes=true, maxMergeDocs=2147483647, maxCFSSegmentSizeMB=8.796093022207999E12, noCFSRatio=0.0]
   [junit4]   2> 1382832 INFO  (coreLoadExecutor-5904-thread-1) [    x:core1] o.a.s.s.SolrIndexSearcher Opening [Searcher@15d11e50[core1] main]
   [junit4]   2> 1382832 INFO  (coreLoadExecutor-5904-thread-1) [    x:core1] o.a.s.r.ManagedResourceStorage File-based storage initialized to use dir: C:\Users\jenkins\workspace\Lucene-Solr-master-Windows\solr\build\solr-core\test\J0\temp\solr.core.TestCoreDiscovery_546F5921B3825801-001\tempDir-001\relativeCoreDir\core1\conf
   [junit4]   2> 1382833 INFO  (coreLoadExecutor-5904-thread-1) [    x:core1] o.a.s.h.ReplicationHandler Commits will be reserved for 10000ms.
   [junit4]   2> 1382833 INFO  (searcherExecutor-5905-thread-1-processing-x:core1) [    x:core1] o.a.s.c.SolrCore [core1] Registered new searcher Searcher@15d11e50[core1] main{ExitableDirectoryReader(UninvertingDirectoryReader())}
   [junit4]   2> 1382871 INFO  (TEST-TestCoreDiscovery.testAlternateRelativeCoreDir-seed#[546F5921B3825801]) [    x:core2] o.a.s.c.SolrConfig Using Lucene MatchVersion: 8.0.0
   [junit4]   2> 1382894 INFO  (TEST-TestCoreDiscovery.testAlternateRelativeCoreDir-seed#[546F5921B3825801]) [    x:core2] o.a.s.s.IndexSchema [core2] Schema name=tiny
   [junit4]   2> 1382900 INFO  (TEST-TestCoreDiscovery.testAlternateRelativeCoreDir-seed#[546F5921B3825801]) [    x:core2] o.a.s.s.IndexSchema Loaded schema tiny/1.1 with uniqueid field id
   [junit4]   2> 1382900 INFO  (TEST-TestCoreDiscovery.testAlternateRelativeCoreDir-seed#[546F5921B3825801]) [    x:core2] o.a.s.c.CoreContainer Creating SolrCore 'core2' using configuration from instancedir C:\Users\jenkins\workspace\Lucene-Solr-master-Windows\solr\build\solr-core\test\J0\temp\solr.core.TestCoreDiscovery_546F5921B3825801-001\tempDir-001\relativeCoreDir\core2, trusted=true
   [junit4]   2> 1382901 INFO  (TEST-TestCoreDiscovery.testAlternateRelativeCoreDir-seed#[546F5921B3825801]) [    x:core2] o.a.s.m.r.SolrJmxReporter JMX monitoring for 'solr.core.core2' (registry 'solr.core.core2') enabled at server: com.sun.jmx.mbeanserver.JmxMBeanServer@5d6a9f0d
   [junit4]   2> 1382901 INFO  (TEST-TestCoreDiscovery.testAlternateRelativeCoreDir-seed#[546F5921B3825801]) [    x:core2] o.a.s.c.SolrCore solr.RecoveryStrategy.Builder
   [junit4]   2> 1382901 INFO  (TEST-TestCoreDiscovery.testAlternateRelativeCoreDir-seed#[546F5921B3825801]) [    x:core2] o.a.s.c.SolrCore [[core2] ] Opening new SolrCore at [C:\Users\jenkins\workspace\Lucene-Solr-master-Windows\solr\build\solr-core\test\J0\temp\solr.core.TestCoreDiscovery_546F5921B3825801-001\tempDir-001\relativeCoreDir\core2], dataDir=[C:\Users\jenkins\workspace\Lucene-Solr-master-Windows\solr\build\solr-core\test\J0\temp\solr.core.TestCoreDiscovery_546F5921B3825801-001\tempDir-001\relativeCoreDir\core2\core2\]
   [junit4]   2> 1382902 INFO  (TEST-TestCoreDiscovery.testAlternateRelativeCoreDir-seed#[546F5921B3825801]) [    x:core2] o.a.s.u.RandomMergePolicy RandomMergePolicy wrapping class org.apache.lucene.index.TieredMergePolicy: [TieredMergePolicy: maxMergeAtOnce=43, maxMergeAtOnceExplicit=23, maxMergedSegmentMB=36.87109375, floorSegmentMB=1.0146484375, forceMergeDeletesPctAllowed=24.176648976419088, segmentsPerTier=43.0, maxCFSSegmentSizeMB=8.796093022207999E12, noCFSRatio=0.628868858175335
   [junit4]   2> 1382994 INFO  (TEST-TestCoreDiscovery.testAlternateRelativeCoreDir-seed#[546F5921B3825801]) [    x:core2] o.a.s.u.CommitTracker Hard AutoCommit: disabled
   [junit4]   2> 1382994 INFO  (TEST-TestCoreDiscovery.testAlternateRelativeCoreDir-seed#[546F5921B3825801]) [    x:core2] o.a.s.u.CommitTracker Soft AutoCommit: disabled
   [junit4]   2> 1382996 INFO  (TEST-TestCoreDiscovery.testAlternateRelativeCoreDir-seed#[546F5921B3825801]) [    x:core2] o.a.s.u.RandomMergePolicy RandomMergePolicy wrapping class org.apache.lucene.index.TieredMergePolicy: [TieredMergePolicy: maxMergeAtOnce=32, maxMergeAtOnceExplicit=35, maxMergedSegmentMB=30.6728515625, floorSegmentMB=0.810546875, forceMergeDeletesPctAllowed=17.17701527676647, segmentsPerTier=36.0, maxCFSSegmentSizeMB=8.796093022207999E12, noCFSRatio=0.4436326118070918
   [junit4]   2> 1382996 INFO  (TEST-TestCoreDiscovery.testAlternateRelativeCoreDir-seed#[546F5921B3825801]) [    x:core2] o.a.s.s.SolrIndexSearcher Opening [Searcher@5d4ae3cb[core2] main]
   [junit4]   2> 1382996 INFO  (TEST-TestCoreDiscovery.testAlternateRelativeCoreDir-seed#[546F5921B3825801]) [    x:core2] o.a.s.r.ManagedResourceStorage File-based storage initialized to use dir: C:\Users\jenkins\workspace\Lucene-Solr-master-Windows\solr\build\solr-core\test\J0\temp\solr.core.TestCoreDiscovery_546F5921B3825801-001\tempDir-001\relativeCoreDir\core2\conf
   [junit4]   2> 1382997 INFO  (TEST-TestCoreDiscovery.testAlternateRelativeCoreDir-seed#[546F5921B3825801]) [    x:core2] o.a.s.h.ReplicationHandler Commits will be reserved for 10000ms.
   [junit4]   2> 1382998 INFO  (searcherExecutor-5909-thread-1-processing-x:core2) [    x:core2] o.a.s.c.SolrCore [core2] Registered new searcher Searcher@5d4ae3cb[core2] main{ExitableDirectoryReader(UninvertingDirectoryReader())}
   [junit4]   2> 1383029 INFO  (TEST-TestCoreDiscovery.testAlternateRelativeCoreDir-seed#[546F5921B3825801]) [    x:core2] o.a.s.c.SolrConfig Using Lucene MatchVersion: 8.0.0
   [junit4]   2> 1383036 INFO  (TEST-TestCoreDiscovery.testAlternateRelativeCoreDir-seed#[546F5921B3825801]) [    x:core2] o.a.s.s.IndexSchema [core3] Schema name=minimal
   [junit4]   2> 1383041 WARN  (TEST-TestCoreDiscovery.testAlternateRelativeCoreDir-seed#[546F5921B3825801]) [    x:core2] o.a.s.s.IndexSchema no uniqueKey specified in schema.
   [junit4]   2> 1383041 INFO  (TEST-TestCoreDiscovery.testAlternateRelativeCoreDir-seed#[546F5921B3825801]) [    x:core2] o.a.s.s.IndexSchema Loaded schema minimal/1.1 with uniqueid field null
   [junit4]   2> 1383042 INFO  (TEST-TestCoreDiscovery.testAlternateRelativeCoreDir-seed#[546F5921B3825801]) [    x:core2] o.a.s.c.CoreContainer Creating SolrCore 'core3' using configuration from configset C:\Users\jenkins\workspace\Lucene-Solr-master-Windows\solr\core\src\test-files\solr\configsets\minimal, trusted=true
   [junit4]   2> 1383042 INFO  (TEST-TestCoreDiscovery.testAlternateRelativeCoreDir-seed#[546F5921B3825801]) [    x:core2] o.a.s.m.r.SolrJmxReporter JMX monitoring for 'solr.core.core3' (registry 'solr.core.core3') enabled at server: com.sun.jmx.mbeanserver.JmxMBeanServer@5d6a9f0d
   [junit4]   2> 1383042 INFO  (TEST-TestCoreDiscovery.testAlternateRelativeCoreDir-seed#[546F5921B3825801]) [    x:core2] o.a.s.c.SolrCore solr.RecoveryStrategy.Builder
   [junit4]   2> 1383042 INFO  (TEST-TestCoreDiscovery.testAlternateRelativeCoreDir-seed#[546F5921B3825801]) [    x:core2] o.a.s.c.SolrCore [[core3] ] Opening new SolrCore at [C:\Users\jenkins\workspace\Lucene-Solr-master-Windows\solr\core\src\test-files\solr\configsets\minimal], dataDir=[C:\Users\jenkins\workspace\Lucene-Solr-master-Windows\solr\build\solr-core\test\J0\temp\solr.core.TestCoreDiscovery_546F5921B3825801-001\tempDir-001\relativeCoreDir\core3\data\]
   [junit4]   2> 1383131 INFO  (TEST-TestCoreDiscovery.testAlternateRelativeCoreDir-seed#[546F5921B3825801]) [    x:core2] o.a.s.u.CommitTracker Hard AutoCommit: disabled
   [junit4]   2> 1383131 INFO  (TEST-TestCoreDiscovery.testAlternateRelativeCoreDir-seed#[546F5921B3825801]) [    x:core2] o.a.s.u.CommitTracker Soft AutoCommit: disabled
   [junit4]   2> 1383132 INFO  (TEST-TestCoreDiscovery.testAlternateRelativeCoreDir-seed#[546F5921B3825801]) [    x:core2] o.a.s.s.SolrIndexSearcher Opening [Searcher@1c7c5f7c[core3] main]
   [junit4]   2> 1383132 WARN  (TEST-TestCoreDiscovery.testAlternateRelativeCoreDir-seed#[546F5921B3825801]) [    x:core2] o.a.s.r.ManagedResourceStorage Cannot write to config directory C:\Users\jenkins\workspace\Lucene-Solr-master-Windows\solr\core\src\test-files\solr\configsets\minimal\conf; switching to use InMemory storage instead.
   [junit4]   2> 1383133 INFO  (TEST-TestCoreDiscovery.testAlternateRelativeCoreDir-seed#[546F5921B3825801]) [    x:core2] o.a.s.h.ReplicationHandler Commits will be reserved for 10000ms.
   [junit4]   2> 1383134 INFO  (searcherExecutor-5913-thread-1-processing-x:core2) [    x:core2] o.a.s.c.SolrCore [core3] Registered new searcher Searcher@1c7c5f7c[core3] main{ExitableDirectoryReader(UninvertingDirectoryReader())}
   [junit4]   2> 1383145 INFO  (TEST-TestCoreDiscovery.testAlternateRelativeCoreDir-seed#[546F5921B3825801]) [    x:core2] o.a.s.c.CoreContainer Shutting down CoreContainer instance=377972960
   [junit4]   2> 1383145 INFO  (TEST-TestCoreDiscovery.testAlternateRelativeCoreDir-seed#[546F5921B3825801]) [    x:core2] o.a.s.m.SolrMetricManager Closing metric reporters for registry=solr.node, tag=null
   [junit4]   2> 1383145 INFO  (TEST-TestCoreDiscovery.testAlternateRelativeCoreDir-seed#[546F5921B3825801]) [    x:core2] o.a.s.m.r.SolrJmxReporter Closing reporter [org.apache.solr.metrics.reporters.SolrJmxReporter@29331988: rootName = null, domain = solr.node, service url = null, agent id = null] for registry solr.node / com.codahale.metrics.MetricRegistry@661c34cf
   [junit4]   2> 1383149 INFO  (TEST-TestCoreDiscovery.testAlternateRelativeCoreDir-seed#[546F5921B3825801]) [    x:core2] o.a.s.m.SolrMetricManager Closing metric reporters for registry=solr.jvm, tag=null
   [junit4]   2> 1383149 INFO  (TEST-TestCoreDiscovery.testAlternateRelativeCoreDir-seed#[546F5921B3825801]) [    x:core2] o.a.s.m.r.SolrJmxReporter Closing reporter [org.apache.solr.metrics.reporters.SolrJmxReporter@72d33ec0: rootName = null, domain = solr.jvm, service url = null, agent id = null] for registry solr.jvm / com.codahale.metrics.MetricRegistry@24dfed25
   [junit4]   2> 1383152 INFO  (TEST-TestCoreDiscovery.testAlternateRelativeCoreDir-seed#[546F5921B3825801]) [    x:core2] o.a.s.m.SolrMetricManager Closing metric reporters for registry=solr.jetty, tag=null
   [junit4]   2> 1383152 INFO  (TEST-TestCoreDiscovery.testAlternateRelativeCoreDir-seed#[546F5921B3825801]) [    x:core2] o.a.s.m.r.SolrJmxReporter Closing reporter [org.apache.solr.metrics.reporters.SolrJmxReporter@1e6ea841: rootName = null, domain = solr.jetty, service url = null, agent id = null] for registry solr.jetty / com.codahale.metrics.MetricRegistry@b325e2d
   [junit4]   2> 1383154 INFO  (coreCloseExecutor-5917-thread-1-processing-x:core2) [    x:core1] o.a.s.c.SolrCore [core1]  CLOSING SolrCore org.apache.solr.core.SolrCore@2d951d6
   [junit4]   2> 1383154 INFO  (coreCloseExecutor-5917-thread-3-processing-x:core2) [    x:core3] o.a.s.c.SolrCore [core3]  CLOSING SolrCore org.apache.solr.core.SolrCore@56939f1
   [junit4]   2> 1383154 INFO  (coreCloseExecutor-5917-thread-1-processing-x:core2) [    x:core1] o.a.s.m.SolrMetricManager Closing metric reporters for registry=solr.core.core1, tag=47796694
   [junit4]   2> 1383154 INFO  (coreCloseExecutor-5917-thread-2-processing-x:core2) [    x:core2] o.a.s.c.SolrCore [core2]  CLOSING SolrCore org.apache.solr.core.SolrCore@27f70fa9
   [junit4]   2> 1383155 INFO  (coreCloseExecutor-5917-thread-1-processing-x:core2) [    x:core1] o.a.s.m.r.SolrJmxReporter Closing reporter [org.apache.solr.metrics.reporters.SolrJmxReporter@56d0953: rootName = null, domain = solr.core.core1, service url = null, agent id = null] for registry solr.core.core1 / com.codahale.metrics.MetricRegistry@24be3953
   [junit4]   2> 1383161 INFO  (coreCloseExecutor-5917-thread-3-processing-x:core2) [    x:core3] o.a.s.m.SolrMetricManager Closing metric reporters for registry=solr.core.core3, tag=90782193
   [junit4]   2> 1383161 INFO  (coreCloseExecutor-5917-thread-3-processing-x:core2) [    x:core3] o.a.s.m.r.SolrJmxReporter Closing reporter [org.apache.solr.metrics.reporters.SolrJmxReporter@4d1b73cb: rootName = null, domain = solr.core.core3, service url = null, agent id = null] for registry solr.core.core3 / com.codahale.metrics.MetricRegistry@563d3b55
   [junit4]   2> 1383168 INFO  (coreCloseExecutor-5917-thread-2-processing-x:core2) [    x:core2] o.a.s.m.SolrMetricManager Closing metric reporters for registry=solr.core.core2, tag=670502825
   [junit4]   2> 1383168 INFO  (coreCloseExecutor-5917-thread-2-processing-x:core2) [    x:core2] o.a.s.m.r.SolrJmxReporter Closing reporter [org.apache.solr.metrics.reporters.SolrJmxReporter@5d531d9e: rootName = null, domain = solr.core.core2, service url = null, agent id = null] for registry solr.core.core2 / com.codahale.metrics.MetricRegistry@20424d70
   [junit4]   2> 1383175 INFO  (TEST-TestCoreDiscovery.testAlternateRelativeCoreDir-seed#[546F5921B3825801]) [    x:core2] o.a.s.SolrTestCaseJ4 ###Ending testAlternateRelativeCoreDir
   [junit4]   2> 1383179 INFO  (TEST-TestCoreDiscovery.testPropFilePersistence-seed#[546F5921B3825801]) [    x:core2] o.a.s.SolrTestCaseJ4 ###Starting testPropFilePersistence
   [junit4]   2> 1383198 INFO  (TEST-TestCoreDiscovery.testPropFilePersistence-seed#[546F5921B3825801]) [    x:core2] o.a.s.c.SolrXmlConfig Loading container configuration from C:\Users\jenkins\workspace\Lucene-Solr-master-Windows\solr\build\solr-core\test\J0\temp\solr.core.TestCoreDiscovery_546F5921B3825801-001\tempDir-002\solr.xml
   [junit4]   2> 1383207 INFO  (TEST-TestCoreDiscovery.testPropFilePersistence-seed#[546F5921B3825801]) [    x:core2] o.a.s.c.SolrXmlConfig MBean server found: com.sun.jmx.mbeanserver.JmxMBeanServer@5d6a9f0d, but no JMX reporters were configured - adding default JMX reporter.
   [junit4]   2> 1383313 INFO  (TEST-TestCoreDiscovery.testPropFilePersistence-seed#[546F5921B3825801]) [    x:core2] o.a.s.m.r.SolrJmxReporter JMX monitoring for 'solr.node' (registry 'solr.node') enabled at server: com.sun.jmx.mbeanserver.JmxMBeanServer@5d6a9f0d
   [junit4]   2> 1383334 INFO  (TEST-TestCoreDiscovery.testPropFilePersistence-seed#[546F5921B3825801]) [    x:core2] o.a.s.m.r.SolrJmxReporter JMX monitoring for 'solr.jvm' (registry 'solr.jvm') enabled at server: com.sun.jmx.mbeanserver.JmxMBeanServer@5d6a9f0d
   [junit4]   2> 1383334 INFO  (TEST-TestCoreDiscovery.testPropFilePersistence-seed#[546F5921B3825801]) [    x:core2] o.a.s.m.r.SolrJmxReporter JMX monitoring for 'solr.jetty' (registry 'solr.jetty') enabled at server: com.sun.jmx.mbeanserver.JmxMBeanServer@5d6a9f0d
   [junit4]   2> 1383343 INFO  (TEST-TestCoreDiscovery.testPropFilePersistence-seed#[546F5921B3825801]) [    x:core2] o.a.s.c.CorePropertiesLocator Found 2 core definitions underneath C:\Users\jenkins\workspace\Lucene-Solr-master-Windows\solr\build\solr-core\test\J0\temp\solr.core.TestCoreDiscovery_546F5921B3825801-001\tempDir-002
   [junit4]   2> 1383343 INFO  (TEST-TestCoreDiscovery.testPropFilePersistence-seed#[546F5921B3825801]) [    x:core2] o.a.s.c.CorePropertiesLocator Cores are: [corep1, corep2]
   [junit4]   2> 1383344 INFO  (coreLoadExecutor-5924-thread-1-processing-x:core2) [    x:core2] o.a.s.c.TransientSolrCoreCacheDefault Allocating transient cache for 2 transient cores
   [junit4]   2> 1383392 INFO  (coreLoadExecutor-5924-thread-2-processing-x:core2) [    x:corep2] o.a.s.c.SolrConfig Using Lucene MatchVersion: 8.0.0
   [junit4]   2> 1383392 INFO  (coreLoadExecutor-5924-thread-1-processing-x:core2) [    x:corep1] o.a.s.c.SolrConfig Using Lucene MatchVersion: 8.0.0
   [junit4]   2> 1383400 INFO  (coreLoadExecutor-5924-thread-2-processing-x:core2) [    x:corep2] o.a.s.s.IndexSchema [corep2] Schema name=tiny
   [junit4]   2> 1383406 ERROR (coreLoadExecutor-5924-thread-1-processing-x:core2) [    x:corep1] o.a.s.s.IndexSchemaFactory Error loading schema resource not-there.xml
   [junit4]   2> org.apache.solr.core.SolrResourceNotFoundException: Can't find resource 'not-there.xml' in classpath or 'C:\Users\jenkins\workspace\Lucene-Solr-master-Windows\solr\build\solr-core\test\J0\temp\solr.core.TestCoreDiscovery_546F5921B3825801-001\tempDir-002\corep1'
   [junit4]   2> 	at org.apache.solr.core.SolrResourceLoader.openResource(SolrResourceLoader.java:407)
   [junit4]   2> 	at org.apache.solr.core.SolrResourceLoader.openSchema(SolrResourceLoader.java:354)
   [junit4]   2> 	at org.apache.solr.schema.IndexSchemaFactory.create(IndexSchemaFactory.java:48)
   [junit4]   2> 	at org.apache.solr.schema.IndexSchemaFactory.buildIndexSchema(IndexSchemaFactory.java:70)
   [junit4]   2> 	at org.apache.solr.core.ConfigSetService.createIndexSchema(ConfigSetService.java:119)
   [junit4]   2> 	at org.apache.solr.core.ConfigSetService.getConfig(ConfigSetService.java:92)
   [junit4]   2> 	at org.apache.solr.core.CoreContainer.getConfigSet(CoreContainer.java:1087)
   [junit4]   2> 	at org.apache.solr.core.CoreContainer.createFromDescriptor(CoreContainer.java:1039)
   [junit4]   2> 	at org.apache.solr.core.CoreContainer.lambda$load$13(CoreContainer.java:644)
   [junit4]   2> 	at com.codahale.metrics.InstrumentedExecutorService$InstrumentedCallable.call(InstrumentedExecutorService.java:197)
   [junit4]   2> 	at java.util.concurrent.FutureTask.run(FutureTask.java:266)
   [junit4]   2> 	at org.apache.solr.common.util.ExecutorUtil$MDCAwareThreadPoolExecutor.lambda$execute$0(ExecutorUtil.java:188)
   [junit4]   2> 	at java.util.concurrent.ThreadPoolExecutor.runWorker(ThreadPoolExecutor.java:1149)
   [junit4]   2> 	at java.util.concurrent.ThreadPoolExecutor$Worker.run(ThreadPoolExecutor.java:624)
   [junit4]   2> 	at java.lang.Thread.run(Thread.java:748)
   [junit4]   2> 1383407 INFO  (coreLoadExecutor-5924-thread-2-processing-x:core2) [    x:corep2] o.a.s.s.IndexSchema Loaded schema tiny/1.1 with uniqueid field id
   [junit4]   2> 1383407 INFO  (coreLoadExecutor-5924-thread-2-processing-x:core2) [    x:corep2] o.a.s.c.CoreContainer Creating SolrCore 'corep2' using configuration from instancedir C:\Users\jenkins\workspace\Lucene-Solr-master-Windows\solr\build\solr-core\test\J0\temp\solr.core.TestCoreDiscovery_546F5921B3825801-001\tempDir-002\corep2, trusted=true
   [junit4]   2> 1383407 INFO  (coreLoadExecutor-5924-thread-2-processing-x:core2) [    x:corep2] o.a.s.m.r.SolrJmxReporter JMX monitoring for 'solr.core.corep2' (registry 'solr.core.corep2') enabled at server: com.sun.jmx.mbeanserver.JmxMBeanServer@5d6a9f0d
   [junit4]   2> 1383407 INFO  (coreLoadExecutor-5924-thread-2-processing-x:core2) [    x:corep2] o.a.s.c.SolrCore solr.RecoveryStrategy.Builder
   [junit4]   2> 1383407 INFO  (coreLoadExecutor-5924-thread-2-processing-x:core2) [    x:corep2] o.a.s.c.SolrCore [[corep2] ] Opening new SolrCore at [C:\Users\jenkins\workspace\Lucene-Solr-master-Windows\solr\build\solr-core\test\J0\temp\solr.core.TestCoreDiscovery_546F5921B3825801-001\tempDir-002\corep2], dataDir=[C:\Users\jenkins\workspace\Lucene-Solr-master-Windows\solr\build\solr-core\test\J0\temp\solr.core.TestCoreDiscovery_546F5921B3825801-001\tempDir-002\corep2\stuffandnonsense\]
   [junit4]   2> 1383409 INFO  (coreLoadExecutor-5924-thread-2-processing-x:core2) [    x:corep2] o.a.s.u.RandomMergePolicy RandomMergePolicy wrapping class org.apache.lucene.index.TieredMergePolicy: [TieredMergePolicy: maxMergeAtOnce=49, maxMergeAtOnceExplicit=30, maxMergedSegmentMB=16.7060546875, floorSegmentMB=0.6865234375, forceMergeDeletesPctAllowed=5.183039795461898, segmentsPerTier=23.0, maxCFSSegmentSizeMB=8.796093022207999E12, noCFSRatio=0.6335061190704153
   [junit4]   2> 1383506 INFO  (coreLoadExecutor-5924-thread-2-processing-x:core2) [    x:corep2] o.a.s.u.CommitTracker Hard AutoCommit: disabled
   [junit4]   2> 1383506 INFO  (coreLoadExecutor-5924-thread-2-processing-x:core2) [    x:corep2] o.a.s.u.CommitTracker Soft AutoCommit: disabled
   [junit4]   2> 1383508 INFO  (coreLoadExecutor-5924-thread-2-processing-x:core2) [    x:corep2] o.a.s.u.RandomMergePolicy RandomMergePolicy wrapping class org.apache.lucene.index.LogByteSizeMergePolicy: [LogByteSizeMergePolicy: minMergeSize=1677721, mergeFactor=44, maxMergeSize=2147483648, maxMergeSizeForForcedMerge=9223372036854775807, calibrateSizeByDeletes=true, maxMergeDocs=2147483647, maxCFSSegmentSizeMB=8.796093022207999E12, noCFSRatio=0.0]
   [junit4]   2> 1383508 INFO  (coreLoadExecutor-5924-thread-2-processing-x:core2) [    x:corep2] o.a.s.s.SolrIndexSearcher Opening [Searcher@4ec981b0[corep2] main]
   [junit4]   2> 1383508 INFO  (coreLoadExecutor-5924-thread-2-processing-x:core2) [    x:corep2] o.a.s.r.ManagedResourceStorage File-based storage initialized to use dir: C:\Users\jenkins\workspace\Lucene-Solr-master-Windows\solr\build\solr-core\test\J0\temp\solr.core.TestCoreDiscovery_546F5921B3825801-001\tempDir-002\corep2\conf
   [junit4]   2> 1383509 INFO  (coreLoadExecutor-5924-thread-2-processing-x:core2) [    x:corep2] o.a.s.h.ReplicationHandler Commits will be reserved for 10000ms.
   [junit4]   2> 1383509 INFO  (searcherExecutor-5925-thread-1-processing-x:corep2) [    x:corep2] o.a.s.c.SolrCore [corep2] Registered new searcher Searcher@4ec981b0[corep2] main{ExitableDirectoryReader(UninvertingDirectoryReader())}
   [junit4]   2> 1383551 INFO  (TEST-TestCoreDiscovery.testPropFilePersistence-seed#[546F5921B3825801]) [    x:core2] o.a.s.c.SolrConfig Using Lucene MatchVersion: 8.0.0
   [junit4]   2> 1383566 INFO  (TEST-TestCoreDiscovery.testPropFilePersistence-seed#[546F5921B3825801]) [    x:core2] o.a.s.s.IndexSchema [corep3] Schema name=minimal
   [junit4]   2> 1383571 WARN  (TEST-TestCoreDiscovery.testPropFilePersistence-seed#[546F5921B3825801]) [    x:core2] o.a.s.s.IndexSchema no uniqueKey specified in schema.
   [junit4]   2> 1383572 INFO  (TEST-TestCoreDiscovery.testPropFilePersistence-seed#[546F5921B3825801]) [    x:core2] o.a.s.s.IndexSchema Loaded schema minimal/1.1 with uniqueid field null
   [junit4]   2> 1383572 INFO  (TEST-TestCoreDiscovery.testPropFilePersistence-seed#[546F5921B3825801]) [    x:core2] o.a.s.c.CoreContainer Creating SolrCore 'corep3' using configuration from configset C:\Users\jenkins\workspace\Lucene-Solr-master-Windows\solr\core\src\test-files\solr\configsets\minimal, trusted=true
   [junit4]   2> 1383572 INFO  (TEST-TestCoreDiscovery.testPropFilePersistence-seed#[546F5921B3825801]) [    x:core2] o.a.s.m.r.SolrJmxReporter JMX monitoring for 'solr.core.corep3' (registry 'solr.core.corep3') enabled at server: com.sun.jmx.mbeanserver.JmxMBeanServer@5d6a9f0d
   [junit4]   2> 1383573 INFO  (TEST-TestCoreDiscovery.testPropFilePersistence-seed#[546F5921B3825801]) [    x:core2] o.a.s.c.SolrCore solr.RecoveryStrategy.Builder
   [junit4]   2> 1383573 INFO  (TEST-TestCoreDiscovery.testPropFilePersistence-seed#[546F5921B3825801]) [    x:core2] o.a.s.c.SolrCore [[corep3] ] Opening new SolrCore at [C:\Users\jenkins\workspace\Lucene-Solr-master-Windows\solr\core\src\test-files\solr\configsets\minimal], dataDir=[C:\Users\jenkins\workspace\Lucene-Solr-master-Windows\solr\build\solr-core\test\J0\temp\solr.core.TestCoreDiscovery_546F5921B3825801-001\tempDir-002\corep3\data\]
   [junit4]   2> 1383685 INFO  (TEST-TestCoreDiscovery.testPropFilePersistence-seed#[546F5921B3825801]) [    x:core2] o.a.s.u.CommitTracker Hard AutoCommit: disabled
   [junit4]   2> 1383685 INFO  (TEST-TestCoreDiscovery.testPropFilePersistence-seed#[546F5921B3825801]) [    x:core2] o.a.s.u.CommitTracker Soft AutoCommit: disabled
   [junit4]   2> 1383687 INFO  (TEST-TestCoreDiscovery.testPropFilePersistence-seed#[546F5921B3825801]) [    x:core2] o.a.s.s.SolrIndexSearcher Opening [Searcher@2afd7e20[corep3] main]
   [junit4]   2> 1383688 WARN  (TEST-TestCoreDiscovery.testPropFilePersistence-seed#[546F5921B3825801]) [    x:core2] o.a.s.r.ManagedResourceStorage Cannot write to config directory C:\Users\jenkins\workspace\Lucene-Solr-master-Windows\solr\core\src\test-files\solr\configsets\minimal\conf; switching to use InMemory storage instead.
   [junit4]   2> 1383689 INFO  (TEST-TestCoreDiscovery.testPropFilePersistence-seed#[546F5921B3825801]) [    x:core2] o.a.s.h.ReplicationHandler Commits will be reserved for 10000ms.
   [junit4]   2> 1383689 INFO  (searcherExecutor-5929-thread-1-processing-x:core2) [    x:core2] o.a.s.c.SolrCore [corep3] Registered new searcher Searcher@2afd7e20[corep3] main{ExitableDirectoryReader(UninvertingDirectoryReader())}
   [junit4]   2> 1383746 INFO  (TEST-TestCoreDiscovery.testPropFilePersistence-seed#[546F5921B3825801]) [    x:core2] o.a.s.c.SolrConfig Using Lucene MatchVersion: 8.0.0
   [junit4]   2> 1383758 INFO  (TEST-TestCoreDiscovery.testPropFilePersistence-seed#[546F5921B3825801]) [    x:core2] o.a.s.s.IndexSchema [corep5] Schema name=minimal
   [junit4]   2> 1383763 WARN  (TEST-TestCoreDiscovery.testPropFilePersistence-seed#[546F5921B3825801]) [    x:core2] o.a.s.s.IndexSchema no uniqueKey specified in schema.
   [junit4]   2> 1383765 INFO  (TEST-TestCoreDiscovery.testPropFilePersistence-seed#[546F5921B3825801]) [    x:core2] o.a.s.s.IndexSchema Loaded schema minimal/1.1 with uniqueid field null
   [junit4]   2> 1383765 INFO  (TEST-TestCoreDiscovery.testPropFilePersistence-seed#[546F5921B3825801]) [    x:core2] o.a.s.c.CoreContainer Creating SolrCore 'corep5' using configuration from configset C:\Users\jenkins\workspace\Lucene-Solr-master-Windows\solr\core\src\test-files\solr\configsets\minimal, trusted=true
   [junit4]   2> 1383765 INFO  (TEST-TestCoreDiscovery.testPropFilePersistence-seed#[546F5921B3825801]) [    x:core2] o.a.s.m.r.SolrJmxReporter JMX monitoring for 'solr.core.corep5' (registry 'solr.core.corep5') enabled at server: com.sun.jmx.mbeanserver.JmxMBeanServer@5d6a9f0d
   [junit4]   2> 1383765 INFO  (TEST-TestCoreDiscovery.testPropFilePersistence-seed#[546F5921B3825801]) [    x:core2] o.a.s.c.SolrCore solr.RecoveryStrategy.Builder
   [junit4]   2> 1383766 INFO  (TEST-TestCoreDiscovery.testPropFilePersistence-seed#[546F5921B3825801]) [    x:core2] o.a.s.c.SolrCore [[corep5] ] Opening new SolrCore at [C:\Users\jenkins\workspace\Lucene-Solr-master-Windows\solr\core\src\test-files\solr\configsets\minimal], dataDir=[C:\Users\jenkins\workspace\Lucene-Solr-master-Windows\solr\build\solr-core\test\J0\temp\solr.core.TestCoreDiscovery_546F5921B3825801-001\tempDir-002\corep5\data\]
   [junit4]   2> 1383874 INFO  (TEST-TestCoreDiscovery.testPropFilePersistence-seed#[546F5921B3825801]) [    x:core2] o.a.s.u.CommitTracker Hard AutoCommit: disabled
   [junit4]   2> 1383874 INFO  (TEST-TestCoreDiscovery.testPropFilePersistence-seed#[546F5921B3825801]) [    x:core2] o.a.s.u.CommitTracker Soft AutoCommit: disabled
   [junit4]   2> 1383875 INFO  (TEST-TestCoreDiscovery.testPropFilePersistence-seed#[546F5921B3825801]) [    x:core2] o.a.s.s.SolrIndexSearcher Opening [Searcher@3390b9d8[corep5] main]
   [junit4]   2> 1383875 WARN  (TEST-TestCoreDis

[...truncated too long message...]

> 	80	/solr/collections
   [junit4]   2> 
   [junit4]   2> NOTE: leaving temporary files on disk at: C:\Users\jenkins\workspace\Lucene-Solr-master-Windows\solr\build\solr-solrj\test\J1\temp\solr.client.solrj.io.stream.StreamExpressionTest_2740821AB0D7D9E6-001
   [junit4]   2> Jan 02, 2018 9:30:03 AM com.carrotsearch.randomizedtesting.ThreadLeakControl checkThreadLeaks
   [junit4]   2> WARNING: Will linger awaiting termination of 2 leaked thread(s).
   [junit4]   2> NOTE: test params are: codec=Asserting(Lucene70): {expr_s=TestBloomFilteredLucenePostings(BloomFilteringPostingsFormat(Lucene50(blocksize=128))), join2_s=PostingsFormat(name=Asserting), multiDefault=PostingsFormat(name=Asserting), subject=PostingsFormat(name=Asserting), price_f=PostingsFormat(name=Asserting), a1_s=PostingsFormat(name=Asserting), a_f=PostingsFormat(name=Asserting), intDefault=FST50, join1_i=TestBloomFilteredLucenePostings(BloomFilteringPostingsFormat(Lucene50(blocksize=128))), a2_s=PostingsFormat(name=Memory), a_i=TestBloomFilteredLucenePostings(BloomFilteringPostingsFormat(Lucene50(blocksize=128))), test_i=PostingsFormat(name=Asserting), join3_i=PostingsFormat(name=Memory), field_i=PostingsFormat(name=Asserting), level1_s=TestBloomFilteredLucenePostings(BloomFilteringPostingsFormat(Lucene50(blocksize=128))), body_t=PostingsFormat(name=Memory), s_multi=PostingsFormat(name=Memory), col_s=PostingsFormat(name=Asserting), a_ss=FST50, level2_s=FST50, a_s=PostingsFormat(name=Memory), a_t=FST50, id=TestBloomFilteredLucenePostings(BloomFilteringPostingsFormat(Lucene50(blocksize=128))), text=PostingsFormat(name=Memory), timestamp=FST50, i_multi=TestBloomFilteredLucenePostings(BloomFilteringPostingsFormat(Lucene50(blocksize=128))), b_ls=PostingsFormat(name=Asserting), test_dt=TestBloomFilteredLucenePostings(BloomFilteringPostingsFormat(Lucene50(blocksize=128))), test_t=PostingsFormat(name=Memory), ident_s=PostingsFormat(name=Asserting), order_i=PostingsFormat(name=Asserting), _version_=FST50, side_s=PostingsFormat(name=Memory), miles_i=PostingsFormat(name=Asserting)}, docValues:{expr_s=DocValuesFormat(name=Lucene70), join2_s=DocValuesFormat(name=Lucene70), multiDefault=DocValuesFormat(name=Lucene70), price_f=DocValuesFormat(name=Lucene70), a1_s=DocValuesFormat(name=Lucene70), a_f=DocValuesFormat(name=Lucene70), intDefault=DocValuesFormat(name=Direct), join1_i=DocValuesFormat(name=Lucene70), a2_s=DocValuesFormat(name=Asserting), a_i=DocValuesFormat(name=Lucene70), test_i=DocValuesFormat(name=Lucene70), join3_i=DocValuesFormat(name=Asserting), field_i=DocValuesFormat(name=Lucene70), level1_s=DocValuesFormat(name=Lucene70), s_multi=DocValuesFormat(name=Asserting), col_s=DocValuesFormat(name=Lucene70), a_ss=DocValuesFormat(name=Direct), level2_s=DocValuesFormat(name=Direct), a_s=DocValuesFormat(name=Asserting), id=DocValuesFormat(name=Lucene70), timestamp=DocValuesFormat(name=Direct), i_multi=DocValuesFormat(name=Lucene70), b_ls=DocValuesFormat(name=Lucene70), test_dt=DocValuesFormat(name=Lucene70), ident_s=DocValuesFormat(name=Lucene70), order_i=DocValuesFormat(name=Lucene70), _version_=DocValuesFormat(name=Direct), side_s=DocValuesFormat(name=Asserting), miles_i=DocValuesFormat(name=Lucene70)}, maxPointsInLeafNode=384, maxMBSortInHeap=6.692028483388736, sim=Asserting(org.apache.lucene.search.similarities.AssertingSimilarity@7e41ad67), locale=es-PE, timezone=Asia/Novokuznetsk
   [junit4]   2> NOTE: Windows 10 10.0 amd64/Oracle Corporation 1.8.0_144 (64-bit)/cpus=3,threads=1,free=214810928,total=327680000
   [junit4]   2> NOTE: All tests run in this JVM: [TestClusteringResponse, SolrExceptionTest, ModuloEvaluatorTest, TestV2Request, AbsoluteValueEvaluatorTest, JdbcDriverTest, ArcTangentEvaluatorTest, OrEvaluatorTest, SolrParamTest, TestSuggesterResponse, DocumentAnalysisResponseTest, TestSolrJErrorHandling, DivideEvaluatorTest, TestZkConfigManager, TestNamedListCodec, NormalizeEvaluatorTest, NaturalLogEvaluatorTest, BasicHttpSolrClientTest, CubedRootEvaluatorTest, HttpSolrClientConPoolTest, FacetFieldTest, GreaterThanEqualToEvaluatorTest, SolrSchemalessExampleTest, MergeIndexesEmbeddedTest, SolrQueryTest, SolrPingTest, OperationsTest, QueryResponseTest, CommonParamsTest, GraphExpressionTest, TestPathTrie, EqualToEvaluatorTest, StreamExpressionTest]
   [junit4] Completed [91/146 (2!)] on J1 in 94.87s, 144 tests, 1 failure, 9 skipped <<< FAILURES!

[...truncated 1621 lines...]
   [junit4] Suite: org.apache.solr.update.processor.TestOpenNLPExtractNamedEntitiesUpdateProcessorFactory
   [junit4]   2> log4j:WARN No appenders could be found for logger (org.apache.solr.SolrTestCaseJ4).
   [junit4]   2> log4j:WARN Please initialize the log4j system properly.
   [junit4]   2> log4j:WARN See http://logging.apache.org/log4j/1.2/faq.html#noconfig for more info.
   [junit4]   2> Creating dataDir: C:\Users\jenkins\workspace\Lucene-Solr-master-Windows\solr\build\contrib\solr-analysis-extras\test\J1\temp\solr.update.processor.TestOpenNLPExtractNamedEntitiesUpdateProcessorFactory_4136B852E722A32-001\init-core-data-001
   [junit4]   2> NOTE: test params are: codec=CheapBastard, sim=Asserting(org.apache.lucene.search.similarities.AssertingSimilarity@490de494), locale=id, timezone=Asia/Krasnoyarsk
   [junit4]   2> NOTE: Windows 10 10.0 amd64/Oracle Corporation 1.8.0_144 (64-bit)/cpus=3,threads=1,free=133513824,total=152043520
   [junit4]   2> NOTE: All tests run in this JVM: [TestOpenNLPExtractNamedEntitiesUpdateProcessorFactory]
   [junit4]   2> NOTE: reproduce with: ant test  -Dtestcase=TestOpenNLPExtractNamedEntitiesUpdateProcessorFactory -Dtests.seed=4136B852E722A32 -Dtests.slow=true -Dtests.locale=id -Dtests.timezone=Asia/Krasnoyarsk -Dtests.asserts=true -Dtests.file.encoding=US-ASCII
   [junit4] ERROR   0.00s J1 | TestOpenNLPExtractNamedEntitiesUpdateProcessorFactory (suite) <<<
   [junit4]    > Throwable #1: java.io.IOException: Could not remove the following files (in the order of attempts):
   [junit4]    >    C:\Users\jenkins\workspace\Lucene-Solr-master-Windows\solr\build\contrib\solr-analysis-extras\test\J1\temp\solr.update.processor.TestOpenNLPExtractNamedEntitiesUpdateProcessorFactory_4136B852E722A32-001\tempDir-001\collection1\conf: java.nio.file.DirectoryNotEmptyException: C:\Users\jenkins\workspace\Lucene-Solr-master-Windows\solr\build\contrib\solr-analysis-extras\test\J1\temp\solr.update.processor.TestOpenNLPExtractNamedEntitiesUpdateProcessorFactory_4136B852E722A32-001\tempDir-001\collection1\conf
   [junit4]    >    C:\Users\jenkins\workspace\Lucene-Solr-master-Windows\solr\build\contrib\solr-analysis-extras\test\J1\temp\solr.update.processor.TestOpenNLPExtractNamedEntitiesUpdateProcessorFactory_4136B852E722A32-001\tempDir-001\collection1: java.nio.file.DirectoryNotEmptyException: C:\Users\jenkins\workspace\Lucene-Solr-master-Windows\solr\build\contrib\solr-analysis-extras\test\J1\temp\solr.update.processor.TestOpenNLPExtractNamedEntitiesUpdateProcessorFactory_4136B852E722A32-001\tempDir-001\collection1
   [junit4]    >    C:\Users\jenkins\workspace\Lucene-Solr-master-Windows\solr\build\contrib\solr-analysis-extras\test\J1\temp\solr.update.processor.TestOpenNLPExtractNamedEntitiesUpdateProcessorFactory_4136B852E722A32-001\tempDir-001: java.nio.file.DirectoryNotEmptyException: C:\Users\jenkins\workspace\Lucene-Solr-master-Windows\solr\build\contrib\solr-analysis-extras\test\J1\temp\solr.update.processor.TestOpenNLPExtractNamedEntitiesUpdateProcessorFactory_4136B852E722A32-001\tempDir-001
   [junit4]    >    C:\Users\jenkins\workspace\Lucene-Solr-master-Windows\solr\build\contrib\solr-analysis-extras\test\J1\temp\solr.update.processor.TestOpenNLPExtractNamedEntitiesUpdateProcessorFactory_4136B852E722A32-001\tempDir-001\collection1\conf\en-test-sent.bin: java.nio.file.AccessDeniedException: C:\Users\jenkins\workspace\Lucene-Solr-master-Windows\solr\build\contrib\solr-analysis-extras\test\J1\temp\solr.update.processor.TestOpenNLPExtractNamedEntitiesUpdateProcessorFactory_4136B852E722A32-001\tempDir-001\collection1\conf\en-test-sent.bin
   [junit4]    >    C:\Users\jenkins\workspace\Lucene-Solr-master-Windows\solr\build\contrib\solr-analysis-extras\test\J1\temp\solr.update.processor.TestOpenNLPExtractNamedEntitiesUpdateProcessorFactory_4136B852E722A32-001\tempDir-001\collection1\conf\en-test-tokenizer.bin: java.nio.file.AccessDeniedException: C:\Users\jenkins\workspace\Lucene-Solr-master-Windows\solr\build\contrib\solr-analysis-extras\test\J1\temp\solr.update.processor.TestOpenNLPExtractNamedEntitiesUpdateProcessorFactory_4136B852E722A32-001\tempDir-001\collection1\conf\en-test-tokenizer.bin
   [junit4]    >    C:\Users\jenkins\workspace\Lucene-Solr-master-Windows\solr\build\contrib\solr-analysis-extras\test\J1\temp\solr.update.processor.TestOpenNLPExtractNamedEntitiesUpdateProcessorFactory_4136B852E722A32-001\tempDir-001\collection1\conf\en-test-ner-person.bin: java.nio.file.AccessDeniedException: C:\Users\jenkins\workspace\Lucene-Solr-master-Windows\solr\build\contrib\solr-analysis-extras\test\J1\temp\solr.update.processor.TestOpenNLPExtractNamedEntitiesUpdateProcessorFactory_4136B852E722A32-001\tempDir-001\collection1\conf\en-test-ner-person.bin
   [junit4]    >    C:\Users\jenkins\workspace\Lucene-Solr-master-Windows\solr\build\contrib\solr-analysis-extras\test\J1\temp\solr.update.processor.TestOpenNLPExtractNamedEntitiesUpdateProcessorFactory_4136B852E722A32-001: java.nio.file.DirectoryNotEmptyException: C:\Users\jenkins\workspace\Lucene-Solr-master-Windows\solr\build\contrib\solr-analysis-extras\test\J1\temp\solr.update.processor.TestOpenNLPExtractNamedEntitiesUpdateProcessorFactory_4136B852E722A32-001
   [junit4]    > 	at __randomizedtesting.SeedInfo.seed([4136B852E722A32]:0)
   [junit4]    > 	at org.apache.lucene.util.IOUtils.rm(IOUtils.java:329)
   [junit4]    > 	at java.lang.Thread.run(Thread.java:748)
   [junit4] Completed [1/5 (1!)] on J1 in 14.05s, 8 tests, 1 error <<< FAILURES!

[...truncated 45709 lines...]

Mime
View raw message