lucene-dev mailing list archives

Site index · List index
Message view « Date » · « Thread »
Top « Date » · « Thread »
From Policeman Jenkins Server <jenk...@thetaphi.de>
Subject [JENKINS] Lucene-Solr-7.x-Linux (32bit/jdk1.8.0_144) - Build # 1107 - Still Unstable!
Date Wed, 03 Jan 2018 06:20:10 GMT
Build: https://jenkins.thetaphi.de/job/Lucene-Solr-7.x-Linux/1107/
Java: 32bit/jdk1.8.0_144 -client -XX:+UseSerialGC

3 tests failed.
FAILED:  junit.framework.TestSuite.org.apache.solr.schema.ManagedSchemaRoundRobinCloudTest

Error Message:
Error from server at https://127.0.0.1:41313/solr: create the collection time out:180s

Stack Trace:
org.apache.solr.client.solrj.impl.HttpSolrClient$RemoteSolrException: Error from server at https://127.0.0.1:41313/solr: create the collection time out:180s
	at __randomizedtesting.SeedInfo.seed([627E21C664583B7F]:0)
	at org.apache.solr.client.solrj.impl.HttpSolrClient.executeMethod(HttpSolrClient.java:643)
	at org.apache.solr.client.solrj.impl.HttpSolrClient.request(HttpSolrClient.java:255)
	at org.apache.solr.client.solrj.impl.HttpSolrClient.request(HttpSolrClient.java:244)
	at org.apache.solr.client.solrj.impl.LBHttpSolrClient.doRequest(LBHttpSolrClient.java:483)
	at org.apache.solr.client.solrj.impl.LBHttpSolrClient.request(LBHttpSolrClient.java:413)
	at org.apache.solr.client.solrj.impl.CloudSolrClient.sendRequest(CloudSolrClient.java:1104)
	at org.apache.solr.client.solrj.impl.CloudSolrClient.requestWithRetryOnStaleState(CloudSolrClient.java:884)
	at org.apache.solr.client.solrj.impl.CloudSolrClient.request(CloudSolrClient.java:817)
	at org.apache.solr.client.solrj.SolrRequest.process(SolrRequest.java:194)
	at org.apache.solr.client.solrj.SolrRequest.process(SolrRequest.java:211)
	at org.apache.solr.schema.ManagedSchemaRoundRobinCloudTest.setupCluster(ManagedSchemaRoundRobinCloudTest.java:50)
	at sun.reflect.NativeMethodAccessorImpl.invoke0(Native Method)
	at sun.reflect.NativeMethodAccessorImpl.invoke(NativeMethodAccessorImpl.java:62)
	at sun.reflect.DelegatingMethodAccessorImpl.invoke(DelegatingMethodAccessorImpl.java:43)
	at java.lang.reflect.Method.invoke(Method.java:498)
	at com.carrotsearch.randomizedtesting.RandomizedRunner.invoke(RandomizedRunner.java:1737)
	at com.carrotsearch.randomizedtesting.RandomizedRunner$6.evaluate(RandomizedRunner.java:874)
	at com.carrotsearch.randomizedtesting.RandomizedRunner$7.evaluate(RandomizedRunner.java:890)
	at com.carrotsearch.randomizedtesting.rules.StatementAdapter.evaluate(StatementAdapter.java:36)
	at com.carrotsearch.randomizedtesting.rules.SystemPropertiesRestoreRule$1.evaluate(SystemPropertiesRestoreRule.java:57)
	at org.apache.lucene.util.AbstractBeforeAfterRule$1.evaluate(AbstractBeforeAfterRule.java:45)
	at com.carrotsearch.randomizedtesting.rules.StatementAdapter.evaluate(StatementAdapter.java:36)
	at org.apache.lucene.util.TestRuleStoreClassName$1.evaluate(TestRuleStoreClassName.java:41)
	at com.carrotsearch.randomizedtesting.rules.NoShadowingOrOverridesOnMethodsRule$1.evaluate(NoShadowingOrOverridesOnMethodsRule.java:40)
	at com.carrotsearch.randomizedtesting.rules.NoShadowingOrOverridesOnMethodsRule$1.evaluate(NoShadowingOrOverridesOnMethodsRule.java:40)
	at com.carrotsearch.randomizedtesting.rules.StatementAdapter.evaluate(StatementAdapter.java:36)
	at com.carrotsearch.randomizedtesting.rules.StatementAdapter.evaluate(StatementAdapter.java:36)
	at com.carrotsearch.randomizedtesting.rules.StatementAdapter.evaluate(StatementAdapter.java:36)
	at org.apache.lucene.util.TestRuleAssertionsRequired$1.evaluate(TestRuleAssertionsRequired.java:53)
	at org.apache.lucene.util.TestRuleMarkFailure$1.evaluate(TestRuleMarkFailure.java:47)
	at org.apache.lucene.util.TestRuleIgnoreAfterMaxFailures$1.evaluate(TestRuleIgnoreAfterMaxFailures.java:64)
	at org.apache.lucene.util.TestRuleIgnoreTestSuites$1.evaluate(TestRuleIgnoreTestSuites.java:54)
	at com.carrotsearch.randomizedtesting.rules.StatementAdapter.evaluate(StatementAdapter.java:36)
	at com.carrotsearch.randomizedtesting.ThreadLeakControl$StatementRunner.run(ThreadLeakControl.java:368)
	at java.lang.Thread.run(Thread.java:748)


FAILED:  org.apache.solr.cloud.ChaosMonkeySafeLeaderWithPullReplicasTest.test

Error Message:
Timeout occured while waiting response from server at: http://127.0.0.1:41615/ofs

Stack Trace:
org.apache.solr.client.solrj.SolrServerException: Timeout occured while waiting response from server at: http://127.0.0.1:41615/ofs
	at __randomizedtesting.SeedInfo.seed([627E21C664583B7F:EA2A1E1CCAA45687]:0)
	at org.apache.solr.client.solrj.impl.HttpSolrClient.executeMethod(HttpSolrClient.java:654)
	at org.apache.solr.client.solrj.impl.HttpSolrClient.request(HttpSolrClient.java:255)
	at org.apache.solr.client.solrj.impl.HttpSolrClient.request(HttpSolrClient.java:244)
	at org.apache.solr.client.solrj.impl.LBHttpSolrClient.doRequest(LBHttpSolrClient.java:483)
	at org.apache.solr.client.solrj.impl.LBHttpSolrClient.request(LBHttpSolrClient.java:413)
	at org.apache.solr.client.solrj.impl.CloudSolrClient.sendRequest(CloudSolrClient.java:1104)
	at org.apache.solr.client.solrj.impl.CloudSolrClient.requestWithRetryOnStaleState(CloudSolrClient.java:884)
	at org.apache.solr.client.solrj.impl.CloudSolrClient.request(CloudSolrClient.java:817)
	at org.apache.solr.client.solrj.SolrRequest.process(SolrRequest.java:194)
	at org.apache.solr.client.solrj.SolrRequest.process(SolrRequest.java:211)
	at org.apache.solr.cloud.AbstractFullDistribZkTestBase.createServers(AbstractFullDistribZkTestBase.java:320)
	at org.apache.solr.BaseDistributedSearchTestCase$ShardsRepeatRule$ShardsFixedStatement.callStatement(BaseDistributedSearchTestCase.java:991)
	at org.apache.solr.BaseDistributedSearchTestCase$ShardsRepeatRule$ShardsStatement.evaluate(BaseDistributedSearchTestCase.java:968)
	at com.carrotsearch.randomizedtesting.rules.SystemPropertiesRestoreRule$1.evaluate(SystemPropertiesRestoreRule.java:57)
	at org.apache.lucene.util.TestRuleSetupTeardownChained$1.evaluate(TestRuleSetupTeardownChained.java:49)
	at org.apache.lucene.util.AbstractBeforeAfterRule$1.evaluate(AbstractBeforeAfterRule.java:45)
	at org.apache.lucene.util.TestRuleThreadAndTestName$1.evaluate(TestRuleThreadAndTestName.java:48)
	at org.apache.lucene.util.TestRuleIgnoreAfterMaxFailures$1.evaluate(TestRuleIgnoreAfterMaxFailures.java:64)
	at org.apache.lucene.util.TestRuleMarkFailure$1.evaluate(TestRuleMarkFailure.java:47)
	at com.carrotsearch.randomizedtesting.rules.StatementAdapter.evaluate(StatementAdapter.java:36)
	at com.carrotsearch.randomizedtesting.ThreadLeakControl$StatementRunner.run(ThreadLeakControl.java:368)
	at com.carrotsearch.randomizedtesting.ThreadLeakControl.forkTimeoutingTask(ThreadLeakControl.java:817)
	at com.carrotsearch.randomizedtesting.ThreadLeakControl$3.evaluate(ThreadLeakControl.java:468)
	at com.carrotsearch.randomizedtesting.RandomizedRunner.runSingleTest(RandomizedRunner.java:943)
	at com.carrotsearch.randomizedtesting.RandomizedRunner$5.evaluate(RandomizedRunner.java:829)
	at com.carrotsearch.randomizedtesting.RandomizedRunner$6.evaluate(RandomizedRunner.java:879)
	at com.carrotsearch.randomizedtesting.RandomizedRunner$7.evaluate(RandomizedRunner.java:890)
	at com.carrotsearch.randomizedtesting.rules.StatementAdapter.evaluate(StatementAdapter.java:36)
	at com.carrotsearch.randomizedtesting.rules.SystemPropertiesRestoreRule$1.evaluate(SystemPropertiesRestoreRule.java:57)
	at org.apache.lucene.util.AbstractBeforeAfterRule$1.evaluate(AbstractBeforeAfterRule.java:45)
	at com.carrotsearch.randomizedtesting.rules.StatementAdapter.evaluate(StatementAdapter.java:36)
	at org.apache.lucene.util.TestRuleStoreClassName$1.evaluate(TestRuleStoreClassName.java:41)
	at com.carrotsearch.randomizedtesting.rules.NoShadowingOrOverridesOnMethodsRule$1.evaluate(NoShadowingOrOverridesOnMethodsRule.java:40)
	at com.carrotsearch.randomizedtesting.rules.NoShadowingOrOverridesOnMethodsRule$1.evaluate(NoShadowingOrOverridesOnMethodsRule.java:40)
	at com.carrotsearch.randomizedtesting.rules.StatementAdapter.evaluate(StatementAdapter.java:36)
	at com.carrotsearch.randomizedtesting.rules.StatementAdapter.evaluate(StatementAdapter.java:36)
	at com.carrotsearch.randomizedtesting.rules.StatementAdapter.evaluate(StatementAdapter.java:36)
	at org.apache.lucene.util.TestRuleAssertionsRequired$1.evaluate(TestRuleAssertionsRequired.java:53)
	at org.apache.lucene.util.TestRuleMarkFailure$1.evaluate(TestRuleMarkFailure.java:47)
	at org.apache.lucene.util.TestRuleIgnoreAfterMaxFailures$1.evaluate(TestRuleIgnoreAfterMaxFailures.java:64)
	at org.apache.lucene.util.TestRuleIgnoreTestSuites$1.evaluate(TestRuleIgnoreTestSuites.java:54)
	at com.carrotsearch.randomizedtesting.rules.StatementAdapter.evaluate(StatementAdapter.java:36)
	at com.carrotsearch.randomizedtesting.ThreadLeakControl$StatementRunner.run(ThreadLeakControl.java:368)
	at java.lang.Thread.run(Thread.java:748)
Caused by: java.net.SocketTimeoutException: Read timed out
	at java.net.SocketInputStream.socketRead0(Native Method)
	at java.net.SocketInputStream.socketRead(SocketInputStream.java:116)
	at java.net.SocketInputStream.read(SocketInputStream.java:171)
	at java.net.SocketInputStream.read(SocketInputStream.java:141)
	at org.apache.http.impl.io.SessionInputBufferImpl.streamRead(SessionInputBufferImpl.java:137)
	at org.apache.http.impl.io.SessionInputBufferImpl.fillBuffer(SessionInputBufferImpl.java:153)
	at org.apache.http.impl.io.SessionInputBufferImpl.readLine(SessionInputBufferImpl.java:282)
	at org.apache.http.impl.conn.DefaultHttpResponseParser.parseHead(DefaultHttpResponseParser.java:138)
	at org.apache.http.impl.conn.DefaultHttpResponseParser.parseHead(DefaultHttpResponseParser.java:56)
	at org.apache.http.impl.io.AbstractMessageParser.parse(AbstractMessageParser.java:259)
	at org.apache.http.impl.DefaultBHttpClientConnection.receiveResponseHeader(DefaultBHttpClientConnection.java:163)
	at org.apache.http.impl.conn.CPoolProxy.receiveResponseHeader(CPoolProxy.java:165)
	at org.apache.http.protocol.HttpRequestExecutor.doReceiveResponse(HttpRequestExecutor.java:273)
	at org.apache.http.protocol.HttpRequestExecutor.execute(HttpRequestExecutor.java:125)
	at org.apache.http.impl.execchain.MainClientExec.execute(MainClientExec.java:272)
	at org.apache.http.impl.execchain.ProtocolExec.execute(ProtocolExec.java:185)
	at org.apache.http.impl.execchain.RetryExec.execute(RetryExec.java:89)
	at org.apache.http.impl.execchain.RedirectExec.execute(RedirectExec.java:111)
	at org.apache.http.impl.client.InternalHttpClient.doExecute(InternalHttpClient.java:185)
	at org.apache.http.impl.client.CloseableHttpClient.execute(CloseableHttpClient.java:83)
	at org.apache.http.impl.client.CloseableHttpClient.execute(CloseableHttpClient.java:56)
	at org.apache.solr.client.solrj.impl.HttpSolrClient.executeMethod(HttpSolrClient.java:542)
	... 43 more


FAILED:  org.apache.solr.cloud.TestDistribDocBasedVersion.test

Error Message:
Timeout occured while waiting response from server at: https://127.0.0.1:46295

Stack Trace:
org.apache.solr.client.solrj.SolrServerException: Timeout occured while waiting response from server at: https://127.0.0.1:46295
	at __randomizedtesting.SeedInfo.seed([627E21C664583B7F:EA2A1E1CCAA45687]:0)
	at org.apache.solr.client.solrj.impl.HttpSolrClient.executeMethod(HttpSolrClient.java:654)
	at org.apache.solr.client.solrj.impl.HttpSolrClient.request(HttpSolrClient.java:255)
	at org.apache.solr.client.solrj.impl.HttpSolrClient.request(HttpSolrClient.java:244)
	at org.apache.solr.client.solrj.impl.LBHttpSolrClient.doRequest(LBHttpSolrClient.java:483)
	at org.apache.solr.client.solrj.impl.LBHttpSolrClient.request(LBHttpSolrClient.java:413)
	at org.apache.solr.client.solrj.impl.CloudSolrClient.sendRequest(CloudSolrClient.java:1104)
	at org.apache.solr.client.solrj.impl.CloudSolrClient.requestWithRetryOnStaleState(CloudSolrClient.java:884)
	at org.apache.solr.client.solrj.impl.CloudSolrClient.request(CloudSolrClient.java:817)
	at org.apache.solr.client.solrj.SolrRequest.process(SolrRequest.java:194)
	at org.apache.solr.client.solrj.SolrRequest.process(SolrRequest.java:211)
	at org.apache.solr.cloud.AbstractFullDistribZkTestBase.createServers(AbstractFullDistribZkTestBase.java:320)
	at org.apache.solr.BaseDistributedSearchTestCase$ShardsRepeatRule$ShardsFixedStatement.callStatement(BaseDistributedSearchTestCase.java:991)
	at org.apache.solr.BaseDistributedSearchTestCase$ShardsRepeatRule$ShardsStatement.evaluate(BaseDistributedSearchTestCase.java:968)
	at com.carrotsearch.randomizedtesting.rules.SystemPropertiesRestoreRule$1.evaluate(SystemPropertiesRestoreRule.java:57)
	at org.apache.lucene.util.TestRuleSetupTeardownChained$1.evaluate(TestRuleSetupTeardownChained.java:49)
	at org.apache.lucene.util.AbstractBeforeAfterRule$1.evaluate(AbstractBeforeAfterRule.java:45)
	at org.apache.lucene.util.TestRuleThreadAndTestName$1.evaluate(TestRuleThreadAndTestName.java:48)
	at org.apache.lucene.util.TestRuleIgnoreAfterMaxFailures$1.evaluate(TestRuleIgnoreAfterMaxFailures.java:64)
	at org.apache.lucene.util.TestRuleMarkFailure$1.evaluate(TestRuleMarkFailure.java:47)
	at com.carrotsearch.randomizedtesting.rules.StatementAdapter.evaluate(StatementAdapter.java:36)
	at com.carrotsearch.randomizedtesting.ThreadLeakControl$StatementRunner.run(ThreadLeakControl.java:368)
	at com.carrotsearch.randomizedtesting.ThreadLeakControl.forkTimeoutingTask(ThreadLeakControl.java:817)
	at com.carrotsearch.randomizedtesting.ThreadLeakControl$3.evaluate(ThreadLeakControl.java:468)
	at com.carrotsearch.randomizedtesting.RandomizedRunner.runSingleTest(RandomizedRunner.java:943)
	at com.carrotsearch.randomizedtesting.RandomizedRunner$5.evaluate(RandomizedRunner.java:829)
	at com.carrotsearch.randomizedtesting.RandomizedRunner$6.evaluate(RandomizedRunner.java:879)
	at com.carrotsearch.randomizedtesting.RandomizedRunner$7.evaluate(RandomizedRunner.java:890)
	at com.carrotsearch.randomizedtesting.rules.StatementAdapter.evaluate(StatementAdapter.java:36)
	at com.carrotsearch.randomizedtesting.rules.SystemPropertiesRestoreRule$1.evaluate(SystemPropertiesRestoreRule.java:57)
	at org.apache.lucene.util.AbstractBeforeAfterRule$1.evaluate(AbstractBeforeAfterRule.java:45)
	at com.carrotsearch.randomizedtesting.rules.StatementAdapter.evaluate(StatementAdapter.java:36)
	at org.apache.lucene.util.TestRuleStoreClassName$1.evaluate(TestRuleStoreClassName.java:41)
	at com.carrotsearch.randomizedtesting.rules.NoShadowingOrOverridesOnMethodsRule$1.evaluate(NoShadowingOrOverridesOnMethodsRule.java:40)
	at com.carrotsearch.randomizedtesting.rules.NoShadowingOrOverridesOnMethodsRule$1.evaluate(NoShadowingOrOverridesOnMethodsRule.java:40)
	at com.carrotsearch.randomizedtesting.rules.StatementAdapter.evaluate(StatementAdapter.java:36)
	at com.carrotsearch.randomizedtesting.rules.StatementAdapter.evaluate(StatementAdapter.java:36)
	at com.carrotsearch.randomizedtesting.rules.StatementAdapter.evaluate(StatementAdapter.java:36)
	at org.apache.lucene.util.TestRuleAssertionsRequired$1.evaluate(TestRuleAssertionsRequired.java:53)
	at org.apache.lucene.util.TestRuleMarkFailure$1.evaluate(TestRuleMarkFailure.java:47)
	at org.apache.lucene.util.TestRuleIgnoreAfterMaxFailures$1.evaluate(TestRuleIgnoreAfterMaxFailures.java:64)
	at org.apache.lucene.util.TestRuleIgnoreTestSuites$1.evaluate(TestRuleIgnoreTestSuites.java:54)
	at com.carrotsearch.randomizedtesting.rules.StatementAdapter.evaluate(StatementAdapter.java:36)
	at com.carrotsearch.randomizedtesting.ThreadLeakControl$StatementRunner.run(ThreadLeakControl.java:368)
	at java.lang.Thread.run(Thread.java:748)
Caused by: java.net.SocketTimeoutException: Read timed out
	at java.net.SocketInputStream.socketRead0(Native Method)
	at java.net.SocketInputStream.socketRead(SocketInputStream.java:116)
	at java.net.SocketInputStream.read(SocketInputStream.java:171)
	at java.net.SocketInputStream.read(SocketInputStream.java:141)
	at sun.security.ssl.InputRecord.readFully(InputRecord.java:465)
	at sun.security.ssl.InputRecord.read(InputRecord.java:503)
	at sun.security.ssl.SSLSocketImpl.readRecord(SSLSocketImpl.java:983)
	at sun.security.ssl.SSLSocketImpl.readDataRecord(SSLSocketImpl.java:940)
	at sun.security.ssl.AppInputStream.read(AppInputStream.java:105)
	at org.apache.http.impl.io.SessionInputBufferImpl.streamRead(SessionInputBufferImpl.java:137)
	at org.apache.http.impl.io.SessionInputBufferImpl.fillBuffer(SessionInputBufferImpl.java:153)
	at org.apache.http.impl.io.SessionInputBufferImpl.readLine(SessionInputBufferImpl.java:282)
	at org.apache.http.impl.conn.DefaultHttpResponseParser.parseHead(DefaultHttpResponseParser.java:138)
	at org.apache.http.impl.conn.DefaultHttpResponseParser.parseHead(DefaultHttpResponseParser.java:56)
	at org.apache.http.impl.io.AbstractMessageParser.parse(AbstractMessageParser.java:259)
	at org.apache.http.impl.DefaultBHttpClientConnection.receiveResponseHeader(DefaultBHttpClientConnection.java:163)
	at org.apache.http.impl.conn.CPoolProxy.receiveResponseHeader(CPoolProxy.java:165)
	at org.apache.http.protocol.HttpRequestExecutor.doReceiveResponse(HttpRequestExecutor.java:273)
	at org.apache.http.protocol.HttpRequestExecutor.execute(HttpRequestExecutor.java:125)
	at org.apache.http.impl.execchain.MainClientExec.execute(MainClientExec.java:272)
	at org.apache.http.impl.execchain.ProtocolExec.execute(ProtocolExec.java:185)
	at org.apache.http.impl.execchain.RetryExec.execute(RetryExec.java:89)
	at org.apache.http.impl.execchain.RedirectExec.execute(RedirectExec.java:111)
	at org.apache.http.impl.client.InternalHttpClient.doExecute(InternalHttpClient.java:185)
	at org.apache.http.impl.client.CloseableHttpClient.execute(CloseableHttpClient.java:83)
	at org.apache.http.impl.client.CloseableHttpClient.execute(CloseableHttpClient.java:56)
	at org.apache.solr.client.solrj.impl.HttpSolrClient.executeMethod(HttpSolrClient.java:542)
	... 43 more




Build Log:
[...truncated 12535 lines...]
   [junit4] Suite: org.apache.solr.cloud.TestDistribDocBasedVersion
   [junit4]   2> Creating dataDir: /home/jenkins/workspace/Lucene-Solr-7.x-Linux/solr/build/solr-core/test/J2/temp/solr.cloud.TestDistribDocBasedVersion_627E21C664583B7F-001/init-core-data-001
   [junit4]   2> 382065 WARN  (SUITE-TestDistribDocBasedVersion-seed#[627E21C664583B7F]-worker) [    ] o.a.s.SolrTestCaseJ4 startTrackingSearchers: numOpens=33 numCloses=33
   [junit4]   2> 382065 INFO  (SUITE-TestDistribDocBasedVersion-seed#[627E21C664583B7F]-worker) [    ] o.a.s.SolrTestCaseJ4 Using PointFields (NUMERIC_POINTS_SYSPROP=true) w/NUMERIC_DOCVALUES_SYSPROP=true
   [junit4]   2> 382066 INFO  (SUITE-TestDistribDocBasedVersion-seed#[627E21C664583B7F]-worker) [    ] o.a.s.SolrTestCaseJ4 Randomized ssl (true) and clientAuth (false) via: @org.apache.solr.util.RandomizeSSL(reason=, ssl=NaN, value=NaN, clientAuth=NaN)
   [junit4]   2> 382067 INFO  (SUITE-TestDistribDocBasedVersion-seed#[627E21C664583B7F]-worker) [    ] o.a.s.SolrTestCaseJ4 SecureRandom sanity checks: test.solr.allowed.securerandom=null & java.security.egd=file:/dev/./urandom
   [junit4]   2> 382067 INFO  (SUITE-TestDistribDocBasedVersion-seed#[627E21C664583B7F]-worker) [    ] o.a.s.BaseDistributedSearchTestCase Setting hostContext system property: /
   [junit4]   2> 382069 INFO  (TEST-TestDistribDocBasedVersion.test-seed#[627E21C664583B7F]) [    ] o.a.s.c.ZkTestServer STARTING ZK TEST SERVER
   [junit4]   2> 382069 INFO  (Thread-346) [    ] o.a.s.c.ZkTestServer client port:0.0.0.0/0.0.0.0:0
   [junit4]   2> 382069 INFO  (Thread-346) [    ] o.a.s.c.ZkTestServer Starting server
   [junit4]   2> 382071 ERROR (Thread-346) [    ] o.a.z.s.ZooKeeperServer ZKShutdownHandler is not registered, so ZooKeeper server won't take any action on ERROR or SHUTDOWN server state changes
   [junit4]   2> 382169 INFO  (TEST-TestDistribDocBasedVersion.test-seed#[627E21C664583B7F]) [    ] o.a.s.c.ZkTestServer start zk server on port:41889
   [junit4]   2> 382171 INFO  (zkConnectionManagerCallback-571-thread-1) [    ] o.a.s.c.c.ConnectionManager zkClient has connected
   [junit4]   2> 382174 INFO  (zkConnectionManagerCallback-573-thread-1) [    ] o.a.s.c.c.ConnectionManager zkClient has connected
   [junit4]   2> 382178 INFO  (TEST-TestDistribDocBasedVersion.test-seed#[627E21C664583B7F]) [    ] o.a.s.c.AbstractZkTestCase put /home/jenkins/workspace/Lucene-Solr-7.x-Linux/solr/core/src/test-files/solr/collection1/conf/solrconfig-externalversionconstraint.xml to /configs/conf1/solrconfig.xml
   [junit4]   2> 382179 INFO  (TEST-TestDistribDocBasedVersion.test-seed#[627E21C664583B7F]) [    ] o.a.s.c.AbstractZkTestCase put /home/jenkins/workspace/Lucene-Solr-7.x-Linux/solr/core/src/test-files/solr/collection1/conf/schema15.xml to /configs/conf1/schema.xml
   [junit4]   2> 382180 INFO  (TEST-TestDistribDocBasedVersion.test-seed#[627E21C664583B7F]) [    ] o.a.s.c.AbstractZkTestCase put /home/jenkins/workspace/Lucene-Solr-7.x-Linux/solr/core/src/test-files/solr/collection1/conf/solrconfig.snippet.randomindexconfig.xml to /configs/conf1/solrconfig.snippet.randomindexconfig.xml
   [junit4]   2> 382181 INFO  (TEST-TestDistribDocBasedVersion.test-seed#[627E21C664583B7F]) [    ] o.a.s.c.AbstractZkTestCase put /home/jenkins/workspace/Lucene-Solr-7.x-Linux/solr/core/src/test-files/solr/collection1/conf/stopwords.txt to /configs/conf1/stopwords.txt
   [junit4]   2> 382182 INFO  (TEST-TestDistribDocBasedVersion.test-seed#[627E21C664583B7F]) [    ] o.a.s.c.AbstractZkTestCase put /home/jenkins/workspace/Lucene-Solr-7.x-Linux/solr/core/src/test-files/solr/collection1/conf/protwords.txt to /configs/conf1/protwords.txt
   [junit4]   2> 382182 INFO  (TEST-TestDistribDocBasedVersion.test-seed#[627E21C664583B7F]) [    ] o.a.s.c.AbstractZkTestCase put /home/jenkins/workspace/Lucene-Solr-7.x-Linux/solr/core/src/test-files/solr/collection1/conf/currency.xml to /configs/conf1/currency.xml
   [junit4]   2> 382183 INFO  (TEST-TestDistribDocBasedVersion.test-seed#[627E21C664583B7F]) [    ] o.a.s.c.AbstractZkTestCase put /home/jenkins/workspace/Lucene-Solr-7.x-Linux/solr/core/src/test-files/solr/collection1/conf/enumsConfig.xml to /configs/conf1/enumsConfig.xml
   [junit4]   2> 382183 INFO  (TEST-TestDistribDocBasedVersion.test-seed#[627E21C664583B7F]) [    ] o.a.s.c.AbstractZkTestCase put /home/jenkins/workspace/Lucene-Solr-7.x-Linux/solr/core/src/test-files/solr/collection1/conf/open-exchange-rates.json to /configs/conf1/open-exchange-rates.json
   [junit4]   2> 382184 INFO  (TEST-TestDistribDocBasedVersion.test-seed#[627E21C664583B7F]) [    ] o.a.s.c.AbstractZkTestCase put /home/jenkins/workspace/Lucene-Solr-7.x-Linux/solr/core/src/test-files/solr/collection1/conf/mapping-ISOLatin1Accent.txt to /configs/conf1/mapping-ISOLatin1Accent.txt
   [junit4]   2> 382185 INFO  (TEST-TestDistribDocBasedVersion.test-seed#[627E21C664583B7F]) [    ] o.a.s.c.AbstractZkTestCase put /home/jenkins/workspace/Lucene-Solr-7.x-Linux/solr/core/src/test-files/solr/collection1/conf/old_synonyms.txt to /configs/conf1/old_synonyms.txt
   [junit4]   2> 382185 INFO  (TEST-TestDistribDocBasedVersion.test-seed#[627E21C664583B7F]) [    ] o.a.s.c.AbstractZkTestCase put /home/jenkins/workspace/Lucene-Solr-7.x-Linux/solr/core/src/test-files/solr/collection1/conf/synonyms.txt to /configs/conf1/synonyms.txt
   [junit4]   2> 382190 INFO  (zkConnectionManagerCallback-576-thread-1) [    ] o.a.s.c.c.ConnectionManager zkClient has connected
   [junit4]   2> 382192 INFO  (TEST-TestDistribDocBasedVersion.test-seed#[627E21C664583B7F]) [    ] o.a.s.c.AbstractFullDistribZkTestBase Will use NRT replicas unless explicitly asked otherwise
   [junit4]   2> 382293 INFO  (TEST-TestDistribDocBasedVersion.test-seed#[627E21C664583B7F]) [    ] o.e.j.s.Server jetty-9.3.20.v20170531
   [junit4]   2> 382294 INFO  (TEST-TestDistribDocBasedVersion.test-seed#[627E21C664583B7F]) [    ] o.e.j.s.h.ContextHandler Started o.e.j.s.ServletContextHandler@28437f{/,null,AVAILABLE}
   [junit4]   2> 382296 INFO  (TEST-TestDistribDocBasedVersion.test-seed#[627E21C664583B7F]) [    ] o.e.j.s.AbstractConnector Started ServerConnector@c1ab9b{SSL,[ssl, http/1.1]}{127.0.0.1:46295}
   [junit4]   2> 382296 INFO  (TEST-TestDistribDocBasedVersion.test-seed#[627E21C664583B7F]) [    ] o.e.j.s.Server Started @383533ms
   [junit4]   2> 382296 INFO  (TEST-TestDistribDocBasedVersion.test-seed#[627E21C664583B7F]) [    ] o.a.s.c.s.e.JettySolrRunner Jetty properties: {solr.data.dir=/home/jenkins/workspace/Lucene-Solr-7.x-Linux/solr/build/solr-core/test/J2/temp/solr.cloud.TestDistribDocBasedVersion_627E21C664583B7F-001/tempDir-001/control/data, replicaType=NRT, hostContext=/, hostPort=46295, coreRootDirectory=/home/jenkins/workspace/Lucene-Solr-7.x-Linux/solr/build/solr-core/test/J2/temp/solr.cloud.TestDistribDocBasedVersion_627E21C664583B7F-001/control-001/cores}
   [junit4]   2> 382296 ERROR (TEST-TestDistribDocBasedVersion.test-seed#[627E21C664583B7F]) [    ] o.a.s.u.StartupLoggingUtils Missing Java Option solr.log.dir. Logging may be missing or incomplete.
   [junit4]   2> 382296 INFO  (TEST-TestDistribDocBasedVersion.test-seed#[627E21C664583B7F]) [    ] o.a.s.s.SolrDispatchFilter  ___      _       Welcome to Apache Solr? version 7.3.0
   [junit4]   2> 382296 INFO  (TEST-TestDistribDocBasedVersion.test-seed#[627E21C664583B7F]) [    ] o.a.s.s.SolrDispatchFilter / __| ___| |_ _   Starting in cloud mode on port null
   [junit4]   2> 382297 INFO  (TEST-TestDistribDocBasedVersion.test-seed#[627E21C664583B7F]) [    ] o.a.s.s.SolrDispatchFilter \__ \/ _ \ | '_|  Install dir: null
   [junit4]   2> 382297 INFO  (TEST-TestDistribDocBasedVersion.test-seed#[627E21C664583B7F]) [    ] o.a.s.s.SolrDispatchFilter |___/\___/_|_|    Start time: 2018-01-03T05:18:40.414Z
   [junit4]   2> 382298 INFO  (zkConnectionManagerCallback-578-thread-1) [    ] o.a.s.c.c.ConnectionManager zkClient has connected
   [junit4]   2> 382299 INFO  (TEST-TestDistribDocBasedVersion.test-seed#[627E21C664583B7F]) [    ] o.a.s.s.SolrDispatchFilter Loading solr.xml from SolrHome (not found in ZooKeeper)
   [junit4]   2> 382299 INFO  (TEST-TestDistribDocBasedVersion.test-seed#[627E21C664583B7F]) [    ] o.a.s.c.SolrXmlConfig Loading container configuration from /home/jenkins/workspace/Lucene-Solr-7.x-Linux/solr/build/solr-core/test/J2/temp/solr.cloud.TestDistribDocBasedVersion_627E21C664583B7F-001/control-001/solr.xml
   [junit4]   2> 382308 INFO  (TEST-TestDistribDocBasedVersion.test-seed#[627E21C664583B7F]) [    ] o.a.s.c.SolrXmlConfig Configuration parameter autoReplicaFailoverWorkLoopDelay is ignored
   [junit4]   2> 382308 INFO  (TEST-TestDistribDocBasedVersion.test-seed#[627E21C664583B7F]) [    ] o.a.s.c.SolrXmlConfig Configuration parameter autoReplicaFailoverBadNodeExpiration is ignored
   [junit4]   2> 382320 INFO  (TEST-TestDistribDocBasedVersion.test-seed#[627E21C664583B7F]) [    ] o.a.s.c.SolrXmlConfig MBean server found: com.sun.jmx.mbeanserver.JmxMBeanServer@1787ba2, but no JMX reporters were configured - adding default JMX reporter.
   [junit4]   2> 382324 INFO  (TEST-TestDistribDocBasedVersion.test-seed#[627E21C664583B7F]) [    ] o.a.s.c.ZkContainer Zookeeper client=127.0.0.1:41889/solr
   [junit4]   2> 382325 INFO  (zkConnectionManagerCallback-582-thread-1) [    ] o.a.s.c.c.ConnectionManager zkClient has connected
   [junit4]   2> 382327 INFO  (zkConnectionManagerCallback-584-thread-1-processing-n:127.0.0.1:46295_) [n:127.0.0.1:46295_    ] o.a.s.c.c.ConnectionManager zkClient has connected
   [junit4]   2> 382368 INFO  (TEST-TestDistribDocBasedVersion.test-seed#[627E21C664583B7F]) [n:127.0.0.1:46295_    ] o.a.s.c.Overseer Overseer (id=null) closing
   [junit4]   2> 382369 INFO  (TEST-TestDistribDocBasedVersion.test-seed#[627E21C664583B7F]) [n:127.0.0.1:46295_    ] o.a.s.c.OverseerElectionContext I am going to be the leader 127.0.0.1:46295_
   [junit4]   2> 382369 INFO  (TEST-TestDistribDocBasedVersion.test-seed#[627E21C664583B7F]) [n:127.0.0.1:46295_    ] o.a.s.c.Overseer Overseer (id=99284203614175237-127.0.0.1:46295_-n_0000000000) starting
   [junit4]   2> 382373 INFO  (TEST-TestDistribDocBasedVersion.test-seed#[627E21C664583B7F]) [n:127.0.0.1:46295_    ] o.a.s.c.ZkController Register node as live in ZooKeeper:/live_nodes/127.0.0.1:46295_
   [junit4]   2> 382374 INFO  (OverseerStateUpdate-99284203614175237-127.0.0.1:46295_-n_0000000000) [n:127.0.0.1:46295_    ] o.a.s.c.c.ZkStateReader Updated live nodes from ZooKeeper... (0) -> (1)
   [junit4]   2> 382517 INFO  (TEST-TestDistribDocBasedVersion.test-seed#[627E21C664583B7F]) [n:127.0.0.1:46295_    ] o.a.s.m.r.SolrJmxReporter JMX monitoring for 'solr.node' (registry 'solr.node') enabled at server: com.sun.jmx.mbeanserver.JmxMBeanServer@1787ba2
   [junit4]   2> 382528 INFO  (TEST-TestDistribDocBasedVersion.test-seed#[627E21C664583B7F]) [n:127.0.0.1:46295_    ] o.a.s.m.r.SolrJmxReporter JMX monitoring for 'solr.jvm' (registry 'solr.jvm') enabled at server: com.sun.jmx.mbeanserver.JmxMBeanServer@1787ba2
   [junit4]   2> 382528 INFO  (TEST-TestDistribDocBasedVersion.test-seed#[627E21C664583B7F]) [n:127.0.0.1:46295_    ] o.a.s.m.r.SolrJmxReporter JMX monitoring for 'solr.jetty' (registry 'solr.jetty') enabled at server: com.sun.jmx.mbeanserver.JmxMBeanServer@1787ba2
   [junit4]   2> 382530 INFO  (TEST-TestDistribDocBasedVersion.test-seed#[627E21C664583B7F]) [n:127.0.0.1:46295_    ] o.a.s.c.CorePropertiesLocator Found 0 core definitions underneath /home/jenkins/workspace/Lucene-Solr-7.x-Linux/solr/build/solr-core/test/J2/temp/solr.cloud.TestDistribDocBasedVersion_627E21C664583B7F-001/control-001/cores
   [junit4]   2> 382560 INFO  (zkConnectionManagerCallback-590-thread-1) [    ] o.a.s.c.c.ConnectionManager zkClient has connected
   [junit4]   2> 382561 INFO  (TEST-TestDistribDocBasedVersion.test-seed#[627E21C664583B7F]) [    ] o.a.s.c.c.ZkStateReader Updated live nodes from ZooKeeper... (0) -> (1)
   [junit4]   2> 382561 INFO  (TEST-TestDistribDocBasedVersion.test-seed#[627E21C664583B7F]) [    ] o.a.s.c.s.i.ZkClientClusterStateProvider Cluster at 127.0.0.1:41889/solr ready
   [junit4]   2> 382610 INFO  (qtp9343557-2282) [n:127.0.0.1:46295_    ] o.a.s.h.a.CollectionsHandler Invoked Collection Action :create with params replicationFactor=1&collection.configName=conf1&name=control_collection&nrtReplicas=1&action=CREATE&numShards=1&createNodeSet=127.0.0.1:46295_&wt=javabin&version=2 and sendToOCPQueue=true
   [junit4]   2> 382611 INFO  (OverseerThreadFactory-1081-thread-1-processing-n:127.0.0.1:46295_) [n:127.0.0.1:46295_    ] o.a.s.c.CreateCollectionCmd Create collection control_collection
   [junit4]   2> 382719 INFO  (qtp9343557-2278) [n:127.0.0.1:46295_    ] o.a.s.h.a.CoreAdminOperation core create command qt=/admin/cores&collection.configName=conf1&newCollection=true&name=control_collection_shard1_replica_n1&action=CREATE&numShards=1&collection=control_collection&shard=shard1&wt=javabin&version=2&replicaType=NRT
   [junit4]   2> 382719 INFO  (qtp9343557-2278) [n:127.0.0.1:46295_    ] o.a.s.c.TransientSolrCoreCacheDefault Allocating transient cache for 4 transient cores
   [junit4]   2> 382822 INFO  (zkCallback-583-thread-1-processing-n:127.0.0.1:46295_) [n:127.0.0.1:46295_    ] o.a.s.c.c.ZkStateReader A cluster state change: [WatchedEvent state:SyncConnected type:NodeDataChanged path:/collections/control_collection/state.json] for collection [control_collection] has occurred - updating... (live nodes size: [1])
   [junit4]   2> 383760 INFO  (qtp9343557-2278) [n:127.0.0.1:46295_ c:control_collection s:shard1  x:control_collection_shard1_replica_n1] o.a.s.c.SolrConfig Using Lucene MatchVersion: 7.3.0
   [junit4]   2> 383791 INFO  (qtp9343557-2278) [n:127.0.0.1:46295_ c:control_collection s:shard1  x:control_collection_shard1_replica_n1] o.a.s.s.IndexSchema [control_collection_shard1_replica_n1] Schema name=test
   [junit4]   2> 383885 INFO  (qtp9343557-2278) [n:127.0.0.1:46295_ c:control_collection s:shard1  x:control_collection_shard1_replica_n1] o.a.s.s.IndexSchema Loaded schema test/1.6 with uniqueid field id
   [junit4]   2> 383903 INFO  (qtp9343557-2278) [n:127.0.0.1:46295_ c:control_collection s:shard1  x:control_collection_shard1_replica_n1] o.a.s.c.CoreContainer Creating SolrCore 'control_collection_shard1_replica_n1' using configuration from collection control_collection, trusted=true
   [junit4]   2> 383904 INFO  (qtp9343557-2278) [n:127.0.0.1:46295_ c:control_collection s:shard1  x:control_collection_shard1_replica_n1] o.a.s.m.r.SolrJmxReporter JMX monitoring for 'solr.core.control_collection.shard1.replica_n1' (registry 'solr.core.control_collection.shard1.replica_n1') enabled at server: com.sun.jmx.mbeanserver.JmxMBeanServer@1787ba2
   [junit4]   2> 383908 INFO  (qtp9343557-2278) [n:127.0.0.1:46295_ c:control_collection s:shard1  x:control_collection_shard1_replica_n1] o.a.s.c.SolrCore solr.RecoveryStrategy.Builder
   [junit4]   2> 383908 INFO  (qtp9343557-2278) [n:127.0.0.1:46295_ c:control_collection s:shard1  x:control_collection_shard1_replica_n1] o.a.s.c.SolrCore [[control_collection_shard1_replica_n1] ] Opening new SolrCore at [/home/jenkins/workspace/Lucene-Solr-7.x-Linux/solr/build/solr-core/test/J2/temp/solr.cloud.TestDistribDocBasedVersion_627E21C664583B7F-001/control-001/cores/control_collection_shard1_replica_n1], dataDir=[/home/jenkins/workspace/Lucene-Solr-7.x-Linux/solr/build/solr-core/test/J2/temp/solr.cloud.TestDistribDocBasedVersion_627E21C664583B7F-001/control-001/cores/control_collection_shard1_replica_n1/data/]
   [junit4]   2> 383911 INFO  (qtp9343557-2278) [n:127.0.0.1:46295_ c:control_collection s:shard1  x:control_collection_shard1_replica_n1] o.a.s.u.RandomMergePolicy RandomMergePolicy wrapping class org.apache.lucene.index.LogDocMergePolicy: [LogDocMergePolicy: minMergeSize=1000, mergeFactor=13, maxMergeSize=9223372036854775807, maxMergeSizeForForcedMerge=9223372036854775807, calibrateSizeByDeletes=true, maxMergeDocs=2147483647, maxCFSSegmentSizeMB=8.796093022207999E12, noCFSRatio=0.0]
   [junit4]   2> 384026 INFO  (qtp9343557-2278) [n:127.0.0.1:46295_ c:control_collection s:shard1  x:control_collection_shard1_replica_n1] o.a.s.u.UpdateHandler Using UpdateLog implementation: org.apache.solr.update.UpdateLog
   [junit4]   2> 384026 INFO  (qtp9343557-2278) [n:127.0.0.1:46295_ c:control_collection s:shard1  x:control_collection_shard1_replica_n1] o.a.s.u.UpdateLog Initializing UpdateLog: dataDir= defaultSyncLevel=FLUSH numRecordsToKeep=100 maxNumLogsToKeep=10 numVersionBuckets=65536
   [junit4]   2> 384027 INFO  (qtp9343557-2278) [n:127.0.0.1:46295_ c:control_collection s:shard1  x:control_collection_shard1_replica_n1] o.a.s.u.CommitTracker Hard AutoCommit: disabled
   [junit4]   2> 384027 INFO  (qtp9343557-2278) [n:127.0.0.1:46295_ c:control_collection s:shard1  x:control_collection_shard1_replica_n1] o.a.s.u.CommitTracker Soft AutoCommit: disabled
   [junit4]   2> 384029 INFO  (qtp9343557-2278) [n:127.0.0.1:46295_ c:control_collection s:shard1  x:control_collection_shard1_replica_n1] o.a.s.u.RandomMergePolicy RandomMergePolicy wrapping class org.apache.lucene.index.TieredMergePolicy: [TieredMergePolicy: maxMergeAtOnce=25, maxMergeAtOnceExplicit=50, maxMergedSegmentMB=75.6220703125, floorSegmentMB=2.1572265625, forceMergeDeletesPctAllowed=9.433735447934225, segmentsPerTier=46.0, maxCFSSegmentSizeMB=8.796093022207999E12, noCFSRatio=1.0
   [junit4]   2> 384029 INFO  (qtp9343557-2278) [n:127.0.0.1:46295_ c:control_collection s:shard1  x:control_collection_shard1_replica_n1] o.a.s.s.SolrIndexSearcher Opening [Searcher@1b03dc9[control_collection_shard1_replica_n1] main]
   [junit4]   2> 384030 INFO  (qtp9343557-2278) [n:127.0.0.1:46295_ c:control_collection s:shard1  x:control_collection_shard1_replica_n1] o.a.s.r.ManagedResourceStorage Configured ZooKeeperStorageIO with znodeBase: /configs/conf1
   [junit4]   2> 384031 INFO  (qtp9343557-2278) [n:127.0.0.1:46295_ c:control_collection s:shard1  x:control_collection_shard1_replica_n1] o.a.s.r.ManagedResourceStorage Loaded null at path _rest_managed.json using ZooKeeperStorageIO:path=/configs/conf1
   [junit4]   2> 384031 INFO  (qtp9343557-2278) [n:127.0.0.1:46295_ c:control_collection s:shard1  x:control_collection_shard1_replica_n1] o.a.s.h.ReplicationHandler Commits will be reserved for 10000ms.
   [junit4]   2> 384033 INFO  (searcherExecutor-1084-thread-1-processing-n:127.0.0.1:46295_ x:control_collection_shard1_replica_n1 s:shard1 c:control_collection) [n:127.0.0.1:46295_ c:control_collection s:shard1  x:control_collection_shard1_replica_n1] o.a.s.c.SolrCore [control_collection_shard1_replica_n1] Registered new searcher Searcher@1b03dc9[control_collection_shard1_replica_n1] main{ExitableDirectoryReader(UninvertingDirectoryReader())}
   [junit4]   2> 384033 INFO  (qtp9343557-2278) [n:127.0.0.1:46295_ c:control_collection s:shard1  x:control_collection_shard1_replica_n1] o.a.s.u.UpdateLog Could not find max version in index or recent updates, using new clock 1588547259885158400
   [junit4]   2> 384037 INFO  (qtp9343557-2278) [n:127.0.0.1:46295_ c:control_collection s:shard1  x:control_collection_shard1_replica_n1] o.a.s.c.ShardLeaderElectionContext Enough replicas found to continue.
   [junit4]   2> 384037 INFO  (qtp9343557-2278) [n:127.0.0.1:46295_ c:control_collection s:shard1  x:control_collection_shard1_replica_n1] o.a.s.c.ShardLeaderElectionContext I may be the new leader - try and sync
   [junit4]   2> 384037 INFO  (qtp9343557-2278) [n:127.0.0.1:46295_ c:control_collection s:shard1  x:control_collection_shard1_replica_n1] o.a.s.c.SyncStrategy Sync replicas to https://127.0.0.1:46295/control_collection_shard1_replica_n1/
   [junit4]   2> 384037 INFO  (qtp9343557-2278) [n:127.0.0.1:46295_ c:control_collection s:shard1  x:control_collection_shard1_replica_n1] o.a.s.c.SyncStrategy Sync Success - now sync replicas to me
   [junit4]   2> 384037 INFO  (qtp9343557-2278) [n:127.0.0.1:46295_ c:control_collection s:shard1  x:control_collection_shard1_replica_n1] o.a.s.c.SyncStrategy https://127.0.0.1:46295/control_collection_shard1_replica_n1/ has no replicas
   [junit4]   2> 384037 INFO  (qtp9343557-2278) [n:127.0.0.1:46295_ c:control_collection s:shard1  x:control_collection_shard1_replica_n1] o.a.s.c.ShardLeaderElectionContext Found all replicas participating in election, clear LIR
   [junit4]   2> 384038 INFO  (qtp9343557-2278) [n:127.0.0.1:46295_ c:control_collection s:shard1  x:control_collection_shard1_replica_n1] o.a.s.c.ShardLeaderElectionContext I am the new leader: https://127.0.0.1:46295/control_collection_shard1_replica_n1/ shard1
   [junit4]   2> 442667 INFO  (TEST-TestDistribDocBasedVersion.test-seed#[627E21C664583B7F]) [    ] o.a.s.c.ChaosMonkey monkey: stop jetty! 46295
   [junit4]   2> 442667 INFO  (TEST-TestDistribDocBasedVersion.test-seed#[627E21C664583B7F]) [    ] o.a.s.c.CoreContainer Shutting down CoreContainer instance=15150168
   [junit4]   2> 442667 INFO  (TEST-TestDistribDocBasedVersion.test-seed#[627E21C664583B7F]) [    ] o.a.s.m.SolrMetricManager Closing metric reporters for registry=solr.node, tag=null
   [junit4]   2> 442668 INFO  (TEST-TestDistribDocBasedVersion.test-seed#[627E21C664583B7F]) [    ] o.a.s.m.r.SolrJmxReporter Closing reporter [org.apache.solr.metrics.reporters.SolrJmxReporter@17ce72: rootName = null, domain = solr.node, service url = null, agent id = null] for registry solr.node / com.codahale.metrics.MetricRegistry@339cbc
   [junit4]   2> 442673 INFO  (TEST-TestDistribDocBasedVersion.test-seed#[627E21C664583B7F]) [    ] o.a.s.m.SolrMetricManager Closing metric reporters for registry=solr.jvm, tag=null
   [junit4]   2> 442673 INFO  (TEST-TestDistribDocBasedVersion.test-seed#[627E21C664583B7F]) [    ] o.a.s.m.r.SolrJmxReporter Closing reporter [org.apache.solr.metrics.reporters.SolrJmxReporter@1aa8130: rootName = null, domain = solr.jvm, service url = null, agent id = null] for registry solr.jvm / com.codahale.metrics.MetricRegistry@6a3268
   [junit4]   2> 442678 INFO  (TEST-TestDistribDocBasedVersion.test-seed#[627E21C664583B7F]) [    ] o.a.s.m.SolrMetricManager Closing metric reporters for registry=solr.jetty, tag=null
   [junit4]   2> 442678 INFO  (TEST-TestDistribDocBasedVersion.test-seed#[627E21C664583B7F]) [    ] o.a.s.m.r.SolrJmxReporter Closing reporter [org.apache.solr.metrics.reporters.SolrJmxReporter@16e03a5: rootName = null, domain = solr.jetty, service url = null, agent id = null] for registry solr.jetty / com.codahale.metrics.MetricRegistry@bbde7b
   [junit4]   2> 442680 INFO  (TEST-TestDistribDocBasedVersion.test-seed#[627E21C664583B7F]) [    ] o.a.s.c.ZkController Remove node as live in ZooKeeper:/live_nodes/127.0.0.1:46295_
   [junit4]   2> 442682 INFO  (TEST-TestDistribDocBasedVersion.test-seed#[627E21C664583B7F]) [    ] o.a.s.m.SolrMetricManager Closing metric reporters for registry=solr.cluster, tag=null
   [junit4]   2> 442683 INFO  (zkCallback-583-thread-2-processing-n:127.0.0.1:46295_) [n:127.0.0.1:46295_    ] o.a.s.c.c.ZkStateReader Updated live nodes from ZooKeeper... (1) -> (0)
   [junit4]   2> 442684 INFO  (coreCloseExecutor-1089-thread-1) [n:127.0.0.1:46295_ c:control_collection s:shard1 r:core_node2 x:control_collection_shard1_replica_n1] o.a.s.c.SolrCore [control_collection_shard1_replica_n1]  CLOSING SolrCore org.apache.solr.core.SolrCore@1b1ce36
   [junit4]   2> 442684 INFO  (coreCloseExecutor-1089-thread-1) [n:127.0.0.1:46295_ c:control_collection s:shard1 r:core_node2 x:control_collection_shard1_replica_n1] o.a.s.m.SolrMetricManager Closing metric reporters for registry=solr.core.control_collection.shard1.replica_n1, tag=28429878
   [junit4]   2> 442684 INFO  (coreCloseExecutor-1089-thread-1) [n:127.0.0.1:46295_ c:control_collection s:shard1 r:core_node2 x:control_collection_shard1_replica_n1] o.a.s.m.r.SolrJmxReporter Closing reporter [org.apache.solr.metrics.reporters.SolrJmxReporter@85c0e1: rootName = null, domain = solr.core.control_collection.shard1.replica_n1, service url = null, agent id = null] for registry solr.core.control_collection.shard1.replica_n1 / com.codahale.metrics.MetricRegistry@8a13b6
   [junit4]   2> 442694 INFO  (coreCloseExecutor-1089-thread-1) [n:127.0.0.1:46295_ c:control_collection s:shard1 r:core_node2 x:control_collection_shard1_replica_n1] o.a.s.m.SolrMetricManager Closing metric reporters for registry=solr.collection.control_collection.shard1.leader, tag=28429878
   [junit4]   2> 453393 INFO  (ScheduledTrigger-1079-thread-1) [n:127.0.0.1:46295_    ] o.a.s.c.a.SystemLogListener Collection .system does not exist, disabling logging.
   [junit4]   2> 453394 INFO  (AutoscalingActionExecutor-1080-thread-1-processing-n:127.0.0.1:46295_) [n:127.0.0.1:46295_    ] o.a.s.c.s.c.a.PolicyHelper returnSession, curr-time 2657933483 sessionWrapper.createTime 2657933483665519, this.sessionWrapper.createTime 2657933483665519 
   [junit4]   2> 453394 INFO  (AutoscalingActionExecutor-1080-thread-1-processing-n:127.0.0.1:46295_) [n:127.0.0.1:46295_    ] o.a.s.c.a.ExecutePlanAction No operations to execute for event: {
   [junit4]   2>   "id":"9715e08ce2191T8suuzuu59z7zsmdr0jb3f3475",
   [junit4]   2>   "source":".auto_add_replicas",
   [junit4]   2>   "eventTime":2657923478987153,
   [junit4]   2>   "eventType":"NODELOST",
   [junit4]   2>   "properties":{
   [junit4]   2>     "eventTimes":[2657923478987153],
   [junit4]   2>     "_enqueue_time_":2657933481515656,
   [junit4]   2>     "nodeNames":["127.0.0.1:46295_"]}}
   [junit4]   2> 562612 ERROR (qtp9343557-2282) [n:127.0.0.1:46295_    ] o.a.s.h.RequestHandlerBase org.apache.solr.common.SolrException: create the collection time out:180s
   [junit4]   2> 	at org.apache.solr.handler.admin.CollectionsHandler.handleResponse(CollectionsHandler.java:314)
   [junit4]   2> 	at org.apache.solr.handler.admin.CollectionsHandler.invokeAction(CollectionsHandler.java:246)
   [junit4]   2> 	at org.apache.solr.handler.admin.CollectionsHandler.handleRequestBody(CollectionsHandler.java:224)
   [junit4]   2> 	at org.apache.solr.handler.RequestHandlerBase.handleRequest(RequestHandlerBase.java:177)
   [junit4]   2> 	at org.apache.solr.servlet.HttpSolrCall.handleAdmin(HttpSolrCall.java:736)
   [junit4]   2> 	at org.apache.solr.servlet.HttpSolrCall.handleAdminRequest(HttpSolrCall.java:717)
   [junit4]   2> 	at org.apache.solr.servlet.HttpSolrCall.call(HttpSolrCall.java:498)
   [junit4]   2> 	at org.apache.solr.servlet.SolrDispatchFilter.doFilter(SolrDispatchFilter.java:382)
   [junit4]   2> 	at org.apache.solr.servlet.SolrDispatchFilter.doFilter(SolrDispatchFilter.java:326)
   [junit4]   2> 	at org.eclipse.jetty.servlet.ServletHandler$CachedChain.doFilter(ServletHandler.java:1759)
   [junit4]   2> 	at org.apache.solr.client.solrj.embedded.JettySolrRunner$DebugFilter.doFilter(JettySolrRunner.java:139)
   [junit4]   2> 	at org.eclipse.jetty.servlet.ServletHandler$CachedChain.doFilter(ServletHandler.java:1759)
   [junit4]   2> 	at org.eclipse.jetty.servlet.ServletHandler.doHandle(ServletHandler.java:582)
   [junit4]   2> 	at org.eclipse.jetty.server.session.SessionHandler.doHandle(SessionHandler.java:224)
   [junit4]   2> 	at org.eclipse.jetty.server.handler.ContextHandler.doHandle(ContextHandler.java:1180)
   [junit4]   2> 	at org.eclipse.jetty.servlet.ServletHandler.doScope(ServletHandler.java:512)
   [junit4]   2> 	at org.eclipse.jetty.server.session.SessionHandler.doScope(SessionHandler.java:185)
   [junit4]   2> 	at org.eclipse.jetty.server.handler.ContextHandler.doScope(ContextHandler.java:1112)
   [junit4]   2> 	at org.eclipse.jetty.server.handler.ScopedHandler.handle(ScopedHandler.java:141)
   [junit4]   2> 	at org.eclipse.jetty.server.handler.gzip.GzipHandler.handle(GzipHandler.java:493)
   [junit4]   2> 	at org.eclipse.jetty.server.handler.HandlerWrapper.handle(HandlerWrapper.java:134)
   [junit4]   2> 	at org.eclipse.jetty.server.Server.handle(Server.java:534)
   [junit4]   2> 	at org.eclipse.jetty.server.HttpChannel.handle(HttpChannel.java:320)
   [junit4]   2> 	at org.eclipse.jetty.server.HttpConnection.onFillable(HttpConnection.java:251)
   [junit4]   2> 	at org.eclipse.jetty.io.AbstractConnection$ReadCallback.succeeded(AbstractConnection.java:283)
   [junit4]   2> 	at org.eclipse.jetty.io.FillInterest.fillable(FillInterest.java:108)
   [junit4]   2> 	at org.eclipse.jetty.io.ssl.SslConnection.onFillable(SslConnection.java:251)
   [junit4]   2> 	at org.eclipse.jetty.io.AbstractConnection$ReadCallback.succeeded(AbstractConnection.java:283)
   [junit4]   2> 	at org.eclipse.jetty.io.FillInterest.fillable(FillInterest.java:108)
   [junit4]   2> 	at org.eclipse.jetty.io.SelectChannelEndPoint$2.run(SelectChannelEndPoint.java:93)
   [junit4]   2> 	at org.eclipse.jetty.util.thread.strategy.ExecuteProduceConsume.executeProduceConsume(ExecuteProduceConsume.java:303)
   [junit4]   2> 	at org.eclipse.jetty.util.thread.strategy.ExecuteProduceConsume.produceConsume(ExecuteProduceConsume.java:148)
   [junit4]   2> 	at org.eclipse.jetty.util.thread.strategy.ExecuteProduceConsume.run(ExecuteProduceConsume.java:136)
   [junit4]   2> 	at org.eclipse.jetty.util.thread.QueuedThreadPool.runJob(QueuedThreadPool.java:671)
   [junit4]   2> 	at org.eclipse.jetty.util.thread.QueuedThreadPool$2.run(QueuedThreadPool.java:589)
   [junit4]   2> 	at java.lang.Thread.run(Thread.java:748)
   [junit4]   2> 
   [junit4]   2> 562612 INFO  (qtp9343557-2282) [n:127.0.0.1:46295_    ] o.a.s.s.HttpSolrCall [admin] webapp=null path=/admin/collections params={replicationFactor=1&collection.configName=conf1&name=control_collection&nrtReplicas=1&action=CREATE&numShards=1&createNodeSet=127.0.0.1:46295_&wt=javabin&version=2} status=500 QTime=180002
   [junit4]   2> 562613 ERROR (qtp9343557-2282) [n:127.0.0.1:46295_    ] o.a.s.s.HttpSolrCall null:org.apache.solr.common.SolrException: create the collection time out:180s
   [junit4]   2> 	at org.apache.solr.handler.admin.CollectionsHandler.handleResponse(CollectionsHandler.java:314)
   [junit4]   2> 	at org.apache.solr.handler.admin.CollectionsHandler.invokeAction(CollectionsHandler.java:246)
   [junit4]   2> 	at org.apache.solr.handler.admin.CollectionsHandler.handleRequestBody(CollectionsHandler.java:224)
   [junit4]   2> 	at org.apache.solr.handler.RequestHandlerBase.handleRequest(RequestHandlerBase.java:177)
   [junit4]   2> 	at org.apache.solr.servlet.HttpSolrCall.handleAdmin(HttpSolrCall.java:736)
   [junit4]   2> 	at org.apache.solr.servlet.HttpSolrCall.handleAdminRequest(HttpSolrCall.java:717)
   [junit4]   2> 	at org.apache.solr.servlet.HttpSolrCall.call(HttpSolrCall.java:498)
   [junit4]   2> 	at org.apache.solr.servlet.SolrDispatchFilter.doFilter(SolrDispatchFilter.java:382)
   [junit4]   2> 	at org.apache.solr.servlet.SolrDispatchFilter.doFilter(SolrDispatchFilter.java:326)
   [junit4]   2> 	at org.eclipse.jetty.servlet.ServletHandler$CachedChain.doFilter(ServletHandler.java:1759)
   [junit4]   2> 	at org.apache.solr.client.solrj.embedded.JettySolrRunner$DebugFilter.doFilter(JettySolrRunner.java:139)
   [junit4]   2> 	at org.eclipse.jetty.servlet.ServletHandler$CachedChain.doFilter(ServletHandler.java:1759)
   [junit4]   2> 	at org.eclipse.jetty.servlet.ServletHandler.doHandle(ServletHandler.java:582)
   [junit4]   2> 	at org.eclipse.jetty.server.session.SessionHandler.doHandle(SessionHandler.java:224)
   [junit4]   2> 	at org.eclipse.jetty.server.handler.ContextHandler.doHandle(ContextHandler.java:1180)
   [junit4]   2> 	at org.eclipse.jetty.servlet.ServletHandler.doScope(ServletHandler.java:512)
   [junit4]   2> 	at org.eclipse.jetty.server.session.SessionHandler.doScope(SessionHandler.java:185)
   [junit4]   2> 	at org.eclipse.jetty.server.handler.ContextHandler.doScope(ContextHandler.java:1112)
   [junit4]   2> 	at org.eclipse.jetty.server.handler.ScopedHandler.handle(ScopedHandler.java:141)
   [junit4]   2> 	at org.eclipse.jetty.server.handler.gzip.GzipHandler.handle(GzipHandler.java:493)
   [junit4]   2> 	at org.eclipse.jetty.server.handler.HandlerWrapper.handle(HandlerWrapper.java:134)
   [junit4]   2> 	at org.eclipse.jetty.server.Server.handle(Server.java:534)
   [junit4]   2> 	at org.eclipse.jetty.server.HttpChannel.handle(HttpChannel.java:320)
   [junit4]   2> 	at org.eclipse.jetty.server.HttpConnection.onFillable(HttpConnection.java:251)
   [junit4]   2> 	at org.eclipse.jetty.io.AbstractConnection$ReadCallback.succeeded(AbstractConnection.java:283)
   [junit4]   2> 	at org.eclipse.jetty.io.FillInterest.fillable(FillInterest.java:108)
   [junit4]   2> 	at org.eclipse.jetty.io.ssl.SslConnection.onFillable(SslConnection.java:251)
   [junit4]   2> 	at org.eclipse.jetty.io.AbstractConnection$ReadCallback.succeeded(AbstractConnection.java:283)
   [junit4]   2> 	at org.eclipse.jetty.io.FillInterest.fillable(FillInterest.java:108)
   [junit4]   2> 	at org.eclipse.jetty.io.SelectChannelEndPoint$2.run(SelectChannelEndPoint.java:93)
   [junit4]   2> 	at org.eclipse.jetty.util.thread.strategy.ExecuteProduceConsume.executeProduceConsume(ExecuteProduceConsume.java:303)
   [junit4]   2> 	at org.eclipse.jetty.util.thread.strategy.ExecuteProduceConsume.produceConsume(ExecuteProduceConsume.java:148)
   [junit4]   2> 	at org.eclipse.jetty.util.thread.strategy.ExecuteProduceConsume.run(ExecuteProduceConsume.java:136)
   [junit4]   2> 	at org.eclipse.jetty.util.thread.QueuedThreadPool.runJob(QueuedThreadPool.java:671)
   [junit4]   2> 	at org.eclipse.jetty.util.thread.QueuedThreadPool$2.run(QueuedThreadPool.java:589)
   [junit4]   2> 	at java.lang.Thread.run(Thread.java:748)
   [junit4]   2> 
   [junit4]   2> 982803 ERROR (OverseerThreadFactory-1081-thread-1-processing-n:127.0.0.1:46295_) [n:127.0.0.1:46295_    ] o.a.s.c.OverseerCollectionMessageHandler Error from shard: https://127.0.0.1:46295
   [junit4]   2> org.apache.solr.client.solrj.SolrServerException: Timeout occured while waiting response from server at: https://127.0.0.1:46295
   [junit4]   2> 	at org.apache.solr.client.solrj.impl.HttpSolrClient.executeMethod(HttpSolrClient.java:654)
   [junit4]   2> 	at org.apache.solr.client.solrj.impl.HttpSolrClient.request(HttpSolrClient.java:255)
   [junit4]   2> 	at org.apache.solr.client.solrj.impl.HttpSolrClient.request(HttpSolrClient.java:244)
   [junit4]   2> 	at org.apache.solr.client.solrj.SolrClient.request(SolrClient.java:1219)
   [junit4]   2> 	at org.apache.solr.handler.component.HttpShardHandler.lambda$submit$0(HttpShardHandler.java:172)
   [junit4]   2> 	at java.util.concurrent.FutureTask.run(FutureTask.java:266)
   [junit4]   2> 	at java.util.concurrent.Executors$RunnableAdapter.call(Executors.java:511)
   [junit4]   2> 	at java.util.concurrent.FutureTask.run(FutureTask.java:266)
   [junit4]   2> 	at com.codahale.metrics.InstrumentedExecutorService$InstrumentedRunnable.run(InstrumentedExecutorService.java:176)
   [junit4]   2> 	at org.apache.solr.common.util.ExecutorUtil$MDCAwareThreadPoolExecutor.lambda$execute$0(ExecutorUtil.java:188)
   [junit4]   2> 	at java.util.concurrent.ThreadPoolExecutor.runWorker(ThreadPoolExecutor.java:1149)
   [junit4]   2> 	at java.util.concurrent.ThreadPoolExecutor$Worker.run(ThreadPoolExecutor.java:624)
   [junit4]   2> 	at java.lang.Thread.run(Thread.java:748)
   [junit4]   2> Caused by: java.net.SocketTimeoutException: Read timed out
   [junit4]   2> 	at java.net.SocketInputStream.socketRead0(Native Method)
   [junit4]   2> 	at java.net.SocketInputStream.socketRead(SocketInputStream.java:116)
   [junit4]   2> 	at java.net.SocketInputStream.read(SocketInputStream.java:171)
   [junit4]   2> 	at java.net.SocketInputStream.read(SocketInputStream.java:141)
   [junit4]   2> 	at sun.security.ssl.InputRecord.readFully(InputRecord.java:465)
   [junit4]   2> 	at sun.security.ssl.InputRecord.read(InputRecord.java:503)
   [junit4]   2> 	at sun.security.ssl.SSLSocketImpl.readRecord(SSLSocketImpl.java:983)
   [junit4]   2> 	at sun.security.ssl.SSLSocketImpl.readDataRecord(SSLSocketImpl.java:940)
   [junit4]   2> 	at sun.security.ssl.AppInputStream.read(AppInputStream.java:105)
   [junit4]   2> 	at org.apache.http.impl.io.SessionInputBufferImpl.streamRead(SessionInputBufferImpl.java:137)
   [junit4]   2> 	at org.apache.http.impl.io.SessionInputBufferImpl.fillBuffer(SessionInputBufferImpl.java:153)
   [junit4]   2> 	at org.apache.http.impl.io.SessionInputBufferImpl.readLine(SessionInputBufferImpl.java:282)
   [junit4]   2> 	at org.apache.http.impl.conn.DefaultHttpResponseParser.parseHead(DefaultHttpResponseParser.java:138)
   [junit4]   2> 	at org.apache.http.impl.conn.DefaultHttpResponseParser.parseHead(DefaultHttpResponseParser.java:56)
   [junit4]   2> 	at org.apache.http.impl.io.AbstractMessageParser.parse(AbstractMessageParser.java:259)
   [junit4]   2> 	at org.apache.http.impl.DefaultBHttpClientConnection.receiveResponseHeader(DefaultBHttpClientConnection.java:163)
   [junit4]   2> 	at org.apache.http.impl.conn.CPoolProxy.receiveResponseHeader(CPoolProxy.java:165)
   [junit4]   2> 	at org.apache.http.protocol.HttpRequestExecutor.doReceiveResponse(HttpRequestExecutor.java:273)
   [junit4]   2> 	at org.apache.http.protocol.HttpRequestExecutor.execute(HttpRequestExecutor.java:125)
   [junit4]   2> 	at org.apache.solr.util.stats.InstrumentedHttpRequestExecutor.execute(InstrumentedHttpRequestExecutor.java:118)
   [junit4]   2> 	at org.apache.http.impl.execchain.MainClientExec.execute(MainClientExec.java:272)
   [junit4]   2> 	at org.apache.http.impl.execchain.ProtocolExec.execute(ProtocolExec.java:185)
   [junit4]   2> 	at org.apache.http.impl.execchain.RetryExec.execute(RetryExec.java:89)
   [junit4]   2> 	at org.apache.http.impl.execchain.RedirectExec.execute(RedirectExec.java:111)
   [junit4]   2> 	at org.apache.http.impl.client.InternalHttpClient.doExecute(InternalHttpClient.java:185)
   [junit4]   2> 	at org.apache.http.impl.client.CloseableHttpClient.execute(CloseableHttpClient.java:83)
   [junit4]   2> 	at org.apache.http.impl.client.CloseableHttpClient.execute(CloseableHttpClient.java:56)
   [junit4]   2> 	at org.apache.solr.client.solrj.impl.HttpSolrClient.executeMethod(HttpSolrClient.java:542)
   [junit4]   2> 	... 12 more
   [junit4]   2> 982804 INFO  (TEST-TestDistribDocBasedVersion.test-seed#[627E21C664583B7F]) [    ] o.a.s.c.Overseer Overseer (id=99284203614175237-127.0.0.1:46295_-n_0000000000) closing
   [junit4]   2> 982805 ERROR (OverseerThreadFactory-1081-thread-1-processing-n:127.0.0.1:46295_) [n:127.0.0.1:46295_    ] o.a.s.c.OverseerCollectionMessageHandler Cleaning up collection [control_collection].
   [junit4]   2> 982805 INFO  (OverseerStateUpdate-99284203614175237-127.0.0.1:46295_-n_0000000000) [n:127.0.0.1:46295_    ] o.a.s.c.Overseer Overseer Loop exiting : 127.0.0.1:46295_
   [junit4]   2> 982806 INFO  (OverseerThreadFactory-1081-thread-1-processing-n:127.0.0.1:46295_) [n:127.0.0.1:46295_    ] o.a.s.c.OverseerCollectionMessageHandler Executing Collection Cmd : action=UNLOAD&deleteInstanceDir=true&deleteDataDir=true
   [junit4]   2> 1012843 INFO  (zkCallback-583-thread-5-processing-n:127.0.0.1:46295_) [n:127.0.0.1:46295_    ] o.a.s.c.c.ZkStateReader A cluster state change: [WatchedEvent state:SyncConnected type:NodeDeleted path:/collections/control_collection/state.json] for collection [control_collection] has occurred - updating... (live nodes size: [0])
   [junit4]   2> 1012846 ERROR (OverseerThreadFactory-1081-thread-1-processing-n:127.0.0.1:46295_) [n:127.0.0.1:46295_    ] o.a.s.c.OverseerCollectionMessageHandler Collection: control_collection operation: create failed:org.apache.solr.common.SolrException: Could not fully remove collection: control_collection
   [junit4]   2> 	at org.apache.solr.cloud.DeleteCollectionCmd.call(DeleteCollectionCmd.java:112)
   [junit4]   2> 	at org.apache.solr.cloud.OverseerCollectionMessageHandler.cleanupCollection(OverseerCollectionMessageHandler.java:688)
   [junit4]   2> 	at org.apache.solr.cloud.CreateCollectionCmd.call(CreateCollectionCmd.java:240)
   [junit4]   2> 	at org.apache.solr.cloud.OverseerCollectionMessageHandler.processMessage(OverseerCollectionMessageHandler.java:242)
   [junit4]   2> 	at org.apache.solr.cloud.OverseerTaskProcessor$Runner.run(OverseerTaskProcessor.java:464)
   [junit4]   2> 	at org.apache.solr.common.util.ExecutorUtil$MDCAwareThreadPoolExecutor.lambda$execute$0(ExecutorUtil.java:188)
   [junit4]   2> 	at java.util.concurrent.ThreadPoolExecutor.runWorker(ThreadPoolExecutor.java:1149)
   [junit4]   2> 	at java.util.concurrent.ThreadPoolExecutor$Worker.run(ThreadPoolExecutor.java:624)
   [junit4]   2> 	at java.lang.Thread.run(Thread.java:748)
   [junit4]   2> 
   [junit4]   2> 1012859 INFO  (OverseerThreadFactory-1081-thread-1-processing-n:127.0.0.1:46295_) [n:127.0.0.1:46295_    ] o.a.s.c.OverseerTaskQueue Response ZK path: /overseer/collection-queue-work/qnr-0000000000 doesn't exist.  Requestor may have disconnected from ZooKeeper
   [junit4]   2> 1012860 WARN  (OverseerAutoScalingTriggerThread-99284203614175237-127.0.0.1:46295_-n_0000000000) [n:127.0.0.1:46295_    ] o.a.s.c.a.OverseerTriggerThread OverseerTriggerThread woken up but we are closed, exiting.
   [junit4]   2> 1012864 INFO  (TEST-TestDistribDocBasedVersion.test-seed#[627E21C664583B7F]) [    ] o.e.j.s.AbstractConnector Stopped ServerConnector@c1ab9b{SSL,[ssl, http/1.1]}{127.0.0.1:0}
   [junit4]   2> 1012864 INFO  (TEST-TestDistribDocBasedVersion.test-seed#[627E21C664583B7F]) [    ] o.e.j.s.h.ContextHandler Stopped o.e.j.s.ServletContextHandler@28437f{/,null,UNAVAILABLE}
   [junit4]   2> 1012888 ERROR (qtp9343557-2278) [n:127.0.0.1:46295_ c:control_collection s:shard1  x:control_collection_shard1_replica_n1] o.a.s.c.ZkController Error getting leader from zk
   [junit4]   2> org.apache.solr.common.SolrException: No registered leader was found after waiting for 1220000ms , collection: control_collection slice: shard1 saw state=null with live_nodes=[]
   [junit4]   2> 	at org.apache.solr.common.cloud.ZkStateReader.getLeaderRetry(ZkStateReader.java:771)
   [junit4]   2> 	at org.apache.solr.common.cloud.ZkStateReader.getLeaderUrl(ZkStateReader.java:736)
   [junit4]   2> 	at org.apache.solr.cloud.ZkController.getLeader(ZkController.java:1178)
   [junit4]   2> 	at org.apache.solr.cloud.ZkController.register(ZkController.java:1079)
   [junit4]   2> 	at org.apache.solr.cloud.ZkController.register(ZkController.java:1014)
   [junit4]   2> 	at org.apache.solr.core.ZkContainer.lambda$registerInZk$0(ZkContainer.java:181)
   [junit4]   2> 	at org.apache.solr.core.ZkContainer.registerInZk(ZkContainer.java:208)
   [junit4]   2> 	at org.apache.solr.core.CoreContainer.registerCore(CoreContainer.java:888)
   [junit4]   2> 	at org.apache.solr.core.CoreContainer.createFromDescriptor(CoreContainer.java:1049)
   [junit4]   2> 	at org.apache.solr.core.CoreContainer.create(CoreContainer.java:950)
   [junit4]   2> 	at org.apache.solr.handler.admin.CoreAdminOperation.lambda$static$0(CoreAdminOperation.java:91)
   [junit4]   2> 	at org.apache.solr.handler.admin.CoreAdminOperation.execute(CoreAdminOperation.java:384)
   [junit4]   2> 	at org.apache.solr.handler.admin.CoreAdminHandler$CallInfo.call(CoreAdminHandler.java:389)
   [junit4]   2> 	at org.apache.solr.handler.admin.CoreAdminHandler.handleRequestBody(CoreAdminHandler.java:174)
   [junit4]   2> 	at org.apache.solr.handler.RequestHandlerBase.handleRequest(RequestHandlerBase.java:177)
   [junit4]   2> 	at org.apache.solr.servlet.HttpSolrCall.handleAdmin(HttpSolrCall.java:736)
   [junit4]   2> 	at org.apache.solr.servlet.HttpSolrCall.handleAdminRequest(HttpSolrCall.java:717)
   [junit4]   2> 	at org.apache.solr.servlet.HttpSolrCall.call(HttpSolrCall.java:498)
   [junit4]   2> 	at org.apache.solr.servlet.SolrDispatchFilter.doFilter(SolrDispatchFilter.java:382)
   [junit4]   2> 	at org.apache.solr.servlet.SolrDispatchFilter.doFilter(SolrDispatchFilter.java:326)
   [junit4]   2> 	at org.eclipse.jetty.servlet.ServletHandler$CachedChain.doFilter(ServletHandler.java:1759)
   [junit4]   2> 	at org.apache.solr.client.solrj.embedded.JettySolrRunner$DebugFilter.doFilter(JettySolrRunner.java:139)
   [junit4]   2> 	at org.eclipse.jetty.servlet.ServletHandler$CachedChain.doFilter(ServletHandler.java:1759)
   [junit4]   2> 	at org.eclipse.jetty.servlet.ServletHandler.doHandle(ServletHandler.java:582)
   [junit4]   2> 	at org.eclipse.jetty.server.session.SessionHandler.doHandle(SessionHandler.java:224)
   [junit4]   2> 	at org.eclipse.jetty.server.handler.ContextHandler.doHandle(ContextHandler.java:1180)
   [junit4]   2> 	at org.eclipse.jetty.servlet.ServletHandler.doScope(ServletHandler.java:512)
   [junit4]   2> 	at org.eclipse.jetty.server.session.SessionHandler.doScope(SessionHandler.java:185)
   [junit4]   2> 	at org.eclipse.jetty.server.handler.ContextHandler.doScope(ContextHandler.java:1112)
   [junit4]   2> 	at org.eclipse.jetty.server.handler.ScopedHandler.handle(ScopedHandler.java:141)
   [junit4]   2> 	at org.eclipse.jetty.server.handler.gzip.GzipHandler.handle(GzipHandler.java:426)
   [junit4]   2> 	at org.eclipse.jetty.server.handler.HandlerWrapper.handle(HandlerWrapper.java:134)
   [junit4]   2> 	at org.eclipse.jetty.server.Server.handle(Server.java:534)
   [junit4]   2> 	at org.eclipse.jetty.server.HttpChannel.handle(HttpChannel.java:320)
   [junit4]   2> 	at org.eclipse.jetty.server.HttpConnection.onFillable(HttpConnection.java:251)
   [junit4]   2> 	at org.eclipse.jetty.io.AbstractConnection$ReadCallback.succeeded(AbstractConnection.java:283)
   [junit4]   2> 	at org.eclipse.jetty.io.FillInterest.fillable(FillInterest.java:108)
   [junit4]   2> 	at org.eclipse.jetty.io.ssl.SslConnection.onFillable(SslConnection.java:251)
   [junit4]   2> 	at org.eclipse.jetty.io.AbstractConnection$ReadCallback.succeeded(AbstractConnection.java:283)
   [junit4]   2> 	at org.eclipse.jetty.io.FillInterest.fillable(FillInterest.java:108)
   [junit4]   2> 	at org.eclipse.jetty.io.SelectChannelEndPoint$2.run(SelectChannelEndPoint.java:93)
   [junit4]   2> 	at org.eclipse.jetty.util.thread.strategy.ExecuteProduceConsume.executeProduceConsume(ExecuteProduceConsume.java:303)
   [junit4]   2> 	at org.eclipse.jetty.util.thread.strategy.ExecuteProduceConsume.produceConsume(ExecuteProduceConsume.java:148)
   [junit4]   2> 	at org.eclipse.jetty.util.thread.strategy.ExecuteProduceConsume.run(ExecuteProduceConsume.java:136)
   [junit4]   2> 	at org.eclipse.jetty.util.thread.QueuedThreadPool.runJob(QueuedThreadPool.java:671)
   [junit4]   2> 	at org.eclipse.jetty.util.thread.QueuedThreadPool$2.run(QueuedThreadPool.java:589)
   [junit4]   2> 	at java.lang.Thread.run(Thread.java:748)
   [junit4]   2> 1012889 ERROR (qtp9343557-2278) [n:127.0.0.1:46295_ c:control_collection s:shard1  x:control_collection_shard1_replica_n1] o.a.s.c.ZkContainer :org.apache.solr.common.SolrException: Error getting leader from zk for shard shard1
   [junit4]   2> 	at org.apache.solr.cloud.ZkController.getLeader(ZkController.java:1207)
   [junit4]   2> 	at org.apache.solr.cloud.ZkController.register(ZkController.java:1079)
   [junit4]   2> 	at org.apache.solr.cloud.ZkController.register(ZkController.java:1014)
   [junit4]   2> 	at org.apache.solr.core.ZkContainer.lambda$registerInZk$0(ZkContainer.java:181)
   [junit4]   2> 	at org.apache.solr.core.ZkContainer.registerInZk(ZkContainer.java:208)
   [junit4]   2> 	at org.apache.solr.core.CoreContainer.registerCore(CoreContainer.java:888)
   [junit4]   2> 	at org.apache.solr.core.CoreContainer.createFromDescriptor(CoreContainer.java:1049)
   [junit4]   2> 	at org.apache.solr.core.CoreContainer.create(CoreContainer.java:950)
   [junit4]   2> 	at org.apache.solr.handler.admin.CoreAdminOperation.lambda$static$0(CoreAdminOperation.java:91)
   [junit4]   2> 	at org.apache.solr.handler.admin.CoreAdminOperation.execute(CoreAdminOperation.java:384)
   [junit4]   2> 	at org.apache.solr.handler.admin.CoreAdminHandler$CallInfo.call(CoreAdminHandler.java:389)
   [junit4]   2> 	at org.apache.solr.handler.admin.CoreAdminHandler.handleRequestBody(CoreAdminHandler.java:174)
   [junit4]   2> 	at org.apache.solr.handler.RequestHandlerBase.handleRequest(RequestHandlerBase.java:177)
   [junit4]   2> 	at org.apache.solr.servlet.HttpSolrCall.handleAdmin(HttpSolrCall.java:736)
   [junit4]   2> 	at org.apache.solr.servlet.HttpSolrCall.handleAdminRequest(HttpSolrCall.java:717)
   [junit4]   2> 	at org.apache.solr.servlet.HttpSolrCall.call(HttpSolrCall.java:498)
   [junit4]   2> 	at org.apache.solr.servlet.SolrDispatchFilter.doFilter(SolrDispatchFilter.java:382)
   [junit4]   2> 	at org.apache.solr.servlet.SolrDispatchFilter.doFilter(SolrDispatchFilter.java:326)
   [junit4]   2> 	at org.eclipse.jetty.servlet.ServletHandler$CachedChain.doFilter(ServletHandler.java:1759)
   [junit4]   2> 	at org.apache.solr.client.solrj.embedded.JettySolrRunner$DebugFilter.doFilter(JettySolrRunner.java:139)
   [junit4]   2> 	at org.eclipse.jetty.servlet.ServletHandler$CachedChain.doFilter(ServletHandler.java:1759)
   [junit4]   2> 	at org.eclipse.jetty.servlet.ServletHandler.doHandle(ServletHandler.java:582)
   [junit4]   2> 	at org.eclipse.jetty.server.session.SessionHandler.doHandle(SessionHandler.java:224)
   [junit4]   2> 	at org.eclipse.jetty.server.handler.ContextHandler.doHandle(ContextHandler.java:1180)
   [junit4]   2> 	at org.eclipse.jetty.servlet.ServletHandler.doScope(ServletHandler.java:512)
   [junit4]   2> 	at org.eclipse.jetty.server.session.SessionHandler.doScope(SessionHandler.java:185)
   [junit4]   2> 	at org.eclipse.jetty.server.handler.ContextHandler.doScope(ContextHandler.java:1112)
   [junit4]   2> 	at org.eclipse.jetty.server.handler.ScopedHandler.handle(ScopedHandler.java:141)
   [junit4]   2> 	at org.eclipse.jetty.server.handler.gzip.GzipHandler.handle(GzipHandler.java:426)
   [junit4]   2> 	at org.eclipse.jetty.server.handler.HandlerWrapper.handle(HandlerWrapper.java:134)
   [junit4]   2> 	at org.eclipse.jetty.server.Server.handle(Server.java:534)
   [junit4]   2> 	at org.eclipse.jetty.server.HttpChannel.handle(HttpChannel.java:320)
   [junit4]   2> 	at org.eclipse.jetty.server.HttpConnection.onFillable(HttpConnection.java:251)
   [junit4]   2> 	at org.eclipse.jetty.io.AbstractConnection$ReadCallback.succeeded(AbstractConnection.java:283)
   [junit4]   2> 	at org.eclipse.jetty.io.FillInterest.fillable(FillInterest.java:108)
   [junit4]   2> 	at org.eclipse.jetty.io.ssl.SslConnection.onFillable(SslConnection.java:251)
   [junit4]   2> 	at org.eclipse.jetty.io.AbstractConnection$ReadCallback.succeeded(AbstractConnection.java:283)
   [junit4]   2> 	at org.eclipse.jetty.io.FillInterest.fillable(FillInterest.java:108)
   [junit4]   2> 	at org.eclipse.jetty.io.SelectChannelEndPoint$2.run(SelectChannelEndPoint.java:93)
   [junit4]   2> 	at org.eclipse.jetty.util.thread.strategy.ExecuteProduceConsume.executeProduceConsume(ExecuteProduceConsume.java:303)
   [junit4]   2> 	at org.eclipse.jetty.util.thread.strategy.ExecuteProduceConsume.produceConsume(ExecuteProduceConsume.java:148)
   [junit4]   2> 	at org.eclipse.jetty.util.thread.strategy.ExecuteProduceConsume.run(ExecuteProduceConsume.java:136)
   [junit4]   2> 	at org.eclipse.jetty.util.thread.QueuedThreadPool.runJob(QueuedThreadPool.java:671)
   [junit4]   2> 	at org.eclipse.jetty.util.thread.QueuedThreadPool$2.run(QueuedThreadPool.java:589)
   [junit4]   2> 	at java.lang.Thread.run(Thread.java:748)
   [junit4]   2> Caused by: org.apache.solr.common.SolrException: No registered leader was found after waiting for 1220000ms , collection: control_collection slice: shard1 saw state=null with live_nodes=[]
   [junit4]   2> 	at org.apache.solr.common.cloud.ZkStateReader.getLeaderRetry(ZkStateReader.java:771)
   [junit4]   2> 	at org.apache.solr.common.cloud.ZkStateReader.getLeaderUrl(ZkStateReader.java:736)
   [junit4]   2> 	at org.apache.solr.cloud.ZkController.getLeader(ZkController.java:1178)
   [junit4]   2> 	... 44 more
   [junit4]   2> 
   [junit4]   2> 1012890 INFO  (qtp9343557-2278) [n:127.0.0.1:46295_ c:control_collection s:shard1  x:control_collection_shard1_replica_n1] o.a.s.s.HttpSolrCall [admin] webapp=null path=/admin/cores params={qt=/admin/cores&collection.configName=conf1&newCollection=true&name=control_collection_shard1_replica_n1&action=CREATE&numShards=1&collection=control_collection&shard=shard1&wt=javabin&version=2&replicaType=NRT} status=0 QTime=630171
   [junit4]   2> 1012890 ERROR (TEST-TestDistribDocBasedVersion.test-seed#[627E21C664583B7F]) [    ] o.a.z.s.ZooKeeperServer ZKShutdownHandler is not registered, so ZooKeeper server won't take any action on ERROR or SHUTDOWN server state changes
   [junit4]   2> 1012890 INFO  (TEST-TestDistribDocBasedVersion.test-seed#[627E21C664583B7F]) [    ] o.a.s.c.ZkTestServer connecting to 127.0.0.1:41889 41889
   [junit4]   2> 1018006 INFO  (Thread-346) [    ] o.a.s.c.ZkTestServer connecting to 127.0.0.1:41889 41889
   [junit4]   2> 1018007 WARN  (Thread-346) [    ] o.a.s.c.ZkTestServer Watch limit violations: 
   [junit4]   2> Maximum concurrent create/delete watches above limit:
   [junit4]   2> 
   [junit4]   2> 	2	/solr/aliases.json
   [junit4]   2> 
   [junit4]   2> Maximum concurrent data watches above limit:
   [junit4]   2> 
   [junit4]   2> 	2	/solr/clusterstate.json
   [junit4]   2> 	2	/solr/clusterprops.json
   [junit4]   2> 
   [junit4]   2> Maximum concurrent children watches above limit:
   [junit4]   2> 
   [junit4]   2> 	2	/solr/live_nodes
   [junit4]   2> 	2	/solr/collections
   [junit4]   2> 
   [junit4]   2> NOTE: reproduce with: ant test  -Dtestcase=TestDistribDocBasedVersion -Dtests.method=test -Dtests.seed=627E21C664583B7F -Dtests.multiplier=3 -Dtests.slow=true -Dtests.locale=bg -Dtests.timezone=Africa/Lagos -Dtests.asserts=true -Dtests.file.encoding=US-ASCII
   [junit4] ERROR    636s J2 | TestDistribDocBasedVersion.test <<<
   [junit4]    > Throwable #1: org.apache.solr.client.solrj.SolrServerException: Timeout occured while waiting response from server at: https://127.0.0.1:46295
   [junit4]    > 	at __randomizedtesting.SeedInfo.seed([627E21C664583B7F:EA2A1E1CCAA45687]:0)
   [junit4]    > 	at org.apache.solr.client.solrj.impl.HttpSolrClient.executeMethod(HttpSolrClient.java:654)
   [junit4]    > 	at org.apache.solr.client.solrj.impl.HttpSolrClient.request(HttpSolrClient.java:255)
   [junit4]    > 	at org.apache.solr.client.solrj.impl.HttpSolrClient.request(HttpSolrClient.java:244)
   [junit4]    > 	at org.apache.solr.client.solrj.impl.LBHttpSolrClient.doRequest(LBHttpSolrClient.java:483)
   [junit4]    > 	at org.apache.solr.client.solrj.impl.LBHttpSolrClient.request(LBHttpSolrClient.java:413)
   [junit4]    > 	at org.apache.solr.client.solrj.impl.CloudSolrClient.sendRequest(CloudSolrClient.java:1104)
   [junit4]    > 	at org.apache.solr.client.solrj.impl.CloudSolrClient.requestWithRetryOnStaleState(CloudSolrClient.java:884)
   [junit4]    > 	at org.apache.solr.client.solrj.impl.CloudSolrClient.request(CloudSolrClient.java:817)
   [junit4]    > 	at org.apache.solr.client.solrj.SolrRequest.process(SolrRequest.java:194)
   [junit4]    > 	at org.apache.solr.client.solrj.SolrRequest.process(SolrRequest.java:211)
   [junit4]    > 	at org.apache.solr.cloud.AbstractFullDistribZkTestBase.createServers(AbstractFullDistribZkTestBase.java:320)
   [junit4]    > 	at org.apache.solr.BaseDistributedSearchTestCase$ShardsRepeatRule$ShardsFixedStatement.callStatement(BaseDistributedSearchTestCase.java:991)
   [junit4]    > 	at org.apache.solr.BaseDistributedSearchTestCase$ShardsRepeatRule$ShardsStatement.evaluate(BaseDistributedSearchTestCase.java:968)
   [junit4]    > 	at java.lang.Thread.run(Thread.java:748)
   [junit4]    > Caused by: java.net.SocketTimeoutException: Read timed out
   [junit4]    > 	at java.net.SocketInputStream.socketRead0(Native Method)
   [junit4]    > 	at java.net.SocketInputStream.socketRead(SocketInputStream.java:116)
   [junit4]    > 	at java.net.SocketInputStream.read(SocketInputStream.java:171)
   [junit4]    > 	at java.net.SocketInputStream.read(SocketInputStream.java:141)
   [junit4]    > 	at sun.security.ssl.InputRecord.readFully(InputRecord.java:465)
   [junit4]    > 	at sun.security.ssl.InputRecord.read(InputRecord.java:503)
   [junit4]    > 	at sun.security.ssl.SSLSocketImpl.readRecord(SSLSocketImpl.java:983)
   [junit4]    > 	at sun.security.ssl.SSLSocketImpl.readDataRecord(SSLSocketImpl.java:940)
   [junit4]    > 	at sun.security.ssl.AppInputStream.read(AppInputStream.java:105)
   [junit4]    > 	at org.apache.http.impl.io.SessionInputBufferImpl.streamRead(SessionInputBufferImpl.java:137)
   [junit4]    > 	at org.apache.http.impl.io.SessionInputBufferImpl.fillBuffer(SessionInputBufferImpl.java:153)
   [junit4]    > 	at org.apache.http.impl.io.SessionInputBufferImpl.readLine(SessionInputBufferImpl.java:282)
   [junit4]    > 	at org.apache.http.impl.conn.DefaultHttpResponseParser.parseHead(DefaultHttpResponseParser.java:138)
   [junit4]    > 	at org.apache.http.impl.conn.DefaultHttpResponseParser.parseHead(DefaultHttpResponseParser.java:56)
   [junit4]    > 	at org.apache.http.impl.io.AbstractMessageParser.parse(AbstractMessageParser.java:259)
   [junit4]    > 	at org.apache.http.impl.DefaultBHttpClientConnection.receiveResponseHeader(DefaultBHttpClientConnection.java:163)
   [junit4]    > 	at org.apache.http.impl.conn.CPoolProxy.receiveResponseHeader(CPoolProxy.java:165)
   [junit4]    > 	at org.apache.http.protocol.HttpRequestExecutor.doReceiveResponse(HttpRequestExecutor.java:273)
   [junit4]    > 	at org.apache.http.protocol.HttpRequestExecutor.execute(HttpRequestExecutor.java:125)
   [junit4]    > 	at org.apache.http.impl.execchain.MainClientExec.execute(MainClientExec.java:272)
   [junit4]    > 	at org.apache.http.impl.execchain.ProtocolExec.execute(ProtocolExec.java:185)
   [junit4]    > 	at org.apache.http.impl.execchain.RetryExec.execute(RetryExec.java:89)
   [junit4]    > 	at org.apache.http.impl.execchain.RedirectExec.execute(RedirectExec.java:111)
   [junit4]    > 	at org.apache.http.impl.client.InternalHttpClient.doExecute(InternalHttpClient.java:185)
   [junit4]    > 	at org.apache.http.impl.client.CloseableHttpClient.execute(CloseableHttpClient.java:83)
   [junit4]    > 	at org.apache.http.impl.client.CloseableHttpClient.execute(CloseableHttpClient.java:56)
   [junit4]    > 	at org.apache.solr.client.solrj.impl.HttpSolrClient.executeMethod(HttpSolrClient.java:542)
   [junit4]    > 	... 43 more
   [junit4]   2> NOTE: leaving temporary files on disk at: /home/jenkins/workspace/Lucene-Solr-7.x-Linux/solr/build/solr-core/test/J2/temp/solr.cloud.TestDistribDocBasedVersion_627E21C664583B7F-001
   [junit4]   2> NOTE: test params are: codec=CheapBastard, sim=RandomSimilarity(queryNorm=true): {}, locale=bg, timezone=Africa/Lagos
   [junit4]   2> NOTE: Linux 4.10.0-40-generic i386/Oracle Corporation 1.8.0_144 (32-bit)/cpus=8,threads=1,free=54820864,total=195878912
   [junit4]   2> NOTE: All tests run in this JVM: [RuleEngineTest, UUIDUpdateProcessorFallbackTest, TestCloudManagedSchema, TestLFUCache, CdcrUpdateLogTest, WordBreakSolrSpellCheckerTest, TestLMJelinekMercerSimilarityFactory, TestExportWriter, DocExpirationUpdateProcessorFactoryTest, TestTrieFacet, TestExtendedDismaxParser, ZkNodePropsTest, TestRealTimeGet, HighlighterMaxOffsetTest, TestSegmentSorting, DirectSolrConnectionTest, IndexSchemaTest, ReplicationFactorTest, LeaderElectionTest, TestTrie, EchoParamsTest, AtomicUpdateProcessorFactoryTest, CSVRequestHandlerTest, TestPolicyCloud, CollectionReloadTest, TestIndexSearcher, TestPullReplica, IndexBasedSpellCheckerTest, TestLMDirichletSimilarityFactory, TestSolrXml, TestQueryTypes, TestNumericRangeQuery64, TestNamedUpdateProcessors, TestDistribDocBasedVersion]
   [junit4] Completed [254/764 (1!)] on J2 in 635.97s, 1 test, 1 error <<< FAILURES!

[...truncated 933 lines...]
   [junit4] Suite: org.apache.solr.cloud.ChaosMonkeySafeLeaderWithPullReplicasTest
   [junit4]   2> Creating dataDir: /home/jenkins/workspace/Lucene-Solr-7.x-Linux/solr/build/solr-core/test/J1/temp/solr.cloud.ChaosMonkeySafeLeaderWithPullReplicasTest_627E21C664583B7F-001/init-core-data-001
   [junit4]   2> 1761265 WARN  (SUITE-ChaosMonkeySafeLeaderWithPullReplicasTest-seed#[627E21C664583B7F]-worker) [    ] o.a.s.SolrTestCaseJ4 startTrackingSearchers: numOpens=2 numCloses=2
   [junit4]   2> 1761265 INFO  (SUITE-ChaosMonkeySafeLeaderWithPullReplicasTest-seed#[627E21C664583B7F]-worker) [    ] o.a.s.SolrTestCaseJ4 Using PointFields (NUMERIC_POINTS_SYSPROP=true) w/NUMERIC_DOCVALUES_SYSPROP=true
   [junit4]   2> 1761266 INFO  (SUITE-ChaosMonkeySafeLeaderWithPullReplicasTest-seed#[627E21C664583B7F]-worker) [    ] o.a.s.SolrTestCaseJ4 Randomized ssl (false) and clientAuth (true) via: @org.apache.solr.util.RandomizeSSL(reason=, ssl=NaN, value=NaN, clientAuth=NaN)
   [junit4]   2> 1761266 INFO  (SUITE-ChaosMonkeySafeLeaderWithPullReplicasTest-seed#[627E21C664583B7F]-worker) [    ] o.a.s.SolrTestCaseJ4 SecureRandom sanity checks: test.solr.allowed.securerandom=null & java.security.egd=file:/dev/./urandom
   [junit4]   2> 1761266 INFO  (SUITE-ChaosMonkeySafeLeaderWithPullReplicasTest-seed#[627E21C664583B7F]-worker) [    ] o.a.s.BaseDistributedSearchTestCase Setting hostContext system property: /ofs/
   [junit4]   2> 1761266 INFO  (TEST-ChaosMonkeySafeLeaderWithPullReplicasTest.test-seed#[627E21C664583B7F]) [    ] o.a.s.c.ChaosMonkeySafeLeaderWithPullReplicasTest Starting ChaosMonkey test with 1 shards and 3 nodes
   [junit4]   2> 1761270 INFO  (TEST-ChaosMonkeySafeLeaderWithPullReplicasTest.test-seed#[627E21C664583B7F]) [    ] o.a.s.c.ZkTestServer STARTING ZK TEST SERVER
   [junit4]   2> 1761270 INFO  (Thread-5814) [    ] o.a.s.c.ZkTestServer client port:0.0.0.0/0.0.0.0:0
   [junit4]   2> 1761270 INFO  (Thread-5814) [    ] o.a.s.c.ZkTestServer Starting server
   [junit4]   2> 1761272 ERROR (Thread-5814) [    ] o.a.z.s.ZooKeeperServer ZKShutdownHandler is not registered, so ZooKeeper server won't take any action on ERROR or SHUTDOWN server state changes
   [junit4]   2> 1761370 INFO  (TEST-ChaosMonkeySafeLeaderWithPullReplicasTest.test-seed#[627E21C664583B7F]) [    ] o.a.s.c.ZkTestServer start zk server on port:44305
   [junit4]   2> 1761376 INFO  (zkConnectionManagerCallback-3044-thread-1) [    ] o.a.s.c.c.ConnectionManager zkClient has connected
   [junit4]   2> 1761384 INFO  (zkConnectionManagerCallback-3046-thread-1) [    ] o.a.s.c.c.ConnectionManager zkClient has connected
   [junit4]   2> 1761394 INFO  (TEST-ChaosMonkeySafeLeaderWithPullReplicasTest.test-seed#[627E21C664583B7F]) [    ] o.a.s.c.AbstractZkTestCase put /home/jenkins/workspace/Lucene-Solr-7.x-Linux/solr/core/src/test-files/solr/collection1/conf/solrconfig-tlog.xml to /configs/conf1/solrconfig.xml
   [junit4]   2> 1761396 INFO  (TEST-ChaosMonkeySafeLeaderWithPullReplicasTest.test-seed#[627E21C664583B7F]) [    ] o.a.s.c.AbstractZkTestCase put /home/jenkins/workspace/Lucene-Solr-7.x-Linux/solr/core/src/test-files/solr/collection1/conf/schema15.xml to /configs/conf1/schema.xml
   [junit4]   2> 1761398 INFO  (TEST-ChaosMonkeySafeLeaderWithPullReplicasTest.test-seed#[627E21C664583B7F]) [    ] o.a.s.c.AbstractZkTestCase put /home/jenkins/workspace/Lucene-Solr-7.x-Linux/solr/core/src/test-files/solr/collection1/conf/solrconfig.snippet.randomindexconfig.xml to /configs/conf1/solrconfig.snippet.randomindexconfig.xml
   [junit4]   2> 1761400 INFO  (TEST-ChaosMonkeySafeLeaderWithPullReplicasTest.test-seed#[627E21C664583B7F]) [    ] o.a.s.c.AbstractZkTestCase put /home/jenkins/workspace/Lucene-Solr-7.x-Linux/solr/core/src/test-files/solr/collection1/conf/stopwords.txt to /configs/conf1/stopwords.txt
   [junit4]   2> 1761401 INFO  (TEST-ChaosMonkeySafeLeaderWithPullReplicasTest.test-seed#[627E21C664583B7F]) [    ] o.a.s.c.AbstractZkTestCase put /home/jenkins/workspace/Lucene-Solr-7.x-Linux/solr/core/src/test-files/solr/collection1/conf/protwords.txt to /configs/conf1/protwords.txt
   [junit4]   2> 1761403 INFO  (TEST-ChaosMonkeySafeLeaderWithPullReplicasTest.test-seed#[627E21C664583B7F]) [    ] o.a.s.c.AbstractZkTestCase put /home/jenkins/workspace/Lucene-Solr-7.x-Linux/solr/core/src/test-files/solr/collection1/conf/currency.xml to /configs/conf1/currency.xml
   [junit4]   2> 1761405 INFO  (TEST-ChaosMonkeySafeLeaderWithPullReplicasTest.test-seed#[627E21C664583B7F]) [    ] o.a.s.c.AbstractZkTestCase put /home/jenkins/workspace/Lucene-Solr-7.x-Linux/solr/core/src/test-files/solr/collection1/conf/enumsConfig.xml to /configs/conf1/enumsConfig.xml
   [junit4]   2> 1761407 INFO  (TEST-ChaosMonkeySafeLeaderWithPullReplicasTest.test-seed#[627E21C664583B7F]) [    ] o.a.s.c.AbstractZkTestCase put /home/jenkins/workspace/Lucene-Solr-7.x-Linux/solr/core/src/test-files/solr/collection1/conf/open-exchange-rates.json to /configs/conf1/open-exchange-rates.json
   [junit4]   2> 1761409 INFO  (TEST-ChaosMonkeySafeLeaderWithPullReplicasTest.test-seed#[627E21C664583B7F]) [    ] o.a.s.c.AbstractZkTestCase put /home/jenkins/workspace/Lucene-Solr-7.x-Linux/solr/core/src/test-files/solr/collection1/conf/mapping-ISOLatin1Accent.txt to /configs/conf1/mapping-ISOLatin1Accent.txt
   [junit4]   2> 1761411 INFO  (TEST-ChaosMonkeySafeLeaderWithPullReplicasTest.test-seed#[627E21C664583B7F]) [    ] o.a.s.c.AbstractZkTestCase put /home/jenkins/workspace/Lucene-Solr-7.x-Linux/solr/core/src/test-files/solr/collection1/conf/old_synonyms.txt to /configs/conf1/old_synonyms.txt
   [junit4]   2> 1761411 INFO  (TEST-ChaosMonkeySafeLeaderWithPullReplicasTest.test-seed#[627E21C664583B7F]) [    ] o.a.s.c.AbstractZkTestCase put /home/jenkins/workspace/Lucene-Solr-7.x-Linux/solr/core/src/test-files/solr/collection1/conf/synonyms.txt to /configs/conf1/synonyms.txt
   [junit4]   2> 1761411 INFO  (TEST-ChaosMonkeySafeLeaderWithPullReplicasTest.test-seed#[627E21C664583B7F]) [    ] o.a.s.c.AbstractFullDistribZkTestBase Will use NRT replicas unless explicitly asked otherwise
   [junit4]   2> 1761483 INFO  (TEST-ChaosMonkeySafeLeaderWithPullReplicasTest.test-seed#[627E21C664583B7F]) [    ] o.e.j.s.Server jetty-9.3.20.v20170531
   [junit4]   2> 1761483 INFO  (TEST-ChaosMonkeySafeLeaderWithPullReplicasTest.test-seed#[627E21C664583B7F]) [    ] o.e.j.s.h.ContextHandler Started o.e.j.s.ServletContextHandler@9bff00{/ofs,null,AVAILABLE}
   [junit4]   2> 1761485 INFO  (TEST-ChaosMonkeySafeLeaderWithPullReplicasTest.test-seed#[627E21C664583B7F]) [    ] o.e.j.s.AbstractConnector Started ServerConnector@17ba23e{HTTP/1.1,[http/1.1]}{127.0.0.1:?????}
   [junit4]   2> 1761485 INFO  (TEST-ChaosMonkeySafeLeaderWithPullReplicasTest.test-seed#[627E21C664583B7F]) [    ] o.e.j.s.Server Started @???????ms
   [junit4]   2> 1761485 INFO  (TEST-ChaosMonkeySafeLeaderWithPullReplicasTest.test-seed#[627E21C664583B7F]) [    ] o.a.s.c.s.e.JettySolrRunner Jetty properties: {solr.data.dir=/home/jenkins/workspace/Lucene-Solr-7.x-Linux/solr/build/solr-core/test/J1/temp/solr.cloud.ChaosMonkeySafeLeaderWithPullReplicasTest_627E21C664583B7F-001/tempDir-001/control/data, hostContext=/ofs, hostPort=41615, coreRootDirectory=/home/jenkins/workspace/Lucene-Solr-7.x-Linux/solr/build/solr-core/test/J1/../../../../../../../../../home/jenkins/workspace/Lucene-Solr-7.x-Linux/solr/build/solr-core/test/J1/temp/solr.cloud.ChaosMonkeySafeLeaderWithPullReplicasTest_627E21C664583B7F-001/control-001/cores}
   [junit4]   2> 1761485 ERROR (TEST-ChaosMonkeySafeLeaderWithPullReplicasTest.test-seed#[627E21C664583B7F]) [    ] o.a.s.u.StartupLoggingUtils Missing Java Option solr.log.dir. Logging may be missing or incomplete.
   [junit4]   2> 1761485 INFO  (TEST-ChaosMonkeySafeLeaderWithPullReplicasTest.test-seed#[627E21C664583B7F]) [    ] o.a.s.s.SolrDispatchFilter  ___      _       Welcome to Apache Solr? version 7.3.0
   [junit4]   2> 1761485 INFO  (TEST-ChaosMonkeySafeLeaderWithPullReplicasTest.test-seed#[627E21C664583B7F]) [    ] o.a.s.s.SolrDispatchFilter / __| ___| |_ _   Starting in cloud mode on port null
   [junit4]   2> 1761485 INFO  (TEST-ChaosMonkeySafeLeaderWithPullReplicasTest.test-seed#[627E21C664583B7F]) [    ] o.a.s.s.SolrDispatchFilter \__ \/ _ \ | '_|  Install dir: null
   [junit4]   2> 1761485 INFO  (TEST-ChaosMonkeySafeLeaderWithPullReplicasTest.test-seed#[627E21C664583B7F]) [    ] o.a.s.s.SolrDispatchFilter |___/\___/_|_|    Start time: 2018-01-03T05:41:39.555Z
   [junit4]   2> 1761487 INFO  (zkConnectionManagerCallback-3048-thread-1) [    ] o.a.s.c.c.ConnectionManager zkClient has connected
   [junit4]   2> 1761488 INFO  (TEST-ChaosMonkeySafeLeaderWithPullReplicasTest.test-seed#[627E21C664583B7F]) [    ] o.a.s.s.SolrDispatchFilter Loading solr.xml from SolrHome (not found in ZooKeeper)
   [junit4]   2> 1761488 INFO  (TEST-ChaosMonkeySafeLeaderWithPullReplicasTest.test-seed#[627E21C664583B7F]) [    ] o.a.s.c.SolrXmlConfig Loading container configuration from /home/jenkins/workspace/Lucene-Solr-7.x-Linux/solr/build/solr-core/test/J1/temp/solr.cloud.ChaosMonkeySafeLeaderWithPullReplicasTest_627E21C664583B7F-001/control-001/solr.xml
   [junit4]   2> 1761494 INFO  (TEST-ChaosMonkeySafeLeaderWithPullReplicasTest.test-seed#[627E21C664583B7F]) [    ] o.a.s.c.SolrXmlConfig Configuration parameter autoReplicaFailoverWorkLoopDelay is ignored
   [junit4]   2> 1761494 INFO  (TEST-ChaosMonkeySafeLeaderWithPullReplicasTest.test-seed#[627E21C664583B7F]) [    ] o.a.s.c.SolrXmlConfig Configuration parameter autoReplicaFailoverBadNodeExpiration is ignored
   [junit4]   2> 1761496 INFO  (TEST-ChaosMonkeySafeLeaderWithPullReplicasTest.test-seed#[627E21C664583B7F]) [    ] o.a.s.c.SolrXmlConfig MBean server found: com.sun.jmx.mbeanserver.JmxMBeanServer@5e0c15, but no JMX reporters were configured - adding default JMX reporter.
   [junit4]   2> 1761498 INFO  (TEST-ChaosMonkeySafeLeaderWithPullReplicasTest.test-seed#[627E21C664583B7F]) [    ] o.a.s.c.ZkContainer Zookeeper client=127.0.0.1:44305/solr
   [junit4]   2> 1761499 INFO  (zkConnectionManagerCallback-3052-thread-1) [    ] o.a.s.c.c.ConnectionManager zkClient has connected
   [junit4]   2> 1761501 INFO  (zkConnectionManagerCallback-3054-thread-1-processing-n:127.0.0.1:41615_ofs) [n:127.0.0.1:41615_ofs    ] o.a.s.c.c.ConnectionManager zkClient has connected
   [junit4]   2> 1761533 INFO  (TEST-ChaosMonkeySafeLeaderWithPullReplicasTest.test-seed#[627E21C664583B7F]) [n:127.0.0.1:41615_ofs    ] o.a.s.c.Overseer Overseer (id=null) closing
   [junit4]   2> 1761533 INFO  (TEST-ChaosMonkeySafeLeaderWithPullReplicasTest.test-seed#[627E21C664583B7F]) [n:127.0.0.1:41615_ofs    ] o.a.s.c.OverseerElectionContext I am going to be the leader 127.0.0.1:41615_ofs
   [junit4]   2> 1761534 INFO  (TEST-ChaosMonkeySafeLeaderWithPullReplicasTest.test-seed#[627E21C664583B7F]) [n:127.0.0.1:41615_ofs    ] o.a.s.c.Overseer Overseer (id=99284293998411780-127.0.0.1:41615_ofs-n_0000000000) starting
   [junit4]   2> 1761538 INFO  (TEST-ChaosMonkeySafeLeaderWithPullReplicasTest.test-seed#[627E21C664583B7F]) [n:127.0.0.1:41615_ofs    ] o.a.s.c.ZkController Register node as live in ZooKeeper:/live_nodes/127.0.0.1:41615_ofs
   [junit4]   2> 1761542 INFO  (zkCallback-3053-thread-1-processing-n:127.0.0.1:41615_ofs) [n:127.0.0.1:41615_ofs    ] o.a.s.c.c.ZkStateReader Updated live nodes from ZooKeeper... (0) -> (1)
   [junit4]   2> 1761670 INFO  (TEST-ChaosMonkeySafeLeaderWithPullReplicasTest.test-seed#[627E21C664583B7F]) [n:127.0.0.1:41615_ofs    ] o.a.s.m.r.SolrJmxReporter JMX monitoring for 'solr.node' (registry 'solr.node') enabled at server: com.sun.jmx.mbeanserver.JmxMBeanServer@5e0c15
   [junit4]   2> 1761692 INFO  (TEST-ChaosMonkeySafeLeaderWithPullReplicasTest.test-seed#[627E21C664583B7F]) [n:127.0.0.1:41615_ofs    ] o.a.s.m.r.SolrJmxReporter JMX monitoring for 'solr.jvm' (registry 'solr.jvm') enabled at server: com.sun.jmx.mbeanserver.JmxMBeanServer@5e0c15
   [junit4]   2> 1761693 INFO  (TEST-ChaosMonkeySafeLeaderWithPullReplicasTest.test-seed#[627E21C664583B7F]) [n:127.0.0.1:41615_ofs    ] o.a.s.m.r.SolrJmxReporter JMX monitoring for 'solr.jetty' (registry 'solr.jetty') enabled at server: com.sun.jmx.mbeanserver.JmxMBeanServer@5e0c15
   [junit4]   2> 1761694 INFO  (TEST-ChaosMonkeySafeLeaderWithPullReplicasTest.test-seed#[627E21C664583B7F]) [n:127.0.0.1:41615_ofs    ] o.a.s.c.CorePropertiesLocator Found 0 core definitions underneath /home/jenkins/workspace/Lucene-Solr-7.x-Linux/solr/build/solr-core/test/J1/../../../../../../../../../home/jenkins/workspace/Lu

[...truncated too long message...]

	at org.apache.solr.cloud.ZkController.getLeader(ZkController.java:1178)
   [junit4]   2> 	... 44 more
   [junit4]   2> 
   [junit4]   2> 3231824 INFO  (qtp2742096-22944) [n:127.0.0.1:41313_solr c:managed_coll s:shard1 r:core_node3 x:managed_coll_shard1_replica_n1] o.a.s.s.HttpSolrCall [admin] webapp=null path=/admin/cores params={qt=/admin/cores&coreNodeName=core_node3&collection.configName=cloud-managed&newCollection=true&name=managed_coll_shard1_replica_n1&action=CREATE&numShards=2&collection=managed_coll&shard=shard1&wt=javabin&version=2&replicaType=NRT} status=0 QTime=209747
   [junit4]   2> 3231825 ERROR (SUITE-ManagedSchemaRoundRobinCloudTest-seed#[627E21C664583B7F]-worker) [    ] o.a.z.s.ZooKeeperServer ZKShutdownHandler is not registered, so ZooKeeper server won't take any action on ERROR or SHUTDOWN server state changes
   [junit4]   2> 3231827 INFO  (SUITE-ManagedSchemaRoundRobinCloudTest-seed#[627E21C664583B7F]-worker) [    ] o.a.s.c.ZkTestServer connecting to 127.0.0.1:41267 41267
   [junit4]   2> 3237238 INFO  (Thread-7215) [    ] o.a.s.c.ZkTestServer connecting to 127.0.0.1:41267 41267
   [junit4]   2> 3237239 WARN  (Thread-7215) [    ] o.a.s.c.ZkTestServer Watch limit violations: 
   [junit4]   2> Maximum concurrent create/delete watches above limit:
   [junit4]   2> 
   [junit4]   2> 	3	/solr/aliases.json
   [junit4]   2> 	2	/solr/configs/cloud-managed
   [junit4]   2> 	2	/solr/security.json
   [junit4]   2> 	2	/solr/configs/cloud-managed/managed-schema
   [junit4]   2> 
   [junit4]   2> Maximum concurrent data watches above limit:
   [junit4]   2> 
   [junit4]   2> 	6	/solr/collections/managed_coll/state.json
   [junit4]   2> 	3	/solr/clusterstate.json
   [junit4]   2> 	3	/solr/clusterprops.json
   [junit4]   2> 
   [junit4]   2> Maximum concurrent children watches above limit:
   [junit4]   2> 
   [junit4]   2> 	3	/solr/live_nodes
   [junit4]   2> 	3	/solr/collections
   [junit4]   2> 
   [junit4]   2> 3237240 INFO  (SUITE-ManagedSchemaRoundRobinCloudTest-seed#[627E21C664583B7F]-worker) [    ] o.a.s.SolrTestCaseJ4 ------------------------------------------------------- Done waiting for tracked resources to be released
   [junit4]   2> NOTE: test params are: codec=Asserting(Lucene70): {}, docValues:{}, maxPointsInLeafNode=414, maxMBSortInHeap=7.976452469000723, sim=RandomSimilarity(queryNorm=true): {}, locale=en-ZA, timezone=Asia/Damascus
   [junit4]   2> NOTE: Linux 4.10.0-40-generic i386/Oracle Corporation 1.8.0_144 (32-bit)/cpus=8,threads=1,free=90414032,total=409894912
   [junit4]   2> NOTE: All tests run in this JVM: [TestApiFramework, ChangedSchemaMergeTest, TestSolrConfigHandler, SolrCLIZkUtilsTest, PrimUtilsTest, TestRandomCollapseQParserPlugin, ConvertedLegacyTest, TestFieldTypeResource, TestSolrQueryResponse, BufferStoreTest, HdfsUnloadDistributedZkTest, ParsingFieldUpdateProcessorsTest, PeerSyncWithIndexFingerprintCachingTest, SchemaVersionSpecificBehaviorTest, TestRawResponseWriter, BasicAuthStandaloneTest, TestExecutePlanAction, PingRequestHandlerTest, TestCursorMarkWithoutUniqueKey, DocValuesMultiTest, CdcrReplicationHandlerTest, TestSimpleTrackingShardHandler, AddReplicaTest, DocumentAnalysisRequestHandlerTest, TestPKIAuthenticationPlugin, TestLazyCores, TestJsonFacets, TestSlowCompositeReaderWrapper, HdfsAutoAddReplicasIntegrationTest, SolrJmxReporterCloudTest, OverriddenZkACLAndCredentialsProvidersTest, SparseHLLTest, TlogReplayBufferedWhileIndexingTest, TestSchemaManager, TestRTGBase, SolrCloudReportersTest, TestReplicaProperties, DistributedQueryComponentCustomSortTest, OpenExchangeRatesOrgProviderTest, DistributedFacetPivotSmallAdvancedTest, TestBulkSchemaConcurrent, HdfsBasicDistributedZk2Test, TestFieldCacheWithThreads, TestBackupRepositoryFactory, TestCloudNestedDocsSort, ImplicitSnitchTest, SolrRequestParserTest, TestXmlQParserPlugin, TestOmitPositions, TestDelegationWithHadoopAuth, TestDocSet, TestHttpShardHandlerFactory, SimpleMLTQParserTest, SuggesterFSTTest, CloudExitableDirectoryReaderTest, TestExceedMaxTermLength, TestSubQueryTransformerCrossCore, ReplaceNodeTest, TestHdfsBackupRestoreCore, TestCollationFieldDocValues, LukeRequestHandlerTest, TestDeleteCollectionOnDownNodes, TemplateUpdateProcessorTest, TestFieldCollectionResource, SignatureUpdateProcessorFactoryTest, AddSchemaFieldsUpdateProcessorFactoryTest, TestSolr4Spatial, TestFastLRUCache, CircularListTest, LegacyCloudClusterPropTest, CursorMarkTest, TestSizeLimitedDistributedMap, NotRequiredUniqueKeyTest, ClassificationUpdateProcessorFactoryTest, TestLuceneMatchVersion, PolyFieldTest, TestJmxIntegration, TestLeaderElectionZkExpiry, TestCollapseQParserPlugin, ZkSolrClientTest, TestDocumentBuilder, TestScoreJoinQPScore, TestBlendedInfixSuggestions, ShardRoutingTest, ConcurrentDeleteAndCreateCollectionTest, PeerSyncReplicationTest, TestWriterPerf, TestEmbeddedSolrServerAdminHandler, TestConfigSetProperties, TestPrepRecovery, TestFaceting, SpellingQueryConverterTest, FacetPivotSmallTest, BigEndianAscendingWordSerializerTest, HttpPartitionTest, DistribDocExpirationUpdateProcessorTest, TestRecoveryHdfs, TestStressInPlaceUpdates, DebugComponentTest, TestGraphMLResponseWriter, TestCustomStream, TestCollectionAPI, TestNumericRangeQuery32, TestManagedSynonymGraphFilterFactory, CdcrBidirectionalTest, TestReloadAndDeleteDocs, LeaderFailureAfterFreshStartTest, SubstringBytesRefFilterTest, SecurityConfHandlerTest, MoveReplicaHDFSFailoverTest, MoreLikeThisHandlerTest, TestDefaultStatsCache, NumberUtilsTest, BlockJoinFacetRandomTest, ZkCLITest, TestNodeAddedTrigger, PreAnalyzedFieldTest, JavabinLoaderTest, CloneFieldUpdateProcessorFactoryTest, DOMUtilTest, SolrIndexConfigTest, TestLegacyNumericUtils, ExitableDirectoryReaderTest, ChaosMonkeySafeLeaderTest, SyncSliceTest, OpenCloseCoreStressTest, LeaderElectionIntegrationTest, FullSolrCloudDistribCmdsTest, ClusterStateUpdateTest, TestRandomFaceting, ShardRoutingCustomTest, TestDistributedGrouping, DistributedSpellCheckComponentTest, TermVectorComponentDistributedTest, TestStressReorder, TestStressVersions, TestRangeQuery, PeerSyncTest, BasicFunctionalityTest, DirectUpdateHandlerTest, HighlighterTest, SoftAutoCommitTest, TestSystemIdResolver, ClusterStateTest, TestSolrJ, TestLRUCache, TestUtils, SliceStateTest, DistributedMLTComponentTest, CursorPagingTest, DistributedIntervalFacetingTest, TestHighlightDedupGrouping, TestTolerantSearch, TestLuceneIndexBackCompat, TestEmbeddedSolrServerConstructors, TestEmbeddedSolrServerSchemaAPI, TestJettySolrRunner, AliasIntegrationTest, AssignTest, AsyncCallRequestStatusResponseTest, ChaosMonkeySafeLeaderWithPullReplicasTest, TestLocalFSCloudBackupRestore, TestRandomFlRTGCloud, TestRequestStatusCollectionAPI, TestSolrCloudWithKerberosAlt, TestTolerantUpdateProcessorCloud, ZkFailoverTest, NodeAddedTriggerTest, SystemLogListenerTest, TestComputePlanAction, TestNodeLostTrigger, TestSimDistributedQueue, BaseCdcrDistributedZkTest, CdcrBootstrapTest, HdfsSyncSliceTest, HdfsThreadLeakTest, HdfsTlogReplayBufferedWhileIndexingTest, StressHdfsTest, BlobRepositoryCloudTest, CachingDirectoryFactoryTest, DirectoryFactoryTest, TestDynamicLoading, TestSolrConfigHandlerConcurrent, TestSystemCollAutoCreate, DistributedQueryComponentOptimizationTest, SuggestComponentTest, TestLegacyFieldReuse, TestLegacyTerms, TestMultiValuedNumericRangeQuery, SolrCoreMetricManagerTest, SolrGangliaReporterTest, SolrShardReporterTest, TestStreamBody, TestMacroExpander, TestMacros, JSONWriterTest, TestCustomDocTransformer, TestJavabinTupleStreamParser, TestRetrieveFieldsOptimizer, TestChildDocTransformer, TestSubQueryTransformer, TestManagedResourceStorage, TestCopyFieldCollectionResource, TestDynamicFieldCollectionResource, TestDynamicFieldResource, TestFieldTypeCollectionResource, TestSchemaSimilarityResource, TestSchemaVersionResource, TestSerializedLuceneMatchVersion, TestUniqueKeyFieldResource, TestManagedStopFilterFactory, BadCopyFieldTest, BooleanFieldTest, CurrencyFieldTypeTest, DocValuesMissingTest, ManagedSchemaRoundRobinCloudTest]
   [junit4]   2> NOTE: reproduce with: ant test  -Dtestcase=ManagedSchemaRoundRobinCloudTest -Dtests.seed=627E21C664583B7F -Dtests.multiplier=3 -Dtests.slow=true -Dtests.locale=en-ZA -Dtests.timezone=Asia/Damascus -Dtests.asserts=true -Dtests.file.encoding=US-ASCII
   [junit4] ERROR   0.00s J1 | ManagedSchemaRoundRobinCloudTest (suite) <<<
   [junit4]    > Throwable #1: org.apache.solr.client.solrj.impl.HttpSolrClient$RemoteSolrException: Error from server at https://127.0.0.1:41313/solr: create the collection time out:180s
   [junit4]    > 	at __randomizedtesting.SeedInfo.seed([627E21C664583B7F]:0)
   [junit4]    > 	at org.apache.solr.client.solrj.impl.HttpSolrClient.executeMethod(HttpSolrClient.java:643)
   [junit4]    > 	at org.apache.solr.client.solrj.impl.HttpSolrClient.request(HttpSolrClient.java:255)
   [junit4]    > 	at org.apache.solr.client.solrj.impl.HttpSolrClient.request(HttpSolrClient.java:244)
   [junit4]    > 	at org.apache.solr.client.solrj.impl.LBHttpSolrClient.doRequest(LBHttpSolrClient.java:483)
   [junit4]    > 	at org.apache.solr.client.solrj.impl.LBHttpSolrClient.request(LBHttpSolrClient.java:413)
   [junit4]    > 	at org.apache.solr.client.solrj.impl.CloudSolrClient.sendRequest(CloudSolrClient.java:1104)
   [junit4]    > 	at org.apache.solr.client.solrj.impl.CloudSolrClient.requestWithRetryOnStaleState(CloudSolrClient.java:884)
   [junit4]    > 	at org.apache.solr.client.solrj.impl.CloudSolrClient.request(CloudSolrClient.java:817)
   [junit4]    > 	at org.apache.solr.client.solrj.SolrRequest.process(SolrRequest.java:194)
   [junit4]    > 	at org.apache.solr.client.solrj.SolrRequest.process(SolrRequest.java:211)
   [junit4]    > 	at org.apache.solr.schema.ManagedSchemaRoundRobinCloudTest.setupCluster(ManagedSchemaRoundRobinCloudTest.java:50)
   [junit4]    > 	at java.lang.Thread.run(Thread.java:748)
   [junit4] Completed [748/764 (3!)] on J1 in 216.20s, 0 tests, 1 error <<< FAILURES!

[...truncated 43924 lines...]

Mime
View raw message