lucene-dev mailing list archives

Site index · List index
Message view « Date » · « Thread »
Top « Date » · « Thread »
From Policeman Jenkins Server <jenk...@thetaphi.de>
Subject [JENKINS] Lucene-Solr-master-MacOSX (64bit/jdk1.8.0) - Build # 4376 - Unstable!
Date Tue, 09 Jan 2018 16:21:13 GMT
Build: https://jenkins.thetaphi.de/job/Lucene-Solr-master-MacOSX/4376/
Java: 64bit/jdk1.8.0 -XX:+UseCompressedOops -XX:+UseConcMarkSweepGC

9 tests failed.
FAILED:  org.apache.solr.client.solrj.request.SchemaTest.deletingAFieldTypeThatDoesntExistInTheSchemaShouldFail

Error Message:
Error from server at http://127.0.0.1:56019/solr/collection1: error processing commands

Stack Trace:
org.apache.solr.client.solrj.impl.HttpSolrClient$RemoteExecutionException: Error from server at http://127.0.0.1:56019/solr/collection1: error processing commands
	at __randomizedtesting.SeedInfo.seed([32C8BE505D3A03C:781ABA3F4CC98CE9]:0)
	at org.apache.solr.client.solrj.impl.HttpSolrClient$RemoteExecutionException.create(HttpSolrClient.java:829)
	at org.apache.solr.client.solrj.impl.HttpSolrClient.executeMethod(HttpSolrClient.java:620)
	at org.apache.solr.client.solrj.impl.HttpSolrClient.request(HttpSolrClient.java:255)
	at org.apache.solr.client.solrj.impl.HttpSolrClient.request(HttpSolrClient.java:244)
	at org.apache.solr.client.solrj.SolrRequest.process(SolrRequest.java:194)
	at org.apache.solr.client.solrj.SolrRequest.process(SolrRequest.java:211)
	at org.apache.solr.client.solrj.request.SchemaTest.deletingAFieldTypeThatDoesntExistInTheSchemaShouldFail(SchemaTest.java:694)
	at sun.reflect.NativeMethodAccessorImpl.invoke0(Native Method)
	at sun.reflect.NativeMethodAccessorImpl.invoke(NativeMethodAccessorImpl.java:62)
	at sun.reflect.DelegatingMethodAccessorImpl.invoke(DelegatingMethodAccessorImpl.java:43)
	at java.lang.reflect.Method.invoke(Method.java:498)
	at com.carrotsearch.randomizedtesting.RandomizedRunner.invoke(RandomizedRunner.java:1737)
	at com.carrotsearch.randomizedtesting.RandomizedRunner$8.evaluate(RandomizedRunner.java:934)
	at com.carrotsearch.randomizedtesting.RandomizedRunner$9.evaluate(RandomizedRunner.java:970)
	at com.carrotsearch.randomizedtesting.RandomizedRunner$10.evaluate(RandomizedRunner.java:984)
	at com.carrotsearch.randomizedtesting.rules.SystemPropertiesRestoreRule$1.evaluate(SystemPropertiesRestoreRule.java:57)
	at org.apache.lucene.util.TestRuleSetupTeardownChained$1.evaluate(TestRuleSetupTeardownChained.java:49)
	at org.apache.lucene.util.AbstractBeforeAfterRule$1.evaluate(AbstractBeforeAfterRule.java:45)
	at org.apache.lucene.util.TestRuleThreadAndTestName$1.evaluate(TestRuleThreadAndTestName.java:48)
	at org.apache.lucene.util.TestRuleIgnoreAfterMaxFailures$1.evaluate(TestRuleIgnoreAfterMaxFailures.java:64)
	at org.apache.lucene.util.TestRuleMarkFailure$1.evaluate(TestRuleMarkFailure.java:47)
	at com.carrotsearch.randomizedtesting.rules.StatementAdapter.evaluate(StatementAdapter.java:36)
	at com.carrotsearch.randomizedtesting.ThreadLeakControl$StatementRunner.run(ThreadLeakControl.java:368)
	at com.carrotsearch.randomizedtesting.ThreadLeakControl.forkTimeoutingTask(ThreadLeakControl.java:817)
	at com.carrotsearch.randomizedtesting.ThreadLeakControl$3.evaluate(ThreadLeakControl.java:468)
	at com.carrotsearch.randomizedtesting.RandomizedRunner.runSingleTest(RandomizedRunner.java:943)
	at com.carrotsearch.randomizedtesting.RandomizedRunner$5.evaluate(RandomizedRunner.java:829)
	at com.carrotsearch.randomizedtesting.RandomizedRunner$6.evaluate(RandomizedRunner.java:879)
	at com.carrotsearch.randomizedtesting.RandomizedRunner$7.evaluate(RandomizedRunner.java:890)
	at com.carrotsearch.randomizedtesting.rules.StatementAdapter.evaluate(StatementAdapter.java:36)
	at com.carrotsearch.randomizedtesting.rules.SystemPropertiesRestoreRule$1.evaluate(SystemPropertiesRestoreRule.java:57)
	at org.apache.lucene.util.AbstractBeforeAfterRule$1.evaluate(AbstractBeforeAfterRule.java:45)
	at com.carrotsearch.randomizedtesting.rules.StatementAdapter.evaluate(StatementAdapter.java:36)
	at org.apache.lucene.util.TestRuleStoreClassName$1.evaluate(TestRuleStoreClassName.java:41)
	at com.carrotsearch.randomizedtesting.rules.NoShadowingOrOverridesOnMethodsRule$1.evaluate(NoShadowingOrOverridesOnMethodsRule.java:40)
	at com.carrotsearch.randomizedtesting.rules.NoShadowingOrOverridesOnMethodsRule$1.evaluate(NoShadowingOrOverridesOnMethodsRule.java:40)
	at com.carrotsearch.randomizedtesting.rules.StatementAdapter.evaluate(StatementAdapter.java:36)
	at com.carrotsearch.randomizedtesting.rules.StatementAdapter.evaluate(StatementAdapter.java:36)
	at com.carrotsearch.randomizedtesting.rules.StatementAdapter.evaluate(StatementAdapter.java:36)
	at org.apache.lucene.util.TestRuleAssertionsRequired$1.evaluate(TestRuleAssertionsRequired.java:53)
	at org.apache.lucene.util.TestRuleMarkFailure$1.evaluate(TestRuleMarkFailure.java:47)
	at org.apache.lucene.util.TestRuleIgnoreAfterMaxFailures$1.evaluate(TestRuleIgnoreAfterMaxFailures.java:64)
	at org.apache.lucene.util.TestRuleIgnoreTestSuites$1.evaluate(TestRuleIgnoreTestSuites.java:54)
	at com.carrotsearch.randomizedtesting.rules.StatementAdapter.evaluate(StatementAdapter.java:36)
	at com.carrotsearch.randomizedtesting.ThreadLeakControl$StatementRunner.run(ThreadLeakControl.java:368)
	at java.lang.Thread.run(Thread.java:748)


FAILED:  org.apache.solr.client.solrj.request.SchemaTest.copyFieldsShouldFailWhenOneOfTheFieldsDoesntExistInTheSchema

Error Message:
Error from server at http://127.0.0.1:56025/solr/collection1: error processing commands

Stack Trace:
org.apache.solr.client.solrj.impl.HttpSolrClient$RemoteExecutionException: Error from server at http://127.0.0.1:56025/solr/collection1: error processing commands
	at __randomizedtesting.SeedInfo.seed([32C8BE505D3A03C:2CE8AC4531DBD856]:0)
	at org.apache.solr.client.solrj.impl.HttpSolrClient$RemoteExecutionException.create(HttpSolrClient.java:829)
	at org.apache.solr.client.solrj.impl.HttpSolrClient.executeMethod(HttpSolrClient.java:620)
	at org.apache.solr.client.solrj.impl.HttpSolrClient.request(HttpSolrClient.java:255)
	at org.apache.solr.client.solrj.impl.HttpSolrClient.request(HttpSolrClient.java:244)
	at org.apache.solr.client.solrj.SolrRequest.process(SolrRequest.java:194)
	at org.apache.solr.client.solrj.SolrRequest.process(SolrRequest.java:211)
	at org.apache.solr.client.solrj.request.SchemaTest.copyFieldsShouldFailWhenOneOfTheFieldsDoesntExistInTheSchema(SchemaTest.java:806)
	at sun.reflect.NativeMethodAccessorImpl.invoke0(Native Method)
	at sun.reflect.NativeMethodAccessorImpl.invoke(NativeMethodAccessorImpl.java:62)
	at sun.reflect.DelegatingMethodAccessorImpl.invoke(DelegatingMethodAccessorImpl.java:43)
	at java.lang.reflect.Method.invoke(Method.java:498)
	at com.carrotsearch.randomizedtesting.RandomizedRunner.invoke(RandomizedRunner.java:1737)
	at com.carrotsearch.randomizedtesting.RandomizedRunner$8.evaluate(RandomizedRunner.java:934)
	at com.carrotsearch.randomizedtesting.RandomizedRunner$9.evaluate(RandomizedRunner.java:970)
	at com.carrotsearch.randomizedtesting.RandomizedRunner$10.evaluate(RandomizedRunner.java:984)
	at com.carrotsearch.randomizedtesting.rules.SystemPropertiesRestoreRule$1.evaluate(SystemPropertiesRestoreRule.java:57)
	at org.apache.lucene.util.TestRuleSetupTeardownChained$1.evaluate(TestRuleSetupTeardownChained.java:49)
	at org.apache.lucene.util.AbstractBeforeAfterRule$1.evaluate(AbstractBeforeAfterRule.java:45)
	at org.apache.lucene.util.TestRuleThreadAndTestName$1.evaluate(TestRuleThreadAndTestName.java:48)
	at org.apache.lucene.util.TestRuleIgnoreAfterMaxFailures$1.evaluate(TestRuleIgnoreAfterMaxFailures.java:64)
	at org.apache.lucene.util.TestRuleMarkFailure$1.evaluate(TestRuleMarkFailure.java:47)
	at com.carrotsearch.randomizedtesting.rules.StatementAdapter.evaluate(StatementAdapter.java:36)
	at com.carrotsearch.randomizedtesting.ThreadLeakControl$StatementRunner.run(ThreadLeakControl.java:368)
	at com.carrotsearch.randomizedtesting.ThreadLeakControl.forkTimeoutingTask(ThreadLeakControl.java:817)
	at com.carrotsearch.randomizedtesting.ThreadLeakControl$3.evaluate(ThreadLeakControl.java:468)
	at com.carrotsearch.randomizedtesting.RandomizedRunner.runSingleTest(RandomizedRunner.java:943)
	at com.carrotsearch.randomizedtesting.RandomizedRunner$5.evaluate(RandomizedRunner.java:829)
	at com.carrotsearch.randomizedtesting.RandomizedRunner$6.evaluate(RandomizedRunner.java:879)
	at com.carrotsearch.randomizedtesting.RandomizedRunner$7.evaluate(RandomizedRunner.java:890)
	at com.carrotsearch.randomizedtesting.rules.StatementAdapter.evaluate(StatementAdapter.java:36)
	at com.carrotsearch.randomizedtesting.rules.SystemPropertiesRestoreRule$1.evaluate(SystemPropertiesRestoreRule.java:57)
	at org.apache.lucene.util.AbstractBeforeAfterRule$1.evaluate(AbstractBeforeAfterRule.java:45)
	at com.carrotsearch.randomizedtesting.rules.StatementAdapter.evaluate(StatementAdapter.java:36)
	at org.apache.lucene.util.TestRuleStoreClassName$1.evaluate(TestRuleStoreClassName.java:41)
	at com.carrotsearch.randomizedtesting.rules.NoShadowingOrOverridesOnMethodsRule$1.evaluate(NoShadowingOrOverridesOnMethodsRule.java:40)
	at com.carrotsearch.randomizedtesting.rules.NoShadowingOrOverridesOnMethodsRule$1.evaluate(NoShadowingOrOverridesOnMethodsRule.java:40)
	at com.carrotsearch.randomizedtesting.rules.StatementAdapter.evaluate(StatementAdapter.java:36)
	at com.carrotsearch.randomizedtesting.rules.StatementAdapter.evaluate(StatementAdapter.java:36)
	at com.carrotsearch.randomizedtesting.rules.StatementAdapter.evaluate(StatementAdapter.java:36)
	at org.apache.lucene.util.TestRuleAssertionsRequired$1.evaluate(TestRuleAssertionsRequired.java:53)
	at org.apache.lucene.util.TestRuleMarkFailure$1.evaluate(TestRuleMarkFailure.java:47)
	at org.apache.lucene.util.TestRuleIgnoreAfterMaxFailures$1.evaluate(TestRuleIgnoreAfterMaxFailures.java:64)
	at org.apache.lucene.util.TestRuleIgnoreTestSuites$1.evaluate(TestRuleIgnoreTestSuites.java:54)
	at com.carrotsearch.randomizedtesting.rules.StatementAdapter.evaluate(StatementAdapter.java:36)
	at com.carrotsearch.randomizedtesting.ThreadLeakControl$StatementRunner.run(ThreadLeakControl.java:368)
	at java.lang.Thread.run(Thread.java:748)


FAILED:  org.apache.solr.client.solrj.request.SchemaTest.addFieldShouldntBeCalledTwiceWithTheSameName

Error Message:
Error from server at http://127.0.0.1:56106/solr/collection1: error processing commands

Stack Trace:
org.apache.solr.client.solrj.impl.HttpSolrClient$RemoteExecutionException: Error from server at http://127.0.0.1:56106/solr/collection1: error processing commands
	at __randomizedtesting.SeedInfo.seed([32C8BE505D3A03C:D25FE3BFB16B4090]:0)
	at org.apache.solr.client.solrj.impl.HttpSolrClient$RemoteExecutionException.create(HttpSolrClient.java:829)
	at org.apache.solr.client.solrj.impl.HttpSolrClient.executeMethod(HttpSolrClient.java:620)
	at org.apache.solr.client.solrj.impl.HttpSolrClient.request(HttpSolrClient.java:255)
	at org.apache.solr.client.solrj.impl.HttpSolrClient.request(HttpSolrClient.java:244)
	at org.apache.solr.client.solrj.SolrRequest.process(SolrRequest.java:194)
	at org.apache.solr.client.solrj.SolrRequest.process(SolrRequest.java:211)
	at org.apache.solr.client.solrj.request.SchemaTest.addFieldShouldntBeCalledTwiceWithTheSameName(SchemaTest.java:293)
	at sun.reflect.NativeMethodAccessorImpl.invoke0(Native Method)
	at sun.reflect.NativeMethodAccessorImpl.invoke(NativeMethodAccessorImpl.java:62)
	at sun.reflect.DelegatingMethodAccessorImpl.invoke(DelegatingMethodAccessorImpl.java:43)
	at java.lang.reflect.Method.invoke(Method.java:498)
	at com.carrotsearch.randomizedtesting.RandomizedRunner.invoke(RandomizedRunner.java:1737)
	at com.carrotsearch.randomizedtesting.RandomizedRunner$8.evaluate(RandomizedRunner.java:934)
	at com.carrotsearch.randomizedtesting.RandomizedRunner$9.evaluate(RandomizedRunner.java:970)
	at com.carrotsearch.randomizedtesting.RandomizedRunner$10.evaluate(RandomizedRunner.java:984)
	at com.carrotsearch.randomizedtesting.rules.SystemPropertiesRestoreRule$1.evaluate(SystemPropertiesRestoreRule.java:57)
	at org.apache.lucene.util.TestRuleSetupTeardownChained$1.evaluate(TestRuleSetupTeardownChained.java:49)
	at org.apache.lucene.util.AbstractBeforeAfterRule$1.evaluate(AbstractBeforeAfterRule.java:45)
	at org.apache.lucene.util.TestRuleThreadAndTestName$1.evaluate(TestRuleThreadAndTestName.java:48)
	at org.apache.lucene.util.TestRuleIgnoreAfterMaxFailures$1.evaluate(TestRuleIgnoreAfterMaxFailures.java:64)
	at org.apache.lucene.util.TestRuleMarkFailure$1.evaluate(TestRuleMarkFailure.java:47)
	at com.carrotsearch.randomizedtesting.rules.StatementAdapter.evaluate(StatementAdapter.java:36)
	at com.carrotsearch.randomizedtesting.ThreadLeakControl$StatementRunner.run(ThreadLeakControl.java:368)
	at com.carrotsearch.randomizedtesting.ThreadLeakControl.forkTimeoutingTask(ThreadLeakControl.java:817)
	at com.carrotsearch.randomizedtesting.ThreadLeakControl$3.evaluate(ThreadLeakControl.java:468)
	at com.carrotsearch.randomizedtesting.RandomizedRunner.runSingleTest(RandomizedRunner.java:943)
	at com.carrotsearch.randomizedtesting.RandomizedRunner$5.evaluate(RandomizedRunner.java:829)
	at com.carrotsearch.randomizedtesting.RandomizedRunner$6.evaluate(RandomizedRunner.java:879)
	at com.carrotsearch.randomizedtesting.RandomizedRunner$7.evaluate(RandomizedRunner.java:890)
	at com.carrotsearch.randomizedtesting.rules.StatementAdapter.evaluate(StatementAdapter.java:36)
	at com.carrotsearch.randomizedtesting.rules.SystemPropertiesRestoreRule$1.evaluate(SystemPropertiesRestoreRule.java:57)
	at org.apache.lucene.util.AbstractBeforeAfterRule$1.evaluate(AbstractBeforeAfterRule.java:45)
	at com.carrotsearch.randomizedtesting.rules.StatementAdapter.evaluate(StatementAdapter.java:36)
	at org.apache.lucene.util.TestRuleStoreClassName$1.evaluate(TestRuleStoreClassName.java:41)
	at com.carrotsearch.randomizedtesting.rules.NoShadowingOrOverridesOnMethodsRule$1.evaluate(NoShadowingOrOverridesOnMethodsRule.java:40)
	at com.carrotsearch.randomizedtesting.rules.NoShadowingOrOverridesOnMethodsRule$1.evaluate(NoShadowingOrOverridesOnMethodsRule.java:40)
	at com.carrotsearch.randomizedtesting.rules.StatementAdapter.evaluate(StatementAdapter.java:36)
	at com.carrotsearch.randomizedtesting.rules.StatementAdapter.evaluate(StatementAdapter.java:36)
	at com.carrotsearch.randomizedtesting.rules.StatementAdapter.evaluate(StatementAdapter.java:36)
	at org.apache.lucene.util.TestRuleAssertionsRequired$1.evaluate(TestRuleAssertionsRequired.java:53)
	at org.apache.lucene.util.TestRuleMarkFailure$1.evaluate(TestRuleMarkFailure.java:47)
	at org.apache.lucene.util.TestRuleIgnoreAfterMaxFailures$1.evaluate(TestRuleIgnoreAfterMaxFailures.java:64)
	at org.apache.lucene.util.TestRuleIgnoreTestSuites$1.evaluate(TestRuleIgnoreTestSuites.java:54)
	at com.carrotsearch.randomizedtesting.rules.StatementAdapter.evaluate(StatementAdapter.java:36)
	at com.carrotsearch.randomizedtesting.ThreadLeakControl$StatementRunner.run(ThreadLeakControl.java:368)
	at java.lang.Thread.run(Thread.java:748)


FAILED:  org.apache.solr.client.solrj.request.SchemaTest.addDynamicFieldShouldntBeCalledTwiceWithTheSameName

Error Message:
Error from server at http://127.0.0.1:56110/solr/collection1: error processing commands

Stack Trace:
org.apache.solr.client.solrj.impl.HttpSolrClient$RemoteExecutionException: Error from server at http://127.0.0.1:56110/solr/collection1: error processing commands
	at __randomizedtesting.SeedInfo.seed([32C8BE505D3A03C:49DCC4C3DDC21521]:0)
	at org.apache.solr.client.solrj.impl.HttpSolrClient$RemoteExecutionException.create(HttpSolrClient.java:829)
	at org.apache.solr.client.solrj.impl.HttpSolrClient.executeMethod(HttpSolrClient.java:620)
	at org.apache.solr.client.solrj.impl.HttpSolrClient.request(HttpSolrClient.java:255)
	at org.apache.solr.client.solrj.impl.HttpSolrClient.request(HttpSolrClient.java:244)
	at org.apache.solr.client.solrj.SolrRequest.process(SolrRequest.java:194)
	at org.apache.solr.client.solrj.SolrRequest.process(SolrRequest.java:211)
	at org.apache.solr.client.solrj.request.SchemaTest.addDynamicFieldShouldntBeCalledTwiceWithTheSameName(SchemaTest.java:417)
	at sun.reflect.NativeMethodAccessorImpl.invoke0(Native Method)
	at sun.reflect.NativeMethodAccessorImpl.invoke(NativeMethodAccessorImpl.java:62)
	at sun.reflect.DelegatingMethodAccessorImpl.invoke(DelegatingMethodAccessorImpl.java:43)
	at java.lang.reflect.Method.invoke(Method.java:498)
	at com.carrotsearch.randomizedtesting.RandomizedRunner.invoke(RandomizedRunner.java:1737)
	at com.carrotsearch.randomizedtesting.RandomizedRunner$8.evaluate(RandomizedRunner.java:934)
	at com.carrotsearch.randomizedtesting.RandomizedRunner$9.evaluate(RandomizedRunner.java:970)
	at com.carrotsearch.randomizedtesting.RandomizedRunner$10.evaluate(RandomizedRunner.java:984)
	at com.carrotsearch.randomizedtesting.rules.SystemPropertiesRestoreRule$1.evaluate(SystemPropertiesRestoreRule.java:57)
	at org.apache.lucene.util.TestRuleSetupTeardownChained$1.evaluate(TestRuleSetupTeardownChained.java:49)
	at org.apache.lucene.util.AbstractBeforeAfterRule$1.evaluate(AbstractBeforeAfterRule.java:45)
	at org.apache.lucene.util.TestRuleThreadAndTestName$1.evaluate(TestRuleThreadAndTestName.java:48)
	at org.apache.lucene.util.TestRuleIgnoreAfterMaxFailures$1.evaluate(TestRuleIgnoreAfterMaxFailures.java:64)
	at org.apache.lucene.util.TestRuleMarkFailure$1.evaluate(TestRuleMarkFailure.java:47)
	at com.carrotsearch.randomizedtesting.rules.StatementAdapter.evaluate(StatementAdapter.java:36)
	at com.carrotsearch.randomizedtesting.ThreadLeakControl$StatementRunner.run(ThreadLeakControl.java:368)
	at com.carrotsearch.randomizedtesting.ThreadLeakControl.forkTimeoutingTask(ThreadLeakControl.java:817)
	at com.carrotsearch.randomizedtesting.ThreadLeakControl$3.evaluate(ThreadLeakControl.java:468)
	at com.carrotsearch.randomizedtesting.RandomizedRunner.runSingleTest(RandomizedRunner.java:943)
	at com.carrotsearch.randomizedtesting.RandomizedRunner$5.evaluate(RandomizedRunner.java:829)
	at com.carrotsearch.randomizedtesting.RandomizedRunner$6.evaluate(RandomizedRunner.java:879)
	at com.carrotsearch.randomizedtesting.RandomizedRunner$7.evaluate(RandomizedRunner.java:890)
	at com.carrotsearch.randomizedtesting.rules.StatementAdapter.evaluate(StatementAdapter.java:36)
	at com.carrotsearch.randomizedtesting.rules.SystemPropertiesRestoreRule$1.evaluate(SystemPropertiesRestoreRule.java:57)
	at org.apache.lucene.util.AbstractBeforeAfterRule$1.evaluate(AbstractBeforeAfterRule.java:45)
	at com.carrotsearch.randomizedtesting.rules.StatementAdapter.evaluate(StatementAdapter.java:36)
	at org.apache.lucene.util.TestRuleStoreClassName$1.evaluate(TestRuleStoreClassName.java:41)
	at com.carrotsearch.randomizedtesting.rules.NoShadowingOrOverridesOnMethodsRule$1.evaluate(NoShadowingOrOverridesOnMethodsRule.java:40)
	at com.carrotsearch.randomizedtesting.rules.NoShadowingOrOverridesOnMethodsRule$1.evaluate(NoShadowingOrOverridesOnMethodsRule.java:40)
	at com.carrotsearch.randomizedtesting.rules.StatementAdapter.evaluate(StatementAdapter.java:36)
	at com.carrotsearch.randomizedtesting.rules.StatementAdapter.evaluate(StatementAdapter.java:36)
	at com.carrotsearch.randomizedtesting.rules.StatementAdapter.evaluate(StatementAdapter.java:36)
	at org.apache.lucene.util.TestRuleAssertionsRequired$1.evaluate(TestRuleAssertionsRequired.java:53)
	at org.apache.lucene.util.TestRuleMarkFailure$1.evaluate(TestRuleMarkFailure.java:47)
	at org.apache.lucene.util.TestRuleIgnoreAfterMaxFailures$1.evaluate(TestRuleIgnoreAfterMaxFailures.java:64)
	at org.apache.lucene.util.TestRuleIgnoreTestSuites$1.evaluate(TestRuleIgnoreTestSuites.java:54)
	at com.carrotsearch.randomizedtesting.rules.StatementAdapter.evaluate(StatementAdapter.java:36)
	at com.carrotsearch.randomizedtesting.ThreadLeakControl$StatementRunner.run(ThreadLeakControl.java:368)
	at java.lang.Thread.run(Thread.java:748)


FAILED:  org.apache.solr.client.solrj.request.SchemaTest.deletingAFieldThatDoesntExistInTheSchemaShouldFail

Error Message:
Error from server at http://127.0.0.1:56163/solr/collection1: error processing commands

Stack Trace:
org.apache.solr.client.solrj.impl.HttpSolrClient$RemoteExecutionException: Error from server at http://127.0.0.1:56163/solr/collection1: error processing commands
	at __randomizedtesting.SeedInfo.seed([32C8BE505D3A03C:3AC3F2D2CFB3F226]:0)
	at org.apache.solr.client.solrj.impl.HttpSolrClient$RemoteExecutionException.create(HttpSolrClient.java:829)
	at org.apache.solr.client.solrj.impl.HttpSolrClient.executeMethod(HttpSolrClient.java:620)
	at org.apache.solr.client.solrj.impl.HttpSolrClient.request(HttpSolrClient.java:255)
	at org.apache.solr.client.solrj.impl.HttpSolrClient.request(HttpSolrClient.java:244)
	at org.apache.solr.client.solrj.SolrRequest.process(SolrRequest.java:194)
	at org.apache.solr.client.solrj.SolrRequest.process(SolrRequest.java:211)
	at org.apache.solr.client.solrj.request.SchemaTest.deletingAFieldThatDoesntExistInTheSchemaShouldFail(SchemaTest.java:332)
	at sun.reflect.NativeMethodAccessorImpl.invoke0(Native Method)
	at sun.reflect.NativeMethodAccessorImpl.invoke(NativeMethodAccessorImpl.java:62)
	at sun.reflect.DelegatingMethodAccessorImpl.invoke(DelegatingMethodAccessorImpl.java:43)
	at java.lang.reflect.Method.invoke(Method.java:498)
	at com.carrotsearch.randomizedtesting.RandomizedRunner.invoke(RandomizedRunner.java:1737)
	at com.carrotsearch.randomizedtesting.RandomizedRunner$8.evaluate(RandomizedRunner.java:934)
	at com.carrotsearch.randomizedtesting.RandomizedRunner$9.evaluate(RandomizedRunner.java:970)
	at com.carrotsearch.randomizedtesting.RandomizedRunner$10.evaluate(RandomizedRunner.java:984)
	at com.carrotsearch.randomizedtesting.rules.SystemPropertiesRestoreRule$1.evaluate(SystemPropertiesRestoreRule.java:57)
	at org.apache.lucene.util.TestRuleSetupTeardownChained$1.evaluate(TestRuleSetupTeardownChained.java:49)
	at org.apache.lucene.util.AbstractBeforeAfterRule$1.evaluate(AbstractBeforeAfterRule.java:45)
	at org.apache.lucene.util.TestRuleThreadAndTestName$1.evaluate(TestRuleThreadAndTestName.java:48)
	at org.apache.lucene.util.TestRuleIgnoreAfterMaxFailures$1.evaluate(TestRuleIgnoreAfterMaxFailures.java:64)
	at org.apache.lucene.util.TestRuleMarkFailure$1.evaluate(TestRuleMarkFailure.java:47)
	at com.carrotsearch.randomizedtesting.rules.StatementAdapter.evaluate(StatementAdapter.java:36)
	at com.carrotsearch.randomizedtesting.ThreadLeakControl$StatementRunner.run(ThreadLeakControl.java:368)
	at com.carrotsearch.randomizedtesting.ThreadLeakControl.forkTimeoutingTask(ThreadLeakControl.java:817)
	at com.carrotsearch.randomizedtesting.ThreadLeakControl$3.evaluate(ThreadLeakControl.java:468)
	at com.carrotsearch.randomizedtesting.RandomizedRunner.runSingleTest(RandomizedRunner.java:943)
	at com.carrotsearch.randomizedtesting.RandomizedRunner$5.evaluate(RandomizedRunner.java:829)
	at com.carrotsearch.randomizedtesting.RandomizedRunner$6.evaluate(RandomizedRunner.java:879)
	at com.carrotsearch.randomizedtesting.RandomizedRunner$7.evaluate(RandomizedRunner.java:890)
	at com.carrotsearch.randomizedtesting.rules.StatementAdapter.evaluate(StatementAdapter.java:36)
	at com.carrotsearch.randomizedtesting.rules.SystemPropertiesRestoreRule$1.evaluate(SystemPropertiesRestoreRule.java:57)
	at org.apache.lucene.util.AbstractBeforeAfterRule$1.evaluate(AbstractBeforeAfterRule.java:45)
	at com.carrotsearch.randomizedtesting.rules.StatementAdapter.evaluate(StatementAdapter.java:36)
	at org.apache.lucene.util.TestRuleStoreClassName$1.evaluate(TestRuleStoreClassName.java:41)
	at com.carrotsearch.randomizedtesting.rules.NoShadowingOrOverridesOnMethodsRule$1.evaluate(NoShadowingOrOverridesOnMethodsRule.java:40)
	at com.carrotsearch.randomizedtesting.rules.NoShadowingOrOverridesOnMethodsRule$1.evaluate(NoShadowingOrOverridesOnMethodsRule.java:40)
	at com.carrotsearch.randomizedtesting.rules.StatementAdapter.evaluate(StatementAdapter.java:36)
	at com.carrotsearch.randomizedtesting.rules.StatementAdapter.evaluate(StatementAdapter.java:36)
	at com.carrotsearch.randomizedtesting.rules.StatementAdapter.evaluate(StatementAdapter.java:36)
	at org.apache.lucene.util.TestRuleAssertionsRequired$1.evaluate(TestRuleAssertionsRequired.java:53)
	at org.apache.lucene.util.TestRuleMarkFailure$1.evaluate(TestRuleMarkFailure.java:47)
	at org.apache.lucene.util.TestRuleIgnoreAfterMaxFailures$1.evaluate(TestRuleIgnoreAfterMaxFailures.java:64)
	at org.apache.lucene.util.TestRuleIgnoreTestSuites$1.evaluate(TestRuleIgnoreTestSuites.java:54)
	at com.carrotsearch.randomizedtesting.rules.StatementAdapter.evaluate(StatementAdapter.java:36)
	at com.carrotsearch.randomizedtesting.ThreadLeakControl$StatementRunner.run(ThreadLeakControl.java:368)
	at java.lang.Thread.run(Thread.java:748)


FAILED:  org.apache.solr.client.solrj.request.SchemaTest.deleteCopyFieldShouldFailWhenOneOfTheFieldsDoesntExistInTheSchema

Error Message:
Error from server at http://127.0.0.1:56166/solr/collection1: error processing commands

Stack Trace:
org.apache.solr.client.solrj.impl.HttpSolrClient$RemoteExecutionException: Error from server at http://127.0.0.1:56166/solr/collection1: error processing commands
	at __randomizedtesting.SeedInfo.seed([32C8BE505D3A03C:C6B1861372CC4042]:0)
	at org.apache.solr.client.solrj.impl.HttpSolrClient$RemoteExecutionException.create(HttpSolrClient.java:829)
	at org.apache.solr.client.solrj.impl.HttpSolrClient.executeMethod(HttpSolrClient.java:620)
	at org.apache.solr.client.solrj.impl.HttpSolrClient.request(HttpSolrClient.java:255)
	at org.apache.solr.client.solrj.impl.HttpSolrClient.request(HttpSolrClient.java:244)
	at org.apache.solr.client.solrj.SolrRequest.process(SolrRequest.java:194)
	at org.apache.solr.client.solrj.SolrRequest.process(SolrRequest.java:211)
	at org.apache.solr.client.solrj.request.SchemaTest.deleteCopyFieldShouldFailWhenOneOfTheFieldsDoesntExistInTheSchema(SchemaTest.java:841)
	at sun.reflect.NativeMethodAccessorImpl.invoke0(Native Method)
	at sun.reflect.NativeMethodAccessorImpl.invoke(NativeMethodAccessorImpl.java:62)
	at sun.reflect.DelegatingMethodAccessorImpl.invoke(DelegatingMethodAccessorImpl.java:43)
	at java.lang.reflect.Method.invoke(Method.java:498)
	at com.carrotsearch.randomizedtesting.RandomizedRunner.invoke(RandomizedRunner.java:1737)
	at com.carrotsearch.randomizedtesting.RandomizedRunner$8.evaluate(RandomizedRunner.java:934)
	at com.carrotsearch.randomizedtesting.RandomizedRunner$9.evaluate(RandomizedRunner.java:970)
	at com.carrotsearch.randomizedtesting.RandomizedRunner$10.evaluate(RandomizedRunner.java:984)
	at com.carrotsearch.randomizedtesting.rules.SystemPropertiesRestoreRule$1.evaluate(SystemPropertiesRestoreRule.java:57)
	at org.apache.lucene.util.TestRuleSetupTeardownChained$1.evaluate(TestRuleSetupTeardownChained.java:49)
	at org.apache.lucene.util.AbstractBeforeAfterRule$1.evaluate(AbstractBeforeAfterRule.java:45)
	at org.apache.lucene.util.TestRuleThreadAndTestName$1.evaluate(TestRuleThreadAndTestName.java:48)
	at org.apache.lucene.util.TestRuleIgnoreAfterMaxFailures$1.evaluate(TestRuleIgnoreAfterMaxFailures.java:64)
	at org.apache.lucene.util.TestRuleMarkFailure$1.evaluate(TestRuleMarkFailure.java:47)
	at com.carrotsearch.randomizedtesting.rules.StatementAdapter.evaluate(StatementAdapter.java:36)
	at com.carrotsearch.randomizedtesting.ThreadLeakControl$StatementRunner.run(ThreadLeakControl.java:368)
	at com.carrotsearch.randomizedtesting.ThreadLeakControl.forkTimeoutingTask(ThreadLeakControl.java:817)
	at com.carrotsearch.randomizedtesting.ThreadLeakControl$3.evaluate(ThreadLeakControl.java:468)
	at com.carrotsearch.randomizedtesting.RandomizedRunner.runSingleTest(RandomizedRunner.java:943)
	at com.carrotsearch.randomizedtesting.RandomizedRunner$5.evaluate(RandomizedRunner.java:829)
	at com.carrotsearch.randomizedtesting.RandomizedRunner$6.evaluate(RandomizedRunner.java:879)
	at com.carrotsearch.randomizedtesting.RandomizedRunner$7.evaluate(RandomizedRunner.java:890)
	at com.carrotsearch.randomizedtesting.rules.StatementAdapter.evaluate(StatementAdapter.java:36)
	at com.carrotsearch.randomizedtesting.rules.SystemPropertiesRestoreRule$1.evaluate(SystemPropertiesRestoreRule.java:57)
	at org.apache.lucene.util.AbstractBeforeAfterRule$1.evaluate(AbstractBeforeAfterRule.java:45)
	at com.carrotsearch.randomizedtesting.rules.StatementAdapter.evaluate(StatementAdapter.java:36)
	at org.apache.lucene.util.TestRuleStoreClassName$1.evaluate(TestRuleStoreClassName.java:41)
	at com.carrotsearch.randomizedtesting.rules.NoShadowingOrOverridesOnMethodsRule$1.evaluate(NoShadowingOrOverridesOnMethodsRule.java:40)
	at com.carrotsearch.randomizedtesting.rules.NoShadowingOrOverridesOnMethodsRule$1.evaluate(NoShadowingOrOverridesOnMethodsRule.java:40)
	at com.carrotsearch.randomizedtesting.rules.StatementAdapter.evaluate(StatementAdapter.java:36)
	at com.carrotsearch.randomizedtesting.rules.StatementAdapter.evaluate(StatementAdapter.java:36)
	at com.carrotsearch.randomizedtesting.rules.StatementAdapter.evaluate(StatementAdapter.java:36)
	at org.apache.lucene.util.TestRuleAssertionsRequired$1.evaluate(TestRuleAssertionsRequired.java:53)
	at org.apache.lucene.util.TestRuleMarkFailure$1.evaluate(TestRuleMarkFailure.java:47)
	at org.apache.lucene.util.TestRuleIgnoreAfterMaxFailures$1.evaluate(TestRuleIgnoreAfterMaxFailures.java:64)
	at org.apache.lucene.util.TestRuleIgnoreTestSuites$1.evaluate(TestRuleIgnoreTestSuites.java:54)
	at com.carrotsearch.randomizedtesting.rules.StatementAdapter.evaluate(StatementAdapter.java:36)
	at com.carrotsearch.randomizedtesting.ThreadLeakControl$StatementRunner.run(ThreadLeakControl.java:368)
	at java.lang.Thread.run(Thread.java:748)


FAILED:  org.apache.solr.client.solrj.request.SchemaTest.deletingADynamicFieldThatDoesntExistInTheSchemaShouldFail

Error Message:
Error from server at http://127.0.0.1:56174/solr/collection1: error processing commands

Stack Trace:
org.apache.solr.client.solrj.impl.HttpSolrClient$RemoteExecutionException: Error from server at http://127.0.0.1:56174/solr/collection1: error processing commands
	at __randomizedtesting.SeedInfo.seed([32C8BE505D3A03C:87DF8806CE08D4F3]:0)
	at org.apache.solr.client.solrj.impl.HttpSolrClient$RemoteExecutionException.create(HttpSolrClient.java:829)
	at org.apache.solr.client.solrj.impl.HttpSolrClient.executeMethod(HttpSolrClient.java:620)
	at org.apache.solr.client.solrj.impl.HttpSolrClient.request(HttpSolrClient.java:255)
	at org.apache.solr.client.solrj.impl.HttpSolrClient.request(HttpSolrClient.java:244)
	at org.apache.solr.client.solrj.SolrRequest.process(SolrRequest.java:194)
	at org.apache.solr.client.solrj.SolrRequest.process(SolrRequest.java:211)
	at org.apache.solr.client.solrj.request.SchemaTest.deletingADynamicFieldThatDoesntExistInTheSchemaShouldFail(SchemaTest.java:458)
	at sun.reflect.NativeMethodAccessorImpl.invoke0(Native Method)
	at sun.reflect.NativeMethodAccessorImpl.invoke(NativeMethodAccessorImpl.java:62)
	at sun.reflect.DelegatingMethodAccessorImpl.invoke(DelegatingMethodAccessorImpl.java:43)
	at java.lang.reflect.Method.invoke(Method.java:498)
	at com.carrotsearch.randomizedtesting.RandomizedRunner.invoke(RandomizedRunner.java:1737)
	at com.carrotsearch.randomizedtesting.RandomizedRunner$8.evaluate(RandomizedRunner.java:934)
	at com.carrotsearch.randomizedtesting.RandomizedRunner$9.evaluate(RandomizedRunner.java:970)
	at com.carrotsearch.randomizedtesting.RandomizedRunner$10.evaluate(RandomizedRunner.java:984)
	at com.carrotsearch.randomizedtesting.rules.SystemPropertiesRestoreRule$1.evaluate(SystemPropertiesRestoreRule.java:57)
	at org.apache.lucene.util.TestRuleSetupTeardownChained$1.evaluate(TestRuleSetupTeardownChained.java:49)
	at org.apache.lucene.util.AbstractBeforeAfterRule$1.evaluate(AbstractBeforeAfterRule.java:45)
	at org.apache.lucene.util.TestRuleThreadAndTestName$1.evaluate(TestRuleThreadAndTestName.java:48)
	at org.apache.lucene.util.TestRuleIgnoreAfterMaxFailures$1.evaluate(TestRuleIgnoreAfterMaxFailures.java:64)
	at org.apache.lucene.util.TestRuleMarkFailure$1.evaluate(TestRuleMarkFailure.java:47)
	at com.carrotsearch.randomizedtesting.rules.StatementAdapter.evaluate(StatementAdapter.java:36)
	at com.carrotsearch.randomizedtesting.ThreadLeakControl$StatementRunner.run(ThreadLeakControl.java:368)
	at com.carrotsearch.randomizedtesting.ThreadLeakControl.forkTimeoutingTask(ThreadLeakControl.java:817)
	at com.carrotsearch.randomizedtesting.ThreadLeakControl$3.evaluate(ThreadLeakControl.java:468)
	at com.carrotsearch.randomizedtesting.RandomizedRunner.runSingleTest(RandomizedRunner.java:943)
	at com.carrotsearch.randomizedtesting.RandomizedRunner$5.evaluate(RandomizedRunner.java:829)
	at com.carrotsearch.randomizedtesting.RandomizedRunner$6.evaluate(RandomizedRunner.java:879)
	at com.carrotsearch.randomizedtesting.RandomizedRunner$7.evaluate(RandomizedRunner.java:890)
	at com.carrotsearch.randomizedtesting.rules.StatementAdapter.evaluate(StatementAdapter.java:36)
	at com.carrotsearch.randomizedtesting.rules.SystemPropertiesRestoreRule$1.evaluate(SystemPropertiesRestoreRule.java:57)
	at org.apache.lucene.util.AbstractBeforeAfterRule$1.evaluate(AbstractBeforeAfterRule.java:45)
	at com.carrotsearch.randomizedtesting.rules.StatementAdapter.evaluate(StatementAdapter.java:36)
	at org.apache.lucene.util.TestRuleStoreClassName$1.evaluate(TestRuleStoreClassName.java:41)
	at com.carrotsearch.randomizedtesting.rules.NoShadowingOrOverridesOnMethodsRule$1.evaluate(NoShadowingOrOverridesOnMethodsRule.java:40)
	at com.carrotsearch.randomizedtesting.rules.NoShadowingOrOverridesOnMethodsRule$1.evaluate(NoShadowingOrOverridesOnMethodsRule.java:40)
	at com.carrotsearch.randomizedtesting.rules.StatementAdapter.evaluate(StatementAdapter.java:36)
	at com.carrotsearch.randomizedtesting.rules.StatementAdapter.evaluate(StatementAdapter.java:36)
	at com.carrotsearch.randomizedtesting.rules.StatementAdapter.evaluate(StatementAdapter.java:36)
	at org.apache.lucene.util.TestRuleAssertionsRequired$1.evaluate(TestRuleAssertionsRequired.java:53)
	at org.apache.lucene.util.TestRuleMarkFailure$1.evaluate(TestRuleMarkFailure.java:47)
	at org.apache.lucene.util.TestRuleIgnoreAfterMaxFailures$1.evaluate(TestRuleIgnoreAfterMaxFailures.java:64)
	at org.apache.lucene.util.TestRuleIgnoreTestSuites$1.evaluate(TestRuleIgnoreTestSuites.java:54)
	at com.carrotsearch.randomizedtesting.rules.StatementAdapter.evaluate(StatementAdapter.java:36)
	at com.carrotsearch.randomizedtesting.ThreadLeakControl$StatementRunner.run(ThreadLeakControl.java:368)
	at java.lang.Thread.run(Thread.java:748)


FAILED:  org.apache.solr.client.solrj.request.SchemaTest.addFieldTypeShouldntBeCalledTwiceWithTheSameName

Error Message:
Error from server at http://127.0.0.1:56189/solr/collection1: error processing commands

Stack Trace:
org.apache.solr.client.solrj.impl.HttpSolrClient$RemoteExecutionException: Error from server at http://127.0.0.1:56189/solr/collection1: error processing commands
	at __randomizedtesting.SeedInfo.seed([32C8BE505D3A03C:C6CD79F5FBAEB294]:0)
	at org.apache.solr.client.solrj.impl.HttpSolrClient$RemoteExecutionException.create(HttpSolrClient.java:829)
	at org.apache.solr.client.solrj.impl.HttpSolrClient.executeMethod(HttpSolrClient.java:620)
	at org.apache.solr.client.solrj.impl.HttpSolrClient.request(HttpSolrClient.java:255)
	at org.apache.solr.client.solrj.impl.HttpSolrClient.request(HttpSolrClient.java:244)
	at org.apache.solr.client.solrj.SolrRequest.process(SolrRequest.java:194)
	at org.apache.solr.client.solrj.SolrRequest.process(SolrRequest.java:211)
	at org.apache.solr.client.solrj.request.SchemaTest.addFieldTypeShouldntBeCalledTwiceWithTheSameName(SchemaTest.java:649)
	at sun.reflect.NativeMethodAccessorImpl.invoke0(Native Method)
	at sun.reflect.NativeMethodAccessorImpl.invoke(NativeMethodAccessorImpl.java:62)
	at sun.reflect.DelegatingMethodAccessorImpl.invoke(DelegatingMethodAccessorImpl.java:43)
	at java.lang.reflect.Method.invoke(Method.java:498)
	at com.carrotsearch.randomizedtesting.RandomizedRunner.invoke(RandomizedRunner.java:1737)
	at com.carrotsearch.randomizedtesting.RandomizedRunner$8.evaluate(RandomizedRunner.java:934)
	at com.carrotsearch.randomizedtesting.RandomizedRunner$9.evaluate(RandomizedRunner.java:970)
	at com.carrotsearch.randomizedtesting.RandomizedRunner$10.evaluate(RandomizedRunner.java:984)
	at com.carrotsearch.randomizedtesting.rules.SystemPropertiesRestoreRule$1.evaluate(SystemPropertiesRestoreRule.java:57)
	at org.apache.lucene.util.TestRuleSetupTeardownChained$1.evaluate(TestRuleSetupTeardownChained.java:49)
	at org.apache.lucene.util.AbstractBeforeAfterRule$1.evaluate(AbstractBeforeAfterRule.java:45)
	at org.apache.lucene.util.TestRuleThreadAndTestName$1.evaluate(TestRuleThreadAndTestName.java:48)
	at org.apache.lucene.util.TestRuleIgnoreAfterMaxFailures$1.evaluate(TestRuleIgnoreAfterMaxFailures.java:64)
	at org.apache.lucene.util.TestRuleMarkFailure$1.evaluate(TestRuleMarkFailure.java:47)
	at com.carrotsearch.randomizedtesting.rules.StatementAdapter.evaluate(StatementAdapter.java:36)
	at com.carrotsearch.randomizedtesting.ThreadLeakControl$StatementRunner.run(ThreadLeakControl.java:368)
	at com.carrotsearch.randomizedtesting.ThreadLeakControl.forkTimeoutingTask(ThreadLeakControl.java:817)
	at com.carrotsearch.randomizedtesting.ThreadLeakControl$3.evaluate(ThreadLeakControl.java:468)
	at com.carrotsearch.randomizedtesting.RandomizedRunner.runSingleTest(RandomizedRunner.java:943)
	at com.carrotsearch.randomizedtesting.RandomizedRunner$5.evaluate(RandomizedRunner.java:829)
	at com.carrotsearch.randomizedtesting.RandomizedRunner$6.evaluate(RandomizedRunner.java:879)
	at com.carrotsearch.randomizedtesting.RandomizedRunner$7.evaluate(RandomizedRunner.java:890)
	at com.carrotsearch.randomizedtesting.rules.StatementAdapter.evaluate(StatementAdapter.java:36)
	at com.carrotsearch.randomizedtesting.rules.SystemPropertiesRestoreRule$1.evaluate(SystemPropertiesRestoreRule.java:57)
	at org.apache.lucene.util.AbstractBeforeAfterRule$1.evaluate(AbstractBeforeAfterRule.java:45)
	at com.carrotsearch.randomizedtesting.rules.StatementAdapter.evaluate(StatementAdapter.java:36)
	at org.apache.lucene.util.TestRuleStoreClassName$1.evaluate(TestRuleStoreClassName.java:41)
	at com.carrotsearch.randomizedtesting.rules.NoShadowingOrOverridesOnMethodsRule$1.evaluate(NoShadowingOrOverridesOnMethodsRule.java:40)
	at com.carrotsearch.randomizedtesting.rules.NoShadowingOrOverridesOnMethodsRule$1.evaluate(NoShadowingOrOverridesOnMethodsRule.java:40)
	at com.carrotsearch.randomizedtesting.rules.StatementAdapter.evaluate(StatementAdapter.java:36)
	at com.carrotsearch.randomizedtesting.rules.StatementAdapter.evaluate(StatementAdapter.java:36)
	at com.carrotsearch.randomizedtesting.rules.StatementAdapter.evaluate(StatementAdapter.java:36)
	at org.apache.lucene.util.TestRuleAssertionsRequired$1.evaluate(TestRuleAssertionsRequired.java:53)
	at org.apache.lucene.util.TestRuleMarkFailure$1.evaluate(TestRuleMarkFailure.java:47)
	at org.apache.lucene.util.TestRuleIgnoreAfterMaxFailures$1.evaluate(TestRuleIgnoreAfterMaxFailures.java:64)
	at org.apache.lucene.util.TestRuleIgnoreTestSuites$1.evaluate(TestRuleIgnoreTestSuites.java:54)
	at com.carrotsearch.randomizedtesting.rules.StatementAdapter.evaluate(StatementAdapter.java:36)
	at com.carrotsearch.randomizedtesting.ThreadLeakControl$StatementRunner.run(ThreadLeakControl.java:368)
	at java.lang.Thread.run(Thread.java:748)


FAILED:  org.apache.solr.client.solrj.embedded.TestEmbeddedSolrServerSchemaAPI.testSchemaAddFieldAndFailOnImmutable

Error Message:
error processing commands

Stack Trace:
org.apache.solr.api.ApiBag$ExceptionWithErrObject: error processing commands, errors: [{errorMessages=schema is not editable}], 
	at __randomizedtesting.SeedInfo.seed([E4387BC07D208D8:95F7686D5A4462C9]:0)
	at org.apache.solr.handler.SchemaHandler.handleRequestBody(SchemaHandler.java:92)
	at org.apache.solr.handler.RequestHandlerBase.handleRequest(RequestHandlerBase.java:177)
	at org.apache.solr.core.SolrCore.execute(SolrCore.java:2503)
	at org.apache.solr.client.solrj.embedded.EmbeddedSolrServer.request(EmbeddedSolrServer.java:180)
	at org.apache.solr.client.solrj.SolrRequest.process(SolrRequest.java:194)
	at org.apache.solr.client.solrj.SolrRequest.process(SolrRequest.java:211)
	at org.apache.solr.client.solrj.embedded.TestEmbeddedSolrServerSchemaAPI.testSchemaAddFieldAndFailOnImmutable(TestEmbeddedSolrServerSchemaAPI.java:105)
	at sun.reflect.NativeMethodAccessorImpl.invoke0(Native Method)
	at sun.reflect.NativeMethodAccessorImpl.invoke(NativeMethodAccessorImpl.java:62)
	at sun.reflect.DelegatingMethodAccessorImpl.invoke(DelegatingMethodAccessorImpl.java:43)
	at java.lang.reflect.Method.invoke(Method.java:498)
	at com.carrotsearch.randomizedtesting.RandomizedRunner.invoke(RandomizedRunner.java:1737)
	at com.carrotsearch.randomizedtesting.RandomizedRunner$8.evaluate(RandomizedRunner.java:934)
	at com.carrotsearch.randomizedtesting.RandomizedRunner$9.evaluate(RandomizedRunner.java:970)
	at com.carrotsearch.randomizedtesting.RandomizedRunner$10.evaluate(RandomizedRunner.java:984)
	at com.carrotsearch.randomizedtesting.rules.SystemPropertiesRestoreRule$1.evaluate(SystemPropertiesRestoreRule.java:57)
	at org.apache.lucene.util.TestRuleSetupTeardownChained$1.evaluate(TestRuleSetupTeardownChained.java:49)
	at org.apache.lucene.util.AbstractBeforeAfterRule$1.evaluate(AbstractBeforeAfterRule.java:45)
	at org.apache.lucene.util.TestRuleThreadAndTestName$1.evaluate(TestRuleThreadAndTestName.java:48)
	at org.apache.lucene.util.TestRuleIgnoreAfterMaxFailures$1.evaluate(TestRuleIgnoreAfterMaxFailures.java:64)
	at org.apache.lucene.util.TestRuleMarkFailure$1.evaluate(TestRuleMarkFailure.java:47)
	at com.carrotsearch.randomizedtesting.rules.StatementAdapter.evaluate(StatementAdapter.java:36)
	at com.carrotsearch.randomizedtesting.ThreadLeakControl$StatementRunner.run(ThreadLeakControl.java:368)
	at com.carrotsearch.randomizedtesting.ThreadLeakControl.forkTimeoutingTask(ThreadLeakControl.java:817)
	at com.carrotsearch.randomizedtesting.ThreadLeakControl$3.evaluate(ThreadLeakControl.java:468)
	at com.carrotsearch.randomizedtesting.RandomizedRunner.runSingleTest(RandomizedRunner.java:943)
	at com.carrotsearch.randomizedtesting.RandomizedRunner$5.evaluate(RandomizedRunner.java:829)
	at com.carrotsearch.randomizedtesting.RandomizedRunner$6.evaluate(RandomizedRunner.java:879)
	at com.carrotsearch.randomizedtesting.RandomizedRunner$7.evaluate(RandomizedRunner.java:890)
	at com.carrotsearch.randomizedtesting.rules.StatementAdapter.evaluate(StatementAdapter.java:36)
	at com.carrotsearch.randomizedtesting.rules.SystemPropertiesRestoreRule$1.evaluate(SystemPropertiesRestoreRule.java:57)
	at org.apache.lucene.util.AbstractBeforeAfterRule$1.evaluate(AbstractBeforeAfterRule.java:45)
	at com.carrotsearch.randomizedtesting.rules.StatementAdapter.evaluate(StatementAdapter.java:36)
	at org.apache.lucene.util.TestRuleStoreClassName$1.evaluate(TestRuleStoreClassName.java:41)
	at com.carrotsearch.randomizedtesting.rules.NoShadowingOrOverridesOnMethodsRule$1.evaluate(NoShadowingOrOverridesOnMethodsRule.java:40)
	at com.carrotsearch.randomizedtesting.rules.NoShadowingOrOverridesOnMethodsRule$1.evaluate(NoShadowingOrOverridesOnMethodsRule.java:40)
	at com.carrotsearch.randomizedtesting.rules.StatementAdapter.evaluate(StatementAdapter.java:36)
	at com.carrotsearch.randomizedtesting.rules.StatementAdapter.evaluate(StatementAdapter.java:36)
	at com.carrotsearch.randomizedtesting.rules.StatementAdapter.evaluate(StatementAdapter.java:36)
	at org.apache.lucene.util.TestRuleAssertionsRequired$1.evaluate(TestRuleAssertionsRequired.java:53)
	at org.apache.lucene.util.TestRuleMarkFailure$1.evaluate(TestRuleMarkFailure.java:47)
	at org.apache.lucene.util.TestRuleIgnoreAfterMaxFailures$1.evaluate(TestRuleIgnoreAfterMaxFailures.java:64)
	at org.apache.lucene.util.TestRuleIgnoreTestSuites$1.evaluate(TestRuleIgnoreTestSuites.java:54)
	at com.carrotsearch.randomizedtesting.rules.StatementAdapter.evaluate(StatementAdapter.java:36)
	at com.carrotsearch.randomizedtesting.ThreadLeakControl$StatementRunner.run(ThreadLeakControl.java:368)
	at java.lang.Thread.run(Thread.java:748)




Build Log:
[...truncated 11742 lines...]
   [junit4] Suite: org.apache.solr.client.solrj.embedded.TestEmbeddedSolrServerSchemaAPI
   [junit4]   2> 303584 INFO  (SUITE-TestEmbeddedSolrServerSchemaAPI-seed#[E4387BC07D208D8]-worker) [    ] o.a.s.SolrTestCaseJ4 SecureRandom sanity checks: test.solr.allowed.securerandom=null & java.security.egd=file:/dev/./urandom
   [junit4]   2> Creating dataDir: /Users/jenkins/workspace/Lucene-Solr-master-MacOSX/solr/build/solr-core/test/J0/temp/solr.client.solrj.embedded.TestEmbeddedSolrServerSchemaAPI_E4387BC07D208D8-001/init-core-data-001
   [junit4]   2> 303585 WARN  (SUITE-TestEmbeddedSolrServerSchemaAPI-seed#[E4387BC07D208D8]-worker) [    ] o.a.s.SolrTestCaseJ4 startTrackingSearchers: numOpens=44 numCloses=44
   [junit4]   2> 303585 INFO  (SUITE-TestEmbeddedSolrServerSchemaAPI-seed#[E4387BC07D208D8]-worker) [    ] o.a.s.SolrTestCaseJ4 Using PointFields (NUMERIC_POINTS_SYSPROP=true) w/NUMERIC_DOCVALUES_SYSPROP=true
   [junit4]   2> 303589 INFO  (SUITE-TestEmbeddedSolrServerSchemaAPI-seed#[E4387BC07D208D8]-worker) [    ] o.a.s.SolrTestCaseJ4 Randomized ssl (false) and clientAuth (false) via: @org.apache.solr.util.RandomizeSSL(reason=, value=NaN, ssl=NaN, clientAuth=NaN) w/ MAC_OS_X supressed clientAuth
   [junit4]   2> 303592 INFO  (SUITE-TestEmbeddedSolrServerSchemaAPI-seed#[E4387BC07D208D8]-worker) [    ] o.a.s.SolrTestCaseJ4 ####initCore
   [junit4]   2> 303606 INFO  (SUITE-TestEmbeddedSolrServerSchemaAPI-seed#[E4387BC07D208D8]-worker) [    ] o.a.s.c.SolrConfig Using Lucene MatchVersion: 8.0.0
   [junit4]   2> 303619 INFO  (SUITE-TestEmbeddedSolrServerSchemaAPI-seed#[E4387BC07D208D8]-worker) [    ] o.a.s.s.ManagedIndexSchemaFactory The schema is configured as managed, but managed schema resource managed-schema not found - loading non-managed schema schema.xml instead
   [junit4]   2> 303620 INFO  (SUITE-TestEmbeddedSolrServerSchemaAPI-seed#[E4387BC07D208D8]-worker) [    ] o.a.s.s.IndexSchema [null] Schema name=tiny
   [junit4]   2> 303626 INFO  (SUITE-TestEmbeddedSolrServerSchemaAPI-seed#[E4387BC07D208D8]-worker) [    ] o.a.s.s.IndexSchema Loaded schema tiny/1.1 with uniqueid field id
   [junit4]   2> 303626 INFO  (SUITE-TestEmbeddedSolrServerSchemaAPI-seed#[E4387BC07D208D8]-worker) [    ] o.a.s.s.ManagedIndexSchema Upgraded to managed schema at /Users/jenkins/workspace/Lucene-Solr-master-MacOSX/solr/build/solr-core/test/J0/temp/solr.client.solrj.embedded.TestEmbeddedSolrServerSchemaAPI_E4387BC07D208D8-001/tmp-home-001/collection1/conf/managed-schema
   [junit4]   2> 303627 INFO  (SUITE-TestEmbeddedSolrServerSchemaAPI-seed#[E4387BC07D208D8]-worker) [    ] o.a.s.s.ManagedIndexSchemaFactory After upgrading to managed schema, renamed the non-managed schema /Users/jenkins/workspace/Lucene-Solr-master-MacOSX/solr/build/solr-core/test/J0/temp/solr.client.solrj.embedded.TestEmbeddedSolrServerSchemaAPI_E4387BC07D208D8-001/tmp-home-001/collection1/conf/schema.xml to /Users/jenkins/workspace/Lucene-Solr-master-MacOSX/solr/build/solr-core/test/J0/temp/solr.client.solrj.embedded.TestEmbeddedSolrServerSchemaAPI_E4387BC07D208D8-001/tmp-home-001/collection1/conf/schema.xml.bak
   [junit4]   2> 303673 INFO  (SUITE-TestEmbeddedSolrServerSchemaAPI-seed#[E4387BC07D208D8]-worker) [    ] o.a.s.m.r.SolrJmxReporter JMX monitoring for 'solr.node' (registry 'solr.node') enabled at server: com.sun.jmx.mbeanserver.JmxMBeanServer@2c35c508
   [junit4]   2> 303694 INFO  (SUITE-TestEmbeddedSolrServerSchemaAPI-seed#[E4387BC07D208D8]-worker) [    ] o.a.s.m.r.SolrJmxReporter JMX monitoring for 'solr.jvm' (registry 'solr.jvm') enabled at server: com.sun.jmx.mbeanserver.JmxMBeanServer@2c35c508
   [junit4]   2> 303694 INFO  (SUITE-TestEmbeddedSolrServerSchemaAPI-seed#[E4387BC07D208D8]-worker) [    ] o.a.s.m.r.SolrJmxReporter JMX monitoring for 'solr.jetty' (registry 'solr.jetty') enabled at server: com.sun.jmx.mbeanserver.JmxMBeanServer@2c35c508
   [junit4]   2> 303696 INFO  (coreLoadExecutor-1483-thread-1) [    ] o.a.s.c.TransientSolrCoreCacheDefault Allocating transient cache for 2147483647 transient cores
   [junit4]   2> 303711 INFO  (coreLoadExecutor-1483-thread-1) [    x:collection1] o.a.s.c.SolrConfig Using Lucene MatchVersion: 8.0.0
   [junit4]   2> 303722 INFO  (coreLoadExecutor-1483-thread-1) [    x:collection1] o.a.s.s.IndexSchema [collection1] Schema name=tiny
   [junit4]   2> 303724 INFO  (coreLoadExecutor-1483-thread-1) [    x:collection1] o.a.s.s.IndexSchema Loaded schema tiny/1.1 with uniqueid field id
   [junit4]   2> 303724 INFO  (coreLoadExecutor-1483-thread-1) [    x:collection1] o.a.s.c.CoreContainer Creating SolrCore 'collection1' using configuration from instancedir /Users/jenkins/workspace/Lucene-Solr-master-MacOSX/solr/build/solr-core/test/J0/temp/solr.client.solrj.embedded.TestEmbeddedSolrServerSchemaAPI_E4387BC07D208D8-001/tmp-home-001/collection1, trusted=true
   [junit4]   2> 303725 INFO  (coreLoadExecutor-1483-thread-1) [    x:collection1] o.a.s.m.r.SolrJmxReporter JMX monitoring for 'solr.core.collection1' (registry 'solr.core.collection1') enabled at server: com.sun.jmx.mbeanserver.JmxMBeanServer@2c35c508
   [junit4]   2> 303725 INFO  (coreLoadExecutor-1483-thread-1) [    x:collection1] o.a.s.c.SolrCore solr.RecoveryStrategy.Builder
   [junit4]   2> 303725 INFO  (coreLoadExecutor-1483-thread-1) [    x:collection1] o.a.s.c.SolrCore [[collection1] ] Opening new SolrCore at [/Users/jenkins/workspace/Lucene-Solr-master-MacOSX/solr/build/solr-core/test/J0/temp/solr.client.solrj.embedded.TestEmbeddedSolrServerSchemaAPI_E4387BC07D208D8-001/tmp-home-001/collection1], dataDir=[/Users/jenkins/workspace/Lucene-Solr-master-MacOSX/solr/build/solr-core/test/J0/temp/solr.client.solrj.embedded.TestEmbeddedSolrServerSchemaAPI_E4387BC07D208D8-001/init-core-data-001/]
   [junit4]   2> 303728 INFO  (coreLoadExecutor-1483-thread-1) [    x:collection1] o.a.s.u.RandomMergePolicy RandomMergePolicy wrapping class org.apache.lucene.index.TieredMergePolicy: [TieredMergePolicy: maxMergeAtOnce=25, maxMergeAtOnceExplicit=36, maxMergedSegmentMB=72.837890625, floorSegmentMB=0.4423828125, forceMergeDeletesPctAllowed=6.844702382542134, segmentsPerTier=28.0, maxCFSSegmentSizeMB=8.796093022207999E12, noCFSRatio=0.0
   [junit4]   2> 303733 WARN  (coreLoadExecutor-1483-thread-1) [    x:collection1] o.a.s.c.RequestHandlers INVALID paramSet a in requestHandler {type = requestHandler,name = /dump,class = DumpRequestHandler,attributes = {initParams=a, name=/dump, registerPath=/solr,/v2, class=DumpRequestHandler},args = {defaults={a=A,b=B}}}
   [junit4]   2> 303779 INFO  (coreLoadExecutor-1483-thread-1) [    x:collection1] o.a.s.u.UpdateHandler Using UpdateLog implementation: org.apache.solr.update.UpdateLog
   [junit4]   2> 303779 INFO  (coreLoadExecutor-1483-thread-1) [    x:collection1] o.a.s.u.UpdateLog Initializing UpdateLog: dataDir= defaultSyncLevel=FLUSH numRecordsToKeep=100 maxNumLogsToKeep=10 numVersionBuckets=65536
   [junit4]   2> 303780 INFO  (coreLoadExecutor-1483-thread-1) [    x:collection1] o.a.s.u.CommitTracker Hard AutoCommit: disabled
   [junit4]   2> 303780 INFO  (coreLoadExecutor-1483-thread-1) [    x:collection1] o.a.s.u.CommitTracker Soft AutoCommit: disabled
   [junit4]   2> 303781 INFO  (coreLoadExecutor-1483-thread-1) [    x:collection1] o.a.s.u.RandomMergePolicy RandomMergePolicy wrapping class org.apache.lucene.index.TieredMergePolicy: [TieredMergePolicy: maxMergeAtOnce=25, maxMergeAtOnceExplicit=12, maxMergedSegmentMB=48.2353515625, floorSegmentMB=1.4658203125, forceMergeDeletesPctAllowed=24.25952102689982, segmentsPerTier=24.0, maxCFSSegmentSizeMB=8.796093022207999E12, noCFSRatio=0.38000632432617565
   [junit4]   2> 303790 INFO  (coreLoadExecutor-1483-thread-1) [    x:collection1] o.a.s.s.SolrIndexSearcher Opening [Searcher@16876d39[collection1] main]
   [junit4]   2> 303791 INFO  (coreLoadExecutor-1483-thread-1) [    x:collection1] o.a.s.r.ManagedResourceStorage File-based storage initialized to use dir: /Users/jenkins/workspace/Lucene-Solr-master-MacOSX/solr/build/solr-core/test/J0/temp/solr.client.solrj.embedded.TestEmbeddedSolrServerSchemaAPI_E4387BC07D208D8-001/tmp-home-001/collection1/conf
   [junit4]   2> 303791 INFO  (coreLoadExecutor-1483-thread-1) [    x:collection1] o.a.s.h.ReplicationHandler Commits will be reserved for 10000ms.
   [junit4]   2> 303791 INFO  (coreLoadExecutor-1483-thread-1) [    x:collection1] o.a.s.u.UpdateLog Could not find max version in index or recent updates, using new clock 1589127245868302336
   [junit4]   2> 303792 INFO  (searcherExecutor-1484-thread-1-processing-x:collection1) [    x:collection1] o.a.s.c.SolrCore [collection1] Registered new searcher Searcher@16876d39[collection1] main{ExitableDirectoryReader(UninvertingDirectoryReader())}
   [junit4]   2> 303796 INFO  (SUITE-TestEmbeddedSolrServerSchemaAPI-seed#[E4387BC07D208D8]-worker) [    ] o.a.s.SolrTestCaseJ4 ####initCore end
   [junit4]   2> 303813 INFO  (TEST-TestEmbeddedSolrServerSchemaAPI.testSchemaAddFieldAndVerifyExistence-seed#[E4387BC07D208D8]) [    ] o.a.s.SolrTestCaseJ4 ###Starting testSchemaAddFieldAndVerifyExistence
   [junit4]   2> 303821 INFO  (TEST-TestEmbeddedSolrServerSchemaAPI.testSchemaAddFieldAndVerifyExistence-seed#[E4387BC07D208D8]) [    ] o.a.s.c.S.Request [collection1]  webapp=null path=/schema/fields/VerificationTest params={} status=404 QTime=0
   [junit4]   2> 303821 INFO  (TEST-TestEmbeddedSolrServerSchemaAPI.testSchemaAddFieldAndVerifyExistence-seed#[E4387BC07D208D8]) [    ] o.a.s.SolrTestCaseJ4 ###Ending testSchemaAddFieldAndVerifyExistence
   [junit4] IGNOR/A 0.01s J0 | TestEmbeddedSolrServerSchemaAPI.testSchemaAddFieldAndVerifyExistence
   [junit4]    > Assumption #1: it needs to ammend schema
   [junit4]   2> 303823 INFO  (TEST-TestEmbeddedSolrServerSchemaAPI.testSchemaAddFieldAndFailOnImmutable-seed#[E4387BC07D208D8]) [    ] o.a.s.SolrTestCaseJ4 ###Starting testSchemaAddFieldAndFailOnImmutable
   [junit4]   2> 303823 INFO  (TEST-TestEmbeddedSolrServerSchemaAPI.testSchemaAddFieldAndFailOnImmutable-seed#[E4387BC07D208D8]) [    ] o.a.s.c.S.Request [collection1]  webapp=null path=/schema/fields/VerificationTest params={} status=404 QTime=0
   [junit4]   2> 303845 ERROR (TEST-TestEmbeddedSolrServerSchemaAPI.testSchemaAddFieldAndFailOnImmutable-seed#[E4387BC07D208D8]) [    ] o.a.s.h.RequestHandlerBase org.apache.solr.api.ApiBag$ExceptionWithErrObject: error processing commands, errors: [{errorMessages=schema is not editable}], 
   [junit4]   2> 	at org.apache.solr.handler.SchemaHandler.handleRequestBody(SchemaHandler.java:92)
   [junit4]   2> 	at org.apache.solr.handler.RequestHandlerBase.handleRequest(RequestHandlerBase.java:177)
   [junit4]   2> 	at org.apache.solr.core.SolrCore.execute(SolrCore.java:2503)
   [junit4]   2> 	at org.apache.solr.client.solrj.embedded.EmbeddedSolrServer.request(EmbeddedSolrServer.java:180)
   [junit4]   2> 	at org.apache.solr.client.solrj.SolrRequest.process(SolrRequest.java:194)
   [junit4]   2> 	at org.apache.solr.client.solrj.SolrRequest.process(SolrRequest.java:211)
   [junit4]   2> 	at org.apache.solr.client.solrj.embedded.TestEmbeddedSolrServerSchemaAPI.testSchemaAddFieldAndFailOnImmutable(TestEmbeddedSolrServerSchemaAPI.java:105)
   [junit4]   2> 	at sun.reflect.NativeMethodAccessorImpl.invoke0(Native Method)
   [junit4]   2> 	at sun.reflect.NativeMethodAccessorImpl.invoke(NativeMethodAccessorImpl.java:62)
   [junit4]   2> 	at sun.reflect.DelegatingMethodAccessorImpl.invoke(DelegatingMethodAccessorImpl.java:43)
   [junit4]   2> 	at java.lang.reflect.Method.invoke(Method.java:498)
   [junit4]   2> 	at com.carrotsearch.randomizedtesting.RandomizedRunner.invoke(RandomizedRunner.java:1737)
   [junit4]   2> 	at com.carrotsearch.randomizedtesting.RandomizedRunner$8.evaluate(RandomizedRunner.java:934)
   [junit4]   2> 	at com.carrotsearch.randomizedtesting.RandomizedRunner$9.evaluate(RandomizedRunner.java:970)
   [junit4]   2> 	at com.carrotsearch.randomizedtesting.RandomizedRunner$10.evaluate(RandomizedRunner.java:984)
   [junit4]   2> 	at com.carrotsearch.randomizedtesting.rules.SystemPropertiesRestoreRule$1.evaluate(SystemPropertiesRestoreRule.java:57)
   [junit4]   2> 	at org.apache.lucene.util.TestRuleSetupTeardownChained$1.evaluate(TestRuleSetupTeardownChained.java:49)
   [junit4]   2> 	at org.apache.lucene.util.AbstractBeforeAfterRule$1.evaluate(AbstractBeforeAfterRule.java:45)
   [junit4]   2> 	at org.apache.lucene.util.TestRuleThreadAndTestName$1.evaluate(TestRuleThreadAndTestName.java:48)
   [junit4]   2> 	at org.apache.lucene.util.TestRuleIgnoreAfterMaxFailures$1.evaluate(TestRuleIgnoreAfterMaxFailures.java:64)
   [junit4]   2> 	at org.apache.lucene.util.TestRuleMarkFailure$1.evaluate(TestRuleMarkFailure.java:47)
   [junit4]   2> 	at com.carrotsearch.randomizedtesting.rules.StatementAdapter.evaluate(StatementAdapter.java:36)
   [junit4]   2> 	at com.carrotsearch.randomizedtesting.ThreadLeakControl$StatementRunner.run(ThreadLeakControl.java:368)
   [junit4]   2> 	at com.carrotsearch.randomizedtesting.ThreadLeakControl.forkTimeoutingTask(ThreadLeakControl.java:817)
   [junit4]   2> 	at com.carrotsearch.randomizedtesting.ThreadLeakControl$3.evaluate(ThreadLeakControl.java:468)
   [junit4]   2> 	at com.carrotsearch.randomizedtesting.RandomizedRunner.runSingleTest(RandomizedRunner.java:943)
   [junit4]   2> 	at com.carrotsearch.randomizedtesting.RandomizedRunner$5.evaluate(RandomizedRunner.java:829)
   [junit4]   2> 	at com.carrotsearch.randomizedtesting.RandomizedRunner$6.evaluate(RandomizedRunner.java:879)
   [junit4]   2> 	at com.carrotsearch.randomizedtesting.RandomizedRunner$7.evaluate(RandomizedRunner.java:890)
   [junit4]   2> 	at com.carrotsearch.randomizedtesting.rules.StatementAdapter.evaluate(StatementAdapter.java:36)
   [junit4]   2> 	at com.carrotsearch.randomizedtesting.rules.SystemPropertiesRestoreRule$1.evaluate(SystemPropertiesRestoreRule.java:57)
   [junit4]   2> 	at org.apache.lucene.util.AbstractBeforeAfterRule$1.evaluate(AbstractBeforeAfterRule.java:45)
   [junit4]   2> 	at com.carrotsearch.randomizedtesting.rules.StatementAdapter.evaluate(StatementAdapter.java:36)
   [junit4]   2> 	at org.apache.lucene.util.TestRuleStoreClassName$1.evaluate(TestRuleStoreClassName.java:41)
   [junit4]   2> 	at com.carrotsearch.randomizedtesting.rules.NoShadowingOrOverridesOnMethodsRule$1.evaluate(NoShadowingOrOverridesOnMethodsRule.java:40)
   [junit4]   2> 	at com.carrotsearch.randomizedtesting.rules.NoShadowingOrOverridesOnMethodsRule$1.evaluate(NoShadowingOrOverridesOnMethodsRule.java:40)
   [junit4]   2> 	at com.carrotsearch.randomizedtesting.rules.StatementAdapter.evaluate(StatementAdapter.java:36)
   [junit4]   2> 	at com.carrotsearch.randomizedtesting.rules.StatementAdapter.evaluate(StatementAdapter.java:36)
   [junit4]   2> 	at com.carrotsearch.randomizedtesting.rules.StatementAdapter.evaluate(StatementAdapter.java:36)
   [junit4]   2> 	at org.apache.lucene.util.TestRuleAssertionsRequired$1.evaluate(TestRuleAssertionsRequired.java:53)
   [junit4]   2> 	at org.apache.lucene.util.TestRuleMarkFailure$1.evaluate(TestRuleMarkFailure.java:47)
   [junit4]   2> 	at org.apache.lucene.util.TestRuleIgnoreAfterMaxFailures$1.evaluate(TestRuleIgnoreAfterMaxFailures.java:64)
   [junit4]   2> 	at org.apache.lucene.util.TestRuleIgnoreTestSuites$1.evaluate(TestRuleIgnoreTestSuites.java:54)
   [junit4]   2> 	at com.carrotsearch.randomizedtesting.rules.StatementAdapter.evaluate(StatementAdapter.java:36)
   [junit4]   2> 	at com.carrotsearch.randomizedtesting.ThreadLeakControl$StatementRunner.run(ThreadLeakControl.java:368)
   [junit4]   2> 	at java.lang.Thread.run(Thread.java:748)
   [junit4]   2> 
   [junit4]   2> 303851 INFO  (TEST-TestEmbeddedSolrServerSchemaAPI.testSchemaAddFieldAndFailOnImmutable-seed#[E4387BC07D208D8]) [    ] o.a.s.c.S.Request [collection1]  webapp=null path=/schema params={} status=400 QTime=9
   [junit4]   2> 303852 INFO  (TEST-TestEmbeddedSolrServerSchemaAPI.testSchemaAddFieldAndFailOnImmutable-seed#[E4387BC07D208D8]) [    ] o.a.s.SolrTestCaseJ4 ###Ending testSchemaAddFieldAndFailOnImmutable
   [junit4]   2> NOTE: reproduce with: ant test  -Dtestcase=TestEmbeddedSolrServerSchemaAPI -Dtests.method=testSchemaAddFieldAndFailOnImmutable -Dtests.seed=E4387BC07D208D8 -Dtests.slow=true -Dtests.locale=sr-BA -Dtests.timezone=Pacific/Tarawa -Dtests.asserts=true -Dtests.file.encoding=UTF-8
   [junit4] ERROR   0.03s J0 | TestEmbeddedSolrServerSchemaAPI.testSchemaAddFieldAndFailOnImmutable <<<
   [junit4]    > Throwable #1: org.apache.solr.api.ApiBag$ExceptionWithErrObject: error processing commands, errors: [{errorMessages=schema is not editable}], 
   [junit4]    > 	at __randomizedtesting.SeedInfo.seed([E4387BC07D208D8:95F7686D5A4462C9]:0)
   [junit4]    > 	at org.apache.solr.handler.SchemaHandler.handleRequestBody(SchemaHandler.java:92)
   [junit4]    > 	at org.apache.solr.handler.RequestHandlerBase.handleRequest(RequestHandlerBase.java:177)
   [junit4]    > 	at org.apache.solr.core.SolrCore.execute(SolrCore.java:2503)
   [junit4]    > 	at org.apache.solr.client.solrj.embedded.EmbeddedSolrServer.request(EmbeddedSolrServer.java:180)
   [junit4]    > 	at org.apache.solr.client.solrj.SolrRequest.process(SolrRequest.java:194)
   [junit4]    > 	at org.apache.solr.client.solrj.SolrRequest.process(SolrRequest.java:211)
   [junit4]    > 	at org.apache.solr.client.solrj.embedded.TestEmbeddedSolrServerSchemaAPI.testSchemaAddFieldAndFailOnImmutable(TestEmbeddedSolrServerSchemaAPI.java:105)
   [junit4]    > 	at java.lang.Thread.run(Thread.java:748)
   [junit4]   2> 303853 INFO  (SUITE-TestEmbeddedSolrServerSchemaAPI-seed#[E4387BC07D208D8]-worker) [    ] o.a.s.c.CoreContainer Shutting down CoreContainer instance=3329148
   [junit4]   2> 303853 INFO  (SUITE-TestEmbeddedSolrServerSchemaAPI-seed#[E4387BC07D208D8]-worker) [    ] o.a.s.m.SolrMetricManager Closing metric reporters for registry=solr.node, tag=null
   [junit4]   2> 303853 INFO  (SUITE-TestEmbeddedSolrServerSchemaAPI-seed#[E4387BC07D208D8]-worker) [    ] o.a.s.m.r.SolrJmxReporter Closing reporter [org.apache.solr.metrics.reporters.SolrJmxReporter@6bfedbfc: rootName = null, domain = solr.node, service url = null, agent id = null] for registry solr.node / com.codahale.metrics.MetricRegistry@7b88e8e9
   [junit4]   2> 303857 INFO  (SUITE-TestEmbeddedSolrServerSchemaAPI-seed#[E4387BC07D208D8]-worker) [    ] o.a.s.m.SolrMetricManager Closing metric reporters for registry=solr.jvm, tag=null
   [junit4]   2> 303857 INFO  (SUITE-TestEmbeddedSolrServerSchemaAPI-seed#[E4387BC07D208D8]-worker) [    ] o.a.s.m.r.SolrJmxReporter Closing reporter [org.apache.solr.metrics.reporters.SolrJmxReporter@17bb3e4d: rootName = null, domain = solr.jvm, service url = null, agent id = null] for registry solr.jvm / com.codahale.metrics.MetricRegistry@72e2b4cb
   [junit4]   2> 303859 INFO  (SUITE-TestEmbeddedSolrServerSchemaAPI-seed#[E4387BC07D208D8]-worker) [    ] o.a.s.m.SolrMetricManager Closing metric reporters for registry=solr.jetty, tag=null
   [junit4]   2> 303859 INFO  (SUITE-TestEmbeddedSolrServerSchemaAPI-seed#[E4387BC07D208D8]-worker) [    ] o.a.s.m.r.SolrJmxReporter Closing reporter [org.apache.solr.metrics.reporters.SolrJmxReporter@101ffc64: rootName = null, domain = solr.jetty, service url = null, agent id = null] for registry solr.jetty / com.codahale.metrics.MetricRegistry@d3cd4eb
   [junit4]   2> 303860 INFO  (coreCloseExecutor-1489-thread-1) [    x:collection1] o.a.s.c.SolrCore [collection1]  CLOSING SolrCore org.apache.solr.core.SolrCore@45e51f19
   [junit4]   2> 303860 INFO  (coreCloseExecutor-1489-thread-1) [    x:collection1] o.a.s.m.SolrMetricManager Closing metric reporters for registry=solr.core.collection1, tag=1172643609
   [junit4]   2> 303860 INFO  (coreCloseExecutor-1489-thread-1) [    x:collection1] o.a.s.m.r.SolrJmxReporter Closing reporter [org.apache.solr.metrics.reporters.SolrJmxReporter@4060e31a: rootName = null, domain = solr.core.collection1, service url = null, agent id = null] for registry solr.core.collection1 / com.codahale.metrics.MetricRegistry@7249d019
   [junit4]   2> 303867 INFO  (SUITE-TestEmbeddedSolrServerSchemaAPI-seed#[E4387BC07D208D8]-worker) [    ] o.a.s.SolrTestCaseJ4 ###deleteCore
   [junit4]   2> 303867 INFO  (SUITE-TestEmbeddedSolrServerSchemaAPI-seed#[E4387BC07D208D8]-worker) [    ] o.a.s.c.CoreContainer Shutting down CoreContainer instance=3329148
   [junit4]   2> 303867 INFO  (SUITE-TestEmbeddedSolrServerSchemaAPI-seed#[E4387BC07D208D8]-worker) [    ] o.a.s.m.SolrMetricManager Closing metric reporters for registry=solr.node, tag=null
   [junit4]   2> 303867 INFO  (SUITE-TestEmbeddedSolrServerSchemaAPI-seed#[E4387BC07D208D8]-worker) [    ] o.a.s.m.SolrMetricManager Closing metric reporters for registry=solr.jvm, tag=null
   [junit4]   2> 303867 INFO  (SUITE-TestEmbeddedSolrServerSchemaAPI-seed#[E4387BC07D208D8]-worker) [    ] o.a.s.m.SolrMetricManager Closing metric reporters for registry=solr.jetty, tag=null
   [junit4]   2> NOTE: leaving temporary files on disk at: /Users/jenkins/workspace/Lucene-Solr-master-MacOSX/solr/build/solr-core/test/J0/temp/solr.client.solrj.embedded.TestEmbeddedSolrServerSchemaAPI_E4387BC07D208D8-001
   [junit4]   2> NOTE: test params are: codec=Asserting(Lucene70): {}, docValues:{}, maxPointsInLeafNode=1377, maxMBSortInHeap=7.408867718105429, sim=Asserting(org.apache.lucene.search.similarities.AssertingSimilarity@2774b9db), locale=sr-BA, timezone=Pacific/Tarawa
   [junit4]   2> NOTE: Mac OS X 10.11.6 x86_64/Oracle Corporation 1.8.0_144 (64-bit)/cpus=3,threads=1,free=114198568,total=220168192
   [junit4]   2> NOTE: All tests run in this JVM: [BooleanFieldTest, CollectionsAPISolrJTest, OutOfBoxZkACLAndCredentialsProvidersTest, CursorMarkTest, CleanupOldIndexTest, TestLegacyFieldCache, TestPullReplica, DisMaxRequestHandlerTest, BlobRepositoryCloudTest, TestJmxIntegration, ConfigSetsAPITest, TestPHPSerializedResponseWriter, TestTolerantSearch, GraphQueryTest, TestCryptoKeys, PKIAuthenticationIntegrationTest, StatsComponentTest, UninvertDocValuesMergePolicyTest, SpatialHeatmapFacetsTest, TestEmbeddedSolrServerSchemaAPI]
   [junit4] Completed [58/767 (1!)] on J0 in 0.29s, 2 tests, 1 error, 1 skipped <<< FAILURES!

[...truncated 3257 lines...]
   [junit4] Suite: org.apache.solr.client.solrj.request.SchemaTest
   [junit4]   2> Creating dataDir: /Users/jenkins/workspace/Lucene-Solr-master-MacOSX/solr/build/solr-solrj/test/J0/temp/solr.client.solrj.request.SchemaTest_32C8BE505D3A03C-001/init-core-data-001
   [junit4]   2> 185837 WARN  (SUITE-SchemaTest-seed#[32C8BE505D3A03C]-worker) [    ] o.a.s.SolrTestCaseJ4 startTrackingSearchers: numOpens=74 numCloses=74
   [junit4]   2> 185837 INFO  (SUITE-SchemaTest-seed#[32C8BE505D3A03C]-worker) [    ] o.a.s.SolrTestCaseJ4 Using PointFields (NUMERIC_POINTS_SYSPROP=true) w/NUMERIC_DOCVALUES_SYSPROP=true
   [junit4]   2> 185841 INFO  (SUITE-SchemaTest-seed#[32C8BE505D3A03C]-worker) [    ] o.a.s.SolrTestCaseJ4 Randomized ssl (false) and clientAuth (false) via: @org.apache.solr.util.RandomizeSSL(reason=, value=NaN, ssl=NaN, clientAuth=NaN) w/ MAC_OS_X supressed clientAuth
   [junit4]   2> 185841 INFO  (SUITE-SchemaTest-seed#[32C8BE505D3A03C]-worker) [    ] o.a.s.SolrTestCaseJ4 SecureRandom sanity checks: test.solr.allowed.securerandom=null & java.security.egd=file:/dev/./urandom
   [junit4]   2> 185843 INFO  (TEST-SchemaTest.deletingAFieldTypeThatDoesntExistInTheSchemaShouldFail-seed#[32C8BE505D3A03C]) [    ] o.a.s.SolrTestCaseJ4 ###Starting deletingAFieldTypeThatDoesntExistInTheSchemaShouldFail
   [junit4]   2> 185942 INFO  (TEST-SchemaTest.deletingAFieldTypeThatDoesntExistInTheSchemaShouldFail-seed#[32C8BE505D3A03C]) [    ] o.a.s.SolrTestCaseJ4 ####initCore
   [junit4]   2> 185943 INFO  (TEST-SchemaTest.deletingAFieldTypeThatDoesntExistInTheSchemaShouldFail-seed#[32C8BE505D3A03C]) [    ] o.a.s.SolrTestCaseJ4 ####initCore end
   [junit4]   2> 185943 INFO  (TEST-SchemaTest.deletingAFieldTypeThatDoesntExistInTheSchemaShouldFail-seed#[32C8BE505D3A03C]) [    ] o.a.s.SolrTestCaseJ4 Writing core.properties file to /Users/jenkins/workspace/Lucene-Solr-master-MacOSX/solr/build/solr-solrj/test/J0/temp/solr.client.solrj.request.SchemaTest_32C8BE505D3A03C-001/tempDir-003/cores/core
   [junit4]   2> 185945 INFO  (TEST-SchemaTest.deletingAFieldTypeThatDoesntExistInTheSchemaShouldFail-seed#[32C8BE505D3A03C]) [    ] o.e.j.s.Server jetty-9.3.20.v20170531
   [junit4]   2> 185947 INFO  (TEST-SchemaTest.deletingAFieldTypeThatDoesntExistInTheSchemaShouldFail-seed#[32C8BE505D3A03C]) [    ] o.e.j.s.h.ContextHandler Started o.e.j.s.ServletContextHandler@3a024c0b{/solr,null,AVAILABLE}
   [junit4]   2> 185947 INFO  (TEST-SchemaTest.deletingAFieldTypeThatDoesntExistInTheSchemaShouldFail-seed#[32C8BE505D3A03C]) [    ] o.e.j.s.AbstractConnector Started ServerConnector@4c5b5527{HTTP/1.1,[http/1.1]}{127.0.0.1:56019}
   [junit4]   2> 185948 INFO  (TEST-SchemaTest.deletingAFieldTypeThatDoesntExistInTheSchemaShouldFail-seed#[32C8BE505D3A03C]) [    ] o.e.j.s.Server Started @191760ms
   [junit4]   2> 185948 INFO  (TEST-SchemaTest.deletingAFieldTypeThatDoesntExistInTheSchemaShouldFail-seed#[32C8BE505D3A03C]) [    ] o.a.s.c.s.e.JettySolrRunner Jetty properties: {hostContext=/solr, hostPort=56019, configSetBaseDir=/Users/jenkins/workspace/Lucene-Solr-master-MacOSX/solr/build/solr-solrj/test/J0/temp/solr.client.solrj.request.SchemaTest_32C8BE505D3A03C-001/tempDir-001, coreRootDirectory=/Users/jenkins/workspace/Lucene-Solr-master-MacOSX/solr/build/solr-solrj/test/J0/temp/solr.client.solrj.request.SchemaTest_32C8BE505D3A03C-001/tempDir-003/cores}
   [junit4]   2> 185951 ERROR (TEST-SchemaTest.deletingAFieldTypeThatDoesntExistInTheSchemaShouldFail-seed#[32C8BE505D3A03C]) [    ] o.a.s.u.StartupLoggingUtils Missing Java Option solr.log.dir. Logging may be missing or incomplete.
   [junit4]   2> 185951 INFO  (TEST-SchemaTest.deletingAFieldTypeThatDoesntExistInTheSchemaShouldFail-seed#[32C8BE505D3A03C]) [    ] o.a.s.s.SolrDispatchFilter  ___      _       Welcome to Apache Solr? version 8.0.0
   [junit4]   2> 185951 INFO  (TEST-SchemaTest.deletingAFieldTypeThatDoesntExistInTheSchemaShouldFail-seed#[32C8BE505D3A03C]) [    ] o.a.s.s.SolrDispatchFilter / __| ___| |_ _   Starting in standalone mode on port null
   [junit4]   2> 185951 INFO  (TEST-SchemaTest.deletingAFieldTypeThatDoesntExistInTheSchemaShouldFail-seed#[32C8BE505D3A03C]) [    ] o.a.s.s.SolrDispatchFilter \__ \/ _ \ | '_|  Install dir: null
   [junit4]   2> 185951 INFO  (TEST-SchemaTest.deletingAFieldTypeThatDoesntExistInTheSchemaShouldFail-seed#[32C8BE505D3A03C]) [    ] o.a.s.s.SolrDispatchFilter |___/\___/_|_|    Start time: 2018-01-09T16:01:43.345Z
   [junit4]   2> 185952 INFO  (TEST-SchemaTest.deletingAFieldTypeThatDoesntExistInTheSchemaShouldFail-seed#[32C8BE505D3A03C]) [    ] o.a.s.c.SolrXmlConfig Loading container configuration from /Users/jenkins/workspace/Lucene-Solr-master-MacOSX/solr/build/solr-solrj/test/J0/temp/solr.client.solrj.request.SchemaTest_32C8BE505D3A03C-001/tempDir-001/solr.xml
   [junit4]   2> 185958 INFO  (TEST-SchemaTest.deletingAFieldTypeThatDoesntExistInTheSchemaShouldFail-seed#[32C8BE505D3A03C]) [    ] o.a.s.c.SolrXmlConfig MBean server found: com.sun.jmx.mbeanserver.JmxMBeanServer@3d5cab0f, but no JMX reporters were configured - adding default JMX reporter.
   [junit4]   2> 186038 INFO  (TEST-SchemaTest.deletingAFieldTypeThatDoesntExistInTheSchemaShouldFail-seed#[32C8BE505D3A03C]) [    ] o.a.s.m.r.SolrJmxReporter JMX monitoring for 'solr.node' (registry 'solr.node') enabled at server: com.sun.jmx.mbeanserver.JmxMBeanServer@3d5cab0f
   [junit4]   2> 186049 INFO  (TEST-SchemaTest.deletingAFieldTypeThatDoesntExistInTheSchemaShouldFail-seed#[32C8BE505D3A03C]) [    ] o.a.s.m.r.SolrJmxReporter JMX monitoring for 'solr.jvm' (registry 'solr.jvm') enabled at server: com.sun.jmx.mbeanserver.JmxMBeanServer@3d5cab0f
   [junit4]   2> 186049 INFO  (TEST-SchemaTest.deletingAFieldTypeThatDoesntExistInTheSchemaShouldFail-seed#[32C8BE505D3A03C]) [    ] o.a.s.m.r.SolrJmxReporter JMX monitoring for 'solr.jetty' (registry 'solr.jetty') enabled at server: com.sun.jmx.mbeanserver.JmxMBeanServer@3d5cab0f
   [junit4]   2> 186052 INFO  (TEST-SchemaTest.deletingAFieldTypeThatDoesntExistInTheSchemaShouldFail-seed#[32C8BE505D3A03C]) [    ] o.a.s.c.CorePropertiesLocator Found 1 core definitions underneath /Users/jenkins/workspace/Lucene-Solr-master-MacOSX/solr/build/solr-solrj/test/J0/temp/solr.client.solrj.request.SchemaTest_32C8BE505D3A03C-001/tempDir-003/cores
   [junit4]   2> 186052 INFO  (TEST-SchemaTest.deletingAFieldTypeThatDoesntExistInTheSchemaShouldFail-seed#[32C8BE505D3A03C]) [    ] o.a.s.c.CorePropertiesLocator Cores are: [collection1]
   [junit4]   2> 186052 INFO  (coreLoadExecutor-921-thread-1) [    ] o.a.s.c.TransientSolrCoreCacheDefault Allocating transient cache for 2147483647 transient cores
   [junit4]   2> 186073 INFO  (coreLoadExecutor-921-thread-1) [    x:collection1] o.a.s.c.SolrConfig Using Lucene MatchVersion: 8.0.0
   [junit4]   2> 186090 INFO  (coreLoadExecutor-921-thread-1) [    x:collection1] o.a.s.s.ManagedIndexSchemaFactory The schema is configured as managed, but managed schema resource managed-schema not found - loading non-managed schema schema.xml instead
   [junit4]   2> 186100 INFO  (coreLoadExecutor-921-thread-1) [    x:collection1] o.a.s.s.IndexSchema [collection1] Schema name=test
   [junit4]   2> 186176 WARN  (coreLoadExecutor-921-thread-1) [    x:collection1] o.a.s.s.IndexSchema Field lowerfilt1and2 is not multivalued and destination for multiple copyFields (2)
   [junit4]   2> 186176 WARN  (coreLoadExecutor-921-thread-1) [    x:collection1] o.a.s.s.IndexSchema Field text is not multivalued and destination for multiple copyFields (3)
   [junit4]   2> 186176 INFO  (coreLoadExecutor-921-thread-1) [    x:collection1] o.a.s.s.IndexSchema Loaded schema test/1.6 with uniqueid field id
   [junit4]   2> 186179 INFO  (coreLoadExecutor-921-thread-1) [    x:collection1] o.a.s.s.ManagedIndexSchema Upgraded to managed schema at /Users/jenkins/workspace/Lucene-Solr-master-MacOSX/solr/build/solr-solrj/test/J0/temp/solr.client.solrj.request.SchemaTest_32C8BE505D3A03C-001/tempDir-001/collection1/conf/managed-schema
   [junit4]   2> 186187 INFO  (coreLoadExecutor-921-thread-1) [    x:collection1] o.a.s.s.ManagedIndexSchemaFactory After upgrading to managed schema, renamed the non-managed schema /Users/jenkins/workspace/Lucene-Solr-master-MacOSX/solr/build/solr-solrj/test/J0/temp/solr.client.solrj.request.SchemaTest_32C8BE505D3A03C-001/tempDir-001/collection1/conf/schema.xml to /Users/jenkins/workspace/Lucene-Solr-master-MacOSX/solr/build/solr-solrj/test/J0/temp/solr.client.solrj.request.SchemaTest_32C8BE505D3A03C-001/tempDir-001/collection1/conf/schema.xml.bak
   [junit4]   2> 186187 INFO  (coreLoadExecutor-921-thread-1) [    x:collection1] o.a.s.c.CoreContainer Creating SolrCore 'collection1' using configuration from configset /Users/jenkins/workspace/Lucene-Solr-master-MacOSX/solr/build/solr-solrj/test/J0/temp/solr.client.solrj.request.SchemaTest_32C8BE505D3A03C-001/tempDir-001/collection1, trusted=true
   [junit4]   2> 186188 INFO  (coreLoadExecutor-921-thread-1) [    x:collection1] o.a.s.m.r.SolrJmxReporter JMX monitoring for 'solr.core.collection1' (registry 'solr.core.collection1') enabled at server: com.sun.jmx.mbeanserver.JmxMBeanServer@3d5cab0f
   [junit4]   2> 186188 INFO  (coreLoadExecutor-921-thread-1) [    x:collection1] o.a.s.c.SolrCore solr.RecoveryStrategy.Builder
   [junit4]   2> 186188 INFO  (coreLoadExecutor-921-thread-1) [    x:collection1] o.a.s.c.SolrCore [[collection1] ] Opening new SolrCore at [/Users/jenkins/workspace/Lucene-Solr-master-MacOSX/solr/build/solr-solrj/test/J0/temp/solr.client.solrj.request.SchemaTest_32C8BE505D3A03C-001/tempDir-001/collection1], dataDir=[/Users/jenkins/workspace/Lucene-Solr-master-MacOSX/solr/build/solr-solrj/test/J0/temp/solr.client.solrj.request.SchemaTest_32C8BE505D3A03C-001/tempDir-003/cores/core/data/]
   [junit4]   2> 186263 WARN  (coreLoadExecutor-921-thread-1) [    x:collection1] o.a.s.c.RequestHandlers no default request handler is registered (either '/select' or 'standard')
   [junit4]   2> 186264 INFO  (coreLoadExecutor-921-thread-1) [    x:collection1] o.a.s.u.CommitTracker Hard AutoCommit: disabled
   [junit4]   2> 186264 INFO  (coreLoadExecutor-921-thread-1) [    x:collection1] o.a.s.u.CommitTracker Soft AutoCommit: disabled
   [junit4]   2> 186286 INFO  (coreLoadExecutor-921-thread-1) [    x:collection1] o.a.s.s.SolrIndexSearcher Opening [Searcher@367d0a33[collection1] main]
   [junit4]   2> 186286 INFO  (coreLoadExecutor-921-thread-1) [    x:collection1] o.a.s.r.ManagedResourceStorage File-based storage initialized to use dir: /Users/jenkins/workspace/Lucene-Solr-master-MacOSX/solr/build/solr-solrj/test/J0/temp/solr.client.solrj.request.SchemaTest_32C8BE505D3A03C-001/tempDir-001/collection1/conf
   [junit4]   2> 186287 INFO  (coreLoadExecutor-921-thread-1) [    x:collection1] o.a.s.h.ReplicationHandler Commits will be reserved for 10000ms.
   [junit4]   2> 186288 INFO  (TEST-SchemaTest.deletingAFieldTypeThatDoesntExistInTheSchemaShouldFail-seed#[32C8BE505D3A03C]) [    ] o.a.s.SolrJettyTestBase Jetty Assigned Port#56019
   [junit4]   2> 186288 INFO  (searcherExecutor-922-thread-1-processing-x:collection1) [    x:collection1] o.a.s.c.SolrCore [collection1] Registered new searcher Searcher@367d0a33[collection1] main{ExitableDirectoryReader(UninvertingDirectoryReader())}
   [junit4]   2> 186351 ERROR (qtp39509343-3214) [    x:collection1] o.a.s.h.RequestHandlerBase org.apache.solr.api.ApiBag$ExceptionWithErrObject: error processing commands, errors: [{delete-field-type={name=fieldTypeToBeDeleted}, errorMessages=[The field type 'fieldTypeToBeDeleted' is not present in this schema, and so cannot be deleted.
   [junit4]   2> ]}], 
   [junit4]   2> 	at org.apache.solr.handler.SchemaHandler.handleRequestBody(SchemaHandler.java:92)
   [junit4]   2> 	at org.apache.solr.handler.RequestHandlerBase.handleRequest(RequestHandlerBase.java:177)
   [junit4]   2> 	at org.apache.solr.core.SolrCore.execute(SolrCore.java:2503)
   [junit4]   2> 	at org.apache.solr.servlet.HttpSolrCall.execute(HttpSolrCall.java:711)
   [junit4]   2> 	at org.apache.solr.servlet.HttpSolrCall.call(HttpSolrCall.java:517)
   [junit4]   2> 	at org.apache.solr.servlet.SolrDispatchFilter.doFilter(SolrDispatchFilter.java:380)
   [junit4]   2> 	at org.apache.solr.servlet.SolrDispatchFilter.doFilter(SolrDispatchFilter.java:326)
   [junit4]   2> 	at org.eclipse.jetty.servlet.ServletHandler$CachedChain.doFilter(ServletHandler.java:1759)
   [junit4]   2> 	at org.apache.solr.client.solrj.embedded.JettySolrRunner$DebugFilter.doFilter(JettySolrRunner.java:139)
   [junit4]   2> 	at org.eclipse.jetty.servlet.ServletHandler$CachedChain.doFilter(ServletHandler.java:1759)
   [junit4]   2> 	at org.eclipse.jetty.servlet.ServletHandler.doHandle(ServletHandler.java:582)
   [junit4]   2> 	at org.eclipse.jetty.server.session.SessionHandler.doHandle(SessionHandler.java:224)
   [junit4]   2> 	at org.eclipse.jetty.server.handler.ContextHandler.doHandle(ContextHandler.java:1180)
   [junit4]   2> 	at org.eclipse.jetty.servlet.ServletHandler.doScope(ServletHandler.java:512)
   [junit4]   2> 	at org.eclipse.jetty.server.session.SessionHandler.doScope(SessionHandler.java:185)
   [junit4]   2> 	at org.eclipse.jetty.server.handler.ContextHandler.doScope(ContextHandler.java:1112)
   [junit4]   2> 	at org.eclipse.jetty.server.handler.ScopedHandler.handle(ScopedHandler.java:141)
   [junit4]   2> 	at org.eclipse.jetty.server.handler.gzip.GzipHandler.handle(GzipHandler.java:426)
   [junit4]   2> 	at org.eclipse.jetty.server.handler.HandlerWrapper.handle(HandlerWrapper.java:134)
   [junit4]   2> 	at org.eclipse.jetty.server.Server.handle(Server.java:534)
   [junit4]   2> 	at org.eclipse.jetty.server.HttpChannel.handle(HttpChannel.java:320)
   [junit4]   2> 	at org.eclipse.jetty.server.HttpConnection.onFillable(HttpConnection.java:251)
   [junit4]   2> 	at org.eclipse.jetty.io.AbstractConnection$ReadCallback.succeeded(AbstractConnection.java:283)
   [junit4]   2> 	at org.eclipse.jetty.io.FillInterest.fillable(FillInterest.java:108)
   [junit4]   2> 	at org.eclipse.jetty.io.SelectChannelEndPoint$2.run(SelectChannelEndPoint.java:93)
   [junit4]   2> 	at org.eclipse.jetty.util.thread.strategy.ExecuteProduceConsume.executeProduceConsume(ExecuteProduceConsume.java:303)
   [junit4]   2> 	at org.eclipse.jetty.util.thread.strategy.ExecuteProduceConsume.produceConsume(ExecuteProduceConsume.java:148)
   [junit4]   2> 	at org.eclipse.jetty.util.thread.strategy.ExecuteProduceConsume.run(ExecuteProduceConsume.java:136)
   [junit4]   2> 	at org.eclipse.jetty.util.thread.QueuedThreadPool.runJob(QueuedThreadPool.java:671)
   [junit4]   2> 	at org.eclipse.jetty.util.thread.QueuedThreadPool$2.run(QueuedThreadPool.java:589)
   [junit4]   2> 	at java.lang.Thread.run(Thread.java:748)
   [junit4]   2> 
   [junit4]   2> 186352 INFO  (qtp39509343-3214) [    x:collection1] o.a.s.c.S.Request [collection1]  webapp=/solr path=/schema params={wt=javabin&version=2} status=400 QTime=46
   [junit4]   2> 186354 INFO  (TEST-SchemaTest.deletingAFieldTypeThatDoesntExistInTheSchemaShouldFail-seed#[32C8BE505D3A03C]) [    ] o.e.j.s.AbstractConnector Stopped ServerConnector@4c5b5527{HTTP/1.1,[http/1.1]}{127.0.0.1:0}
   [junit4]   2> 186354 INFO  (TEST-SchemaTest.deletingAFieldTypeThatDoesntExistInTheSchemaShouldFail-seed#[32C8BE505D3A03C]) [    ] o.a.s.c.CoreContainer Shutting down CoreContainer instance=1748446515
   [junit4]   2> 186354 INFO  (TEST-SchemaTest.deletingAFieldTypeThatDoesntExistInTheSchemaShouldFail-seed#[32C8BE505D3A03C]) [    ] o.a.s.m.SolrMetricManager Closing metric reporters for registry=solr.node, tag=null
   [junit4]   2> 186354 INFO  (TEST-SchemaTest.deletingAFieldTypeThatDoesntExistInTheSchemaShouldFail-seed#[32C8BE505D3A03C]) [    ] o.a.s.m.r.SolrJmxReporter Closing reporter [org.apache.solr.metrics.reporters.SolrJmxReporter@2711bd67: rootName = null, domain = solr.node, service url = null, agent id = null] for registry solr.node / com.codahale.metrics.MetricRegistry@49534e92
   [junit4]   2> 186361 INFO  (TEST-SchemaTest.deletingAFieldTypeThatDoesntExistInTheSchemaShouldFail-seed#[32C8BE505D3A03C]) [    ] o.a.s.m.SolrMetricManager Closing metric reporters for registry=solr.jvm, tag=null
   [junit4]   2> 186361 INFO  (TEST-SchemaTest.deletingAFieldTypeThatDoesntExistInTheSchemaShouldFail-seed#[32C8BE505D3A03C]) [    ] o.a.s.m.r.SolrJmxReporter Closing reporter [org.apache.solr.metrics.reporters.SolrJmxReporter@4b15aea3: rootName = null, domain = solr.jvm, service url = null, agent id = null] for registry solr.jvm / com.codahale.metrics.MetricRegistry@3da47529
   [junit4]   2> 186367 INFO  (TEST-SchemaTest.deletingAFieldTypeThatDoesntExistInTheSchemaShouldFail-seed#[32C8BE505D3A03C]) [    ] o.a.s.m.SolrMetricManager Closing metric reporters for registry=solr.jetty, tag=null
   [junit4]   2> 186367 INFO  (TEST-SchemaTest.deletingAFieldTypeThatDoesntExistInTheSchemaShouldFail-seed#[32C8BE505D3A03C]) [    ] o.a.s.m.r.SolrJmxReporter Closing reporter [org.apache.solr.metrics.reporters.SolrJmxReporter@3a1a8fc4: rootName = null, domain = solr.jetty, service url = null, agent id = null] for registry solr.jetty / com.codahale.metrics.MetricRegistry@399be645
   [junit4]   2> 186368 INFO  (coreCloseExecutor-926-thread-1) [    x:collection1] o.a.s.c.SolrCore [collection1]  CLOSING SolrCore org.apache.solr.core.SolrCore@311763b0
   [junit4]   2> 186368 INFO  (coreCloseExecutor-926-thread-1) [    x:collection1] o.a.s.m.SolrMetricManager Closing metric reporters for registry=solr.core.collection1, tag=823616432
   [junit4]   2> 186368 INFO  (coreCloseExecutor-926-thread-1) [    x:collection1] o.a.s.m.r.SolrJmxReporter Closing reporter [org.apache.solr.metrics.reporters.SolrJmxReporter@ac806ff: rootName = null, domain = solr.core.collection1, service url = null, agent id = null] for registry solr.core.collection1 / com.codahale.metrics.MetricRegistry@4e9eef1e
   [junit4]   2> 186382 INFO  (TEST-SchemaTest.deletingAFieldTypeThatDoesntExistInTheSchemaShouldFail-seed#[32C8BE505D3A03C]) [    ] o.e.j.s.h.ContextHandler Stopped o.e.j.s.ServletContextHandler@3a024c0b{/solr,null,UNAVAILABLE}
   [junit4]   2> 186387 INFO  (TEST-SchemaTest.deletingAFieldTypeThatDoesntExistInTheSchemaShouldFail-seed#[32C8BE505D3A03C]) [    ] o.a.s.SolrTestCaseJ4 ###Ending deletingAFieldTypeThatDoesntExistInTheSchemaShouldFail
   [junit4]   2> NOTE: reproduce with: ant test  -Dtestcase=SchemaTest -Dtests.method=deletingAFieldTypeThatDoesntExistInTheSchemaShouldFail -Dtests.seed=32C8BE505D3A03C -Dtests.slow=true -Dtests.locale=ja-JP -Dtests.timezone=Asia/Khandyga -Dtests.asserts=true -Dtests.file.encoding=ISO-8859-1
   [junit4] ERROR   0.55s J0 | SchemaTest.deletingAFieldTypeThatDoesntExistInTheSchemaShouldFail <<<
   [junit4]    > Throwable #1: org.apache.solr.client.solrj.impl.HttpSolrClient$RemoteExecutionException: Error from server at http://127.0.0.1:56019/solr/collection1: error processing commands
   [junit4]    > 	at __randomizedtesting.SeedInfo.seed([32C8BE505D3A03C:781ABA3F4CC98CE9]:0)
   [junit4]    > 	at org.apache.solr.client.solrj.impl.HttpSolrClient$RemoteExecutionException.create(HttpSolrClient.java:829)
   [junit4]    > 	at org.apache.solr.client.solrj.impl.HttpSolrClient.executeMethod(HttpSolrClient.java:620)
   [junit4]    > 	at org.apache.solr.client.solrj.impl.HttpSolrClient.request(HttpSolrClient.java:255)
   [junit4]    > 	at org.apache.solr.client.solrj.impl.HttpSolrClient.request(HttpSolrClient.java:244)
   [junit4]    > 	at org.apache.solr.client.solrj.SolrRequest.process(SolrRequest.java:194)
   [junit4]    > 	at org.apache.solr.client.solrj.SolrRequest.process(SolrRequest.java:211)
   [junit4]    > 	at org.apache.solr.client.solrj.request.SchemaTest.deletingAFieldTypeThatDoesntExistInTheSchemaShouldFail(SchemaTest.java:694)
   [junit4]    > 	at java.lang.Thread.run(Thread.java:748)
   [junit4]   2> 186394 INFO  (TEST-SchemaTest.testReplaceFieldAccuracy-seed#[32C8BE505D3A03C]) [    ] o.a.s.SolrTestCaseJ4 ###Starting testReplaceFieldAccuracy
   [junit4]   2> 186440 INFO  (TEST-SchemaTest.testReplaceFieldAccuracy-seed#[32C8BE505D3A03C]) [    ] o.a.s.SolrTestCaseJ4 ####initCore
   [junit4]   2> 186440 INFO  (TEST-SchemaTest.testReplaceFieldAccuracy-seed#[32C8BE505D3A03C]) [    ] o.a.s.SolrTestCaseJ4 ####initCore end
   [junit4]   2> 186441 INFO  (TEST-SchemaTest.testReplaceFieldAccuracy-seed#[32C8BE505D3A03C]) [    ] o.a.s.SolrTestCaseJ4 Writing core.properties file to /Users/jenkins/workspace/Lucene-Solr-master-MacOSX/solr/build/solr-solrj/test/J0/temp/solr.client.solrj.request.SchemaTest_32C8BE505D3A03C-001/tempDir-006/cores/core
   [junit4]   2> 186443 INFO  (TEST-SchemaTest.testReplaceFieldAccuracy-seed#[32C8BE505D3A03C]) [    ] o.e.j.s.Server jetty-9.3.20.v20170531
   [junit4]   2> 186445 INFO  (TEST-SchemaTest.testReplaceFieldAccuracy-seed#[32C8BE505D3A03C]) [    ] o.e.j.s.h.ContextHandler Started o.e.j.s.ServletContextHandler@4ba2787a{/solr,null,AVAILABLE}
   [junit4]   2> 186446 INFO  (TEST-SchemaTest.testReplaceFieldAccuracy-seed#[32C8BE505D3A03C]) [    ] o.e.j.s.AbstractConnector Started ServerConnector@75db31f5{HTTP/1.1,[http/1.1]}{127.0.0.1:56021}
   [junit4]   2> 186446 INFO  (TEST-SchemaTest.testReplaceFieldAccuracy-seed#[32C8BE505D3A03C]) [    ] o.e.j.s.Server Started @192258ms
   [junit4]   2> 186450 INFO  (TEST-SchemaTest.testReplaceFieldAccuracy-seed#[32C8BE505D3A03C]) [    ] o.a.s.c.s.e.JettySolrRunner Jetty properties: {hostContext=/solr, hostPort=56021, configSetBaseDir=/Users/jenkins/workspace/Lucene-Solr-master-MacOSX/solr/build/solr-solrj/test/J0/temp/solr.client.solrj.request.SchemaTest_32C8BE505D3A03C-001/tempDir-004, coreRootDirectory=/Users/jenkins/workspace/Lucene-Solr-master-MacOSX/solr/build/solr-solrj/test/J0/temp/solr.client.solrj.request.SchemaTest_32C8BE505D3A03C-001/tempDir-006/cores}
   [junit4]   2> 186450 ERROR (TEST-SchemaTest.testReplaceFieldAccuracy-seed#[32C8BE505D3A03C]) [    ] o.a.s.u.StartupLoggingUtils Missing Java Option solr.log.dir. Logging may be missing or incomplete.
   [junit4]   2> 186450 INFO  (TEST-SchemaTest.testReplaceFieldAccuracy-seed#[32C8BE505D3A03C]) [    ] o.a.s.s.SolrDispatchFilter  ___      _       Welcome to Apache Solr? version 8.0.0
   [junit4]   2> 186450 INFO  (TEST-SchemaTest.testReplaceFieldAccuracy-seed#[32C8BE505D3A03C]) [    ] o.a.s.s.SolrDispatchFilter / __| ___| |_ _   Starting in standalone mode on port null
   [junit4]   2> 186450 INFO  (TEST-SchemaTest.testReplaceFieldAccuracy-seed#[32C8BE505D3A03C]) [    ] o.a.s.s.SolrDispatchFilter \__ \/ _ \ | '_|  Install dir: null
   [junit4]   2> 186450 INFO  (TEST-SchemaTest.testReplaceFieldAccuracy-seed#[32C8BE505D3A03C]) [    ] o.a.s.s.SolrDispatchFilter |___/\___/_|_|    Start time: 2018-01-09T16:01:43.844Z
   [junit4]   2> 186451 INFO  (TEST-SchemaTest.testReplaceFieldAccuracy-seed#[32C8BE505D3A03C]) [    ] o.a.s.c.SolrXmlConfig Loading container configuration from /Users/jenkins/workspace/Lucene-Solr-master-MacOSX/solr/build/solr-solrj/test/J0/temp/solr.client.solrj.request.SchemaTest_32C8BE505D3A03C-001/tempDir-004/solr.xml
   [junit4]   2> 186457 INFO  (TEST-SchemaTest.testReplaceFieldAccuracy-seed#[32C8BE505D3A03C]) [    ] o.a.s.c.SolrXmlConfig MBean server found: com.sun.jmx.mbeanserver.JmxMBeanServer@3d5cab0f, but no JMX reporters were configured - adding default JMX reporter.
   [junit4]   2> 186541 INFO  (TEST-SchemaTest.testReplaceFieldAccuracy-seed#[32C8BE505D3A03C]) [    ] o.a.s.m.r.SolrJmxReporter JMX monitoring for 'solr.node' (registry 'solr.node') enabled at server: com.sun.jmx.mbeanserver.JmxMBeanServer@3d5cab0f
   [junit4]   2> 186554 INFO  (TEST-SchemaTest.testReplaceFieldAccuracy-seed#[32C8BE505D3A03C]) 

[...truncated too long message...]

iple copyFields (3)
   [junit4]   2> 204483 INFO  (coreLoadExecutor-1329-thread-1) [    x:collection1] o.a.s.s.IndexSchema Loaded schema test/1.6 with uniqueid field id
   [junit4]   2> 204484 INFO  (coreLoadExecutor-1329-thread-1) [    x:collection1] o.a.s.s.ManagedIndexSchema Upgraded to managed schema at /Users/jenkins/workspace/Lucene-Solr-master-MacOSX/solr/build/solr-solrj/test/J0/temp/solr.client.solrj.request.SchemaTest_32C8BE505D3A03C-001/tempDir-103/collection1/conf/managed-schema
   [junit4]   2> 204487 INFO  (coreLoadExecutor-1329-thread-1) [    x:collection1] o.a.s.s.ManagedIndexSchemaFactory After upgrading to managed schema, renamed the non-managed schema /Users/jenkins/workspace/Lucene-Solr-master-MacOSX/solr/build/solr-solrj/test/J0/temp/solr.client.solrj.request.SchemaTest_32C8BE505D3A03C-001/tempDir-103/collection1/conf/schema.xml to /Users/jenkins/workspace/Lucene-Solr-master-MacOSX/solr/build/solr-solrj/test/J0/temp/solr.client.solrj.request.SchemaTest_32C8BE505D3A03C-001/tempDir-103/collection1/conf/schema.xml.bak
   [junit4]   2> 204487 INFO  (coreLoadExecutor-1329-thread-1) [    x:collection1] o.a.s.c.CoreContainer Creating SolrCore 'collection1' using configuration from configset /Users/jenkins/workspace/Lucene-Solr-master-MacOSX/solr/build/solr-solrj/test/J0/temp/solr.client.solrj.request.SchemaTest_32C8BE505D3A03C-001/tempDir-103/collection1, trusted=true
   [junit4]   2> 204487 INFO  (coreLoadExecutor-1329-thread-1) [    x:collection1] o.a.s.m.r.SolrJmxReporter JMX monitoring for 'solr.core.collection1' (registry 'solr.core.collection1') enabled at server: com.sun.jmx.mbeanserver.JmxMBeanServer@3d5cab0f
   [junit4]   2> 204487 INFO  (coreLoadExecutor-1329-thread-1) [    x:collection1] o.a.s.c.SolrCore solr.RecoveryStrategy.Builder
   [junit4]   2> 204487 INFO  (coreLoadExecutor-1329-thread-1) [    x:collection1] o.a.s.c.SolrCore [[collection1] ] Opening new SolrCore at [/Users/jenkins/workspace/Lucene-Solr-master-MacOSX/solr/build/solr-solrj/test/J0/temp/solr.client.solrj.request.SchemaTest_32C8BE505D3A03C-001/tempDir-103/collection1], dataDir=[/Users/jenkins/workspace/Lucene-Solr-master-MacOSX/solr/build/solr-solrj/test/J0/temp/solr.client.solrj.request.SchemaTest_32C8BE505D3A03C-001/tempDir-105/cores/core/data/]
   [junit4]   2> 204542 WARN  (coreLoadExecutor-1329-thread-1) [    x:collection1] o.a.s.c.RequestHandlers no default request handler is registered (either '/select' or 'standard')
   [junit4]   2> 204542 INFO  (coreLoadExecutor-1329-thread-1) [    x:collection1] o.a.s.u.CommitTracker Hard AutoCommit: disabled
   [junit4]   2> 204542 INFO  (coreLoadExecutor-1329-thread-1) [    x:collection1] o.a.s.u.CommitTracker Soft AutoCommit: disabled
   [junit4]   2> 204544 INFO  (coreLoadExecutor-1329-thread-1) [    x:collection1] o.a.s.s.SolrIndexSearcher Opening [Searcher@65886a7a[collection1] main]
   [junit4]   2> 204544 INFO  (coreLoadExecutor-1329-thread-1) [    x:collection1] o.a.s.r.ManagedResourceStorage File-based storage initialized to use dir: /Users/jenkins/workspace/Lucene-Solr-master-MacOSX/solr/build/solr-solrj/test/J0/temp/solr.client.solrj.request.SchemaTest_32C8BE505D3A03C-001/tempDir-103/collection1/conf
   [junit4]   2> 204545 INFO  (coreLoadExecutor-1329-thread-1) [    x:collection1] o.a.s.h.ReplicationHandler Commits will be reserved for 10000ms.
   [junit4]   2> 204545 INFO  (TEST-SchemaTest.testSchemaVersionRequestAccuracy-seed#[32C8BE505D3A03C]) [    ] o.a.s.SolrJettyTestBase Jetty Assigned Port#56246
   [junit4]   2> 204545 INFO  (searcherExecutor-1330-thread-1-processing-x:collection1) [    x:collection1] o.a.s.c.SolrCore [collection1] Registered new searcher Searcher@65886a7a[collection1] main{ExitableDirectoryReader(UninvertingDirectoryReader())}
   [junit4]   2> 204550 INFO  (qtp1003669145-3943) [    x:collection1] o.a.s.c.S.Request [collection1]  webapp=/solr path=/schema/version params={wt=javabin&version=2} status=0 QTime=0
   [junit4]   2> 204551 INFO  (TEST-SchemaTest.testSchemaVersionRequestAccuracy-seed#[32C8BE505D3A03C]) [    ] o.e.j.s.AbstractConnector Stopped ServerConnector@66412660{HTTP/1.1,[http/1.1]}{127.0.0.1:0}
   [junit4]   2> 204551 INFO  (TEST-SchemaTest.testSchemaVersionRequestAccuracy-seed#[32C8BE505D3A03C]) [    ] o.a.s.c.CoreContainer Shutting down CoreContainer instance=941467179
   [junit4]   2> 204551 INFO  (TEST-SchemaTest.testSchemaVersionRequestAccuracy-seed#[32C8BE505D3A03C]) [    ] o.a.s.m.SolrMetricManager Closing metric reporters for registry=solr.node, tag=null
   [junit4]   2> 204551 INFO  (TEST-SchemaTest.testSchemaVersionRequestAccuracy-seed#[32C8BE505D3A03C]) [    ] o.a.s.m.r.SolrJmxReporter Closing reporter [org.apache.solr.metrics.reporters.SolrJmxReporter@74c85f6e: rootName = null, domain = solr.node, service url = null, agent id = null] for registry solr.node / com.codahale.metrics.MetricRegistry@3f34f899
   [junit4]   2> 204556 INFO  (TEST-SchemaTest.testSchemaVersionRequestAccuracy-seed#[32C8BE505D3A03C]) [    ] o.a.s.m.SolrMetricManager Closing metric reporters for registry=solr.jvm, tag=null
   [junit4]   2> 204556 INFO  (TEST-SchemaTest.testSchemaVersionRequestAccuracy-seed#[32C8BE505D3A03C]) [    ] o.a.s.m.r.SolrJmxReporter Closing reporter [org.apache.solr.metrics.reporters.SolrJmxReporter@40b5cad2: rootName = null, domain = solr.jvm, service url = null, agent id = null] for registry solr.jvm / com.codahale.metrics.MetricRegistry@3da47529
   [junit4]   2> 204560 INFO  (TEST-SchemaTest.testSchemaVersionRequestAccuracy-seed#[32C8BE505D3A03C]) [    ] o.a.s.m.SolrMetricManager Closing metric reporters for registry=solr.jetty, tag=null
   [junit4]   2> 204560 INFO  (TEST-SchemaTest.testSchemaVersionRequestAccuracy-seed#[32C8BE505D3A03C]) [    ] o.a.s.m.r.SolrJmxReporter Closing reporter [org.apache.solr.metrics.reporters.SolrJmxReporter@6ede4594: rootName = null, domain = solr.jetty, service url = null, agent id = null] for registry solr.jetty / com.codahale.metrics.MetricRegistry@399be645
   [junit4]   2> 204561 INFO  (coreCloseExecutor-1334-thread-1) [    x:collection1] o.a.s.c.SolrCore [collection1]  CLOSING SolrCore org.apache.solr.core.SolrCore@788d795c
   [junit4]   2> 204561 INFO  (coreCloseExecutor-1334-thread-1) [    x:collection1] o.a.s.m.SolrMetricManager Closing metric reporters for registry=solr.core.collection1, tag=2022537564
   [junit4]   2> 204561 INFO  (coreCloseExecutor-1334-thread-1) [    x:collection1] o.a.s.m.r.SolrJmxReporter Closing reporter [org.apache.solr.metrics.reporters.SolrJmxReporter@732e0df7: rootName = null, domain = solr.core.collection1, service url = null, agent id = null] for registry solr.core.collection1 / com.codahale.metrics.MetricRegistry@3fd4b1c4
   [junit4]   2> 204569 INFO  (TEST-SchemaTest.testSchemaVersionRequestAccuracy-seed#[32C8BE505D3A03C]) [    ] o.e.j.s.h.ContextHandler Stopped o.e.j.s.ServletContextHandler@6f36d4{/solr,null,UNAVAILABLE}
   [junit4]   2> 204570 INFO  (TEST-SchemaTest.testSchemaVersionRequestAccuracy-seed#[32C8BE505D3A03C]) [    ] o.a.s.SolrTestCaseJ4 ###Ending testSchemaVersionRequestAccuracy
   [junit4]   2> NOTE: leaving temporary files on disk at: /Users/jenkins/workspace/Lucene-Solr-master-MacOSX/solr/build/solr-solrj/test/J0/temp/solr.client.solrj.request.SchemaTest_32C8BE505D3A03C-001
   [junit4]   2> NOTE: test params are: codec=Asserting(Lucene70): {}, docValues:{}, maxPointsInLeafNode=328, maxMBSortInHeap=6.9112778649797075, sim=Asserting(org.apache.lucene.search.similarities.AssertingSimilarity@44ce5018), locale=ja-JP, timezone=Asia/Khandyga
   [junit4]   2> NOTE: Mac OS X 10.11.6 x86_64/Oracle Corporation 1.8.0_144 (64-bit)/cpus=3,threads=1,free=85799200,total=177573888
   [junit4]   2> NOTE: All tests run in this JVM: [CumulativeProbabilityEvaluatorTest, SolrDocumentTest, GreaterThanEvaluatorTest, ConcatOperationTest, SolrExampleEmbeddedTest, NormalDistributionEvaluatorTest, MultiplyEvaluatorTest, SineEvaluatorTest, CloudSolrClientBuilderTest, AppendEvaluatorTest, StreamExpressionToExpessionTest, TestCollectionAdminRequest, TestV1toV2ApiMapper, TestLBHttpSolrClient, LessThanEvaluatorTest, HttpSolrClientSSLAuthConPoolTest, GraphTest, EmpiricalDistributionEvaluatorTest, TestJavaBinCodec, AddEvaluatorTest, TestToleratedUpdateError, ModifiableSolrParamsTest, UuidEvaluatorTest, TestCoreAdmin, CloudSolrClientMultiConstructorTest, SolrExampleStreamingTest, TestDelegationTokenResponse, CeilingEvaluatorTest, FloorEvaluatorTest, JettyWebappTest, ConcurrentUpdateSolrClientBuilderTest, JdbcTest, TestUpdateRequestCodec, TestRetryUtil, NamedListTest, TestDelegationTokenRequest, FieldAnalysisResponseTest, SolrExampleBinaryTest, SolrExampleXMLTest, SolrExampleJettyTest, LargeVolumeBinaryJettyTest, TestBatchUpdate, LargeVolumeEmbeddedTest, TestSpellCheckResponse, LargeVolumeJettyTest, TestSolrProperties, TermsResponseTest, TestEmbeddedSolrServer, QueryResponseTest, TestNamedListCodec, TestDocumentObjectBinder, TestHash, TestFastInputStream, TestXMLEscaping, DocumentAnalysisResponseTest, UsingSolrJRefGuideExamplesTest, GetByIdTest, SolrSchemalessExampleTest, TestPolicy, HttpSolrClientBuilderTest, HttpSolrClientConPoolTest, TestCloudSolrClientConnections, GraphExpressionTest, JdbcDriverTest, SelectWithEvaluatorsTest, StreamExpressionToExplanationTest, StreamingTest, ArcCosineEvaluatorTest, ArcSineEvaluatorTest, ArcTangentEvaluatorTest, ArrayEvaluatorTest, AscEvaluatorTest, CorrelationEvaluatorTest, CosineEvaluatorTest, DivideEvaluatorTest, EqualToEvaluatorTest, ExclusiveOrEvaluatorTest, GreaterThanEqualToEvaluatorTest, HyperbolicCosineEvaluatorTest, HyperbolicSineEvaluatorTest, LengthEvaluatorTest, NaturalLogEvaluatorTest, NotEvaluatorTest, PowerEvaluatorTest, RawValueEvaluatorTest, RecursiveEvaluatorTest, ReverseEvaluatorTest, RoundEvaluatorTest, SubtractEvaluatorTest, UniformDistributionEvaluatorTest, OperationsTest, SchemaTest]
   [junit4] Completed [124/146 (1!)] on J0 in 18.77s, 35 tests, 8 errors <<< FAILURES!

[...truncated 47237 lines...]

Mime
View raw message