lucene-dev mailing list archives

Site index · List index
Message view « Date » · « Thread »
Top « Date » · « Thread »
From Policeman Jenkins Server <jenk...@thetaphi.de>
Subject [JENKINS] Lucene-Solr-7.x-Windows (32bit/jdk1.8.0_144) - Build # 375 - Still Unstable!
Date Tue, 02 Jan 2018 00:38:10 GMT
Build: https://jenkins.thetaphi.de/job/Lucene-Solr-7.x-Windows/375/
Java: 32bit/jdk1.8.0_144 -client -XX:+UseConcMarkSweepGC

6 tests failed.
FAILED:  junit.framework.TestSuite.org.apache.lucene.store.TestMmapDirectory

Error Message:
Could not remove the following files (in the order of attempts):    C:\Users\jenkins\workspace\Lucene-Solr-7.x-Windows\lucene\build\core\test\J0\temp\lucene.store.TestMmapDirectory_CD785048E1CD3DC1-001\testInt-001: java.nio.file.DirectoryNotEmptyException: C:\Users\jenkins\workspace\Lucene-Solr-7.x-Windows\lucene\build\core\test\J0\temp\lucene.store.TestMmapDirectory_CD785048E1CD3DC1-001\testInt-001 

Stack Trace:
java.io.IOException: Could not remove the following files (in the order of attempts):
   C:\Users\jenkins\workspace\Lucene-Solr-7.x-Windows\lucene\build\core\test\J0\temp\lucene.store.TestMmapDirectory_CD785048E1CD3DC1-001\testInt-001: java.nio.file.DirectoryNotEmptyException: C:\Users\jenkins\workspace\Lucene-Solr-7.x-Windows\lucene\build\core\test\J0\temp\lucene.store.TestMmapDirectory_CD785048E1CD3DC1-001\testInt-001

	at __randomizedtesting.SeedInfo.seed([CD785048E1CD3DC1]:0)
	at org.apache.lucene.util.IOUtils.rm(IOUtils.java:329)
	at org.apache.lucene.util.TestRuleTemporaryFilesCleanup.afterAlways(TestRuleTemporaryFilesCleanup.java:216)
	at com.carrotsearch.randomizedtesting.rules.TestRuleAdapter$1.afterAlways(TestRuleAdapter.java:31)
	at com.carrotsearch.randomizedtesting.rules.StatementAdapter.evaluate(StatementAdapter.java:43)
	at com.carrotsearch.randomizedtesting.rules.StatementAdapter.evaluate(StatementAdapter.java:36)
	at org.apache.lucene.util.TestRuleAssertionsRequired$1.evaluate(TestRuleAssertionsRequired.java:53)
	at org.apache.lucene.util.TestRuleMarkFailure$1.evaluate(TestRuleMarkFailure.java:47)
	at org.apache.lucene.util.TestRuleIgnoreAfterMaxFailures$1.evaluate(TestRuleIgnoreAfterMaxFailures.java:64)
	at org.apache.lucene.util.TestRuleIgnoreTestSuites$1.evaluate(TestRuleIgnoreTestSuites.java:54)
	at com.carrotsearch.randomizedtesting.rules.StatementAdapter.evaluate(StatementAdapter.java:36)
	at com.carrotsearch.randomizedtesting.ThreadLeakControl$StatementRunner.run(ThreadLeakControl.java:368)
	at java.lang.Thread.run(Thread.java:748)


FAILED:  org.apache.solr.cloud.PeerSyncReplicationTest.test

Error Message:
Timeout occured while waiting response from server at: http://127.0.0.1:56563

Stack Trace:
org.apache.solr.client.solrj.SolrServerException: Timeout occured while waiting response from server at: http://127.0.0.1:56563
	at __randomizedtesting.SeedInfo.seed([3B01807158094CB2:B355BFABF6F5214A]:0)
	at org.apache.solr.client.solrj.impl.HttpSolrClient.executeMethod(HttpSolrClient.java:654)
	at org.apache.solr.client.solrj.impl.HttpSolrClient.request(HttpSolrClient.java:255)
	at org.apache.solr.client.solrj.impl.HttpSolrClient.request(HttpSolrClient.java:244)
	at org.apache.solr.client.solrj.impl.LBHttpSolrClient.doRequest(LBHttpSolrClient.java:483)
	at org.apache.solr.client.solrj.impl.LBHttpSolrClient.request(LBHttpSolrClient.java:413)
	at org.apache.solr.client.solrj.impl.CloudSolrClient.sendRequest(CloudSolrClient.java:1104)
	at org.apache.solr.client.solrj.impl.CloudSolrClient.requestWithRetryOnStaleState(CloudSolrClient.java:884)
	at org.apache.solr.client.solrj.impl.CloudSolrClient.request(CloudSolrClient.java:817)
	at org.apache.solr.client.solrj.SolrRequest.process(SolrRequest.java:194)
	at org.apache.solr.client.solrj.SolrRequest.process(SolrRequest.java:211)
	at org.apache.solr.cloud.AbstractFullDistribZkTestBase.createServers(AbstractFullDistribZkTestBase.java:320)
	at org.apache.solr.BaseDistributedSearchTestCase$ShardsRepeatRule$ShardsFixedStatement.callStatement(BaseDistributedSearchTestCase.java:991)
	at org.apache.solr.BaseDistributedSearchTestCase$ShardsRepeatRule$ShardsStatement.evaluate(BaseDistributedSearchTestCase.java:968)
	at com.carrotsearch.randomizedtesting.rules.SystemPropertiesRestoreRule$1.evaluate(SystemPropertiesRestoreRule.java:57)
	at org.apache.lucene.util.TestRuleSetupTeardownChained$1.evaluate(TestRuleSetupTeardownChained.java:49)
	at org.apache.lucene.util.AbstractBeforeAfterRule$1.evaluate(AbstractBeforeAfterRule.java:45)
	at org.apache.lucene.util.TestRuleThreadAndTestName$1.evaluate(TestRuleThreadAndTestName.java:48)
	at org.apache.lucene.util.TestRuleIgnoreAfterMaxFailures$1.evaluate(TestRuleIgnoreAfterMaxFailures.java:64)
	at org.apache.lucene.util.TestRuleMarkFailure$1.evaluate(TestRuleMarkFailure.java:47)
	at com.carrotsearch.randomizedtesting.rules.StatementAdapter.evaluate(StatementAdapter.java:36)
	at com.carrotsearch.randomizedtesting.ThreadLeakControl$StatementRunner.run(ThreadLeakControl.java:368)
	at com.carrotsearch.randomizedtesting.ThreadLeakControl.forkTimeoutingTask(ThreadLeakControl.java:817)
	at com.carrotsearch.randomizedtesting.ThreadLeakControl$3.evaluate(ThreadLeakControl.java:468)
	at com.carrotsearch.randomizedtesting.RandomizedRunner.runSingleTest(RandomizedRunner.java:943)
	at com.carrotsearch.randomizedtesting.RandomizedRunner$5.evaluate(RandomizedRunner.java:829)
	at com.carrotsearch.randomizedtesting.RandomizedRunner$6.evaluate(RandomizedRunner.java:879)
	at com.carrotsearch.randomizedtesting.RandomizedRunner$7.evaluate(RandomizedRunner.java:890)
	at com.carrotsearch.randomizedtesting.rules.StatementAdapter.evaluate(StatementAdapter.java:36)
	at com.carrotsearch.randomizedtesting.rules.SystemPropertiesRestoreRule$1.evaluate(SystemPropertiesRestoreRule.java:57)
	at org.apache.lucene.util.AbstractBeforeAfterRule$1.evaluate(AbstractBeforeAfterRule.java:45)
	at com.carrotsearch.randomizedtesting.rules.StatementAdapter.evaluate(StatementAdapter.java:36)
	at org.apache.lucene.util.TestRuleStoreClassName$1.evaluate(TestRuleStoreClassName.java:41)
	at com.carrotsearch.randomizedtesting.rules.NoShadowingOrOverridesOnMethodsRule$1.evaluate(NoShadowingOrOverridesOnMethodsRule.java:40)
	at com.carrotsearch.randomizedtesting.rules.NoShadowingOrOverridesOnMethodsRule$1.evaluate(NoShadowingOrOverridesOnMethodsRule.java:40)
	at com.carrotsearch.randomizedtesting.rules.StatementAdapter.evaluate(StatementAdapter.java:36)
	at com.carrotsearch.randomizedtesting.rules.StatementAdapter.evaluate(StatementAdapter.java:36)
	at com.carrotsearch.randomizedtesting.rules.StatementAdapter.evaluate(StatementAdapter.java:36)
	at org.apache.lucene.util.TestRuleAssertionsRequired$1.evaluate(TestRuleAssertionsRequired.java:53)
	at org.apache.lucene.util.TestRuleMarkFailure$1.evaluate(TestRuleMarkFailure.java:47)
	at org.apache.lucene.util.TestRuleIgnoreAfterMaxFailures$1.evaluate(TestRuleIgnoreAfterMaxFailures.java:64)
	at org.apache.lucene.util.TestRuleIgnoreTestSuites$1.evaluate(TestRuleIgnoreTestSuites.java:54)
	at com.carrotsearch.randomizedtesting.rules.StatementAdapter.evaluate(StatementAdapter.java:36)
	at com.carrotsearch.randomizedtesting.ThreadLeakControl$StatementRunner.run(ThreadLeakControl.java:368)
	at java.lang.Thread.run(Thread.java:748)
Caused by: java.net.SocketTimeoutException: Read timed out
	at java.net.SocketInputStream.socketRead0(Native Method)
	at java.net.SocketInputStream.socketRead(SocketInputStream.java:116)
	at java.net.SocketInputStream.read(SocketInputStream.java:171)
	at java.net.SocketInputStream.read(SocketInputStream.java:141)
	at org.apache.http.impl.io.SessionInputBufferImpl.streamRead(SessionInputBufferImpl.java:137)
	at org.apache.http.impl.io.SessionInputBufferImpl.fillBuffer(SessionInputBufferImpl.java:153)
	at org.apache.http.impl.io.SessionInputBufferImpl.readLine(SessionInputBufferImpl.java:282)
	at org.apache.http.impl.conn.DefaultHttpResponseParser.parseHead(DefaultHttpResponseParser.java:138)
	at org.apache.http.impl.conn.DefaultHttpResponseParser.parseHead(DefaultHttpResponseParser.java:56)
	at org.apache.http.impl.io.AbstractMessageParser.parse(AbstractMessageParser.java:259)
	at org.apache.http.impl.DefaultBHttpClientConnection.receiveResponseHeader(DefaultBHttpClientConnection.java:163)
	at org.apache.http.impl.conn.CPoolProxy.receiveResponseHeader(CPoolProxy.java:165)
	at org.apache.http.protocol.HttpRequestExecutor.doReceiveResponse(HttpRequestExecutor.java:273)
	at org.apache.http.protocol.HttpRequestExecutor.execute(HttpRequestExecutor.java:125)
	at org.apache.http.impl.execchain.MainClientExec.execute(MainClientExec.java:272)
	at org.apache.http.impl.execchain.ProtocolExec.execute(ProtocolExec.java:185)
	at org.apache.http.impl.execchain.RetryExec.execute(RetryExec.java:89)
	at org.apache.http.impl.execchain.RedirectExec.execute(RedirectExec.java:111)
	at org.apache.http.impl.client.InternalHttpClient.doExecute(InternalHttpClient.java:185)
	at org.apache.http.impl.client.CloseableHttpClient.execute(CloseableHttpClient.java:83)
	at org.apache.http.impl.client.CloseableHttpClient.execute(CloseableHttpClient.java:56)
	at org.apache.solr.client.solrj.impl.HttpSolrClient.executeMethod(HttpSolrClient.java:542)
	... 43 more


FAILED:  org.apache.solr.cloud.TestCollectionAPI.test

Error Message:
Timeout occured while waiting response from server at: http://127.0.0.1:64249/kwhz

Stack Trace:
org.apache.solr.client.solrj.SolrServerException: Timeout occured while waiting response from server at: http://127.0.0.1:64249/kwhz
	at __randomizedtesting.SeedInfo.seed([3B01807158094CB2:B355BFABF6F5214A]:0)
	at org.apache.solr.client.solrj.impl.HttpSolrClient.executeMethod(HttpSolrClient.java:654)
	at org.apache.solr.client.solrj.impl.HttpSolrClient.request(HttpSolrClient.java:255)
	at org.apache.solr.client.solrj.impl.HttpSolrClient.request(HttpSolrClient.java:244)
	at org.apache.solr.client.solrj.impl.LBHttpSolrClient.doRequest(LBHttpSolrClient.java:483)
	at org.apache.solr.client.solrj.impl.LBHttpSolrClient.request(LBHttpSolrClient.java:413)
	at org.apache.solr.client.solrj.impl.CloudSolrClient.sendRequest(CloudSolrClient.java:1104)
	at org.apache.solr.client.solrj.impl.CloudSolrClient.requestWithRetryOnStaleState(CloudSolrClient.java:884)
	at org.apache.solr.client.solrj.impl.CloudSolrClient.request(CloudSolrClient.java:817)
	at org.apache.solr.client.solrj.SolrRequest.process(SolrRequest.java:194)
	at org.apache.solr.client.solrj.SolrRequest.process(SolrRequest.java:211)
	at org.apache.solr.cloud.AbstractFullDistribZkTestBase.createServers(AbstractFullDistribZkTestBase.java:320)
	at org.apache.solr.BaseDistributedSearchTestCase$ShardsRepeatRule$ShardsFixedStatement.callStatement(BaseDistributedSearchTestCase.java:991)
	at org.apache.solr.BaseDistributedSearchTestCase$ShardsRepeatRule$ShardsStatement.evaluate(BaseDistributedSearchTestCase.java:968)
	at com.carrotsearch.randomizedtesting.rules.SystemPropertiesRestoreRule$1.evaluate(SystemPropertiesRestoreRule.java:57)
	at org.apache.lucene.util.TestRuleSetupTeardownChained$1.evaluate(TestRuleSetupTeardownChained.java:49)
	at org.apache.lucene.util.AbstractBeforeAfterRule$1.evaluate(AbstractBeforeAfterRule.java:45)
	at org.apache.lucene.util.TestRuleThreadAndTestName$1.evaluate(TestRuleThreadAndTestName.java:48)
	at org.apache.lucene.util.TestRuleIgnoreAfterMaxFailures$1.evaluate(TestRuleIgnoreAfterMaxFailures.java:64)
	at org.apache.lucene.util.TestRuleMarkFailure$1.evaluate(TestRuleMarkFailure.java:47)
	at com.carrotsearch.randomizedtesting.rules.StatementAdapter.evaluate(StatementAdapter.java:36)
	at com.carrotsearch.randomizedtesting.ThreadLeakControl$StatementRunner.run(ThreadLeakControl.java:368)
	at com.carrotsearch.randomizedtesting.ThreadLeakControl.forkTimeoutingTask(ThreadLeakControl.java:817)
	at com.carrotsearch.randomizedtesting.ThreadLeakControl$3.evaluate(ThreadLeakControl.java:468)
	at com.carrotsearch.randomizedtesting.RandomizedRunner.runSingleTest(RandomizedRunner.java:943)
	at com.carrotsearch.randomizedtesting.RandomizedRunner$5.evaluate(RandomizedRunner.java:829)
	at com.carrotsearch.randomizedtesting.RandomizedRunner$6.evaluate(RandomizedRunner.java:879)
	at com.carrotsearch.randomizedtesting.RandomizedRunner$7.evaluate(RandomizedRunner.java:890)
	at com.carrotsearch.randomizedtesting.rules.StatementAdapter.evaluate(StatementAdapter.java:36)
	at com.carrotsearch.randomizedtesting.rules.SystemPropertiesRestoreRule$1.evaluate(SystemPropertiesRestoreRule.java:57)
	at org.apache.lucene.util.AbstractBeforeAfterRule$1.evaluate(AbstractBeforeAfterRule.java:45)
	at com.carrotsearch.randomizedtesting.rules.StatementAdapter.evaluate(StatementAdapter.java:36)
	at org.apache.lucene.util.TestRuleStoreClassName$1.evaluate(TestRuleStoreClassName.java:41)
	at com.carrotsearch.randomizedtesting.rules.NoShadowingOrOverridesOnMethodsRule$1.evaluate(NoShadowingOrOverridesOnMethodsRule.java:40)
	at com.carrotsearch.randomizedtesting.rules.NoShadowingOrOverridesOnMethodsRule$1.evaluate(NoShadowingOrOverridesOnMethodsRule.java:40)
	at com.carrotsearch.randomizedtesting.rules.StatementAdapter.evaluate(StatementAdapter.java:36)
	at com.carrotsearch.randomizedtesting.rules.StatementAdapter.evaluate(StatementAdapter.java:36)
	at com.carrotsearch.randomizedtesting.rules.StatementAdapter.evaluate(StatementAdapter.java:36)
	at org.apache.lucene.util.TestRuleAssertionsRequired$1.evaluate(TestRuleAssertionsRequired.java:53)
	at org.apache.lucene.util.TestRuleMarkFailure$1.evaluate(TestRuleMarkFailure.java:47)
	at org.apache.lucene.util.TestRuleIgnoreAfterMaxFailures$1.evaluate(TestRuleIgnoreAfterMaxFailures.java:64)
	at org.apache.lucene.util.TestRuleIgnoreTestSuites$1.evaluate(TestRuleIgnoreTestSuites.java:54)
	at com.carrotsearch.randomizedtesting.rules.StatementAdapter.evaluate(StatementAdapter.java:36)
	at com.carrotsearch.randomizedtesting.ThreadLeakControl$StatementRunner.run(ThreadLeakControl.java:368)
	at java.lang.Thread.run(Thread.java:748)
Caused by: java.net.SocketTimeoutException: Read timed out
	at java.net.SocketInputStream.socketRead0(Native Method)
	at java.net.SocketInputStream.socketRead(SocketInputStream.java:116)
	at java.net.SocketInputStream.read(SocketInputStream.java:171)
	at java.net.SocketInputStream.read(SocketInputStream.java:141)
	at org.apache.http.impl.io.SessionInputBufferImpl.streamRead(SessionInputBufferImpl.java:137)
	at org.apache.http.impl.io.SessionInputBufferImpl.fillBuffer(SessionInputBufferImpl.java:153)
	at org.apache.http.impl.io.SessionInputBufferImpl.readLine(SessionInputBufferImpl.java:282)
	at org.apache.http.impl.conn.DefaultHttpResponseParser.parseHead(DefaultHttpResponseParser.java:138)
	at org.apache.http.impl.conn.DefaultHttpResponseParser.parseHead(DefaultHttpResponseParser.java:56)
	at org.apache.http.impl.io.AbstractMessageParser.parse(AbstractMessageParser.java:259)
	at org.apache.http.impl.DefaultBHttpClientConnection.receiveResponseHeader(DefaultBHttpClientConnection.java:163)
	at org.apache.http.impl.conn.CPoolProxy.receiveResponseHeader(CPoolProxy.java:165)
	at org.apache.http.protocol.HttpRequestExecutor.doReceiveResponse(HttpRequestExecutor.java:273)
	at org.apache.http.protocol.HttpRequestExecutor.execute(HttpRequestExecutor.java:125)
	at org.apache.http.impl.execchain.MainClientExec.execute(MainClientExec.java:272)
	at org.apache.http.impl.execchain.ProtocolExec.execute(ProtocolExec.java:185)
	at org.apache.http.impl.execchain.RetryExec.execute(RetryExec.java:89)
	at org.apache.http.impl.execchain.RedirectExec.execute(RedirectExec.java:111)
	at org.apache.http.impl.client.InternalHttpClient.doExecute(InternalHttpClient.java:185)
	at org.apache.http.impl.client.CloseableHttpClient.execute(CloseableHttpClient.java:83)
	at org.apache.http.impl.client.CloseableHttpClient.execute(CloseableHttpClient.java:56)
	at org.apache.solr.client.solrj.impl.HttpSolrClient.executeMethod(HttpSolrClient.java:542)
	... 43 more


FAILED:  org.apache.solr.cloud.autoscaling.sim.TestGenericDistributedQueue.testDistributedQueueBlocking

Error Message:


Stack Trace:
java.util.concurrent.TimeoutException
	at __randomizedtesting.SeedInfo.seed([3B01807158094CB2:7EABF2081C5BF0C6]:0)
	at java.util.concurrent.FutureTask.get(FutureTask.java:205)
	at org.apache.solr.cloud.autoscaling.sim.TestSimDistributedQueue.testDistributedQueueBlocking(TestSimDistributedQueue.java:116)
	at sun.reflect.NativeMethodAccessorImpl.invoke0(Native Method)
	at sun.reflect.NativeMethodAccessorImpl.invoke(NativeMethodAccessorImpl.java:62)
	at sun.reflect.DelegatingMethodAccessorImpl.invoke(DelegatingMethodAccessorImpl.java:43)
	at java.lang.reflect.Method.invoke(Method.java:498)
	at com.carrotsearch.randomizedtesting.RandomizedRunner.invoke(RandomizedRunner.java:1737)
	at com.carrotsearch.randomizedtesting.RandomizedRunner$8.evaluate(RandomizedRunner.java:934)
	at com.carrotsearch.randomizedtesting.RandomizedRunner$9.evaluate(RandomizedRunner.java:970)
	at com.carrotsearch.randomizedtesting.RandomizedRunner$10.evaluate(RandomizedRunner.java:984)
	at com.carrotsearch.randomizedtesting.rules.SystemPropertiesRestoreRule$1.evaluate(SystemPropertiesRestoreRule.java:57)
	at org.apache.lucene.util.TestRuleSetupTeardownChained$1.evaluate(TestRuleSetupTeardownChained.java:49)
	at org.apache.lucene.util.AbstractBeforeAfterRule$1.evaluate(AbstractBeforeAfterRule.java:45)
	at org.apache.lucene.util.TestRuleThreadAndTestName$1.evaluate(TestRuleThreadAndTestName.java:48)
	at org.apache.lucene.util.TestRuleIgnoreAfterMaxFailures$1.evaluate(TestRuleIgnoreAfterMaxFailures.java:64)
	at org.apache.lucene.util.TestRuleMarkFailure$1.evaluate(TestRuleMarkFailure.java:47)
	at com.carrotsearch.randomizedtesting.rules.StatementAdapter.evaluate(StatementAdapter.java:36)
	at com.carrotsearch.randomizedtesting.ThreadLeakControl$StatementRunner.run(ThreadLeakControl.java:368)
	at com.carrotsearch.randomizedtesting.ThreadLeakControl.forkTimeoutingTask(ThreadLeakControl.java:817)
	at com.carrotsearch.randomizedtesting.ThreadLeakControl$3.evaluate(ThreadLeakControl.java:468)
	at com.carrotsearch.randomizedtesting.RandomizedRunner.runSingleTest(RandomizedRunner.java:943)
	at com.carrotsearch.randomizedtesting.RandomizedRunner$5.evaluate(RandomizedRunner.java:829)
	at com.carrotsearch.randomizedtesting.RandomizedRunner$6.evaluate(RandomizedRunner.java:879)
	at com.carrotsearch.randomizedtesting.RandomizedRunner$7.evaluate(RandomizedRunner.java:890)
	at com.carrotsearch.randomizedtesting.rules.StatementAdapter.evaluate(StatementAdapter.java:36)
	at com.carrotsearch.randomizedtesting.rules.SystemPropertiesRestoreRule$1.evaluate(SystemPropertiesRestoreRule.java:57)
	at org.apache.lucene.util.AbstractBeforeAfterRule$1.evaluate(AbstractBeforeAfterRule.java:45)
	at com.carrotsearch.randomizedtesting.rules.StatementAdapter.evaluate(StatementAdapter.java:36)
	at org.apache.lucene.util.TestRuleStoreClassName$1.evaluate(TestRuleStoreClassName.java:41)
	at com.carrotsearch.randomizedtesting.rules.NoShadowingOrOverridesOnMethodsRule$1.evaluate(NoShadowingOrOverridesOnMethodsRule.java:40)
	at com.carrotsearch.randomizedtesting.rules.NoShadowingOrOverridesOnMethodsRule$1.evaluate(NoShadowingOrOverridesOnMethodsRule.java:40)
	at com.carrotsearch.randomizedtesting.rules.StatementAdapter.evaluate(StatementAdapter.java:36)
	at com.carrotsearch.randomizedtesting.rules.StatementAdapter.evaluate(StatementAdapter.java:36)
	at com.carrotsearch.randomizedtesting.rules.StatementAdapter.evaluate(StatementAdapter.java:36)
	at org.apache.lucene.util.TestRuleAssertionsRequired$1.evaluate(TestRuleAssertionsRequired.java:53)
	at org.apache.lucene.util.TestRuleMarkFailure$1.evaluate(TestRuleMarkFailure.java:47)
	at org.apache.lucene.util.TestRuleIgnoreAfterMaxFailures$1.evaluate(TestRuleIgnoreAfterMaxFailures.java:64)
	at org.apache.lucene.util.TestRuleIgnoreTestSuites$1.evaluate(TestRuleIgnoreTestSuites.java:54)
	at com.carrotsearch.randomizedtesting.rules.StatementAdapter.evaluate(StatementAdapter.java:36)
	at com.carrotsearch.randomizedtesting.ThreadLeakControl$StatementRunner.run(ThreadLeakControl.java:368)
	at java.lang.Thread.run(Thread.java:748)


FAILED:  junit.framework.TestSuite.org.apache.solr.cloud.autoscaling.sim.TestGenericDistributedQueue

Error Message:
1 thread leaked from SUITE scope at org.apache.solr.cloud.autoscaling.sim.TestGenericDistributedQueue:     1) Thread[id=9976, name=sdqtest--2906-thread-1, state=TIMED_WAITING, group=TGRP-TestGenericDistributedQueue]         at sun.misc.Unsafe.park(Native Method)         at java.util.concurrent.locks.LockSupport.parkNanos(LockSupport.java:215)         at java.util.concurrent.locks.AbstractQueuedSynchronizer$ConditionObject.awaitNanos(AbstractQueuedSynchronizer.java:2078)         at org.apache.solr.cloud.autoscaling.sim.GenericDistributedQueue.peek(GenericDistributedQueue.java:194)         at org.apache.solr.cloud.autoscaling.sim.GenericDistributedQueue.peek(GenericDistributedQueue.java:167)         at org.apache.solr.cloud.autoscaling.sim.TestSimDistributedQueue.lambda$testDistributedQueueBlocking$1(TestSimDistributedQueue.java:107)         at org.apache.solr.cloud.autoscaling.sim.TestSimDistributedQueue$$Lambda$622/16642998.call(Unknown Source)         at java.util.concurrent.FutureTask.run(FutureTask.java:266)         at org.apache.solr.common.util.ExecutorUtil$MDCAwareThreadPoolExecutor.lambda$execute$0(ExecutorUtil.java:188)         at org.apache.solr.common.util.ExecutorUtil$MDCAwareThreadPoolExecutor$$Lambda$98/12937102.run(Unknown Source)         at java.util.concurrent.ThreadPoolExecutor.runWorker(ThreadPoolExecutor.java:1149)         at java.util.concurrent.ThreadPoolExecutor$Worker.run(ThreadPoolExecutor.java:624)         at java.lang.Thread.run(Thread.java:748)

Stack Trace:
com.carrotsearch.randomizedtesting.ThreadLeakError: 1 thread leaked from SUITE scope at org.apache.solr.cloud.autoscaling.sim.TestGenericDistributedQueue: 
   1) Thread[id=9976, name=sdqtest--2906-thread-1, state=TIMED_WAITING, group=TGRP-TestGenericDistributedQueue]
        at sun.misc.Unsafe.park(Native Method)
        at java.util.concurrent.locks.LockSupport.parkNanos(LockSupport.java:215)
        at java.util.concurrent.locks.AbstractQueuedSynchronizer$ConditionObject.awaitNanos(AbstractQueuedSynchronizer.java:2078)
        at org.apache.solr.cloud.autoscaling.sim.GenericDistributedQueue.peek(GenericDistributedQueue.java:194)
        at org.apache.solr.cloud.autoscaling.sim.GenericDistributedQueue.peek(GenericDistributedQueue.java:167)
        at org.apache.solr.cloud.autoscaling.sim.TestSimDistributedQueue.lambda$testDistributedQueueBlocking$1(TestSimDistributedQueue.java:107)
        at org.apache.solr.cloud.autoscaling.sim.TestSimDistributedQueue$$Lambda$622/16642998.call(Unknown Source)
        at java.util.concurrent.FutureTask.run(FutureTask.java:266)
        at org.apache.solr.common.util.ExecutorUtil$MDCAwareThreadPoolExecutor.lambda$execute$0(ExecutorUtil.java:188)
        at org.apache.solr.common.util.ExecutorUtil$MDCAwareThreadPoolExecutor$$Lambda$98/12937102.run(Unknown Source)
        at java.util.concurrent.ThreadPoolExecutor.runWorker(ThreadPoolExecutor.java:1149)
        at java.util.concurrent.ThreadPoolExecutor$Worker.run(ThreadPoolExecutor.java:624)
        at java.lang.Thread.run(Thread.java:748)
	at __randomizedtesting.SeedInfo.seed([3B01807158094CB2]:0)


FAILED:  junit.framework.TestSuite.org.apache.solr.update.processor.TestOpenNLPExtractNamedEntitiesUpdateProcessorFactory

Error Message:
Could not remove the following files (in the order of attempts):    C:\Users\jenkins\workspace\Lucene-Solr-7.x-Windows\solr\build\contrib\solr-analysis-extras\test\J1\temp\solr.update.processor.TestOpenNLPExtractNamedEntitiesUpdateProcessorFactory_1CC2BE264A7EA42D-001\tempDir-001\collection1\conf: java.nio.file.DirectoryNotEmptyException: C:\Users\jenkins\workspace\Lucene-Solr-7.x-Windows\solr\build\contrib\solr-analysis-extras\test\J1\temp\solr.update.processor.TestOpenNLPExtractNamedEntitiesUpdateProcessorFactory_1CC2BE264A7EA42D-001\tempDir-001\collection1\conf    C:\Users\jenkins\workspace\Lucene-Solr-7.x-Windows\solr\build\contrib\solr-analysis-extras\test\J1\temp\solr.update.processor.TestOpenNLPExtractNamedEntitiesUpdateProcessorFactory_1CC2BE264A7EA42D-001\tempDir-001\collection1: java.nio.file.DirectoryNotEmptyException: C:\Users\jenkins\workspace\Lucene-Solr-7.x-Windows\solr\build\contrib\solr-analysis-extras\test\J1\temp\solr.update.processor.TestOpenNLPExtractNamedEntitiesUpdateProcessorFactory_1CC2BE264A7EA42D-001\tempDir-001\collection1    C:\Users\jenkins\workspace\Lucene-Solr-7.x-Windows\solr\build\contrib\solr-analysis-extras\test\J1\temp\solr.update.processor.TestOpenNLPExtractNamedEntitiesUpdateProcessorFactory_1CC2BE264A7EA42D-001\tempDir-001: java.nio.file.DirectoryNotEmptyException: C:\Users\jenkins\workspace\Lucene-Solr-7.x-Windows\solr\build\contrib\solr-analysis-extras\test\J1\temp\solr.update.processor.TestOpenNLPExtractNamedEntitiesUpdateProcessorFactory_1CC2BE264A7EA42D-001\tempDir-001    C:\Users\jenkins\workspace\Lucene-Solr-7.x-Windows\solr\build\contrib\solr-analysis-extras\test\J1\temp\solr.update.processor.TestOpenNLPExtractNamedEntitiesUpdateProcessorFactory_1CC2BE264A7EA42D-001\tempDir-001\collection1\conf\en-test-tokenizer.bin: java.nio.file.AccessDeniedException: C:\Users\jenkins\workspace\Lucene-Solr-7.x-Windows\solr\build\contrib\solr-analysis-extras\test\J1\temp\solr.update.processor.TestOpenNLPExtractNamedEntitiesUpdateProcessorFactory_1CC2BE264A7EA42D-001\tempDir-001\collection1\conf\en-test-tokenizer.bin    C:\Users\jenkins\workspace\Lucene-Solr-7.x-Windows\solr\build\contrib\solr-analysis-extras\test\J1\temp\solr.update.processor.TestOpenNLPExtractNamedEntitiesUpdateProcessorFactory_1CC2BE264A7EA42D-001\tempDir-001\collection1\conf\en-test-ner-person.bin: java.nio.file.AccessDeniedException: C:\Users\jenkins\workspace\Lucene-Solr-7.x-Windows\solr\build\contrib\solr-analysis-extras\test\J1\temp\solr.update.processor.TestOpenNLPExtractNamedEntitiesUpdateProcessorFactory_1CC2BE264A7EA42D-001\tempDir-001\collection1\conf\en-test-ner-person.bin    C:\Users\jenkins\workspace\Lucene-Solr-7.x-Windows\solr\build\contrib\solr-analysis-extras\test\J1\temp\solr.update.processor.TestOpenNLPExtractNamedEntitiesUpdateProcessorFactory_1CC2BE264A7EA42D-001\tempDir-001\collection1\conf\en-test-sent.bin: java.nio.file.AccessDeniedException: C:\Users\jenkins\workspace\Lucene-Solr-7.x-Windows\solr\build\contrib\solr-analysis-extras\test\J1\temp\solr.update.processor.TestOpenNLPExtractNamedEntitiesUpdateProcessorFactory_1CC2BE264A7EA42D-001\tempDir-001\collection1\conf\en-test-sent.bin    C:\Users\jenkins\workspace\Lucene-Solr-7.x-Windows\solr\build\contrib\solr-analysis-extras\test\J1\temp\solr.update.processor.TestOpenNLPExtractNamedEntitiesUpdateProcessorFactory_1CC2BE264A7EA42D-001: java.nio.file.DirectoryNotEmptyException: C:\Users\jenkins\workspace\Lucene-Solr-7.x-Windows\solr\build\contrib\solr-analysis-extras\test\J1\temp\solr.update.processor.TestOpenNLPExtractNamedEntitiesUpdateProcessorFactory_1CC2BE264A7EA42D-001 

Stack Trace:
java.io.IOException: Could not remove the following files (in the order of attempts):
   C:\Users\jenkins\workspace\Lucene-Solr-7.x-Windows\solr\build\contrib\solr-analysis-extras\test\J1\temp\solr.update.processor.TestOpenNLPExtractNamedEntitiesUpdateProcessorFactory_1CC2BE264A7EA42D-001\tempDir-001\collection1\conf: java.nio.file.DirectoryNotEmptyException: C:\Users\jenkins\workspace\Lucene-Solr-7.x-Windows\solr\build\contrib\solr-analysis-extras\test\J1\temp\solr.update.processor.TestOpenNLPExtractNamedEntitiesUpdateProcessorFactory_1CC2BE264A7EA42D-001\tempDir-001\collection1\conf
   C:\Users\jenkins\workspace\Lucene-Solr-7.x-Windows\solr\build\contrib\solr-analysis-extras\test\J1\temp\solr.update.processor.TestOpenNLPExtractNamedEntitiesUpdateProcessorFactory_1CC2BE264A7EA42D-001\tempDir-001\collection1: java.nio.file.DirectoryNotEmptyException: C:\Users\jenkins\workspace\Lucene-Solr-7.x-Windows\solr\build\contrib\solr-analysis-extras\test\J1\temp\solr.update.processor.TestOpenNLPExtractNamedEntitiesUpdateProcessorFactory_1CC2BE264A7EA42D-001\tempDir-001\collection1
   C:\Users\jenkins\workspace\Lucene-Solr-7.x-Windows\solr\build\contrib\solr-analysis-extras\test\J1\temp\solr.update.processor.TestOpenNLPExtractNamedEntitiesUpdateProcessorFactory_1CC2BE264A7EA42D-001\tempDir-001: java.nio.file.DirectoryNotEmptyException: C:\Users\jenkins\workspace\Lucene-Solr-7.x-Windows\solr\build\contrib\solr-analysis-extras\test\J1\temp\solr.update.processor.TestOpenNLPExtractNamedEntitiesUpdateProcessorFactory_1CC2BE264A7EA42D-001\tempDir-001
   C:\Users\jenkins\workspace\Lucene-Solr-7.x-Windows\solr\build\contrib\solr-analysis-extras\test\J1\temp\solr.update.processor.TestOpenNLPExtractNamedEntitiesUpdateProcessorFactory_1CC2BE264A7EA42D-001\tempDir-001\collection1\conf\en-test-tokenizer.bin: java.nio.file.AccessDeniedException: C:\Users\jenkins\workspace\Lucene-Solr-7.x-Windows\solr\build\contrib\solr-analysis-extras\test\J1\temp\solr.update.processor.TestOpenNLPExtractNamedEntitiesUpdateProcessorFactory_1CC2BE264A7EA42D-001\tempDir-001\collection1\conf\en-test-tokenizer.bin
   C:\Users\jenkins\workspace\Lucene-Solr-7.x-Windows\solr\build\contrib\solr-analysis-extras\test\J1\temp\solr.update.processor.TestOpenNLPExtractNamedEntitiesUpdateProcessorFactory_1CC2BE264A7EA42D-001\tempDir-001\collection1\conf\en-test-ner-person.bin: java.nio.file.AccessDeniedException: C:\Users\jenkins\workspace\Lucene-Solr-7.x-Windows\solr\build\contrib\solr-analysis-extras\test\J1\temp\solr.update.processor.TestOpenNLPExtractNamedEntitiesUpdateProcessorFactory_1CC2BE264A7EA42D-001\tempDir-001\collection1\conf\en-test-ner-person.bin
   C:\Users\jenkins\workspace\Lucene-Solr-7.x-Windows\solr\build\contrib\solr-analysis-extras\test\J1\temp\solr.update.processor.TestOpenNLPExtractNamedEntitiesUpdateProcessorFactory_1CC2BE264A7EA42D-001\tempDir-001\collection1\conf\en-test-sent.bin: java.nio.file.AccessDeniedException: C:\Users\jenkins\workspace\Lucene-Solr-7.x-Windows\solr\build\contrib\solr-analysis-extras\test\J1\temp\solr.update.processor.TestOpenNLPExtractNamedEntitiesUpdateProcessorFactory_1CC2BE264A7EA42D-001\tempDir-001\collection1\conf\en-test-sent.bin
   C:\Users\jenkins\workspace\Lucene-Solr-7.x-Windows\solr\build\contrib\solr-analysis-extras\test\J1\temp\solr.update.processor.TestOpenNLPExtractNamedEntitiesUpdateProcessorFactory_1CC2BE264A7EA42D-001: java.nio.file.DirectoryNotEmptyException: C:\Users\jenkins\workspace\Lucene-Solr-7.x-Windows\solr\build\contrib\solr-analysis-extras\test\J1\temp\solr.update.processor.TestOpenNLPExtractNamedEntitiesUpdateProcessorFactory_1CC2BE264A7EA42D-001

	at __randomizedtesting.SeedInfo.seed([1CC2BE264A7EA42D]:0)
	at org.apache.lucene.util.IOUtils.rm(IOUtils.java:329)
	at org.apache.lucene.util.TestRuleTemporaryFilesCleanup.afterAlways(TestRuleTemporaryFilesCleanup.java:216)
	at com.carrotsearch.randomizedtesting.rules.TestRuleAdapter$1.afterAlways(TestRuleAdapter.java:31)
	at com.carrotsearch.randomizedtesting.rules.StatementAdapter.evaluate(StatementAdapter.java:43)
	at com.carrotsearch.randomizedtesting.rules.StatementAdapter.evaluate(StatementAdapter.java:36)
	at org.apache.lucene.util.TestRuleAssertionsRequired$1.evaluate(TestRuleAssertionsRequired.java:53)
	at org.apache.lucene.util.TestRuleMarkFailure$1.evaluate(TestRuleMarkFailure.java:47)
	at org.apache.lucene.util.TestRuleIgnoreAfterMaxFailures$1.evaluate(TestRuleIgnoreAfterMaxFailures.java:64)
	at org.apache.lucene.util.TestRuleIgnoreTestSuites$1.evaluate(TestRuleIgnoreTestSuites.java:54)
	at com.carrotsearch.randomizedtesting.rules.StatementAdapter.evaluate(StatementAdapter.java:36)
	at com.carrotsearch.randomizedtesting.ThreadLeakControl$StatementRunner.run(ThreadLeakControl.java:368)
	at java.lang.Thread.run(Thread.java:748)




Build Log:
[...truncated 1639 lines...]
   [junit4] Suite: org.apache.lucene.store.TestMmapDirectory
   [junit4]   2> NOTE: test params are: codec=Asserting(Lucene70), sim=RandomSimilarity(queryNorm=true): {}, locale=ar-YE, timezone=Etc/GMT+1
   [junit4]   2> NOTE: Windows 10 10.0 x86/Oracle Corporation 1.8.0_144 (32-bit)/cpus=3,threads=1,free=360603592,total=518979584
   [junit4]   2> NOTE: All tests run in this JVM: [TestCodecHoldsOpenFiles, TestArrayUtil, TestBlockPostingsFormat2, TestNotDocIdSet, TestAddIndexes, TestPolygon, TestManyFields, TestBytesRef, TestSearch, TestReusableStringReader, TestCloseableThreadLocal, TestIndexWriterUnicode, TestDuelingCodecs, TestQueryRescorer, TestPointValues, TestSameTokenSamePosition, TestSwappedIndexFiles, TestSpanCollection, TestIntArrayDocIdSet, TestPackedTokenAttributeImpl, Test4GBStoredFields, TestScorerPerf, TestSpanExplanationsOfNonMatches, MultiCollectorTest, TestSimpleFSDirectory, TestEarlyTermination, TestBinaryDocValuesUpdates, TestMergePolicyWrapper, TestSimilarityProvider, TestCodecUtil, TestSparseFixedBitDocIdSet, TestRecyclingByteBlockAllocator, TestMixedDocValuesUpdates, TestMultiMMap, TestFSTs, TestWordlistLoader, TestSearchWithThreads, TestHighCompressionMode, TestSort, TestBinaryDocument, TestOmitPositions, TestSegmentCacheables, TestBooleanQueryVisitSubscorers, TestReaderWrapperDVTypeCheck, TestTwoPhaseCommitTool, TestFilterLeafReader, TestAtomicUpdate, TestSimilarity2, TestCharsRefBuilder, TestRamUsageEstimator, TestCharFilter, TestSynonymQuery, TestTrackingDirectoryWrapper, TestMultiThreadTermVectors, TestSpanNearQuery, TestSearchForDuplicates, TestSnapshotDeletionPolicy, TestMultiCollector, TestTryDelete, TestLucene70SegmentInfoFormat, TestDocsAndPositions, TestIndexWriterThreadsToSegments, TestRegExp, TestConsistentFieldNumbers, TestControlledRealTimeReopenThread, TestPriorityQueue, TestFilterIterator, TestDocsWithFieldSet, TestMinimize, TestUnicodeUtil, TestIndexWriter, TestFieldCacheRewriteMethod, TestBooleanQuery, TestPayloadsOnVectors, TestPhrasePrefixQuery, TestCrashCausesCorruptIndex, TestSortRescorer, TestCrash, TestTimSorter, TestIntRangeFieldQueries, TestSameScoresWithThreads, TestNewestSegment, TestTopDocsMerge, TestSloppyPhraseQuery, TestThreadedForceMerge, TestIndexOrDocValuesQuery, TestFilterDirectory, TestNeverDelete, TestAssertions, TestPositionIncrement, TestLockFactory, TestFilterCodecReader, TestLucene50TermVectorsFormat, TestDemoParallelLeafReader, TestSpanExplanations, TestBooleanSimilarity, TestIndexWriterOnVMError, TestPrefixRandom, TestSimpleAttributeImpl, TestWildcardRandom, TestBKD, TestDocumentsWriterDeleteQueue, TestPrefixQuery, TestFilterWeight, TestFieldInvertState, TestIndexManyDocuments, TestDocInverterPerFieldErrorInfo, TestLucene70DocValuesFormat, TestScoreCachingWrappingScorer, TestFieldsReader, TestParallelReaderEmptyIndex, TestNoMergePolicy, TestAllFilesDetectTruncation, TestIndexWriterWithThreads, TestPerFieldDocValuesFormat, TestIndexWriterMerging, TestBytesStore, TestGraphTokenizers, TestShardSearching, TestIndexWriterExceptions, TestBooleanOr, TestFlushByRamOrCountsPolicy, TestIndexWriterMergePolicy, TestNorms, TestStandardAnalyzer, TestPerFieldPostingsFormat, TestByteSlices, TestDirectoryReader, TestPhraseQuery, TestBagOfPositions, TestFixedBitSet, TestParallelCompositeReader, TestMultiDocValues, TestToken, TestCustomSearcherSort, TestSimilarityBase, TestBooleanMinShouldMatch, TestTermsEnum2, TestDeterminizeLexicon, TestCustomNorms, TestFlex, TestUTF32ToUTF8, TestDeterminism, TestBagOfPostings, TestCharTermAttributeImpl, TestSloppyPhraseQuery2, TestForceMergeForever, TestLiveFieldValues, TestSpanSearchEquivalence, TestSimpleExplanationsOfNonMatches, TestIntBlockPool, TestSegmentTermEnum, TestAllFilesHaveCodecHeader, TestMaxTermFrequency, TestTopFieldCollector, TestIndexableField, TestSentinelIntSet, TestRegexpRandom, TestSpanMultiTermQueryWrapper, TestSizeBoundedForceMerge, TestCompiledAutomaton, TestElevationComparator, TestSubScorerFreqs, TestConjunctions, TestDateSort, TestVirtualMethod, TestSmallFloat, TestDocCount, TestAutomatonQueryUnicode, TestTotalHitCountCollector, TestIsCurrent, TestNoMergeScheduler, TestNamedSPILoader, TestIndexWriterLockRelease, TestIndexWriterOnJRECrash, TestNGramPhraseQuery, TestTermdocPerf, TestTerm, Test2BTerms, Test2BNumericDocValues, TestCharArrayMap, TestCharacterUtils, TestBlockPostingsFormat3, TestLucene50StoredFieldsFormatHighCompression, TestLucene70NormsFormat, TestFieldType, TestGeoEncodingUtils, Test2BPoints, Test2BSortedDocValuesFixedSorted, Test2BSortedDocValuesOrds, TestAllFilesCheckIndexHeader, TestAllFilesHaveChecksumFooter, TestDuelingCodecsAtNight, TestExceedMaxTermLength, TestExitableDirectoryReader, TestFilterDirectoryReader, TestIndexReaderClose, TestIndexWriterDeleteByQuery, TestIndexWriterExceptions2, TestIndexWriterFromReader, TestIndexWriterOutOfFileDescriptors, TestInfoStream, TestLogMergePolicy, TestMaxPosition, TestMultiTermsEnum, TestNumericDocValuesUpdates, TestBoostQuery, TestDocValuesRewriteMethod, TestDoubleValuesSource, TestFloatRangeFieldQueries, TestMatchNoDocsQuery, TestMultiPhraseEnum, TestMultiset, TestNormsFieldExistsQuery, TestSimpleExplanationsWithFillerDocs, TestMmapDirectory]
   [junit4]   2> NOTE: reproduce with: ant test  -Dtestcase=TestMmapDirectory -Dtests.seed=CD785048E1CD3DC1 -Dtests.slow=true -Dtests.locale=ar-YE -Dtests.timezone=Etc/GMT+1 -Dtests.asserts=true -Dtests.file.encoding=ISO-8859-1
   [junit4] ERROR   0.00s J0 | TestMmapDirectory (suite) <<<
   [junit4]    > Throwable #1: java.io.IOException: Could not remove the following files (in the order of attempts):
   [junit4]    >    C:\Users\jenkins\workspace\Lucene-Solr-7.x-Windows\lucene\build\core\test\J0\temp\lucene.store.TestMmapDirectory_CD785048E1CD3DC1-001\testInt-001: java.nio.file.DirectoryNotEmptyException: C:\Users\jenkins\workspace\Lucene-Solr-7.x-Windows\lucene\build\core\test\J0\temp\lucene.store.TestMmapDirectory_CD785048E1CD3DC1-001\testInt-001
   [junit4]    > 	at __randomizedtesting.SeedInfo.seed([CD785048E1CD3DC1]:0)
   [junit4]    > 	at org.apache.lucene.util.IOUtils.rm(IOUtils.java:329)
   [junit4]    > 	at java.lang.Thread.run(Thread.java:748)
   [junit4] Completed [427/458 (1!)] on J0 in 1.63s, 43 tests, 1 error, 1 skipped <<< FAILURES!

[...truncated 10583 lines...]
   [junit4] Suite: org.apache.solr.cloud.autoscaling.sim.TestGenericDistributedQueue
   [junit4]   2> 764141 INFO  (SUITE-TestGenericDistributedQueue-seed#[3B01807158094CB2]-worker) [    ] o.a.s.SolrTestCaseJ4 SecureRandom sanity checks: test.solr.allowed.securerandom=null & java.security.egd=file:/dev/./urandom
   [junit4]   2> Creating dataDir: C:\Users\jenkins\workspace\Lucene-Solr-7.x-Windows\solr\build\solr-core\test\J0\temp\solr.cloud.autoscaling.sim.TestGenericDistributedQueue_3B01807158094CB2-001\init-core-data-001
   [junit4]   2> 764142 WARN  (SUITE-TestGenericDistributedQueue-seed#[3B01807158094CB2]-worker) [    ] o.a.s.SolrTestCaseJ4 startTrackingSearchers: numOpens=2 numCloses=2
   [junit4]   2> 764142 INFO  (SUITE-TestGenericDistributedQueue-seed#[3B01807158094CB2]-worker) [    ] o.a.s.SolrTestCaseJ4 Using PointFields (NUMERIC_POINTS_SYSPROP=true) w/NUMERIC_DOCVALUES_SYSPROP=true
   [junit4]   2> 764147 INFO  (SUITE-TestGenericDistributedQueue-seed#[3B01807158094CB2]-worker) [    ] o.a.s.SolrTestCaseJ4 Randomized ssl (false) and clientAuth (false) via: @org.apache.solr.util.RandomizeSSL(reason=, value=NaN, ssl=NaN, clientAuth=NaN)
   [junit4]   2> 764148 INFO  (TEST-TestGenericDistributedQueue.testDistributedQueueBlocking-seed#[3B01807158094CB2]) [    ] o.a.s.SolrTestCaseJ4 ###Starting testDistributedQueueBlocking
   [junit4]   2> 767257 INFO  (TEST-TestGenericDistributedQueue.testDistributedQueueBlocking-seed#[3B01807158094CB2]) [    ] o.a.s.SolrTestCaseJ4 ###Ending testDistributedQueueBlocking
   [junit4]   2> NOTE: reproduce with: ant test  -Dtestcase=TestGenericDistributedQueue -Dtests.method=testDistributedQueueBlocking -Dtests.seed=3B01807158094CB2 -Dtests.slow=true -Dtests.locale=ar-IQ -Dtests.timezone=Asia/Barnaul -Dtests.asserts=true -Dtests.file.encoding=Cp1252
   [junit4] ERROR   3.11s J0 | TestGenericDistributedQueue.testDistributedQueueBlocking <<<
   [junit4]    > Throwable #1: java.util.concurrent.TimeoutException
   [junit4]    > 	at __randomizedtesting.SeedInfo.seed([3B01807158094CB2:7EABF2081C5BF0C6]:0)
   [junit4]    > 	at java.util.concurrent.FutureTask.get(FutureTask.java:205)
   [junit4]    > 	at org.apache.solr.cloud.autoscaling.sim.TestSimDistributedQueue.testDistributedQueueBlocking(TestSimDistributedQueue.java:116)
   [junit4]    > 	at java.lang.Thread.run(Thread.java:748)
   [junit4]   2> 767260 INFO  (TEST-TestGenericDistributedQueue.testPeekElements-seed#[3B01807158094CB2]) [    ] o.a.s.SolrTestCaseJ4 ###Starting testPeekElements
   [junit4]   2> 768764 INFO  (TEST-TestGenericDistributedQueue.testPeekElements-seed#[3B01807158094CB2]) [    ] o.a.s.SolrTestCaseJ4 ###Ending testPeekElements
   [junit4]   2> 768778 INFO  (TEST-TestGenericDistributedQueue.testLocallyOffer-seed#[3B01807158094CB2]) [    ] o.a.s.SolrTestCaseJ4 ###Starting testLocallyOffer
   [junit4]   2> 769167 INFO  (TEST-TestGenericDistributedQueue.testLocallyOffer-seed#[3B01807158094CB2]) [    ] o.a.s.SolrTestCaseJ4 ###Ending testLocallyOffer
   [junit4]   2> 769173 INFO  (TEST-TestGenericDistributedQueue.testDistributedQueue-seed#[3B01807158094CB2]) [    ] o.a.s.SolrTestCaseJ4 ###Starting testDistributedQueue
   [junit4]   2> 771217 INFO  (TEST-TestGenericDistributedQueue.testDistributedQueue-seed#[3B01807158094CB2]) [    ] o.a.s.SolrTestCaseJ4 ###Ending testDistributedQueue
   [junit4]   2> NOTE: leaving temporary files on disk at: C:\Users\jenkins\workspace\Lucene-Solr-7.x-Windows\solr\build\solr-core\test\J0\temp\solr.cloud.autoscaling.sim.TestGenericDistributedQueue_3B01807158094CB2-001
   [junit4]   2> Jan 01, 2018 11:22:19 PM com.carrotsearch.randomizedtesting.ThreadLeakControl checkThreadLeaks
   [junit4]   2> WARNING: Will linger awaiting termination of 1 leaked thread(s).
   [junit4]   2> Jan 01, 2018 11:22:39 PM com.carrotsearch.randomizedtesting.ThreadLeakControl checkThreadLeaks
   [junit4]   2> SEVERE: 1 thread leaked from SUITE scope at org.apache.solr.cloud.autoscaling.sim.TestGenericDistributedQueue: 
   [junit4]   2>    1) Thread[id=9976, name=sdqtest--2906-thread-1, state=TIMED_WAITING, group=TGRP-TestGenericDistributedQueue]
   [junit4]   2>         at sun.misc.Unsafe.park(Native Method)
   [junit4]   2>         at java.util.concurrent.locks.LockSupport.parkNanos(LockSupport.java:215)
   [junit4]   2>         at java.util.concurrent.locks.AbstractQueuedSynchronizer$ConditionObject.awaitNanos(AbstractQueuedSynchronizer.java:2078)
   [junit4]   2>         at org.apache.solr.cloud.autoscaling.sim.GenericDistributedQueue.peek(GenericDistributedQueue.java:194)
   [junit4]   2>         at org.apache.solr.cloud.autoscaling.sim.GenericDistributedQueue.peek(GenericDistributedQueue.java:167)
   [junit4]   2>         at org.apache.solr.cloud.autoscaling.sim.TestSimDistributedQueue.lambda$testDistributedQueueBlocking$1(TestSimDistributedQueue.java:107)
   [junit4]   2>         at org.apache.solr.cloud.autoscaling.sim.TestSimDistributedQueue$$Lambda$622/16642998.call(Unknown Source)
   [junit4]   2>         at java.util.concurrent.FutureTask.run(FutureTask.java:266)
   [junit4]   2>         at org.apache.solr.common.util.ExecutorUtil$MDCAwareThreadPoolExecutor.lambda$execute$0(ExecutorUtil.java:188)
   [junit4]   2>         at org.apache.solr.common.util.ExecutorUtil$MDCAwareThreadPoolExecutor$$Lambda$98/12937102.run(Unknown Source)
   [junit4]   2>         at java.util.concurrent.ThreadPoolExecutor.runWorker(ThreadPoolExecutor.java:1149)
   [junit4]   2>         at java.util.concurrent.ThreadPoolExecutor$Worker.run(ThreadPoolExecutor.java:624)
   [junit4]   2>         at java.lang.Thread.run(Thread.java:748)
   [junit4]   2> Jan 01, 2018 11:22:39 PM com.carrotsearch.randomizedtesting.ThreadLeakControl tryToInterruptAll
   [junit4]   2> INFO: Starting to interrupt leaked threads:
   [junit4]   2>    1) Thread[id=9976, name=sdqtest--2906-thread-1, state=TIMED_WAITING, group=TGRP-TestGenericDistributedQueue]
   [junit4]   2> Jan 01, 2018 11:22:39 PM com.carrotsearch.randomizedtesting.ThreadLeakControl tryToInterruptAll
   [junit4]   2> INFO: All leaked threads terminated.
   [junit4]   2> NOTE: test params are: codec=FastCompressingStoredFields(storedFieldsFormat=CompressingStoredFieldsFormat(compressionMode=FAST, chunkSize=3, maxDocsPerChunk=397, blockSize=321), termVectorsFormat=CompressingTermVectorsFormat(compressionMode=FAST, chunkSize=3, blockSize=321)), sim=RandomSimilarity(queryNorm=false): {}, locale=ar-IQ, timezone=Asia/Barnaul
   [junit4]   2> NOTE: Windows 10 10.0 x86/Oracle Corporation 1.8.0_144 (32-bit)/cpus=3,threads=1,free=167386016,total=518979584
   [junit4]   2> NOTE: All tests run in this JVM: [SolrGangliaReporterTest, WordBreakSolrSpellCheckerTest, TestSolrCloudWithSecureImpersonation, SearchHandlerTest, ShowFileRequestHandlerTest, TestHighlightDedupGrouping, SolrCoreMetricManagerTest, VMParamsZkACLAndCredentialsProvidersTest, TestMacroExpander, TestSystemCollAutoCreate, NoCacheHeaderTest, CdcrBidirectionalTest, TestSolr4Spatial, ManagedSchemaRoundRobinCloudTest, SearchRateTriggerTest, BinaryUpdateRequestHandlerTest, TestRecoveryHdfs, TestUseDocValuesAsStored2, ForceLeaderTest, DataDrivenBlockJoinTest, HdfsRestartWhileUpdatingTest, TestJmxIntegration, CursorPagingTest, TestBulkSchemaConcurrent, TestSmileRequest, TestHashQParserPlugin, TestSolrCoreProperties, IgnoreCommitOptimizeUpdateProcessorFactoryTest, TestSolrConfigHandlerCloud, DistributedQueryComponentOptimizationTest, DistributedSpellCheckComponentTest, TestSerializedLuceneMatchVersion, TestUpdate, TestIndexingPerformance, SortByFunctionTest, TestXIncludeConfig, TestHdfsBackupRestoreCore, SharedFSAutoReplicaFailoverTest, TestPHPSerializedResponseWriter, SuggesterWFSTTest, OverseerModifyCollectionTest, TestSolrCLIRunExample, MultiTermTest, ResourceLoaderTest, JSONWriterTest, TestUnifiedSolrHighlighter, TestCustomSort, TestSolrDeletionPolicy2, TestSizeLimitedDistributedMap, TestTlogReplica, SolrCLIZkUtilsTest, TestConfigSetsAPIZkFailure, TestDistribStateManager, RequiredFieldsTest, SolrMetricReporterTest, DeleteShardTest, TestDynamicFieldCollectionResource, DistributedVersionInfoTest, TestCloudNestedDocsSort, TestConfigReload, UtilsToolTest, TestEmbeddedSolrServerAdminHandler, TestCustomStream, TestAnalyzeInfixSuggestions, MetricUtilsTest, TestLeaderElectionZkExpiry, TestExceedMaxTermLength, TestTolerantSearch, TestQuerySenderNoQuery, TestScoreJoinQPNoScore, SuggestComponentTest, SignatureUpdateProcessorFactoryTest, CloneFieldUpdateProcessorFactoryTest, CSVRequestHandlerTest, TestStandardQParsers, DisMaxRequestHandlerTest, FullHLLTest, TestGenericDistributedQueue]
   [junit4]   2> NOTE: reproduce with: ant test  -Dtestcase=TestGenericDistributedQueue -Dtests.seed=3B01807158094CB2 -Dtests.slow=true -Dtests.locale=ar-IQ -Dtests.timezone=Asia/Barnaul -Dtests.asserts=true -Dtests.file.encoding=Cp1252
   [junit4] ERROR   0.00s J0 | TestGenericDistributedQueue (suite) <<<
   [junit4]    > Throwable #1: com.carrotsearch.randomizedtesting.ThreadLeakError: 1 thread leaked from SUITE scope at org.apache.solr.cloud.autoscaling.sim.TestGenericDistributedQueue: 
   [junit4]    >    1) Thread[id=9976, name=sdqtest--2906-thread-1, state=TIMED_WAITING, group=TGRP-TestGenericDistributedQueue]
   [junit4]    >         at sun.misc.Unsafe.park(Native Method)
   [junit4]    >         at java.util.concurrent.locks.LockSupport.parkNanos(LockSupport.java:215)
   [junit4]    >         at java.util.concurrent.locks.AbstractQueuedSynchronizer$ConditionObject.awaitNanos(AbstractQueuedSynchronizer.java:2078)
   [junit4]    >         at org.apache.solr.cloud.autoscaling.sim.GenericDistributedQueue.peek(GenericDistributedQueue.java:194)
   [junit4]    >         at org.apache.solr.cloud.autoscaling.sim.GenericDistributedQueue.peek(GenericDistributedQueue.java:167)
   [junit4]    >         at org.apache.solr.cloud.autoscaling.sim.TestSimDistributedQueue.lambda$testDistributedQueueBlocking$1(TestSimDistributedQueue.java:107)
   [junit4]    >         at org.apache.solr.cloud.autoscaling.sim.TestSimDistributedQueue$$Lambda$622/16642998.call(Unknown Source)
   [junit4]    >         at java.util.concurrent.FutureTask.run(FutureTask.java:266)
   [junit4]    >         at org.apache.solr.common.util.ExecutorUtil$MDCAwareThreadPoolExecutor.lambda$execute$0(ExecutorUtil.java:188)
   [junit4]    >         at org.apache.solr.common.util.ExecutorUtil$MDCAwareThreadPoolExecutor$$Lambda$98/12937102.run(Unknown Source)
   [junit4]    >         at java.util.concurrent.ThreadPoolExecutor.runWorker(ThreadPoolExecutor.java:1149)
   [junit4]    >         at java.util.concurrent.ThreadPoolExecutor$Worker.run(ThreadPoolExecutor.java:624)
   [junit4]    >         at java.lang.Thread.run(Thread.java:748)
   [junit4]    > 	at __randomizedtesting.SeedInfo.seed([3B01807158094CB2]:0)
   [junit4] Completed [159/764 (1!)] on J0 in 27.28s, 4 tests, 2 errors <<< FAILURES!

[...truncated 627 lines...]
   [junit4] Suite: org.apache.solr.cloud.TestCollectionAPI
   [junit4]   2> 1203648 INFO  (SUITE-TestCollectionAPI-seed#[3B01807158094CB2]-worker) [    ] o.a.s.SolrTestCaseJ4 SecureRandom sanity checks: test.solr.allowed.securerandom=null & java.security.egd=file:/dev/./urandom
   [junit4]   2> Creating dataDir: C:\Users\jenkins\workspace\Lucene-Solr-7.x-Windows\solr\build\solr-core\test\J0\temp\solr.cloud.TestCollectionAPI_3B01807158094CB2-001\init-core-data-001
   [junit4]   2> 1203649 WARN  (SUITE-TestCollectionAPI-seed#[3B01807158094CB2]-worker) [    ] o.a.s.SolrTestCaseJ4 startTrackingSearchers: numOpens=8 numCloses=8
   [junit4]   2> 1203650 INFO  (SUITE-TestCollectionAPI-seed#[3B01807158094CB2]-worker) [    ] o.a.s.SolrTestCaseJ4 Using PointFields (NUMERIC_POINTS_SYSPROP=true) w/NUMERIC_DOCVALUES_SYSPROP=true
   [junit4]   2> 1203653 INFO  (SUITE-TestCollectionAPI-seed#[3B01807158094CB2]-worker) [    ] o.a.s.SolrTestCaseJ4 Randomized ssl (false) and clientAuth (false) via: @org.apache.solr.util.RandomizeSSL(reason=, value=NaN, ssl=NaN, clientAuth=NaN)
   [junit4]   2> 1203653 INFO  (SUITE-TestCollectionAPI-seed#[3B01807158094CB2]-worker) [    ] o.a.s.BaseDistributedSearchTestCase Setting hostContext system property: /kwhz/
   [junit4]   2> 1203656 INFO  (TEST-TestCollectionAPI.test-seed#[3B01807158094CB2]) [    ] o.a.s.c.ZkTestServer STARTING ZK TEST SERVER
   [junit4]   2> 1203656 INFO  (Thread-2722) [    ] o.a.s.c.ZkTestServer client port:0.0.0.0/0.0.0.0:0
   [junit4]   2> 1203656 INFO  (Thread-2722) [    ] o.a.s.c.ZkTestServer Starting server
   [junit4]   2> 1203659 ERROR (Thread-2722) [    ] o.a.z.s.ZooKeeperServer ZKShutdownHandler is not registered, so ZooKeeper server won't take any action on ERROR or SHUTDOWN server state changes
   [junit4]   2> 1203756 INFO  (TEST-TestCollectionAPI.test-seed#[3B01807158094CB2]) [    ] o.a.s.c.ZkTestServer start zk server on port:64241
   [junit4]   2> 1203764 INFO  (zkConnectionManagerCallback-3628-thread-1) [    ] o.a.s.c.c.ConnectionManager zkClient has connected
   [junit4]   2> 1203775 INFO  (zkConnectionManagerCallback-3630-thread-1) [    ] o.a.s.c.c.ConnectionManager zkClient has connected
   [junit4]   2> 1203795 INFO  (TEST-TestCollectionAPI.test-seed#[3B01807158094CB2]) [    ] o.a.s.c.AbstractZkTestCase put C:\Users\jenkins\workspace\Lucene-Solr-7.x-Windows\solr\core\src\test-files\solr\collection1\conf\solrconfig-tlog.xml to /configs/conf1/solrconfig.xml
   [junit4]   2> 1203802 INFO  (TEST-TestCollectionAPI.test-seed#[3B01807158094CB2]) [    ] o.a.s.c.AbstractZkTestCase put C:\Users\jenkins\workspace\Lucene-Solr-7.x-Windows\solr\core\src\test-files\solr\collection1\conf\schema15.xml to /configs/conf1/schema.xml
   [junit4]   2> 1203808 INFO  (TEST-TestCollectionAPI.test-seed#[3B01807158094CB2]) [    ] o.a.s.c.AbstractZkTestCase put C:\Users\jenkins\workspace\Lucene-Solr-7.x-Windows\solr\core\src\test-files\solr\collection1\conf\solrconfig.snippet.randomindexconfig.xml to /configs/conf1/solrconfig.snippet.randomindexconfig.xml
   [junit4]   2> 1203813 INFO  (TEST-TestCollectionAPI.test-seed#[3B01807158094CB2]) [    ] o.a.s.c.AbstractZkTestCase put C:\Users\jenkins\workspace\Lucene-Solr-7.x-Windows\solr\core\src\test-files\solr\collection1\conf\stopwords.txt to /configs/conf1/stopwords.txt
   [junit4]   2> 1203818 INFO  (TEST-TestCollectionAPI.test-seed#[3B01807158094CB2]) [    ] o.a.s.c.AbstractZkTestCase put C:\Users\jenkins\workspace\Lucene-Solr-7.x-Windows\solr\core\src\test-files\solr\collection1\conf\protwords.txt to /configs/conf1/protwords.txt
   [junit4]   2> 1203821 INFO  (TEST-TestCollectionAPI.test-seed#[3B01807158094CB2]) [    ] o.a.s.c.AbstractZkTestCase put C:\Users\jenkins\workspace\Lucene-Solr-7.x-Windows\solr\core\src\test-files\solr\collection1\conf\currency.xml to /configs/conf1/currency.xml
   [junit4]   2> 1203824 INFO  (TEST-TestCollectionAPI.test-seed#[3B01807158094CB2]) [    ] o.a.s.c.AbstractZkTestCase put C:\Users\jenkins\workspace\Lucene-Solr-7.x-Windows\solr\core\src\test-files\solr\collection1\conf\enumsConfig.xml to /configs/conf1/enumsConfig.xml
   [junit4]   2> 1203827 INFO  (TEST-TestCollectionAPI.test-seed#[3B01807158094CB2]) [    ] o.a.s.c.AbstractZkTestCase put C:\Users\jenkins\workspace\Lucene-Solr-7.x-Windows\solr\core\src\test-files\solr\collection1\conf\open-exchange-rates.json to /configs/conf1/open-exchange-rates.json
   [junit4]   2> 1203829 INFO  (TEST-TestCollectionAPI.test-seed#[3B01807158094CB2]) [    ] o.a.s.c.AbstractZkTestCase put C:\Users\jenkins\workspace\Lucene-Solr-7.x-Windows\solr\core\src\test-files\solr\collection1\conf\mapping-ISOLatin1Accent.txt to /configs/conf1/mapping-ISOLatin1Accent.txt
   [junit4]   2> 1203832 INFO  (TEST-TestCollectionAPI.test-seed#[3B01807158094CB2]) [    ] o.a.s.c.AbstractZkTestCase put C:\Users\jenkins\workspace\Lucene-Solr-7.x-Windows\solr\core\src\test-files\solr\collection1\conf\old_synonyms.txt to /configs/conf1/old_synonyms.txt
   [junit4]   2> 1203834 INFO  (TEST-TestCollectionAPI.test-seed#[3B01807158094CB2]) [    ] o.a.s.c.AbstractZkTestCase put C:\Users\jenkins\workspace\Lucene-Solr-7.x-Windows\solr\core\src\test-files\solr\collection1\conf\synonyms.txt to /configs/conf1/synonyms.txt
   [junit4]   2> 1203836 INFO  (TEST-TestCollectionAPI.test-seed#[3B01807158094CB2]) [    ] o.a.s.c.AbstractFullDistribZkTestBase Will use NRT replicas unless explicitly asked otherwise
   [junit4]   2> 1204319 INFO  (TEST-TestCollectionAPI.test-seed#[3B01807158094CB2]) [    ] o.e.j.s.Server jetty-9.3.20.v20170531
   [junit4]   2> 1204320 INFO  (TEST-TestCollectionAPI.test-seed#[3B01807158094CB2]) [    ] o.e.j.s.h.ContextHandler Started o.e.j.s.ServletContextHandler@ad3f14{/kwhz,null,AVAILABLE}
   [junit4]   2> 1204324 INFO  (TEST-TestCollectionAPI.test-seed#[3B01807158094CB2]) [    ] o.e.j.s.AbstractConnector Started ServerConnector@10d40b0{HTTP/1.1,[http/1.1]}{127.0.0.1:64249}
   [junit4]   2> 1204324 INFO  (TEST-TestCollectionAPI.test-seed#[3B01807158094CB2]) [    ] o.e.j.s.Server Started @1211385ms
   [junit4]   2> 1204324 INFO  (TEST-TestCollectionAPI.test-seed#[3B01807158094CB2]) [    ] o.a.s.c.s.e.JettySolrRunner Jetty properties: {solr.data.dir=C:\Users\jenkins\workspace\Lucene-Solr-7.x-Windows\solr\build\solr-core\test\J0\temp\solr.cloud.TestCollectionAPI_3B01807158094CB2-001\tempDir-001/control/data, replicaType=NRT, hostContext=/kwhz, hostPort=64249, coreRootDirectory=C:\Users\jenkins\workspace\Lucene-Solr-7.x-Windows\solr\build\solr-core\test\J0\temp\solr.cloud.TestCollectionAPI_3B01807158094CB2-001\control-001\cores}
   [junit4]   2> 1204325 ERROR (TEST-TestCollectionAPI.test-seed#[3B01807158094CB2]) [    ] o.a.s.u.StartupLoggingUtils Missing Java Option solr.log.dir. Logging may be missing or incomplete.
   [junit4]   2> 1204325 INFO  (TEST-TestCollectionAPI.test-seed#[3B01807158094CB2]) [    ] o.a.s.s.SolrDispatchFilter  ___      _       Welcome to Apache Solr™ version 7.3.0
   [junit4]   2> 1204325 INFO  (TEST-TestCollectionAPI.test-seed#[3B01807158094CB2]) [    ] o.a.s.s.SolrDispatchFilter / __| ___| |_ _   Starting in cloud mode on port null
   [junit4]   2> 1204325 INFO  (TEST-TestCollectionAPI.test-seed#[3B01807158094CB2]) [    ] o.a.s.s.SolrDispatchFilter \__ \/ _ \ | '_|  Install dir: null
   [junit4]   2> 1204325 INFO  (TEST-TestCollectionAPI.test-seed#[3B01807158094CB2]) [    ] o.a.s.s.SolrDispatchFilter |___/\___/_|_|    Start time: 2018-01-01T23:29:32.856Z
   [junit4]   2> 1204328 INFO  (zkConnectionManagerCallback-3632-thread-1) [    ] o.a.s.c.c.ConnectionManager zkClient has connected
   [junit4]   2> 1204330 INFO  (TEST-TestCollectionAPI.test-seed#[3B01807158094CB2]) [    ] o.a.s.s.SolrDispatchFilter Loading solr.xml from SolrHome (not found in ZooKeeper)
   [junit4]   2> 1204330 INFO  (TEST-TestCollectionAPI.test-seed#[3B01807158094CB2]) [    ] o.a.s.c.SolrXmlConfig Loading container configuration from C:\Users\jenkins\workspace\Lucene-Solr-7.x-Windows\solr\build\solr-core\test\J0\temp\solr.cloud.TestCollectionAPI_3B01807158094CB2-001\control-001\solr.xml
   [junit4]   2> 1204339 INFO  (TEST-TestCollectionAPI.test-seed#[3B01807158094CB2]) [    ] o.a.s.c.SolrXmlConfig Configuration parameter autoReplicaFailoverWorkLoopDelay is ignored
   [junit4]   2> 1204339 INFO  (TEST-TestCollectionAPI.test-seed#[3B01807158094CB2]) [    ] o.a.s.c.SolrXmlConfig Configuration parameter autoReplicaFailoverBadNodeExpiration is ignored
   [junit4]   2> 1204341 INFO  (TEST-TestCollectionAPI.test-seed#[3B01807158094CB2]) [    ] o.a.s.c.SolrXmlConfig MBean server found: com.sun.jmx.mbeanserver.JmxMBeanServer@260b98, but no JMX reporters were configured - adding default JMX reporter.
   [junit4]   2> 1204346 INFO  (TEST-TestCollectionAPI.test-seed#[3B01807158094CB2]) [    ] o.a.s.c.ZkContainer Zookeeper client=127.0.0.1:64241/solr
   [junit4]   2> 1204348 INFO  (zkConnectionManagerCallback-3636-thread-1) [    ] o.a.s.c.c.ConnectionManager zkClient has connected
   [junit4]   2> 1204353 INFO  (zkConnectionManagerCallback-3638-thread-1-processing-n:127.0.0.1:64249_kwhz) [n:127.0.0.1:64249_kwhz    ] o.a.s.c.c.ConnectionManager zkClient has connected
   [junit4]   2> 1204475 INFO  (TEST-TestCollectionAPI.test-seed#[3B01807158094CB2]) [n:127.0.0.1:64249_kwhz    ] o.a.s.c.Overseer Overseer (id=null) closing
   [junit4]   2> 1204476 INFO  (TEST-TestCollectionAPI.test-seed#[3B01807158094CB2]) [n:127.0.0.1:64249_kwhz    ] o.a.s.c.OverseerElectionContext I am going to be the leader 127.0.0.1:64249_kwhz
   [junit4]   2> 1204477 INFO  (TEST-TestCollectionAPI.test-seed#[3B01807158094CB2]) [n:127.0.0.1:64249_kwhz    ] o.a.s.c.Overseer Overseer (id=99277168455843844-127.0.0.1:64249_kwhz-n_0000000000) starting
   [junit4]   2> 1204488 INFO  (TEST-TestCollectionAPI.test-seed#[3B01807158094CB2]) [n:127.0.0.1:64249_kwhz    ] o.a.s.c.ZkController Register node as live in ZooKeeper:/live_nodes/127.0.0.1:64249_kwhz
   [junit4]   2> 1204492 INFO  (OverseerStateUpdate-99277168455843844-127.0.0.1:64249_kwhz-n_0000000000) [n:127.0.0.1:64249_kwhz    ] o.a.s.c.c.ZkStateReader Updated live nodes from ZooKeeper... (0) -> (1)
   [junit4]   2> 1204639 INFO  (TEST-TestCollectionAPI.test-seed#[3B01807158094CB2]) [n:127.0.0.1:64249_kwhz    ] o.a.s.m.r.SolrJmxReporter JMX monitoring for 'solr.node' (registry 'solr.node') enabled at server: com.sun.jmx.mbeanserver.JmxMBeanServer@260b98
   [junit4]   2> 1204649 INFO  (TEST-TestCollectionAPI.test-seed#[3B01807158094CB2]) [n:127.0.0.1:64249_kwhz    ] o.a.s.m.r.SolrJmxReporter JMX monitoring for 'solr.jvm' (registry 'solr.jvm') enabled at server: com.sun.jmx.mbeanserver.JmxMBeanServer@260b98
   [junit4]   2> 1204649 INFO  (TEST-TestCollectionAPI.test-seed#[3B01807158094CB2]) [n:127.0.0.1:64249_kwhz    ] o.a.s.m.r.SolrJmxReporter JMX monitoring for 'solr.jetty' (registry 'solr.jetty') enabled at server: com.sun.jmx.mbeanserver.JmxMBeanServer@260b98
   [junit4]   2> 1204652 INFO  (TEST-TestCollectionAPI.test-seed#[3B01807158094CB2]) [n:127.0.0.1:64249_kwhz    ] o.a.s.c.CorePropertiesLocator Found 0 core definitions underneath C:\Users\jenkins\workspace\Lucene-Solr-7.x-Windows\solr\build\solr-core\test\J0\temp\solr.cloud.TestCollectionAPI_3B01807158094CB2-001\control-001\cores
   [junit4]   2> 1204682 INFO  (zkConnectionManagerCallback-3644-thread-1) [    ] o.a.s.c.c.ConnectionManager zkClient has connected
   [junit4]   2> 1204684 INFO  (TEST-TestCollectionAPI.test-seed#[3B01807158094CB2]) [    ] o.a.s.c.c.ZkStateReader Updated live nodes from ZooKeeper... (0) -> (1)
   [junit4]   2> 1204685 INFO  (TEST-TestCollectionAPI.test-seed#[3B01807158094CB2]) [    ] o.a.s.c.s.i.ZkClientClusterStateProvider Cluster at 127.0.0.1:64241/solr ready
   [junit4]   2> 1204688 INFO  (qtp11715755-14187) [n:127.0.0.1:64249_kwhz    ] o.a.s.h.a.CollectionsHandler Invoked Collection Action :create with params replicationFactor=1&collection.configName=conf1&name=control_collection&nrtReplicas=1&action=CREATE&numShards=1&createNodeSet=127.0.0.1:64249_kwhz&wt=javabin&version=2 and sendToOCPQueue=true
   [junit4]   2> 1204690 INFO  (OverseerThreadFactory-5473-thread-1-processing-n:127.0.0.1:64249_kwhz) [n:127.0.0.1:64249_kwhz    ] o.a.s.c.CreateCollectionCmd Create collection control_collection
   [junit4]   2> 1204801 INFO  (qtp11715755-14189) [n:127.0.0.1:64249_kwhz    ] o.a.s.h.a.CoreAdminOperation core create command qt=/admin/cores&collection.configName=conf1&newCollection=true&name=control_collection_shard1_replica_n1&action=CREATE&numShards=1&collection=control_collection&shard=shard1&wt=javabin&version=2&replicaType=NRT
   [junit4]   2> 1204802 INFO  (qtp11715755-14189) [n:127.0.0.1:64249_kwhz    ] o.a.s.c.TransientSolrCoreCacheDefault Allocating transient cache for 4 transient cores
   [junit4]   2> 1204908 INFO  (zkCallback-3637-thread-1-processing-n:127.0.0.1:64249_kwhz) [n:127.0.0.1:64249_kwhz    ] o.a.s.c.c.ZkStateReader A cluster state change: [WatchedEvent state:SyncConnected type:NodeDataChanged path:/collections/control_collection/state.json] for collection [control_collection] has occurred - updating... (live nodes size: [1])
   [junit4]   2> 1205834 INFO  (qtp11715755-14189) [n:127.0.0.1:64249_kwhz c:control_collection s:shard1  x:control_collection_shard1_replica_n1] o.a.s.c.SolrConfig Using Lucene MatchVersion: 7.3.0
   [junit4]   2> 1205867 INFO  (qtp11715755-14189) [n:127.0.0.1:64249_kwhz c:control_collection s:shard1  x:control_collection_shard1_replica_n1] o.a.s.s.IndexSchema [control_collection_shard1_replica_n1] Schema name=test
   [junit4]   2> 1205943 INFO  (qtp11715755-14189) [n:127.0.0.1:64249_kwhz c:control_collection s:shard1  x:control_collection_shard1_replica_n1] o.a.s.s.IndexSchema Loaded schema test/1.6 with uniqueid field id
   [junit4]   2> 1205973 INFO  (qtp11715755-14189) [n:127.0.0.1:64249_kwhz c:control_collection s:shard1  x:control_collection_shard1_replica_n1] o.a.s.c.CoreContainer Creating SolrCore 'control_collection_shard1_replica_n1' using configuration from collection control_collection, trusted=true
   [junit4]   2> 1205974 INFO  (qtp11715755-14189) [n:127.0.0.1:64249_kwhz c:control_collection s:shard1  x:control_collection_shard1_replica_n1] o.a.s.m.r.SolrJmxReporter JMX monitoring for 'solr.core.control_collection.shard1.replica_n1' (registry 'solr.core.control_collection.shard1.replica_n1') enabled at server: com.sun.jmx.mbeanserver.JmxMBeanServer@260b98
   [junit4]   2> 1205974 INFO  (qtp11715755-14189) [n:127.0.0.1:64249_kwhz c:control_collection s:shard1  x:control_collection_shard1_replica_n1] o.a.s.c.SolrCore solr.RecoveryStrategy.Builder
   [junit4]   2> 1205974 INFO  (qtp11715755-14189) [n:127.0.0.1:64249_kwhz c:control_collection s:shard1  x:control_collection_shard1_replica_n1] o.a.s.c.SolrCore [[control_collection_shard1_replica_n1] ] Opening new SolrCore at [C:\Users\jenkins\workspace\Lucene-Solr-7.x-Windows\solr\build\solr-core\test\J0\temp\solr.cloud.TestCollectionAPI_3B01807158094CB2-001\control-001\cores\control_collection_shard1_replica_n1], dataDir=[C:\Users\jenkins\workspace\Lucene-Solr-7.x-Windows\solr\build\solr-core\test\J0\temp\solr.cloud.TestCollectionAPI_3B01807158094CB2-001\control-001\cores\control_collection_shard1_replica_n1\data\]
   [junit4]   2> 1205977 INFO  (qtp11715755-14189) [n:127.0.0.1:64249_kwhz c:control_collection s:shard1  x:control_collection_shard1_replica_n1] o.a.s.u.RandomMergePolicy RandomMergePolicy wrapping class org.apache.lucene.index.TieredMergePolicy: [TieredMergePolicy: maxMergeAtOnce=24, maxMergeAtOnceExplicit=38, maxMergedSegmentMB=28.755859375, floorSegmentMB=1.919921875, forceMergeDeletesPctAllowed=7.649922720115412, segmentsPerTier=36.0, maxCFSSegmentSizeMB=8.796093022207999E12, noCFSRatio=0.0
   [junit4]   2> 1205980 WARN  (qtp11715755-14189) [n:127.0.0.1:64249_kwhz c:control_collection s:shard1  x:control_collection_shard1_replica_n1] o.a.s.c.RequestHandlers INVALID paramSet a in requestHandler {type = requestHandler,name = /dump,class = DumpRequestHandler,attributes = {initParams=a, name=/dump, class=DumpRequestHandler},args = {defaults={a=A,b=B}}}
   [junit4]   2> 1206073 INFO  (qtp11715755-14189) [n:127.0.0.1:64249_kwhz c:control_collection s:shard1  x:control_collection_shard1_replica_n1] o.a.s.u.UpdateHandler Using UpdateLog implementation: org.apache.solr.update.UpdateLog
   [junit4]   2> 1206073 INFO  (qtp11715755-14189) [n:127.0.0.1:64249_kwhz c:control_collection s:shard1  x:control_collection_shard1_replica_n1] o.a.s.u.UpdateLog Initializing UpdateLog: dataDir= defaultSyncLevel=FLUSH numRecordsToKeep=100 maxNumLogsToKeep=10 numVersionBuckets=65536
   [junit4]   2> 1206075 INFO  (qtp11715755-14189) [n:127.0.0.1:64249_kwhz c:control_collection s:shard1  x:control_collection_shard1_replica_n1] o.a.s.u.CommitTracker Hard AutoCommit: disabled
   [junit4]   2> 1206075 INFO  (qtp11715755-14189) [n:127.0.0.1:64249_kwhz c:control_collection s:shard1  x:control_collection_shard1_replica_n1] o.a.s.u.CommitTracker Soft AutoCommit: disabled
   [junit4]   2> 1206076 INFO  (qtp11715755-14189) [n:127.0.0.1:64249_kwhz c:control_collection s:shard1  x:control_collection_shard1_replica_n1] o.a.s.u.RandomMergePolicy RandomMergePolicy wrapping class org.apache.lucene.index.TieredMergePolicy: [TieredMergePolicy: maxMergeAtOnce=32, maxMergeAtOnceExplicit=44, maxMergedSegmentMB=47.2353515625, floorSegmentMB=0.970703125, forceMergeDeletesPctAllowed=25.484040503432734, segmentsPerTier=36.0, maxCFSSegmentSizeMB=8.796093022207999E12, noCFSRatio=0.7372477628835474
   [junit4]   2> 1206077 INFO  (qtp11715755-14189) [n:127.0.0.1:64249_kwhz c:control_collection s:shard1  x:control_collection_shard1_replica_n1] o.a.s.s.SolrIndexSearcher Opening [Searcher@165abe8[control_collection_shard1_replica_n1] main]
   [junit4]   2> 1206078 INFO  (qtp11715755-14189) [n:127.0.0.1:64249_kwhz c:control_collection s:shard1  x:control_collection_shard1_replica_n1] o.a.s.r.ManagedResourceStorage Configured ZooKeeperStorageIO with znodeBase: /configs/conf1
   [junit4]   2> 1206079 INFO  (qtp11715755-14189) [n:127.0.0.1:64249_kwhz c:control_collection s:shard1  x:control_collection_shard1_replica_n1] o.a.s.r.ManagedResourceStorage Loaded null at path _rest_managed.json using ZooKeeperStorageIO:path=/configs/conf1
   [junit4]   2> 1206080 INFO  (qtp11715755-14189) [n:127.0.0.1:64249_kwhz c:control_collection s:shard1  x:control_collection_shard1_replica_n1] o.a.s.h.ReplicationHandler Commits will be reserved for 10000ms.
   [junit4]   2> 1206080 INFO  (qtp11715755-14189) [n:127.0.0.1:64249_kwhz c:control_collection s:shard1  x:control_collection_shard1_replica_n1] o.a.s.u.UpdateLog Could not find max version in index or recent updates, using new clock 1588434697832103936
   [junit4]   2> 1206081 INFO  (searcherExecutor-5476-thread-1-processing-n:127.0.0.1:64249_kwhz x:control_collection_shard1_replica_n1 s:shard1 c:control_collection) [n:127.0.0.1:64249_kwhz c:control_collection s:shard1  x:control_collection_shard1_replica_n1] o.a.s.c.SolrCore [control_collection_shard1_replica_n1] Registered new searcher Searcher@165abe8[control_collection_shard1_replica_n1] main{ExitableDirectoryReader(UninvertingDirectoryReader())}
   [junit4]   2> 1206086 INFO  (qtp11715755-14189) [n:127.0.0.1:64249_kwhz c:control_collection s:shard1  x:control_collection_shard1_replica_n1] o.a.s.c.ShardLeaderElectionContext Enough replicas found to continue.
   [junit4]   2> 1206086 INFO  (qtp11715755-14189) [n:127.0.0.1:64249_kwhz c:control_collection s:shard1  x:control_collection_shard1_replica_n1] o.a.s.c.ShardLeaderElectionContext I may be the new leader - try and sync
   [junit4]   2> 1206086 INFO  (qtp11715755-14189) [n:127.0.0.1:64249_kwhz c:control_collection s:shard1  x:control_collection_shard1_replica_n1] o.a.s.c.SyncStrategy Sync replicas to http://127.0.0.1:64249/kwhz/control_collection_shard1_replica_n1/
   [junit4]   2> 1206086 INFO  (qtp11715755-14189) [n:127.0.0.1:64249_kwhz c:control_collection s:shard1  x:control_collection_shard1_replica_n1] o.a.s.c.SyncStrategy Sync Success - now sync replicas to me
   [junit4]   2> 1206086 INFO  (qtp11715755-14189) [n:127.0.0.1:64249_kwhz c:control_collection s:shard1  x:control_collection_shard1_replica_n1] o.a.s.c.SyncStrategy http://127.0.0.1:64249/kwhz/control_collection_shard1_replica_n1/ has no replicas
   [junit4]   2> 1206086 INFO  (qtp11715755-14189) [n:127.0.0.1:64249_kwhz c:control_collection s:shard1  x:control_collection_shard1_replica_n1] o.a.s.c.ShardLeaderElectionContext Found all replicas participating in election, clear LIR
   [junit4]   2> 1206091 INFO  (qtp11715755-14189) [n:127.0.0.1:64249_kwhz c:control_collection s:shard1  x:control_collection_shard1_replica_n1] o.a.s.c.ShardLeaderElectionContext I am the new leader: http://127.0.0.1:64249/kwhz/control_collection_shard1_replica_n1/ shard1
   [junit4]   2> 1264689 INFO  (TEST-TestCollectionAPI.test-seed#[3B01807158094CB2]) [    ] o.a.s.c.ChaosMonkey monkey: stop jetty! 64249
   [junit4]   2> 1264689 INFO  (TEST-TestCollectionAPI.test-seed#[3B01807158094CB2]) [    ] o.a.s.c.CoreContainer Shutting down CoreContainer instance=13641249
   [junit4]   2> 1264689 INFO  (TEST-TestCollectionAPI.test-seed#[3B01807158094CB2]) [    ] o.a.s.m.SolrMetricManager Closing metric reporters for registry=solr.node, tag=null
   [junit4]   2> 1264689 INFO  (TEST-TestCollectionAPI.test-seed#[3B01807158094CB2]) [    ] o.a.s.m.r.SolrJmxReporter Closing reporter [org.apache.solr.metrics.reporters.SolrJmxReporter@9fc445: rootName = null, domain = solr.node, service url = null, agent id = null] for registry solr.node / com.codahale.metrics.MetricRegistry@1975634
   [junit4]   2> 1264699 INFO  (TEST-TestCollectionAPI.test-seed#[3B01807158094CB2]) [    ] o.a.s.m.SolrMetricManager Closing metric reporters for registry=solr.jvm, tag=null
   [junit4]   2> 1264699 INFO  (TEST-TestCollectionAPI.test-seed#[3B01807158094CB2]) [    ] o.a.s.m.r.SolrJmxReporter Closing reporter [org.apache.solr.metrics.reporters.SolrJmxReporter@12ad923: rootName = null, domain = solr.jvm, service url = null, agent id = null] for registry solr.jvm / com.codahale.metrics.MetricRegistry@7d6695
   [junit4]   2> 1264709 INFO  (TEST-TestCollectionAPI.test-seed#[3B01807158094CB2]) [    ] o.a.s.m.SolrMetricManager Closing metric reporters for registry=solr.jetty, tag=null
   [junit4]   2> 1264709 INFO  (TEST-TestCollectionAPI.test-seed#[3B01807158094CB2]) [    ] o.a.s.m.r.SolrJmxReporter Closing reporter [org.apache.solr.metrics.reporters.SolrJmxReporter@1dac5bf: rootName = null, domain = solr.jetty, service url = null, agent id = null] for registry solr.jetty / com.codahale.metrics.MetricRegistry@1b3018f
   [junit4]   2> 1264714 INFO  (TEST-TestCollectionAPI.test-seed#[3B01807158094CB2]) [    ] o.a.s.c.ZkController Remove node as live in ZooKeeper:/live_nodes/127.0.0.1:64249_kwhz
   [junit4]   2> 1264717 INFO  (TEST-TestCollectionAPI.test-seed#[3B01807158094CB2]) [    ] o.a.s.m.SolrMetricManager Closing metric reporters for registry=solr.cluster, tag=null
   [junit4]   2> 1264718 INFO  (zkCallback-3637-thread-2-processing-n:127.0.0.1:64249_kwhz) [n:127.0.0.1:64249_kwhz    ] o.a.s.c.c.ZkStateReader Updated live nodes from ZooKeeper... (1) -> (0)
   [junit4]   2> 1264719 INFO  (coreCloseExecutor-5481-thread-1) [n:127.0.0.1:64249_kwhz c:control_collection s:shard1 r:core_node2 x:control_collection_shard1_replica_n1] o.a.s.c.SolrCore [control_collection_shard1_replica_n1]  CLOSING SolrCore org.apache.solr.core.SolrCore@13b8140
   [junit4]   2> 1264719 INFO  (coreCloseExecutor-5481-thread-1) [n:127.0.0.1:64249_kwhz c:control_collection s:shard1 r:core_node2 x:control_collection_shard1_replica_n1] o.a.s.m.SolrMetricManager Closing metric reporters for registry=solr.core.control_collection.shard1.replica_n1, tag=20676928
   [junit4]   2> 1264719 INFO  (coreCloseExecutor-5481-thread-1) [n:127.0.0.1:64249_kwhz c:control_collection s:shard1 r:core_node2 x:control_collection_shard1_replica_n1] o.a.s.m.r.SolrJmxReporter Closing reporter [org.apache.solr.metrics.reporters.SolrJmxReporter@5088fa: rootName = null, domain = solr.core.control_collection.shard1.replica_n1, service url = null, agent id = null] for registry solr.core.control_collection.shard1.replica_n1 / com.codahale.metrics.MetricRegistry@55da51
   [junit4]   2> 1264742 INFO  (coreCloseExecutor-5481-thread-1) [n:127.0.0.1:64249_kwhz c:control_collection s:shard1 r:core_node2 x:control_collection_shard1_replica_n1] o.a.s.m.SolrMetricManager Closing metric reporters for registry=solr.collection.control_collection.shard1.leader, tag=20676928
   [junit4]   2> 1275559 INFO  (ScheduledTrigger-5471-thread-3) [n:127.0.0.1:64249_kwhz    ] o.a.s.c.a.SystemLogListener Collection .system does not exist, disabling logging.
   [junit4]   2> 1275564 INFO  (AutoscalingActionExecutor-5472-thread-1-processing-n:127.0.0.1:64249_kwhz) [n:127.0.0.1:64249_kwhz    ] o.a.s.c.s.c.a.PolicyHelper returnSession, curr-time 731941951 sessionWrapper.createTime 731941950948110, this.sessionWrapper.createTime 731941950948110 
   [junit4]   2> 1275564 INFO  (AutoscalingActionExecutor-5472-thread-1-processing-n:127.0.0.1:64249_kwhz) [n:127.0.0.1:64249_kwhz    ] o.a.s.c.a.ExecutePlanAction No operations to execute for event: {
   [junit4]   2>   "id":"299b02f02057bTf0cxvw262yrq650jn1fjjyrb3",
   [junit4]   2>   "source":".auto_add_replicas",
   [junit4]   2>   "eventTime":731931935376763,
   [junit4]   2>   "eventType":"NODELOST",
   [junit4]   2>   "properties":{
   [junit4]   2>     "eventTimes":[731931935376763],
   [junit4]   2>     "_enqueue_time_":731941944981033,
   [junit4]   2>     "nodeNames":["127.0.0.1:64249_kwhz"]}}
   [junit4]   2> 1384693 ERROR (qtp11715755-14187) [n:127.0.0.1:64249_kwhz    ] o.a.s.h.RequestHandlerBase org.apache.solr.common.SolrException: create the collection time out:180s
   [junit4]   2> 	at org.apache.solr.handler.admin.CollectionsHandler.handleResponse(CollectionsHandler.java:314)
   [junit4]   2> 	at org.apache.solr.handler.admin.CollectionsHandler.invokeAction(CollectionsHandler.java:246)
   [junit4]   2> 	at org.apache.solr.handler.admin.CollectionsHandler.handleRequestBody(CollectionsHandler.java:224)
   [junit4]   2> 	at org.apache.solr.handler.RequestHandlerBase.handleRequest(RequestHandlerBase.java:177)
   [junit4]   2> 	at org.apache.solr.servlet.HttpSolrCall.handleAdmin(HttpSolrCall.java:736)
   [junit4]   2> 	at org.apache.solr.servlet.HttpSolrCall.handleAdminRequest(HttpSolrCall.java:717)
   [junit4]   2> 	at org.apache.solr.servlet.HttpSolrCall.call(HttpSolrCall.java:498)
   [junit4]   2> 	at org.apache.solr.servlet.SolrDispatchFilter.doFilter(SolrDispatchFilter.java:382)
   [junit4]   2> 	at org.apache.solr.servlet.SolrDispatchFilter.doFilter(SolrDispatchFilter.java:326)
   [junit4]   2> 	at org.eclipse.jetty.servlet.ServletHandler$CachedChain.doFilter(ServletHandler.java:1759)
   [junit4]   2> 	at org.apache.solr.client.solrj.embedded.JettySolrRunner$DebugFilter.doFilter(JettySolrRunner.java:139)
   [junit4]   2> 	at org.eclipse.jetty.servlet.ServletHandler$CachedChain.doFilter(ServletHandler.java:1759)
   [junit4]   2> 	at org.eclipse.jetty.servlet.ServletHandler.doHandle(ServletHandler.java:582)
   [junit4]   2> 	at org.eclipse.jetty.server.session.SessionHandler.doHandle(SessionHandler.java:224)
   [junit4]   2> 	at org.eclipse.jetty.server.handler.ContextHandler.doHandle(ContextHandler.java:1180)
   [junit4]   2> 	at org.eclipse.jetty.servlet.ServletHandler.doScope(ServletHandler.java:512)
   [junit4]   2> 	at org.eclipse.jetty.server.session.SessionHandler.doScope(SessionHandler.java:185)
   [junit4]   2> 	at org.eclipse.jetty.server.handler.ContextHandler.doScope(ContextHandler.java:1112)
   [junit4]   2> 	at org.eclipse.jetty.server.handler.ScopedHandler.handle(ScopedHandler.java:141)
   [junit4]   2> 	at org.eclipse.jetty.server.handler.gzip.GzipHandler.handle(GzipHandler.java:493)
   [junit4]   2> 	at org.eclipse.jetty.server.handler.HandlerWrapper.handle(HandlerWrapper.java:134)
   [junit4]   2> 	at org.eclipse.jetty.server.Server.handle(Server.java:534)
   [junit4]   2> 	at org.eclipse.jetty.server.HttpChannel.handle(HttpChannel.java:320)
   [junit4]   2> 	at org.eclipse.jetty.server.HttpConnection.onFillable(HttpConnection.java:251)
   [junit4]   2> 	at org.eclipse.jetty.io.AbstractConnection$ReadCallback.succeeded(AbstractConnection.java:283)
   [junit4]   2> 	at org.eclipse.jetty.io.FillInterest.fillable(FillInterest.java:108)
   [junit4]   2> 	at org.eclipse.jetty.io.SelectChannelEndPoint$2.run(SelectChannelEndPoint.java:93)
   [junit4]   2> 	at org.eclipse.jetty.util.thread.strategy.ExecuteProduceConsume.executeProduceConsume(ExecuteProduceConsume.java:303)
   [junit4]   2> 	at org.eclipse.jetty.util.thread.strategy.ExecuteProduceConsume.produceConsume(ExecuteProduceConsume.java:148)
   [junit4]   2> 	at org.eclipse.jetty.util.thread.strategy.ExecuteProduceConsume.run(ExecuteProduceConsume.java:136)
   [junit4]   2> 	at org.eclipse.jetty.util.thread.QueuedThreadPool.runJob(QueuedThreadPool.java:671)
   [junit4]   2> 	at org.eclipse.jetty.util.thread.QueuedThreadPool$2.run(QueuedThreadPool.java:589)
   [junit4]   2> 	at java.lang.Thread.run(Thread.java:748)
   [junit4]   2> 
   [junit4]   2> 1384695 INFO  (qtp11715755-14187) [n:127.0.0.1:64249_kwhz    ] o.a.s.s.HttpSolrCall [admin] webapp=null path=/admin/collections params={replicationFactor=1&collection.configName=conf1&name=control_collection&nrtReplicas=1&action=CREATE&numShards=1&createNodeSet=127.0.0.1:64249_kwhz&wt=javabin&version=2} status=500 QTime=180006
   [junit4]   2> 1384695 ERROR (qtp11715755-14187) [n:127.0.0.1:64249_kwhz    ] o.a.s.s.HttpSolrCall null:org.apache.solr.common.SolrException: create the collection time out:180s
   [junit4]   2> 	at org.apache.solr.handler.admin.CollectionsHandler.handleResponse(CollectionsHandler.java:314)
   [junit4]   2> 	at org.apache.solr.handler.admin.CollectionsHandler.invokeAction(CollectionsHandler.java:246)
   [junit4]   2> 	at org.apache.solr.handler.admin.CollectionsHandler.handleRequestBody(CollectionsHandler.java:224)
   [junit4]   2> 	at org.apache.solr.handler.RequestHandlerBase.handleRequest(RequestHandlerBase.java:177)
   [junit4]   2> 	at org.apache.solr.servlet.HttpSolrCall.handleAdmin(HttpSolrCall.java:736)
   [junit4]   2> 	at org.apache.solr.servlet.HttpSolrCall.handleAdminRequest(HttpSolrCall.java:717)
   [junit4]   2> 	at org.apache.solr.servlet.HttpSolrCall.call(HttpSolrCall.java:498)
   [junit4]   2> 	at org.apache.solr.servlet.SolrDispatchFilter.doFilter(SolrDispatchFilter.java:382)
   [junit4]   2> 	at org.apache.solr.servlet.SolrDispatchFilter.doFilter(SolrDispatchFilter.java:326)
   [junit4]   2> 	at org.eclipse.jetty.servlet.ServletHandler$CachedChain.doFilter(ServletHandler.java:1759)
   [junit4]   2> 	at org.apache.solr.client.solrj.embedded.JettySolrRunner$DebugFilter.doFilter(JettySolrRunner.java:139)
   [junit4]   2> 	at org.eclipse.jetty.servlet.ServletHandler$CachedChain.doFilter(ServletHandler.java:1759)
   [junit4]   2> 	at org.eclipse.jetty.servlet.ServletHandler.doHandle(ServletHandler.java:582)
   [junit4]   2> 	at org.eclipse.jetty.server.session.SessionHandler.doHandle(SessionHandler.java:224)
   [junit4]   2> 	at org.eclipse.jetty.server.handler.ContextHandler.doHandle(ContextHandler.java:1180)
   [junit4]   2> 	at org.eclipse.jetty.servlet.ServletHandler.doScope(ServletHandler.java:512)
   [junit4]   2> 	at org.eclipse.jetty.server.session.SessionHandler.doScope(SessionHandler.java:185)
   [junit4]   2> 	at org.eclipse.jetty.server.handler.ContextHandler.doScope(ContextHandler.java:1112)
   [junit4]   2> 	at org.eclipse.jetty.server.handler.ScopedHandler.handle(ScopedHandler.java:141)
   [junit4]   2> 	at org.eclipse.jetty.server.handler.gzip.GzipHandler.handle(GzipHandler.java:493)
   [junit4]   2> 	at org.eclipse.jetty.server.handler.HandlerWrapper.handle(HandlerWrapper.java:134)
   [junit4]   2> 	at org.eclipse.jetty.server.Server.handle(Server.java:534)
   [junit4]   2> 	at org.eclipse.jetty.server.HttpChannel.handle(HttpChannel.java:320)
   [junit4]   2> 	at org.eclipse.jetty.server.HttpConnection.onFillable(HttpConnection.java:251)
   [junit4]   2> 	at org.eclipse.jetty.io.AbstractConnection$ReadCallback.succeeded(AbstractConnection.java:283)
   [junit4]   2> 	at org.eclipse.jetty.io.FillInterest.fillable(FillInterest.java:108)
   [junit4]   2> 	at org.eclipse.jetty.io.SelectChannelEndPoint$2.run(SelectChannelEndPoint.java:93)
   [junit4]   2> 	at org.eclipse.jetty.util.thread.strategy.ExecuteProduceConsume.executeProduceConsume(ExecuteProduceConsume.java:303)
   [junit4]   2> 	at org.eclipse.jetty.util.thread.strategy.ExecuteProduceConsume.produceConsume(ExecuteProduceConsume.java:148)
   [junit4]   2> 	at org.eclipse.jetty.util.thread.strategy.ExecuteProduceConsume.run(ExecuteProduceConsume.java:136)
   [junit4]   2> 	at org.eclipse.jetty.util.thread.QueuedThreadPool.runJob(QueuedThreadPool.java:671)
   [junit4]   2> 	at org.eclipse.jetty.util.thread.QueuedThreadPool$2.run(QueuedThreadPool.java:589)
   [junit4]   2> 	at java.lang.Thread.run(Thread.java:748)
   [junit4]   2> 
   [junit4]   2> 1804800 ERROR (OverseerThreadFactory-5473-thread-1-processing-n:127.0.0.1:64249_kwhz) [n:127.0.0.1:64249_kwhz    ] o.a.s.c.OverseerCollectionMessageHandler Error from shard: http://127.0.0.1:64249/kwhz
   [junit4]   2> org.apache.solr.client.solrj.SolrServerException: Timeout occured while waiting response from server at: http://127.0.0.1:64249/kwhz
   [junit4]   2> 	at org.apache.solr.client.solrj.impl.HttpSolrClient.executeMethod(HttpSolrClient.java:654)
   [junit4]   2> 	at org.apache.solr.client.solrj.impl.HttpSolrClient.request(HttpSolrClient.java:255)
   [junit4]   2> 	at org.apache.solr.client.solrj.impl.HttpSolrClient.request(HttpSolrClient.java:244)
   [junit4]   2> 	at org.apache.solr.client.solrj.SolrClient.request(SolrClient.java:1219)
   [junit4]   2> 	at org.apache.solr.handler.component.HttpShardHandler.lambda$submit$0(HttpShardHandler.java:172)
   [junit4]   2> 	at java.util.concurrent.FutureTask.run(FutureTask.java:266)
   [junit4]   2> 	at java.util.concurrent.Executors$RunnableAdapter.call(Executors.java:511)
   [junit4]   2> 	at java.util.concurrent.FutureTask.run(FutureTask.java:266)
   [junit4]   2> 	at com.codahale.metrics.InstrumentedExecutorService$InstrumentedRunnable.run(InstrumentedExecutorService.java:176)
   [junit4]   2> 	at org.apache.solr.common.util.ExecutorUtil$MDCAwareThreadPoolExecutor.lambda$execute$0(ExecutorUtil.java:188)
   [junit4]   2> 	at java.util.concurrent.ThreadPoolExecutor.runWorker(ThreadPoolExecutor.java:1149)
   [junit4]   2> 	at java.util.concurrent.ThreadPoolExecutor$Worker.run(ThreadPoolExecutor.java:624)
   [junit4]   2> 	at java.lang.Thread.run(Thread.java:748)
   [junit4]   2> Caused by: java.net.SocketTimeoutException: Read timed out
   [junit4]   2> 	at java.net.SocketInputStream.socketRead0(Native Method)
   [junit4]   2> 	at java.net.SocketInputStream.socketRead(SocketInputStream.java:116)
   [junit4]   2> 	at java.net.SocketInputStream.read(SocketInputStream.java:171)
   [junit4]   2> 	at java.net.SocketInputStream.read(SocketInputStream.java:141)
   [junit4]   2> 	at org.apache.http.impl.io.SessionInputBufferImpl.streamRead(SessionInputBufferImpl.java:137)
   [junit4]   2> 	at org.apache.http.impl.io.SessionInputBufferImpl.fillBuffer(SessionInputBufferImpl.java:153)
   [junit4]   2> 	at org.apache.http.impl.io.SessionInputBufferImpl.readLine(SessionInputBufferImpl.java:282)
   [junit4]   2> 	at org.apache.http.impl.conn.DefaultHttpResponseParser.parseHead(DefaultHttpResponseParser.java:138)
   [junit4]   2> 	at org.apache.http.impl.conn.DefaultHttpResponseParser.parseHead(DefaultHttpResponseParser.java:56)
   [junit4]   2> 	at org.apache.http.impl.io.AbstractMessageParser.parse(AbstractMessageParser.java:259)
   [junit4]   2> 	at org.apache.http.impl.DefaultBHttpClientConnection.receiveResponseHeader(DefaultBHttpClientConnection.java:163)
   [junit4]   2> 	at org.apache.http.impl.conn.CPoolProxy.receiveResponseHeader(CPoolProxy.java:165)
   [junit4]   2> 	at org.apache.http.protocol.HttpRequestExecutor.doReceiveResponse(HttpRequestExecutor.java:273)
   [junit4]   2> 	at org.apache.http.protocol.HttpRequestExecutor.execute(HttpRequestExecutor.java:125)
   [junit4]   2> 	at org.apache.solr.util.stats.InstrumentedHttpRequestExecutor.execute(InstrumentedHttpRequestExecutor.java:118)
   [junit4]   2> 	at org.apache.http.impl.execchain.MainClientExec.execute(MainClientExec.java:272)
   [junit4]   2> 	at org.apache.http.impl.execchain.ProtocolExec.execute(ProtocolExec.java:185)
   [junit4]   2> 	at org.apache.http.impl.execchain.RetryExec.execute(RetryExec.java:89)
   [junit4]   2> 	at org.apache.http.impl.execchain.RedirectExec.execute(RedirectExec.java:111)
   [junit4]   2> 	at org.apache.http.impl.client.InternalHttpClient.doExecute(InternalHttpClient.java:185)
   [junit4]   2> 	at org.apache.http.impl.client.CloseableHttpClient.execute(CloseableHttpClient.java:83)
   [junit4]   2> 	at org.apache.http.impl.client.CloseableHttpClient.execute(CloseableHttpClient.java:56)
   [junit4]   2> 	at org.apache.solr.client.solrj.impl.HttpSolrClient.executeMethod(HttpSolrClient.java:542)
   [junit4]   2> 	... 12 more
   [junit4]   2> 1804801 INFO  (TEST-TestCollectionAPI.test-seed#[3B01807158094CB2]) [    ] o.a.s.c.Overseer Overseer (id=99277168455843844-127.0.0.1:64249_kwhz-n_0000000000) closing
   [junit4]   2> 1804802 ERROR (OverseerThreadFactory-5473-thread-1-processing-n:127.0.0.1:64249_kwhz) [n:127.0.0.1:64249_kwhz    ] o.a.s.c.OverseerCollectionMessageHandler Cleaning up collection [control_collection].
   [junit4]   2> 1804802 INFO  (OverseerStateUpdate-99277168455843844-127.0.0.1:64249_kwhz-n_0000000000) [n:127.0.0.1:64249_kwhz    ] o.a.s.c.Overseer Overseer Loop exiting : 127.0.0.1:64249_kwhz
   [junit4]   2> 1804803 INFO  (OverseerThreadFactory-5473-thread-1-processing-n:127.0.0.1:64249_kwhz) [n:127.0.0.1:64249_kwhz    ] o.a.s.c.OverseerCollectionMessageHandler Executing Collection Cmd : action=UNLOAD&deleteInstanceDir=true&deleteDataDir=true
   [junit4]   2> 1834837 INFO  (zkCallback-3637-thread-5-processing-n:127.0.0.1:64249_kwhz) [n:127.0.0.1:64249_kwhz    ] o.a.s.c.c.ZkStateReader A cluster state change: [WatchedEvent state:SyncConnected type:NodeDeleted path:/collections/control_collection/state.json] for collection [control_collection] has occurred - updating... (live nodes size: [0])
   [junit4]   2> 1834840 ERROR (OverseerThreadFactory-5473-thread-1-processing-n:127.0.0.1:64249_kwhz) [n:127.0.0.1:64249_kwhz    ] o.a.s.c.OverseerCollectionMessageHandler Collection: control_collection operation: create failed:org.apache.solr.common.SolrException: Could not fully remove collection: control_collection
   [junit4]   2> 	at org.apache.solr.cloud.DeleteCollectionCmd.call(DeleteCollectionCmd.java:112)
   [junit4]   2> 	at org.apache.solr.cloud.OverseerCollectionMessageHandler.cleanupCollection(OverseerCollectionMessageHandler.java:688)
   [junit4]   2> 	at org.apache.solr.cloud.CreateCollectionCmd.call(CreateCollectionCmd.java:240)
   [junit4]   2> 	at org.apache.solr.cloud.OverseerCollectionMessageHandler.processMessage(OverseerCollectionMessageHandler.java:242)
   [junit4]   2> 	at org.apache.solr.cloud.OverseerTaskProcessor$Runner.run(OverseerTaskProcessor.java:464)
   [junit4]   2> 	at org.apache.solr.common.util.ExecutorUtil$MDCAwareThreadPoolExecutor.lambda$execute$0(ExecutorUtil.java:188)
   [junit4]   2> 	at java.util.concurrent.ThreadPoolExecutor.runWorker(ThreadPoolExecutor.java:1149)
   [junit4]   2> 	at java.util.concurrent.ThreadPoolExecutor$Worker.run(ThreadPoolExecutor.java:624)
   [junit4]   2> 	at java.lang.Thread.run(Thread.java:748)
   [junit4]   2> 
   [junit4]   2> 1834846 INFO  (OverseerThreadFactory-5473-thread-1-processing-n:127.0.0.1:64249_kwhz) [n:127.0.0.1:64249_kwhz    ] o.a.s.c.OverseerTaskQueue Response ZK path: /overseer/collection-queue-work/qnr-0000000000 doesn't exist.  Requestor may have disconnected from ZooKeeper
   [junit4]   2> 1834847 WARN  (OverseerAutoScalingTriggerThread-99277168455843844-127.0.0.1:64249_kwhz-n_0000000000) [n:127.0.0.1:64249_kwhz    ] o.a.s.c.a.OverseerTriggerThread OverseerTriggerThread woken up but we are closed, exiting.
   [junit4]   2> 1834850 INFO  (TEST-TestCollectionAPI.test-seed#[3B01807158094CB2]) [    ] o.e.j.s.AbstractConnector Stopped ServerConnector@10d40b0{HTTP/1.1,[http/1.1]}{127.0.0.1:0}
   [junit4]   2> 1834850 INFO  (TEST-TestCollectionAPI.test-seed#[3B01807158094CB2]) [    ] o.e.j.s.h.ContextHandler Stopped o.e.j.s.ServletContextHandler@ad3f14{/kwhz,nu

[...truncated too long message...]

stUnifiedSolrHighlighter, TestCustomSort, TestSolrDeletionPolicy2, TestSizeLimitedDistributedMap, TestTlogReplica, SolrCLIZkUtilsTest, TestConfigSetsAPIZkFailure, TestDistribStateManager, RequiredFieldsTest, SolrMetricReporterTest, DeleteShardTest, TestDynamicFieldCollectionResource, DistributedVersionInfoTest, TestCloudNestedDocsSort, TestConfigReload, UtilsToolTest, TestEmbeddedSolrServerAdminHandler, TestCustomStream, TestAnalyzeInfixSuggestions, MetricUtilsTest, TestLeaderElectionZkExpiry, TestExceedMaxTermLength, TestTolerantSearch, TestQuerySenderNoQuery, TestScoreJoinQPNoScore, SuggestComponentTest, SignatureUpdateProcessorFactoryTest, CloneFieldUpdateProcessorFactoryTest, CSVRequestHandlerTest, TestStandardQParsers, DisMaxRequestHandlerTest, FullHLLTest, TestGenericDistributedQueue, AnalyticsQueryTest, TestBackupRepositoryFactory, TestDFRSimilarityFactory, DistributedTermsComponentTest, TestClusterStateProvider, TestPointFields, TestLMDirichletSimilarityFactory, PrimUtilsTest, JavabinLoaderTest, TestManagedResourceStorage, HdfsUnloadDistributedZkTest, TestPushWriter, TestFieldTypeCollectionResource, HdfsBasicDistributedZk2Test, TestAddFieldRealTimeGet, TestHdfsCloudBackupRestore, StressHdfsTest, UUIDUpdateProcessorFallbackTest, TestStressRecovery, LeaderElectionTest, TestSimpleTextCodec, TestCodecSupport, TestDefaultStatsCache, AlternateDirectoryTest, TestGraphMLResponseWriter, TestInPlaceUpdatesDistrib, CdcrReplicationDistributedZkTest, TestStressInPlaceUpdates, TestQueryWrapperFilter, TestCoreAdminApis, DistributedExpandComponentTest, TestRealTimeGet, TestReqParamsAPI, CurrencyFieldTypeTest, TestCollectionAPIs, SolrCmdDistributorTest, PrimitiveFieldTypeTest, TestSchemaSimilarityResource, TestReplicationHandler, DirectUpdateHandlerTest, TestQuerySenderListener, StatsComponentTest, TestNodeAddedTrigger, TestSubQueryTransformerDistrib, AddSchemaFieldsUpdateProcessorFactoryTest, RemoteQueryErrorTest, NumberUtilsTest, TestEmbeddedSolrServerSchemaAPI, UnloadDistributedZkTest, SaslZkACLProviderTest, TestPhraseSuggestions, HdfsDirectoryFactoryTest, SolrJmxReporterCloudTest, TestCollectionAPI, TestDocTermOrds, TestPrepRecovery, TestSolrCoreSnapshots, HighlighterConfigTest, TestXmlQParserPlugin, OverseerStatusTest, TestPivotHelperCode, SolrSlf4jReporterTest, RankQueryTest, TestManagedSynonymGraphFilterFactory, DateFieldTest, ClusterStateUpdateTest, TestCoreDiscovery, DistributedQueryElevationComponentTest, CoreAdminCreateDiscoverTest, TestFieldCacheReopen, TestCloudDeleteByQuery, TestSolrCoreParser, TestDFISimilarityFactory, OverriddenZkACLAndCredentialsProvidersTest, HdfsRecoverLeaseTest, TestCSVResponseWriter, TestPolicyCloud, JvmMetricsTest, TestReplicaProperties, BooleanFieldTest, TestFiltering, TestPullReplicaErrorHandling, DistanceFunctionTest, TestCloudPseudoReturnFields, HdfsThreadLeakTest, ZkStateReaderTest, TestLRUStatsCache, ReturnFieldsTest, TestFilteredDocIdSet, DistributedFacetPivotLargeTest, ConfigureRecoveryStrategyTest, HighlighterTest, ChaosMonkeySafeLeaderWithPullReplicasTest, DirectUpdateHandlerOptimizeTest, TestFileDictionaryLookup, TestMinMaxOnMultiValuedField, CircularListTest, TestRuleBasedAuthorizationPlugin, BadIndexSchemaTest, IndexSchemaTest, SyncSliceTest, TestConfigSets, SubstringBytesRefFilterTest, UUIDFieldTest, RegexBoostProcessorTest, TestComplexPhraseLeadingWildcard, TestTrieFacet, AutoScalingHandlerTest, TestHighFrequencyDictionaryFactory, SpatialFilterTest, SuggesterTSTTest, PolyFieldTest, TestPseudoReturnFields, TestWordDelimiterFilterFactory, QueryEqualityTest, TestRemoteStreaming, TestSolrDeletionPolicy1, XsltUpdateRequestHandlerTest, IndexBasedSpellCheckerTest, LukeRequestHandlerTest, TestQueryTypes, FileBasedSpellCheckerTest, RequestHandlersTest, PathHierarchyTokenizerFactoryTest, FieldAnalysisRequestHandlerTest, TestCollationField, MBeansHandlerTest, SOLR749Test, ResponseLogComponentTest, SampleTest, TestBinaryField, NumericFieldsTest, OutputWriterTest, DirectSolrConnectionTest, TestLuceneMatchVersion, TestSweetSpotSimilarityFactory, TestIBSimilarityFactory, ScriptEngineTest, ChaosMonkeyNothingIsSafeTest, AssignBackwardCompatibilityTest, CollectionReloadTest, CollectionTooManyReplicasTest, CollectionsAPISolrJTest, DeleteInactiveReplicaTest, DeleteLastCustomShardedReplicaTest, DeleteStatusTest, DistribDocExpirationUpdateProcessorTest, LeaderFailureAfterFreshStartTest, LeaderInitiatedRecoveryOnCommitTest, MissingSegmentRecoveryTest, NodeMutatorTest, OverseerRolesTest, OverseerTaskQueueTest, PeerSyncReplicationTest]
   [junit4] Completed [559/764 (3!)] on J0 in 631.82s, 1 test, 1 error <<< FAILURES!

[...truncated 3058 lines...]
   [junit4] Suite: org.apache.solr.update.processor.TestOpenNLPExtractNamedEntitiesUpdateProcessorFactory
   [junit4]   2> Creating dataDir: C:\Users\jenkins\workspace\Lucene-Solr-7.x-Windows\solr\build\contrib\solr-analysis-extras\test\J1\temp\solr.update.processor.TestOpenNLPExtractNamedEntitiesUpdateProcessorFactory_1CC2BE264A7EA42D-001\init-core-data-001
   [junit4]   2> NOTE: test params are: codec=Asserting(Lucene70): {}, docValues:{}, maxPointsInLeafNode=1791, maxMBSortInHeap=6.9154692819464705, sim=RandomSimilarity(queryNorm=true): {}, locale=et, timezone=America/Indianapolis
   [junit4]   2> NOTE: Windows 10 10.0 x86/Oracle Corporation 1.8.0_144 (32-bit)/cpus=3,threads=1,free=8113424,total=28123136
   [junit4]   2> NOTE: All tests run in this JVM: [TestFoldingMultitermExtrasQuery, TestOpenNLPExtractNamedEntitiesUpdateProcessorFactory]
   [junit4]   2> NOTE: reproduce with: ant test  -Dtestcase=TestOpenNLPExtractNamedEntitiesUpdateProcessorFactory -Dtests.seed=1CC2BE264A7EA42D -Dtests.slow=true -Dtests.locale=et -Dtests.timezone=America/Indianapolis -Dtests.asserts=true -Dtests.file.encoding=UTF-8
   [junit4] ERROR   0.00s J1 | TestOpenNLPExtractNamedEntitiesUpdateProcessorFactory (suite) <<<
   [junit4]    > Throwable #1: java.io.IOException: Could not remove the following files (in the order of attempts):
   [junit4]    >    C:\Users\jenkins\workspace\Lucene-Solr-7.x-Windows\solr\build\contrib\solr-analysis-extras\test\J1\temp\solr.update.processor.TestOpenNLPExtractNamedEntitiesUpdateProcessorFactory_1CC2BE264A7EA42D-001\tempDir-001\collection1\conf: java.nio.file.DirectoryNotEmptyException: C:\Users\jenkins\workspace\Lucene-Solr-7.x-Windows\solr\build\contrib\solr-analysis-extras\test\J1\temp\solr.update.processor.TestOpenNLPExtractNamedEntitiesUpdateProcessorFactory_1CC2BE264A7EA42D-001\tempDir-001\collection1\conf
   [junit4]    >    C:\Users\jenkins\workspace\Lucene-Solr-7.x-Windows\solr\build\contrib\solr-analysis-extras\test\J1\temp\solr.update.processor.TestOpenNLPExtractNamedEntitiesUpdateProcessorFactory_1CC2BE264A7EA42D-001\tempDir-001\collection1: java.nio.file.DirectoryNotEmptyException: C:\Users\jenkins\workspace\Lucene-Solr-7.x-Windows\solr\build\contrib\solr-analysis-extras\test\J1\temp\solr.update.processor.TestOpenNLPExtractNamedEntitiesUpdateProcessorFactory_1CC2BE264A7EA42D-001\tempDir-001\collection1
   [junit4]    >    C:\Users\jenkins\workspace\Lucene-Solr-7.x-Windows\solr\build\contrib\solr-analysis-extras\test\J1\temp\solr.update.processor.TestOpenNLPExtractNamedEntitiesUpdateProcessorFactory_1CC2BE264A7EA42D-001\tempDir-001: java.nio.file.DirectoryNotEmptyException: C:\Users\jenkins\workspace\Lucene-Solr-7.x-Windows\solr\build\contrib\solr-analysis-extras\test\J1\temp\solr.update.processor.TestOpenNLPExtractNamedEntitiesUpdateProcessorFactory_1CC2BE264A7EA42D-001\tempDir-001
   [junit4]    >    C:\Users\jenkins\workspace\Lucene-Solr-7.x-Windows\solr\build\contrib\solr-analysis-extras\test\J1\temp\solr.update.processor.TestOpenNLPExtractNamedEntitiesUpdateProcessorFactory_1CC2BE264A7EA42D-001\tempDir-001\collection1\conf\en-test-tokenizer.bin: java.nio.file.AccessDeniedException: C:\Users\jenkins\workspace\Lucene-Solr-7.x-Windows\solr\build\contrib\solr-analysis-extras\test\J1\temp\solr.update.processor.TestOpenNLPExtractNamedEntitiesUpdateProcessorFactory_1CC2BE264A7EA42D-001\tempDir-001\collection1\conf\en-test-tokenizer.bin
   [junit4]    >    C:\Users\jenkins\workspace\Lucene-Solr-7.x-Windows\solr\build\contrib\solr-analysis-extras\test\J1\temp\solr.update.processor.TestOpenNLPExtractNamedEntitiesUpdateProcessorFactory_1CC2BE264A7EA42D-001\tempDir-001\collection1\conf\en-test-ner-person.bin: java.nio.file.AccessDeniedException: C:\Users\jenkins\workspace\Lucene-Solr-7.x-Windows\solr\build\contrib\solr-analysis-extras\test\J1\temp\solr.update.processor.TestOpenNLPExtractNamedEntitiesUpdateProcessorFactory_1CC2BE264A7EA42D-001\tempDir-001\collection1\conf\en-test-ner-person.bin
   [junit4]    >    C:\Users\jenkins\workspace\Lucene-Solr-7.x-Windows\solr\build\contrib\solr-analysis-extras\test\J1\temp\solr.update.processor.TestOpenNLPExtractNamedEntitiesUpdateProcessorFactory_1CC2BE264A7EA42D-001\tempDir-001\collection1\conf\en-test-sent.bin: java.nio.file.AccessDeniedException: C:\Users\jenkins\workspace\Lucene-Solr-7.x-Windows\solr\build\contrib\solr-analysis-extras\test\J1\temp\solr.update.processor.TestOpenNLPExtractNamedEntitiesUpdateProcessorFactory_1CC2BE264A7EA42D-001\tempDir-001\collection1\conf\en-test-sent.bin
   [junit4]    >    C:\Users\jenkins\workspace\Lucene-Solr-7.x-Windows\solr\build\contrib\solr-analysis-extras\test\J1\temp\solr.update.processor.TestOpenNLPExtractNamedEntitiesUpdateProcessorFactory_1CC2BE264A7EA42D-001: java.nio.file.DirectoryNotEmptyException: C:\Users\jenkins\workspace\Lucene-Solr-7.x-Windows\solr\build\contrib\solr-analysis-extras\test\J1\temp\solr.update.processor.TestOpenNLPExtractNamedEntitiesUpdateProcessorFactory_1CC2BE264A7EA42D-001
   [junit4]    > 	at __randomizedtesting.SeedInfo.seed([1CC2BE264A7EA42D]:0)
   [junit4]    > 	at org.apache.lucene.util.IOUtils.rm(IOUtils.java:329)
   [junit4]    > 	at java.lang.Thread.run(Thread.java:748)
   [junit4] Completed [4/5 (1!)] on J1 in 1.09s, 8 tests, 1 error <<< FAILURES!

[...truncated 41504 lines...]

Mime
View raw message