lucene-dev mailing list archives

Site index · List index
Message view « Date » · « Thread »
Top « Date » · « Thread »
From Policeman Jenkins Server <jenk...@thetaphi.de>
Subject [JENKINS] Lucene-Solr-7.x-Windows (32bit/jdk1.8.0_144) - Build # 374 - Still unstable!
Date Mon, 01 Jan 2018 13:16:03 GMT
Build: https://jenkins.thetaphi.de/job/Lucene-Solr-7.x-Windows/374/
Java: 32bit/jdk1.8.0_144 -server -XX:+UseG1GC

3 tests failed.
FAILED:  junit.framework.TestSuite.org.apache.solr.handler.component.DistributedMLTComponentTest

Error Message:
Could not remove the following files (in the order of attempts):    C:\Users\jenkins\workspace\Lucene-Solr-7.x-Windows\solr\build\solr-core\test\J1\temp\solr.handler.component.DistributedMLTComponentTest_9B8713B795C8065A-001\tempDir-001: java.nio.file.DirectoryNotEmptyException: C:\Users\jenkins\workspace\Lucene-Solr-7.x-Windows\solr\build\solr-core\test\J1\temp\solr.handler.component.DistributedMLTComponentTest_9B8713B795C8065A-001\tempDir-001    C:\Users\jenkins\workspace\Lucene-Solr-7.x-Windows\solr\build\solr-core\test\J1\temp\solr.handler.component.DistributedMLTComponentTest_9B8713B795C8065A-001\tempDir-001\shard2: java.nio.file.AccessDeniedException: C:\Users\jenkins\workspace\Lucene-Solr-7.x-Windows\solr\build\solr-core\test\J1\temp\solr.handler.component.DistributedMLTComponentTest_9B8713B795C8065A-001\tempDir-001\shard2 

Stack Trace:
java.io.IOException: Could not remove the following files (in the order of attempts):
   C:\Users\jenkins\workspace\Lucene-Solr-7.x-Windows\solr\build\solr-core\test\J1\temp\solr.handler.component.DistributedMLTComponentTest_9B8713B795C8065A-001\tempDir-001: java.nio.file.DirectoryNotEmptyException: C:\Users\jenkins\workspace\Lucene-Solr-7.x-Windows\solr\build\solr-core\test\J1\temp\solr.handler.component.DistributedMLTComponentTest_9B8713B795C8065A-001\tempDir-001
   C:\Users\jenkins\workspace\Lucene-Solr-7.x-Windows\solr\build\solr-core\test\J1\temp\solr.handler.component.DistributedMLTComponentTest_9B8713B795C8065A-001\tempDir-001\shard2: java.nio.file.AccessDeniedException: C:\Users\jenkins\workspace\Lucene-Solr-7.x-Windows\solr\build\solr-core\test\J1\temp\solr.handler.component.DistributedMLTComponentTest_9B8713B795C8065A-001\tempDir-001\shard2

	at __randomizedtesting.SeedInfo.seed([9B8713B795C8065A]:0)
	at org.apache.lucene.util.IOUtils.rm(IOUtils.java:329)
	at org.apache.lucene.util.TestRuleTemporaryFilesCleanup.afterAlways(TestRuleTemporaryFilesCleanup.java:216)
	at com.carrotsearch.randomizedtesting.rules.TestRuleAdapter$1.afterAlways(TestRuleAdapter.java:31)
	at com.carrotsearch.randomizedtesting.rules.StatementAdapter.evaluate(StatementAdapter.java:43)
	at com.carrotsearch.randomizedtesting.rules.StatementAdapter.evaluate(StatementAdapter.java:36)
	at org.apache.lucene.util.TestRuleAssertionsRequired$1.evaluate(TestRuleAssertionsRequired.java:53)
	at org.apache.lucene.util.TestRuleMarkFailure$1.evaluate(TestRuleMarkFailure.java:47)
	at org.apache.lucene.util.TestRuleIgnoreAfterMaxFailures$1.evaluate(TestRuleIgnoreAfterMaxFailures.java:64)
	at org.apache.lucene.util.TestRuleIgnoreTestSuites$1.evaluate(TestRuleIgnoreTestSuites.java:54)
	at com.carrotsearch.randomizedtesting.rules.StatementAdapter.evaluate(StatementAdapter.java:36)
	at com.carrotsearch.randomizedtesting.ThreadLeakControl$StatementRunner.run(ThreadLeakControl.java:368)
	at java.lang.Thread.run(Thread.java:748)


FAILED:  junit.framework.TestSuite.org.apache.solr.client.solrj.response.NoOpResponseParserTest

Error Message:
Could not remove the following files (in the order of attempts):    C:\Users\jenkins\workspace\Lucene-Solr-7.x-Windows\solr\build\solr-solrj\test\J1\temp\solr.client.solrj.response.NoOpResponseParserTest_40A866D1233695A4-001\tempDir-001\collection1\conf: java.nio.file.DirectoryNotEmptyException: C:\Users\jenkins\workspace\Lucene-Solr-7.x-Windows\solr\build\solr-solrj\test\J1\temp\solr.client.solrj.response.NoOpResponseParserTest_40A866D1233695A4-001\tempDir-001\collection1\conf    C:\Users\jenkins\workspace\Lucene-Solr-7.x-Windows\solr\build\solr-solrj\test\J1\temp\solr.client.solrj.response.NoOpResponseParserTest_40A866D1233695A4-001\tempDir-001\collection1: java.nio.file.DirectoryNotEmptyException: C:\Users\jenkins\workspace\Lucene-Solr-7.x-Windows\solr\build\solr-solrj\test\J1\temp\solr.client.solrj.response.NoOpResponseParserTest_40A866D1233695A4-001\tempDir-001\collection1    C:\Users\jenkins\workspace\Lucene-Solr-7.x-Windows\solr\build\solr-solrj\test\J1\temp\solr.client.solrj.response.NoOpResponseParserTest_40A866D1233695A4-001\tempDir-001: java.nio.file.DirectoryNotEmptyException: C:\Users\jenkins\workspace\Lucene-Solr-7.x-Windows\solr\build\solr-solrj\test\J1\temp\solr.client.solrj.response.NoOpResponseParserTest_40A866D1233695A4-001\tempDir-001    C:\Users\jenkins\workspace\Lucene-Solr-7.x-Windows\solr\build\solr-solrj\test\J1\temp\solr.client.solrj.response.NoOpResponseParserTest_40A866D1233695A4-001\tempDir-001\collection1\conf\xslt: java.nio.file.AccessDeniedException: C:\Users\jenkins\workspace\Lucene-Solr-7.x-Windows\solr\build\solr-solrj\test\J1\temp\solr.client.solrj.response.NoOpResponseParserTest_40A866D1233695A4-001\tempDir-001\collection1\conf\xslt    C:\Users\jenkins\workspace\Lucene-Solr-7.x-Windows\solr\build\solr-solrj\test\J1\temp\solr.client.solrj.response.NoOpResponseParserTest_40A866D1233695A4-001: java.nio.file.DirectoryNotEmptyException: C:\Users\jenkins\workspace\Lucene-Solr-7.x-Windows\solr\build\solr-solrj\test\J1\temp\solr.client.solrj.response.NoOpResponseParserTest_40A866D1233695A4-001 

Stack Trace:
java.io.IOException: Could not remove the following files (in the order of attempts):
   C:\Users\jenkins\workspace\Lucene-Solr-7.x-Windows\solr\build\solr-solrj\test\J1\temp\solr.client.solrj.response.NoOpResponseParserTest_40A866D1233695A4-001\tempDir-001\collection1\conf: java.nio.file.DirectoryNotEmptyException: C:\Users\jenkins\workspace\Lucene-Solr-7.x-Windows\solr\build\solr-solrj\test\J1\temp\solr.client.solrj.response.NoOpResponseParserTest_40A866D1233695A4-001\tempDir-001\collection1\conf
   C:\Users\jenkins\workspace\Lucene-Solr-7.x-Windows\solr\build\solr-solrj\test\J1\temp\solr.client.solrj.response.NoOpResponseParserTest_40A866D1233695A4-001\tempDir-001\collection1: java.nio.file.DirectoryNotEmptyException: C:\Users\jenkins\workspace\Lucene-Solr-7.x-Windows\solr\build\solr-solrj\test\J1\temp\solr.client.solrj.response.NoOpResponseParserTest_40A866D1233695A4-001\tempDir-001\collection1
   C:\Users\jenkins\workspace\Lucene-Solr-7.x-Windows\solr\build\solr-solrj\test\J1\temp\solr.client.solrj.response.NoOpResponseParserTest_40A866D1233695A4-001\tempDir-001: java.nio.file.DirectoryNotEmptyException: C:\Users\jenkins\workspace\Lucene-Solr-7.x-Windows\solr\build\solr-solrj\test\J1\temp\solr.client.solrj.response.NoOpResponseParserTest_40A866D1233695A4-001\tempDir-001
   C:\Users\jenkins\workspace\Lucene-Solr-7.x-Windows\solr\build\solr-solrj\test\J1\temp\solr.client.solrj.response.NoOpResponseParserTest_40A866D1233695A4-001\tempDir-001\collection1\conf\xslt: java.nio.file.AccessDeniedException: C:\Users\jenkins\workspace\Lucene-Solr-7.x-Windows\solr\build\solr-solrj\test\J1\temp\solr.client.solrj.response.NoOpResponseParserTest_40A866D1233695A4-001\tempDir-001\collection1\conf\xslt
   C:\Users\jenkins\workspace\Lucene-Solr-7.x-Windows\solr\build\solr-solrj\test\J1\temp\solr.client.solrj.response.NoOpResponseParserTest_40A866D1233695A4-001: java.nio.file.DirectoryNotEmptyException: C:\Users\jenkins\workspace\Lucene-Solr-7.x-Windows\solr\build\solr-solrj\test\J1\temp\solr.client.solrj.response.NoOpResponseParserTest_40A866D1233695A4-001

	at __randomizedtesting.SeedInfo.seed([40A866D1233695A4]:0)
	at org.apache.lucene.util.IOUtils.rm(IOUtils.java:329)
	at org.apache.lucene.util.TestRuleTemporaryFilesCleanup.afterAlways(TestRuleTemporaryFilesCleanup.java:216)
	at com.carrotsearch.randomizedtesting.rules.TestRuleAdapter$1.afterAlways(TestRuleAdapter.java:31)
	at com.carrotsearch.randomizedtesting.rules.StatementAdapter.evaluate(StatementAdapter.java:43)
	at com.carrotsearch.randomizedtesting.rules.StatementAdapter.evaluate(StatementAdapter.java:36)
	at org.apache.lucene.util.TestRuleAssertionsRequired$1.evaluate(TestRuleAssertionsRequired.java:53)
	at org.apache.lucene.util.TestRuleMarkFailure$1.evaluate(TestRuleMarkFailure.java:47)
	at org.apache.lucene.util.TestRuleIgnoreAfterMaxFailures$1.evaluate(TestRuleIgnoreAfterMaxFailures.java:64)
	at org.apache.lucene.util.TestRuleIgnoreTestSuites$1.evaluate(TestRuleIgnoreTestSuites.java:54)
	at com.carrotsearch.randomizedtesting.rules.StatementAdapter.evaluate(StatementAdapter.java:36)
	at com.carrotsearch.randomizedtesting.ThreadLeakControl$StatementRunner.run(ThreadLeakControl.java:368)
	at java.lang.Thread.run(Thread.java:748)


FAILED:  junit.framework.TestSuite.org.apache.solr.update.processor.TestOpenNLPExtractNamedEntitiesUpdateProcessorFactory

Error Message:
Could not remove the following files (in the order of attempts):    C:\Users\jenkins\workspace\Lucene-Solr-7.x-Windows\solr\build\contrib\solr-analysis-extras\test\J1\temp\solr.update.processor.TestOpenNLPExtractNamedEntitiesUpdateProcessorFactory_89B597106A62D6B0-001\tempDir-001\collection1\conf: java.nio.file.DirectoryNotEmptyException: C:\Users\jenkins\workspace\Lucene-Solr-7.x-Windows\solr\build\contrib\solr-analysis-extras\test\J1\temp\solr.update.processor.TestOpenNLPExtractNamedEntitiesUpdateProcessorFactory_89B597106A62D6B0-001\tempDir-001\collection1\conf    C:\Users\jenkins\workspace\Lucene-Solr-7.x-Windows\solr\build\contrib\solr-analysis-extras\test\J1\temp\solr.update.processor.TestOpenNLPExtractNamedEntitiesUpdateProcessorFactory_89B597106A62D6B0-001\tempDir-001\collection1: java.nio.file.DirectoryNotEmptyException: C:\Users\jenkins\workspace\Lucene-Solr-7.x-Windows\solr\build\contrib\solr-analysis-extras\test\J1\temp\solr.update.processor.TestOpenNLPExtractNamedEntitiesUpdateProcessorFactory_89B597106A62D6B0-001\tempDir-001\collection1    C:\Users\jenkins\workspace\Lucene-Solr-7.x-Windows\solr\build\contrib\solr-analysis-extras\test\J1\temp\solr.update.processor.TestOpenNLPExtractNamedEntitiesUpdateProcessorFactory_89B597106A62D6B0-001\tempDir-001: java.nio.file.DirectoryNotEmptyException: C:\Users\jenkins\workspace\Lucene-Solr-7.x-Windows\solr\build\contrib\solr-analysis-extras\test\J1\temp\solr.update.processor.TestOpenNLPExtractNamedEntitiesUpdateProcessorFactory_89B597106A62D6B0-001\tempDir-001    C:\Users\jenkins\workspace\Lucene-Solr-7.x-Windows\solr\build\contrib\solr-analysis-extras\test\J1\temp\solr.update.processor.TestOpenNLPExtractNamedEntitiesUpdateProcessorFactory_89B597106A62D6B0-001\tempDir-001\collection1\conf\en-test-tokenizer.bin: java.nio.file.AccessDeniedException: C:\Users\jenkins\workspace\Lucene-Solr-7.x-Windows\solr\build\contrib\solr-analysis-extras\test\J1\temp\solr.update.processor.TestOpenNLPExtractNamedEntitiesUpdateProcessorFactory_89B597106A62D6B0-001\tempDir-001\collection1\conf\en-test-tokenizer.bin    C:\Users\jenkins\workspace\Lucene-Solr-7.x-Windows\solr\build\contrib\solr-analysis-extras\test\J1\temp\solr.update.processor.TestOpenNLPExtractNamedEntitiesUpdateProcessorFactory_89B597106A62D6B0-001\tempDir-001\collection1\conf\en-test-ner-person.bin: java.nio.file.AccessDeniedException: C:\Users\jenkins\workspace\Lucene-Solr-7.x-Windows\solr\build\contrib\solr-analysis-extras\test\J1\temp\solr.update.processor.TestOpenNLPExtractNamedEntitiesUpdateProcessorFactory_89B597106A62D6B0-001\tempDir-001\collection1\conf\en-test-ner-person.bin    C:\Users\jenkins\workspace\Lucene-Solr-7.x-Windows\solr\build\contrib\solr-analysis-extras\test\J1\temp\solr.update.processor.TestOpenNLPExtractNamedEntitiesUpdateProcessorFactory_89B597106A62D6B0-001\tempDir-001\collection1\conf\en-test-sent.bin: java.nio.file.AccessDeniedException: C:\Users\jenkins\workspace\Lucene-Solr-7.x-Windows\solr\build\contrib\solr-analysis-extras\test\J1\temp\solr.update.processor.TestOpenNLPExtractNamedEntitiesUpdateProcessorFactory_89B597106A62D6B0-001\tempDir-001\collection1\conf\en-test-sent.bin    C:\Users\jenkins\workspace\Lucene-Solr-7.x-Windows\solr\build\contrib\solr-analysis-extras\test\J1\temp\solr.update.processor.TestOpenNLPExtractNamedEntitiesUpdateProcessorFactory_89B597106A62D6B0-001: java.nio.file.DirectoryNotEmptyException: C:\Users\jenkins\workspace\Lucene-Solr-7.x-Windows\solr\build\contrib\solr-analysis-extras\test\J1\temp\solr.update.processor.TestOpenNLPExtractNamedEntitiesUpdateProcessorFactory_89B597106A62D6B0-001 

Stack Trace:
java.io.IOException: Could not remove the following files (in the order of attempts):
   C:\Users\jenkins\workspace\Lucene-Solr-7.x-Windows\solr\build\contrib\solr-analysis-extras\test\J1\temp\solr.update.processor.TestOpenNLPExtractNamedEntitiesUpdateProcessorFactory_89B597106A62D6B0-001\tempDir-001\collection1\conf: java.nio.file.DirectoryNotEmptyException: C:\Users\jenkins\workspace\Lucene-Solr-7.x-Windows\solr\build\contrib\solr-analysis-extras\test\J1\temp\solr.update.processor.TestOpenNLPExtractNamedEntitiesUpdateProcessorFactory_89B597106A62D6B0-001\tempDir-001\collection1\conf
   C:\Users\jenkins\workspace\Lucene-Solr-7.x-Windows\solr\build\contrib\solr-analysis-extras\test\J1\temp\solr.update.processor.TestOpenNLPExtractNamedEntitiesUpdateProcessorFactory_89B597106A62D6B0-001\tempDir-001\collection1: java.nio.file.DirectoryNotEmptyException: C:\Users\jenkins\workspace\Lucene-Solr-7.x-Windows\solr\build\contrib\solr-analysis-extras\test\J1\temp\solr.update.processor.TestOpenNLPExtractNamedEntitiesUpdateProcessorFactory_89B597106A62D6B0-001\tempDir-001\collection1
   C:\Users\jenkins\workspace\Lucene-Solr-7.x-Windows\solr\build\contrib\solr-analysis-extras\test\J1\temp\solr.update.processor.TestOpenNLPExtractNamedEntitiesUpdateProcessorFactory_89B597106A62D6B0-001\tempDir-001: java.nio.file.DirectoryNotEmptyException: C:\Users\jenkins\workspace\Lucene-Solr-7.x-Windows\solr\build\contrib\solr-analysis-extras\test\J1\temp\solr.update.processor.TestOpenNLPExtractNamedEntitiesUpdateProcessorFactory_89B597106A62D6B0-001\tempDir-001
   C:\Users\jenkins\workspace\Lucene-Solr-7.x-Windows\solr\build\contrib\solr-analysis-extras\test\J1\temp\solr.update.processor.TestOpenNLPExtractNamedEntitiesUpdateProcessorFactory_89B597106A62D6B0-001\tempDir-001\collection1\conf\en-test-tokenizer.bin: java.nio.file.AccessDeniedException: C:\Users\jenkins\workspace\Lucene-Solr-7.x-Windows\solr\build\contrib\solr-analysis-extras\test\J1\temp\solr.update.processor.TestOpenNLPExtractNamedEntitiesUpdateProcessorFactory_89B597106A62D6B0-001\tempDir-001\collection1\conf\en-test-tokenizer.bin
   C:\Users\jenkins\workspace\Lucene-Solr-7.x-Windows\solr\build\contrib\solr-analysis-extras\test\J1\temp\solr.update.processor.TestOpenNLPExtractNamedEntitiesUpdateProcessorFactory_89B597106A62D6B0-001\tempDir-001\collection1\conf\en-test-ner-person.bin: java.nio.file.AccessDeniedException: C:\Users\jenkins\workspace\Lucene-Solr-7.x-Windows\solr\build\contrib\solr-analysis-extras\test\J1\temp\solr.update.processor.TestOpenNLPExtractNamedEntitiesUpdateProcessorFactory_89B597106A62D6B0-001\tempDir-001\collection1\conf\en-test-ner-person.bin
   C:\Users\jenkins\workspace\Lucene-Solr-7.x-Windows\solr\build\contrib\solr-analysis-extras\test\J1\temp\solr.update.processor.TestOpenNLPExtractNamedEntitiesUpdateProcessorFactory_89B597106A62D6B0-001\tempDir-001\collection1\conf\en-test-sent.bin: java.nio.file.AccessDeniedException: C:\Users\jenkins\workspace\Lucene-Solr-7.x-Windows\solr\build\contrib\solr-analysis-extras\test\J1\temp\solr.update.processor.TestOpenNLPExtractNamedEntitiesUpdateProcessorFactory_89B597106A62D6B0-001\tempDir-001\collection1\conf\en-test-sent.bin
   C:\Users\jenkins\workspace\Lucene-Solr-7.x-Windows\solr\build\contrib\solr-analysis-extras\test\J1\temp\solr.update.processor.TestOpenNLPExtractNamedEntitiesUpdateProcessorFactory_89B597106A62D6B0-001: java.nio.file.DirectoryNotEmptyException: C:\Users\jenkins\workspace\Lucene-Solr-7.x-Windows\solr\build\contrib\solr-analysis-extras\test\J1\temp\solr.update.processor.TestOpenNLPExtractNamedEntitiesUpdateProcessorFactory_89B597106A62D6B0-001

	at __randomizedtesting.SeedInfo.seed([89B597106A62D6B0]:0)
	at org.apache.lucene.util.IOUtils.rm(IOUtils.java:329)
	at org.apache.lucene.util.TestRuleTemporaryFilesCleanup.afterAlways(TestRuleTemporaryFilesCleanup.java:216)
	at com.carrotsearch.randomizedtesting.rules.TestRuleAdapter$1.afterAlways(TestRuleAdapter.java:31)
	at com.carrotsearch.randomizedtesting.rules.StatementAdapter.evaluate(StatementAdapter.java:43)
	at com.carrotsearch.randomizedtesting.rules.StatementAdapter.evaluate(StatementAdapter.java:36)
	at org.apache.lucene.util.TestRuleAssertionsRequired$1.evaluate(TestRuleAssertionsRequired.java:53)
	at org.apache.lucene.util.TestRuleMarkFailure$1.evaluate(TestRuleMarkFailure.java:47)
	at org.apache.lucene.util.TestRuleIgnoreAfterMaxFailures$1.evaluate(TestRuleIgnoreAfterMaxFailures.java:64)
	at org.apache.lucene.util.TestRuleIgnoreTestSuites$1.evaluate(TestRuleIgnoreTestSuites.java:54)
	at com.carrotsearch.randomizedtesting.rules.StatementAdapter.evaluate(StatementAdapter.java:36)
	at com.carrotsearch.randomizedtesting.ThreadLeakControl$StatementRunner.run(ThreadLeakControl.java:368)
	at java.lang.Thread.run(Thread.java:748)




Build Log:
[...truncated 12280 lines...]
   [junit4] Suite: org.apache.solr.handler.component.DistributedMLTComponentTest
   [junit4]   2> 1012201 INFO  (SUITE-DistributedMLTComponentTest-seed#[9B8713B795C8065A]-worker) [    ] o.a.s.SolrTestCaseJ4 SecureRandom sanity checks: test.solr.allowed.securerandom=null & java.security.egd=file:/dev/./urandom
   [junit4]   2> Creating dataDir: C:\Users\jenkins\workspace\Lucene-Solr-7.x-Windows\solr\build\solr-core\test\J1\temp\solr.handler.component.DistributedMLTComponentTest_9B8713B795C8065A-001\init-core-data-001
   [junit4]   2> 1012205 INFO  (SUITE-DistributedMLTComponentTest-seed#[9B8713B795C8065A]-worker) [    ] o.a.s.SolrTestCaseJ4 Using PointFields (NUMERIC_POINTS_SYSPROP=true) w/NUMERIC_DOCVALUES_SYSPROP=true
   [junit4]   2> 1012212 INFO  (SUITE-DistributedMLTComponentTest-seed#[9B8713B795C8065A]-worker) [    ] o.a.s.SolrTestCaseJ4 Randomized ssl (true) and clientAuth (false) via: @org.apache.solr.util.RandomizeSSL(reason=, value=NaN, ssl=NaN, clientAuth=NaN)
   [junit4]   2> 1012213 INFO  (SUITE-DistributedMLTComponentTest-seed#[9B8713B795C8065A]-worker) [    ] o.a.s.BaseDistributedSearchTestCase Setting hostContext system property: /
   [junit4]   2> 1012991 INFO  (TEST-DistributedMLTComponentTest.test-seed#[9B8713B795C8065A]) [    ] o.a.s.SolrTestCaseJ4 Writing core.properties file to C:\Users\jenkins\workspace\Lucene-Solr-7.x-Windows\solr\build\solr-core\test\J1\temp\solr.handler.component.DistributedMLTComponentTest_9B8713B795C8065A-001\tempDir-001\control\cores\collection1
   [junit4]   2> 1012995 INFO  (TEST-DistributedMLTComponentTest.test-seed#[9B8713B795C8065A]) [    ] o.e.j.s.Server jetty-9.3.20.v20170531
   [junit4]   2> 1012996 INFO  (TEST-DistributedMLTComponentTest.test-seed#[9B8713B795C8065A]) [    ] o.e.j.s.h.ContextHandler Started o.e.j.s.ServletContextHandler@12de49{/,null,AVAILABLE}
   [junit4]   2> 1012998 INFO  (TEST-DistributedMLTComponentTest.test-seed#[9B8713B795C8065A]) [    ] o.e.j.s.AbstractConnector Started ServerConnector@9da5f9{SSL,[ssl, http/1.1]}{127.0.0.1:60720}
   [junit4]   2> 1012998 INFO  (TEST-DistributedMLTComponentTest.test-seed#[9B8713B795C8065A]) [    ] o.e.j.s.Server Started @1020955ms
   [junit4]   2> 1012998 INFO  (TEST-DistributedMLTComponentTest.test-seed#[9B8713B795C8065A]) [    ] o.a.s.c.s.e.JettySolrRunner Jetty properties: {hostContext=/, hostPort=60720, coreRootDirectory=C:\Users\jenkins\workspace\Lucene-Solr-7.x-Windows\solr\build\solr-core\test\J1\temp\solr.handler.component.DistributedMLTComponentTest_9B8713B795C8065A-001\tempDir-001\control\cores}
   [junit4]   2> 1012999 ERROR (TEST-DistributedMLTComponentTest.test-seed#[9B8713B795C8065A]) [    ] o.a.s.u.StartupLoggingUtils Missing Java Option solr.log.dir. Logging may be missing or incomplete.
   [junit4]   2> 1012999 INFO  (TEST-DistributedMLTComponentTest.test-seed#[9B8713B795C8065A]) [    ] o.a.s.s.SolrDispatchFilter  ___      _       Welcome to Apache Solr™ version 7.3.0
   [junit4]   2> 1012999 INFO  (TEST-DistributedMLTComponentTest.test-seed#[9B8713B795C8065A]) [    ] o.a.s.s.SolrDispatchFilter / __| ___| |_ _   Starting in standalone mode on port null
   [junit4]   2> 1012999 INFO  (TEST-DistributedMLTComponentTest.test-seed#[9B8713B795C8065A]) [    ] o.a.s.s.SolrDispatchFilter \__ \/ _ \ | '_|  Install dir: null
   [junit4]   2> 1012999 INFO  (TEST-DistributedMLTComponentTest.test-seed#[9B8713B795C8065A]) [    ] o.a.s.s.SolrDispatchFilter |___/\___/_|_|    Start time: 2018-01-01T12:22:12.881Z
   [junit4]   2> 1013000 INFO  (TEST-DistributedMLTComponentTest.test-seed#[9B8713B795C8065A]) [    ] o.a.s.c.SolrXmlConfig Loading container configuration from C:\Users\jenkins\workspace\Lucene-Solr-7.x-Windows\solr\build\solr-core\test\J1\temp\solr.handler.component.DistributedMLTComponentTest_9B8713B795C8065A-001\tempDir-001\control\solr.xml
   [junit4]   2> 1013007 INFO  (TEST-DistributedMLTComponentTest.test-seed#[9B8713B795C8065A]) [    ] o.a.s.c.SolrXmlConfig Configuration parameter autoReplicaFailoverWorkLoopDelay is ignored
   [junit4]   2> 1013007 INFO  (TEST-DistributedMLTComponentTest.test-seed#[9B8713B795C8065A]) [    ] o.a.s.c.SolrXmlConfig Configuration parameter autoReplicaFailoverBadNodeExpiration is ignored
   [junit4]   2> 1013009 INFO  (TEST-DistributedMLTComponentTest.test-seed#[9B8713B795C8065A]) [    ] o.a.s.c.SolrXmlConfig MBean server found: com.sun.jmx.mbeanserver.JmxMBeanServer@d98a41, but no JMX reporters were configured - adding default JMX reporter.
   [junit4]   2> 1013114 INFO  (TEST-DistributedMLTComponentTest.test-seed#[9B8713B795C8065A]) [    ] o.a.s.m.r.SolrJmxReporter JMX monitoring for 'solr.node' (registry 'solr.node') enabled at server: com.sun.jmx.mbeanserver.JmxMBeanServer@d98a41
   [junit4]   2> 1013126 INFO  (TEST-DistributedMLTComponentTest.test-seed#[9B8713B795C8065A]) [    ] o.a.s.m.r.SolrJmxReporter JMX monitoring for 'solr.jvm' (registry 'solr.jvm') enabled at server: com.sun.jmx.mbeanserver.JmxMBeanServer@d98a41
   [junit4]   2> 1013127 INFO  (TEST-DistributedMLTComponentTest.test-seed#[9B8713B795C8065A]) [    ] o.a.s.m.r.SolrJmxReporter JMX monitoring for 'solr.jetty' (registry 'solr.jetty') enabled at server: com.sun.jmx.mbeanserver.JmxMBeanServer@d98a41
   [junit4]   2> 1013130 INFO  (TEST-DistributedMLTComponentTest.test-seed#[9B8713B795C8065A]) [    ] o.a.s.c.CorePropertiesLocator Found 1 core definitions underneath C:\Users\jenkins\workspace\Lucene-Solr-7.x-Windows\solr\build\solr-core\test\J1\temp\solr.handler.component.DistributedMLTComponentTest_9B8713B795C8065A-001\tempDir-001\control\cores
   [junit4]   2> 1013130 INFO  (TEST-DistributedMLTComponentTest.test-seed#[9B8713B795C8065A]) [    ] o.a.s.c.CorePropertiesLocator Cores are: [collection1]
   [junit4]   2> 1013143 INFO  (coreLoadExecutor-4196-thread-1) [    ] o.a.s.c.TransientSolrCoreCacheDefault Allocating transient cache for 4 transient cores
   [junit4]   2> 1013146 INFO  (coreLoadExecutor-4196-thread-1) [    x:collection1] o.a.s.c.SolrResourceLoader [null] Added 2 libs to classloader, from paths: [/C:/Users/jenkins/workspace/Lucene-Solr-7.x-Windows/solr/core/src/test-files/solr/collection1/lib, /C:/Users/jenkins/workspace/Lucene-Solr-7.x-Windows/solr/core/src/test-files/solr/collection1/lib/classes]
   [junit4]   2> 1013213 INFO  (coreLoadExecutor-4196-thread-1) [    x:collection1] o.a.s.c.SolrConfig Using Lucene MatchVersion: 7.3.0
   [junit4]   2> 1013239 INFO  (coreLoadExecutor-4196-thread-1) [    x:collection1] o.a.s.s.IndexSchema [collection1] Schema name=test
   [junit4]   2> 1013314 INFO  (coreLoadExecutor-4196-thread-1) [    x:collection1] o.a.s.s.IndexSchema Loaded schema test/1.0 with uniqueid field id
   [junit4]   2> 1013326 INFO  (coreLoadExecutor-4196-thread-1) [    x:collection1] o.a.s.c.CoreContainer Creating SolrCore 'collection1' using configuration from configset C:\Users\jenkins\workspace\Lucene-Solr-7.x-Windows\solr\core\src\test-files\solr\collection1, trusted=true
   [junit4]   2> 1013326 INFO  (coreLoadExecutor-4196-thread-1) [    x:collection1] o.a.s.m.r.SolrJmxReporter JMX monitoring for 'solr.core.collection1' (registry 'solr.core.collection1') enabled at server: com.sun.jmx.mbeanserver.JmxMBeanServer@d98a41
   [junit4]   2> 1013326 INFO  (coreLoadExecutor-4196-thread-1) [    x:collection1] o.a.s.c.SolrCore solr.RecoveryStrategy.Builder
   [junit4]   2> 1013327 INFO  (coreLoadExecutor-4196-thread-1) [    x:collection1] o.a.s.c.SolrCore [[collection1] ] Opening new SolrCore at [C:\Users\jenkins\workspace\Lucene-Solr-7.x-Windows\solr\core\src\test-files\solr\collection1], dataDir=[C:\Users\jenkins\workspace\Lucene-Solr-7.x-Windows\solr\build\solr-core\test\J1\temp\solr.handler.component.DistributedMLTComponentTest_9B8713B795C8065A-001\tempDir-001\control\cores\collection1\data\]
   [junit4]   2> 1013329 INFO  (coreLoadExecutor-4196-thread-1) [    x:collection1] o.a.s.u.RandomMergePolicy RandomMergePolicy wrapping class org.apache.lucene.index.AlcoholicMergePolicy: [AlcoholicMergePolicy: minMergeSize=0, mergeFactor=10, maxMergeSize=922662550, maxMergeSizeForForcedMerge=9223372036854775807, calibrateSizeByDeletes=true, maxMergeDocs=2147483647, maxCFSSegmentSizeMB=8.796093022207999E12, noCFSRatio=0.1]
   [junit4]   2> 1013444 INFO  (coreLoadExecutor-4196-thread-1) [    x:collection1] o.a.s.u.UpdateHandler Using UpdateLog implementation: org.apache.solr.update.UpdateLog
   [junit4]   2> 1013444 INFO  (coreLoadExecutor-4196-thread-1) [    x:collection1] o.a.s.u.UpdateLog Initializing UpdateLog: dataDir= defaultSyncLevel=FLUSH numRecordsToKeep=100 maxNumLogsToKeep=10 numVersionBuckets=65536
   [junit4]   2> 1013446 INFO  (coreLoadExecutor-4196-thread-1) [    x:collection1] o.a.s.u.CommitTracker Hard AutoCommit: disabled
   [junit4]   2> 1013446 INFO  (coreLoadExecutor-4196-thread-1) [    x:collection1] o.a.s.u.CommitTracker Soft AutoCommit: disabled
   [junit4]   2> 1013447 INFO  (coreLoadExecutor-4196-thread-1) [    x:collection1] o.a.s.u.RandomMergePolicy RandomMergePolicy wrapping class org.apache.lucene.index.TieredMergePolicy: [TieredMergePolicy: maxMergeAtOnce=39, maxMergeAtOnceExplicit=19, maxMergedSegmentMB=78.716796875, floorSegmentMB=0.9990234375, forceMergeDeletesPctAllowed=6.163184102188505, segmentsPerTier=47.0, maxCFSSegmentSizeMB=8.796093022207999E12, noCFSRatio=1.0
   [junit4]   2> 1013447 INFO  (coreLoadExecutor-4196-thread-1) [    x:collection1] o.a.s.s.SolrIndexSearcher Opening [Searcher@378b78[collection1] main]
   [junit4]   2> 1013448 INFO  (coreLoadExecutor-4196-thread-1) [    x:collection1] o.a.s.h.c.SpellCheckComponent Initializing spell checkers
   [junit4]   2> 1013462 INFO  (coreLoadExecutor-4196-thread-1) [    x:collection1] o.a.s.s.DirectSolrSpellChecker init: {name=direct,classname=DirectSolrSpellChecker,field=lowerfilt,minQueryLength=3}
   [junit4]   2> 1013498 INFO  (coreLoadExecutor-4196-thread-1) [    x:collection1] o.a.s.h.ReplicationHandler Commits will be reserved for 10000ms.
   [junit4]   2> 1013498 INFO  (searcherExecutor-4197-thread-1-processing-x:collection1) [    x:collection1] o.a.s.h.c.SpellCheckComponent Loading spell index for spellchecker: default
   [junit4]   2> 1013499 INFO  (coreLoadExecutor-4196-thread-1) [    x:collection1] o.a.s.u.UpdateLog Could not find max version in index or recent updates, using new clock 1588392711559315456
   [junit4]   2> 1013499 INFO  (searcherExecutor-4197-thread-1-processing-x:collection1) [    x:collection1] o.a.s.h.c.SpellCheckComponent Loading spell index for spellchecker: direct
   [junit4]   2> 1013499 INFO  (searcherExecutor-4197-thread-1-processing-x:collection1) [    x:collection1] o.a.s.h.c.SpellCheckComponent Loading spell index for spellchecker: wordbreak
   [junit4]   2> 1013499 INFO  (searcherExecutor-4197-thread-1-processing-x:collection1) [    x:collection1] o.a.s.h.c.SpellCheckComponent Loading spell index for spellchecker: multipleFields
   [junit4]   2> 1013499 INFO  (searcherExecutor-4197-thread-1-processing-x:collection1) [    x:collection1] o.a.s.h.c.SpellCheckComponent Loading spell index for spellchecker: jarowinkler
   [junit4]   2> 1013499 INFO  (searcherExecutor-4197-thread-1-processing-x:collection1) [    x:collection1] o.a.s.h.c.SpellCheckComponent Loading spell index for spellchecker: external
   [junit4]   2> 1013499 INFO  (searcherExecutor-4197-thread-1-processing-x:collection1) [    x:collection1] o.a.s.h.c.SpellCheckComponent Loading spell index for spellchecker: freq
   [junit4]   2> 1013500 INFO  (searcherExecutor-4197-thread-1-processing-x:collection1) [    x:collection1] o.a.s.h.c.SpellCheckComponent Loading spell index for spellchecker: fqcn
   [junit4]   2> 1013500 INFO  (searcherExecutor-4197-thread-1-processing-x:collection1) [    x:collection1] o.a.s.h.c.SpellCheckComponent Loading spell index for spellchecker: perDict
   [junit4]   2> 1013501 INFO  (searcherExecutor-4197-thread-1-processing-x:collection1) [    x:collection1] o.a.s.c.SolrCore [collection1] Registered new searcher Searcher@378b78[collection1] main{ExitableDirectoryReader(UninvertingDirectoryReader())}
   [junit4]   2> 1014004 INFO  (TEST-DistributedMLTComponentTest.test-seed#[9B8713B795C8065A]) [    ] o.a.s.SolrTestCaseJ4 Writing core.properties file to C:\Users\jenkins\workspace\Lucene-Solr-7.x-Windows\solr\build\solr-core\test\J1\temp\solr.handler.component.DistributedMLTComponentTest_9B8713B795C8065A-001\tempDir-001\shard0\cores\collection1
   [junit4]   2> 1014007 INFO  (TEST-DistributedMLTComponentTest.test-seed#[9B8713B795C8065A]) [    ] o.e.j.s.Server jetty-9.3.20.v20170531
   [junit4]   2> 1014008 INFO  (TEST-DistributedMLTComponentTest.test-seed#[9B8713B795C8065A]) [    ] o.e.j.s.h.ContextHandler Started o.e.j.s.ServletContextHandler@160b3a3{/,null,AVAILABLE}
   [junit4]   2> 1014008 INFO  (TEST-DistributedMLTComponentTest.test-seed#[9B8713B795C8065A]) [    ] o.e.j.s.AbstractConnector Started ServerConnector@e97857{SSL,[ssl, http/1.1]}{127.0.0.1:60726}
   [junit4]   2> 1014008 INFO  (TEST-DistributedMLTComponentTest.test-seed#[9B8713B795C8065A]) [    ] o.e.j.s.Server Started @1021965ms
   [junit4]   2> 1014008 INFO  (TEST-DistributedMLTComponentTest.test-seed#[9B8713B795C8065A]) [    ] o.a.s.c.s.e.JettySolrRunner Jetty properties: {hostContext=/, hostPort=60726, coreRootDirectory=C:\Users\jenkins\workspace\Lucene-Solr-7.x-Windows\solr\build\solr-core\test\J1\temp\solr.handler.component.DistributedMLTComponentTest_9B8713B795C8065A-001\tempDir-001\shard0\cores}
   [junit4]   2> 1014009 ERROR (TEST-DistributedMLTComponentTest.test-seed#[9B8713B795C8065A]) [    ] o.a.s.u.StartupLoggingUtils Missing Java Option solr.log.dir. Logging may be missing or incomplete.
   [junit4]   2> 1014009 INFO  (TEST-DistributedMLTComponentTest.test-seed#[9B8713B795C8065A]) [    ] o.a.s.s.SolrDispatchFilter  ___      _       Welcome to Apache Solr™ version 7.3.0
   [junit4]   2> 1014009 INFO  (TEST-DistributedMLTComponentTest.test-seed#[9B8713B795C8065A]) [    ] o.a.s.s.SolrDispatchFilter / __| ___| |_ _   Starting in standalone mode on port null
   [junit4]   2> 1014009 INFO  (TEST-DistributedMLTComponentTest.test-seed#[9B8713B795C8065A]) [    ] o.a.s.s.SolrDispatchFilter \__ \/ _ \ | '_|  Install dir: null
   [junit4]   2> 1014009 INFO  (TEST-DistributedMLTComponentTest.test-seed#[9B8713B795C8065A]) [    ] o.a.s.s.SolrDispatchFilter |___/\___/_|_|    Start time: 2018-01-01T12:22:13.891Z
   [junit4]   2> 1014009 INFO  (TEST-DistributedMLTComponentTest.test-seed#[9B8713B795C8065A]) [    ] o.a.s.c.SolrXmlConfig Loading container configuration from C:\Users\jenkins\workspace\Lucene-Solr-7.x-Windows\solr\build\solr-core\test\J1\temp\solr.handler.component.DistributedMLTComponentTest_9B8713B795C8065A-001\tempDir-001\shard0\solr.xml
   [junit4]   2> 1014018 INFO  (TEST-DistributedMLTComponentTest.test-seed#[9B8713B795C8065A]) [    ] o.a.s.c.SolrXmlConfig Configuration parameter autoReplicaFailoverWorkLoopDelay is ignored
   [junit4]   2> 1014018 INFO  (TEST-DistributedMLTComponentTest.test-seed#[9B8713B795C8065A]) [    ] o.a.s.c.SolrXmlConfig Configuration parameter autoReplicaFailoverBadNodeExpiration is ignored
   [junit4]   2> 1014019 INFO  (TEST-DistributedMLTComponentTest.test-seed#[9B8713B795C8065A]) [    ] o.a.s.c.SolrXmlConfig MBean server found: com.sun.jmx.mbeanserver.JmxMBeanServer@d98a41, but no JMX reporters were configured - adding default JMX reporter.
   [junit4]   2> 1014091 INFO  (TEST-DistributedMLTComponentTest.test-seed#[9B8713B795C8065A]) [    ] o.a.s.m.r.SolrJmxReporter JMX monitoring for 'solr.node' (registry 'solr.node') enabled at server: com.sun.jmx.mbeanserver.JmxMBeanServer@d98a41
   [junit4]   2> 1014099 INFO  (TEST-DistributedMLTComponentTest.test-seed#[9B8713B795C8065A]) [    ] o.a.s.m.r.SolrJmxReporter JMX monitoring for 'solr.jvm' (registry 'solr.jvm') enabled at server: com.sun.jmx.mbeanserver.JmxMBeanServer@d98a41
   [junit4]   2> 1014099 INFO  (TEST-DistributedMLTComponentTest.test-seed#[9B8713B795C8065A]) [    ] o.a.s.m.r.SolrJmxReporter JMX monitoring for 'solr.jetty' (registry 'solr.jetty') enabled at server: com.sun.jmx.mbeanserver.JmxMBeanServer@d98a41
   [junit4]   2> 1014103 INFO  (TEST-DistributedMLTComponentTest.test-seed#[9B8713B795C8065A]) [    ] o.a.s.c.CorePropertiesLocator Found 1 core definitions underneath C:\Users\jenkins\workspace\Lucene-Solr-7.x-Windows\solr\build\solr-core\test\J1\temp\solr.handler.component.DistributedMLTComponentTest_9B8713B795C8065A-001\tempDir-001\shard0\cores
   [junit4]   2> 1014103 INFO  (TEST-DistributedMLTComponentTest.test-seed#[9B8713B795C8065A]) [    ] o.a.s.c.CorePropertiesLocator Cores are: [collection1]
   [junit4]   2> 1014107 INFO  (coreLoadExecutor-4207-thread-1) [    ] o.a.s.c.TransientSolrCoreCacheDefault Allocating transient cache for 4 transient cores
   [junit4]   2> 1014108 INFO  (coreLoadExecutor-4207-thread-1) [    x:collection1] o.a.s.c.SolrResourceLoader [null] Added 2 libs to classloader, from paths: [/C:/Users/jenkins/workspace/Lucene-Solr-7.x-Windows/solr/core/src/test-files/solr/collection1/lib, /C:/Users/jenkins/workspace/Lucene-Solr-7.x-Windows/solr/core/src/test-files/solr/collection1/lib/classes]
   [junit4]   2> 1014178 INFO  (coreLoadExecutor-4207-thread-1) [    x:collection1] o.a.s.c.SolrConfig Using Lucene MatchVersion: 7.3.0
   [junit4]   2> 1014198 INFO  (coreLoadExecutor-4207-thread-1) [    x:collection1] o.a.s.s.IndexSchema [collection1] Schema name=test
   [junit4]   2> 1014307 INFO  (coreLoadExecutor-4207-thread-1) [    x:collection1] o.a.s.s.IndexSchema Loaded schema test/1.0 with uniqueid field id
   [junit4]   2> 1014322 INFO  (coreLoadExecutor-4207-thread-1) [    x:collection1] o.a.s.c.CoreContainer Creating SolrCore 'collection1' using configuration from configset C:\Users\jenkins\workspace\Lucene-Solr-7.x-Windows\solr\core\src\test-files\solr\collection1, trusted=true
   [junit4]   2> 1014323 INFO  (coreLoadExecutor-4207-thread-1) [    x:collection1] o.a.s.m.r.SolrJmxReporter JMX monitoring for 'solr.core.collection1' (registry 'solr.core.collection1') enabled at server: com.sun.jmx.mbeanserver.JmxMBeanServer@d98a41
   [junit4]   2> 1014323 INFO  (coreLoadExecutor-4207-thread-1) [    x:collection1] o.a.s.c.SolrCore solr.RecoveryStrategy.Builder
   [junit4]   2> 1014323 INFO  (coreLoadExecutor-4207-thread-1) [    x:collection1] o.a.s.c.SolrCore [[collection1] ] Opening new SolrCore at [C:\Users\jenkins\workspace\Lucene-Solr-7.x-Windows\solr\core\src\test-files\solr\collection1], dataDir=[C:\Users\jenkins\workspace\Lucene-Solr-7.x-Windows\solr\build\solr-core\test\J1\temp\solr.handler.component.DistributedMLTComponentTest_9B8713B795C8065A-001\tempDir-001\shard0\cores\collection1\data\]
   [junit4]   2> 1014326 INFO  (coreLoadExecutor-4207-thread-1) [    x:collection1] o.a.s.u.RandomMergePolicy RandomMergePolicy wrapping class org.apache.lucene.index.AlcoholicMergePolicy: [AlcoholicMergePolicy: minMergeSize=0, mergeFactor=10, maxMergeSize=922662550, maxMergeSizeForForcedMerge=9223372036854775807, calibrateSizeByDeletes=true, maxMergeDocs=2147483647, maxCFSSegmentSizeMB=8.796093022207999E12, noCFSRatio=0.1]
   [junit4]   2> 1014438 INFO  (coreLoadExecutor-4207-thread-1) [    x:collection1] o.a.s.u.UpdateHandler Using UpdateLog implementation: org.apache.solr.update.UpdateLog
   [junit4]   2> 1014438 INFO  (coreLoadExecutor-4207-thread-1) [    x:collection1] o.a.s.u.UpdateLog Initializing UpdateLog: dataDir= defaultSyncLevel=FLUSH numRecordsToKeep=100 maxNumLogsToKeep=10 numVersionBuckets=65536
   [junit4]   2> 1014439 INFO  (coreLoadExecutor-4207-thread-1) [    x:collection1] o.a.s.u.CommitTracker Hard AutoCommit: disabled
   [junit4]   2> 1014439 INFO  (coreLoadExecutor-4207-thread-1) [    x:collection1] o.a.s.u.CommitTracker Soft AutoCommit: disabled
   [junit4]   2> 1014440 INFO  (coreLoadExecutor-4207-thread-1) [    x:collection1] o.a.s.u.RandomMergePolicy RandomMergePolicy wrapping class org.apache.lucene.index.TieredMergePolicy: [TieredMergePolicy: maxMergeAtOnce=39, maxMergeAtOnceExplicit=19, maxMergedSegmentMB=78.716796875, floorSegmentMB=0.9990234375, forceMergeDeletesPctAllowed=6.163184102188505, segmentsPerTier=47.0, maxCFSSegmentSizeMB=8.796093022207999E12, noCFSRatio=1.0
   [junit4]   2> 1014440 INFO  (coreLoadExecutor-4207-thread-1) [    x:collection1] o.a.s.s.SolrIndexSearcher Opening [Searcher@1820219[collection1] main]
   [junit4]   2> 1014440 INFO  (coreLoadExecutor-4207-thread-1) [    x:collection1] o.a.s.h.c.SpellCheckComponent Initializing spell checkers
   [junit4]   2> 1014448 INFO  (coreLoadExecutor-4207-thread-1) [    x:collection1] o.a.s.s.DirectSolrSpellChecker init: {name=direct,classname=DirectSolrSpellChecker,field=lowerfilt,minQueryLength=3}
   [junit4]   2> 1014484 INFO  (coreLoadExecutor-4207-thread-1) [    x:collection1] o.a.s.h.ReplicationHandler Commits will be reserved for 10000ms.
   [junit4]   2> 1014484 INFO  (searcherExecutor-4208-thread-1-processing-x:collection1) [    x:collection1] o.a.s.h.c.SpellCheckComponent Loading spell index for spellchecker: default
   [junit4]   2> 1014484 INFO  (coreLoadExecutor-4207-thread-1) [    x:collection1] o.a.s.u.UpdateLog Could not find max version in index or recent updates, using new clock 1588392712592162816
   [junit4]   2> 1014484 INFO  (searcherExecutor-4208-thread-1-processing-x:collection1) [    x:collection1] o.a.s.h.c.SpellCheckComponent Loading spell index for spellchecker: direct
   [junit4]   2> 1014484 INFO  (searcherExecutor-4208-thread-1-processing-x:collection1) [    x:collection1] o.a.s.h.c.SpellCheckComponent Loading spell index for spellchecker: wordbreak
   [junit4]   2> 1014484 INFO  (searcherExecutor-4208-thread-1-processing-x:collection1) [    x:collection1] o.a.s.h.c.SpellCheckComponent Loading spell index for spellchecker: multipleFields
   [junit4]   2> 1014485 INFO  (searcherExecutor-4208-thread-1-processing-x:collection1) [    x:collection1] o.a.s.h.c.SpellCheckComponent Loading spell index for spellchecker: jarowinkler
   [junit4]   2> 1014485 INFO  (searcherExecutor-4208-thread-1-processing-x:collection1) [    x:collection1] o.a.s.h.c.SpellCheckComponent Loading spell index for spellchecker: external
   [junit4]   2> 1014485 INFO  (searcherExecutor-4208-thread-1-processing-x:collection1) [    x:collection1] o.a.s.h.c.SpellCheckComponent Loading spell index for spellchecker: freq
   [junit4]   2> 1014485 INFO  (searcherExecutor-4208-thread-1-processing-x:collection1) [    x:collection1] o.a.s.h.c.SpellCheckComponent Loading spell index for spellchecker: fqcn
   [junit4]   2> 1014486 INFO  (searcherExecutor-4208-thread-1-processing-x:collection1) [    x:collection1] o.a.s.h.c.SpellCheckComponent Loading spell index for spellchecker: perDict
   [junit4]   2> 1014487 INFO  (searcherExecutor-4208-thread-1-processing-x:collection1) [    x:collection1] o.a.s.c.SolrCore [collection1] Registered new searcher Searcher@1820219[collection1] main{ExitableDirectoryReader(UninvertingDirectoryReader())}
   [junit4]   2> 1015003 INFO  (TEST-DistributedMLTComponentTest.test-seed#[9B8713B795C8065A]) [    ] o.a.s.SolrTestCaseJ4 Writing core.properties file to C:\Users\jenkins\workspace\Lucene-Solr-7.x-Windows\solr\build\solr-core\test\J1\temp\solr.handler.component.DistributedMLTComponentTest_9B8713B795C8065A-001\tempDir-001\shard1\cores\collection1
   [junit4]   2> 1015007 INFO  (TEST-DistributedMLTComponentTest.test-seed#[9B8713B795C8065A]) [    ] o.e.j.s.Server jetty-9.3.20.v20170531
   [junit4]   2> 1015008 INFO  (TEST-DistributedMLTComponentTest.test-seed#[9B8713B795C8065A]) [    ] o.e.j.s.h.ContextHandler Started o.e.j.s.ServletContextHandler@163e2f7{/,null,AVAILABLE}
   [junit4]   2> 1015009 INFO  (TEST-DistributedMLTComponentTest.test-seed#[9B8713B795C8065A]) [    ] o.e.j.s.AbstractConnector Started ServerConnector@a3d711{SSL,[ssl, http/1.1]}{127.0.0.1:60735}
   [junit4]   2> 1015009 INFO  (TEST-DistributedMLTComponentTest.test-seed#[9B8713B795C8065A]) [    ] o.e.j.s.Server Started @1022966ms
   [junit4]   2> 1015009 INFO  (TEST-DistributedMLTComponentTest.test-seed#[9B8713B795C8065A]) [    ] o.a.s.c.s.e.JettySolrRunner Jetty properties: {hostContext=/, hostPort=60735, coreRootDirectory=C:\Users\jenkins\workspace\Lucene-Solr-7.x-Windows\solr\build\solr-core\test\J1\temp\solr.handler.component.DistributedMLTComponentTest_9B8713B795C8065A-001\tempDir-001\shard1\cores}
   [junit4]   2> 1015009 ERROR (TEST-DistributedMLTComponentTest.test-seed#[9B8713B795C8065A]) [    ] o.a.s.u.StartupLoggingUtils Missing Java Option solr.log.dir. Logging may be missing or incomplete.
   [junit4]   2> 1015009 INFO  (TEST-DistributedMLTComponentTest.test-seed#[9B8713B795C8065A]) [    ] o.a.s.s.SolrDispatchFilter  ___      _       Welcome to Apache Solr™ version 7.3.0
   [junit4]   2> 1015010 INFO  (TEST-DistributedMLTComponentTest.test-seed#[9B8713B795C8065A]) [    ] o.a.s.s.SolrDispatchFilter / __| ___| |_ _   Starting in standalone mode on port null
   [junit4]   2> 1015010 INFO  (TEST-DistributedMLTComponentTest.test-seed#[9B8713B795C8065A]) [    ] o.a.s.s.SolrDispatchFilter \__ \/ _ \ | '_|  Install dir: null
   [junit4]   2> 1015010 INFO  (TEST-DistributedMLTComponentTest.test-seed#[9B8713B795C8065A]) [    ] o.a.s.s.SolrDispatchFilter |___/\___/_|_|    Start time: 2018-01-01T12:22:14.892Z
   [junit4]   2> 1015011 INFO  (TEST-DistributedMLTComponentTest.test-seed#[9B8713B795C8065A]) [    ] o.a.s.c.SolrXmlConfig Loading container configuration from C:\Users\jenkins\workspace\Lucene-Solr-7.x-Windows\solr\build\solr-core\test\J1\temp\solr.handler.component.DistributedMLTComponentTest_9B8713B795C8065A-001\tempDir-001\shard1\solr.xml
   [junit4]   2> 1015017 INFO  (TEST-DistributedMLTComponentTest.test-seed#[9B8713B795C8065A]) [    ] o.a.s.c.SolrXmlConfig Configuration parameter autoReplicaFailoverWorkLoopDelay is ignored
   [junit4]   2> 1015018 INFO  (TEST-DistributedMLTComponentTest.test-seed#[9B8713B795C8065A]) [    ] o.a.s.c.SolrXmlConfig Configuration parameter autoReplicaFailoverBadNodeExpiration is ignored
   [junit4]   2> 1015018 INFO  (TEST-DistributedMLTComponentTest.test-seed#[9B8713B795C8065A]) [    ] o.a.s.c.SolrXmlConfig MBean server found: com.sun.jmx.mbeanserver.JmxMBeanServer@d98a41, but no JMX reporters were configured - adding default JMX reporter.
   [junit4]   2> 1015124 INFO  (TEST-DistributedMLTComponentTest.test-seed#[9B8713B795C8065A]) [    ] o.a.s.m.r.SolrJmxReporter JMX monitoring for 'solr.node' (registry 'solr.node') enabled at server: com.sun.jmx.mbeanserver.JmxMBeanServer@d98a41
   [junit4]   2> 1015132 INFO  (TEST-DistributedMLTComponentTest.test-seed#[9B8713B795C8065A]) [    ] o.a.s.m.r.SolrJmxReporter JMX monitoring for 'solr.jvm' (registry 'solr.jvm') enabled at server: com.sun.jmx.mbeanserver.JmxMBeanServer@d98a41
   [junit4]   2> 1015132 INFO  (TEST-DistributedMLTComponentTest.test-seed#[9B8713B795C8065A]) [    ] o.a.s.m.r.SolrJmxReporter JMX monitoring for 'solr.jetty' (registry 'solr.jetty') enabled at server: com.sun.jmx.mbeanserver.JmxMBeanServer@d98a41
   [junit4]   2> 1015136 INFO  (TEST-DistributedMLTComponentTest.test-seed#[9B8713B795C8065A]) [    ] o.a.s.c.CorePropertiesLocator Found 1 core definitions underneath C:\Users\jenkins\workspace\Lucene-Solr-7.x-Windows\solr\build\solr-core\test\J1\temp\solr.handler.component.DistributedMLTComponentTest_9B8713B795C8065A-001\tempDir-001\shard1\cores
   [junit4]   2> 1015136 INFO  (TEST-DistributedMLTComponentTest.test-seed#[9B8713B795C8065A]) [    ] o.a.s.c.CorePropertiesLocator Cores are: [collection1]
   [junit4]   2> 1015139 INFO  (coreLoadExecutor-4218-thread-1) [    ] o.a.s.c.TransientSolrCoreCacheDefault Allocating transient cache for 4 transient cores
   [junit4]   2> 1015141 INFO  (coreLoadExecutor-4218-thread-1) [    x:collection1] o.a.s.c.SolrResourceLoader [null] Added 2 libs to classloader, from paths: [/C:/Users/jenkins/workspace/Lucene-Solr-7.x-Windows/solr/core/src/test-files/solr/collection1/lib, /C:/Users/jenkins/workspace/Lucene-Solr-7.x-Windows/solr/core/src/test-files/solr/collection1/lib/classes]
   [junit4]   2> 1015224 INFO  (coreLoadExecutor-4218-thread-1) [    x:collection1] o.a.s.c.SolrConfig Using Lucene MatchVersion: 7.3.0
   [junit4]   2> 1015243 INFO  (coreLoadExecutor-4218-thread-1) [    x:collection1] o.a.s.s.IndexSchema [collection1] Schema name=test
   [junit4]   2> 1015329 INFO  (coreLoadExecutor-4218-thread-1) [    x:collection1] o.a.s.s.IndexSchema Loaded schema test/1.0 with uniqueid field id
   [junit4]   2> 1015339 INFO  (coreLoadExecutor-4218-thread-1) [    x:collection1] o.a.s.c.CoreContainer Creating SolrCore 'collection1' using configuration from configset C:\Users\jenkins\workspace\Lucene-Solr-7.x-Windows\solr\core\src\test-files\solr\collection1, trusted=true
   [junit4]   2> 1015339 INFO  (coreLoadExecutor-4218-thread-1) [    x:collection1] o.a.s.m.r.SolrJmxReporter JMX monitoring for 'solr.core.collection1' (registry 'solr.core.collection1') enabled at server: com.sun.jmx.mbeanserver.JmxMBeanServer@d98a41
   [junit4]   2> 1015339 INFO  (coreLoadExecutor-4218-thread-1) [    x:collection1] o.a.s.c.SolrCore solr.RecoveryStrategy.Builder
   [junit4]   2> 1015339 INFO  (coreLoadExecutor-4218-thread-1) [    x:collection1] o.a.s.c.SolrCore [[collection1] ] Opening new SolrCore at [C:\Users\jenkins\workspace\Lucene-Solr-7.x-Windows\solr\core\src\test-files\solr\collection1], dataDir=[C:\Users\jenkins\workspace\Lucene-Solr-7.x-Windows\solr\build\solr-core\test\J1\temp\solr.handler.component.DistributedMLTComponentTest_9B8713B795C8065A-001\tempDir-001\shard1\cores\collection1\data\]
   [junit4]   2> 1015341 INFO  (coreLoadExecutor-4218-thread-1) [    x:collection1] o.a.s.u.RandomMergePolicy RandomMergePolicy wrapping class org.apache.lucene.index.AlcoholicMergePolicy: [AlcoholicMergePolicy: minMergeSize=0, mergeFactor=10, maxMergeSize=922662550, maxMergeSizeForForcedMerge=9223372036854775807, calibrateSizeByDeletes=true, maxMergeDocs=2147483647, maxCFSSegmentSizeMB=8.796093022207999E12, noCFSRatio=0.1]
   [junit4]   2> 1015424 INFO  (coreLoadExecutor-4218-thread-1) [    x:collection1] o.a.s.u.UpdateHandler Using UpdateLog implementation: org.apache.solr.update.UpdateLog
   [junit4]   2> 1015424 INFO  (coreLoadExecutor-4218-thread-1) [    x:collection1] o.a.s.u.UpdateLog Initializing UpdateLog: dataDir= defaultSyncLevel=FLUSH numRecordsToKeep=100 maxNumLogsToKeep=10 numVersionBuckets=65536
   [junit4]   2> 1015425 INFO  (coreLoadExecutor-4218-thread-1) [    x:collection1] o.a.s.u.CommitTracker Hard AutoCommit: disabled
   [junit4]   2> 1015425 INFO  (coreLoadExecutor-4218-thread-1) [    x:collection1] o.a.s.u.CommitTracker Soft AutoCommit: disabled
   [junit4]   2> 1015426 INFO  (coreLoadExecutor-4218-thread-1) [    x:collection1] o.a.s.u.RandomMergePolicy RandomMergePolicy wrapping class org.apache.lucene.index.TieredMergePolicy: [TieredMergePolicy: maxMergeAtOnce=39, maxMergeAtOnceExplicit=19, maxMergedSegmentMB=78.716796875, floorSegmentMB=0.9990234375, forceMergeDeletesPctAllowed=6.163184102188505, segmentsPerTier=47.0, maxCFSSegmentSizeMB=8.796093022207999E12, noCFSRatio=1.0
   [junit4]   2> 1015427 INFO  (coreLoadExecutor-4218-thread-1) [    x:collection1] o.a.s.s.SolrIndexSearcher Opening [Searcher@19e76b0[collection1] main]
   [junit4]   2> 1015427 INFO  (coreLoadExecutor-4218-thread-1) [    x:collection1] o.a.s.h.c.SpellCheckComponent Initializing spell checkers
   [junit4]   2> 1015438 INFO  (coreLoadExecutor-4218-thread-1) [    x:collection1] o.a.s.s.DirectSolrSpellChecker init: {name=direct,classname=DirectSolrSpellChecker,field=lowerfilt,minQueryLength=3}
   [junit4]   2> 1015469 INFO  (coreLoadExecutor-4218-thread-1) [    x:collection1] o.a.s.h.ReplicationHandler Commits will be reserved for 10000ms.
   [junit4]   2> 1015469 INFO  (searcherExecutor-4219-thread-1-processing-x:collection1) [    x:collection1] o.a.s.h.c.SpellCheckComponent Loading spell index for spellchecker: default
   [junit4]   2> 1015469 INFO  (coreLoadExecutor-4218-thread-1) [    x:collection1] o.a.s.u.UpdateLog Could not find max version in index or recent updates, using new clock 1588392713625010176
   [junit4]   2> 1015469 INFO  (searcherExecutor-4219-thread-1-processing-x:collection1) [    x:collection1] o.a.s.h.c.SpellCheckComponent Loading spell index for spellchecker: direct
   [junit4]   2> 1015469 INFO  (searcherExecutor-4219-thread-1-processing-x:collection1) [    x:collection1] o.a.s.h.c.SpellCheckComponent Loading spell index for spellchecker: wordbreak
   [junit4]   2> 1015469 INFO  (searcherExecutor-4219-thread-1-processing-x:collection1) [    x:collection1] o.a.s.h.c.SpellCheckComponent Loading spell index for spellchecker: multipleFields
   [junit4]   2> 1015470 INFO  (searcherExecutor-4219-thread-1-processing-x:collection1) [    x:collection1] o.a.s.h.c.SpellCheckComponent Loading spell index for spellchecker: jarowinkler
   [junit4]   2> 1015470 INFO  (searcherExecutor-4219-thread-1-processing-x:collection1) [    x:collection1] o.a.s.h.c.SpellCheckComponent Loading spell index for spellchecker: external
   [junit4]   2> 1015470 INFO  (searcherExecutor-4219-thread-1-processing-x:collection1) [    x:collection1] o.a.s.h.c.SpellCheckComponent Loading spell index for spellchecker: freq
   [junit4]   2> 1015470 INFO  (searcherExecutor-4219-thread-1-processing-x:collection1) [    x:collection1] o.a.s.h.c.SpellCheckComponent Loading spell index for spellchecker: fqcn
   [junit4]   2> 1015470 INFO  (searcherExecutor-4219-thread-1-processing-x:collection1) [    x:collection1] o.a.s.h.c.SpellCheckComponent Loading spell index for spellchecker: perDict
   [junit4]   2> 1015471 INFO  (searcherExecutor-4219-thread-1-processing-x:collection1) [    x:collection1] o.a.s.c.SolrCore [collection1] Registered new searcher Searcher@19e76b0[collection1] main{ExitableDirectoryReader(UninvertingDirectoryReader())}
   [junit4]   2> 1015997 INFO  (TEST-DistributedMLTComponentTest.test-seed#[9B8713B795C8065A]) [    ] o.a.s.SolrTestCaseJ4 Writing core.properties file to C:\Users\jenkins\workspace\Lucene-Solr-7.x-Windows\solr\build\solr-core\test\J1\temp\solr.handler.component.DistributedMLTComponentTest_9B8713B795C8065A-001\tempDir-001\shard2\cores\collection1
   [junit4]   2> 1016001 INFO  (TEST-DistributedMLTComponentTest.test-seed#[9B8713B795C8065A]) [    ] o.e.j.s.Server jetty-9.3.20.v20170531
   [junit4]   2> 1016001 INFO  (TEST-DistributedMLTComponentTest.test-seed#[9B8713B795C8065A]) [    ] o.e.j.s.h.ContextHandler Started o.e.j.s.ServletContextHandler@1eb7aa9{/,null,AVAILABLE}
   [junit4]   2> 1016002 INFO  (TEST-DistributedMLTComponentTest.test-seed#[9B8713B795C8065A]) [    ] o.e.j.s.AbstractConnector Started ServerConnector@8b3408{SSL,[ssl, http/1.1]}{127.0.0.1:60738}
   [junit4]   2> 1016002 INFO  (TEST-DistributedMLTComponentTest.test-seed#[9B8713B795C8065A]) [    ] o.e.j.s.Server Started @1023959ms
   [junit4]   2> 1016002 INFO  (TEST-DistributedMLTComponentTest.test-seed#[9B8713B795C8065A]) [    ] o.a.s.c.s.e.JettySolrRunner Jetty properties: {hostContext=/, hostPort=60738, coreRootDirectory=C:\Users\jenkins\workspace\Lucene-Solr-7.x-Windows\solr\build\solr-core\test\J1\temp\solr.handler.component.DistributedMLTComponentTest_9B8713B795C8065A-001\tempDir-001\shard2\cores}
   [junit4]   2> 1016002 ERROR (TEST-DistributedMLTComponentTest.test-seed#[9B8713B795C8065A]) [    ] o.a.s.u.StartupLoggingUtils Missing Java Option solr.log.dir. Logging may be missing or incomplete.
   [junit4]   2> 1016002 INFO  (TEST-DistributedMLTComponentTest.test-seed#[9B8713B795C8065A]) [    ] o.a.s.s.SolrDispatchFilter  ___      _       Welcome to Apache Solr™ version 7.3.0
   [junit4]   2> 1016002 INFO  (TEST-DistributedMLTComponentTest.test-seed#[9B8713B795C8065A]) [    ] o.a.s.s.SolrDispatchFilter / __| ___| |_ _   Starting in standalone mode on port null
   [junit4]   2> 1016002 INFO  (TEST-DistributedMLTComponentTest.test-seed#[9B8713B795C8065A]) [    ] o.a.s.s.SolrDispatchFilter \__ \/ _ \ | '_|  Install dir: null
   [junit4]   2> 1016002 INFO  (TEST-DistributedMLTComponentTest.test-seed#[9B8713B795C8065A]) [    ] o.a.s.s.SolrDispatchFilter |___/\___/_|_|    Start time: 2018-01-01T12:22:15.884Z
   [junit4]   2> 1016003 INFO  (TEST-DistributedMLTComponentTest.test-seed#[9B8713B795C8065A]) [    ] o.a.s.c.SolrXmlConfig Loading container configuration from C:\Users\jenkins\workspace\Lucene-Solr-7.x-Windows\solr\build\solr-core\test\J1\temp\solr.handler.component.DistributedMLTComponentTest_9B8713B795C8065A-001\tempDir-001\shard2\solr.xml
   [junit4]   2> 1016019 INFO  (TEST-DistributedMLTComponentTest.test-seed#[9B8713B795C8065A]) [    ] o.a.s.c.SolrXmlConfig Configuration parameter autoReplicaFailoverWorkLoopDelay is ignored
   [junit4]   2> 1016019 INFO  (TEST-DistributedMLTComponentTest.test-seed#[9B8713B795C8065A]) [    ] o.a.s.c.SolrXmlConfig Configuration parameter autoReplicaFailoverBadNodeExpiration is ignored
   [junit4]   2> 1016020 INFO  (TEST-DistributedMLTComponentTest.test-seed#[9B8713B795C8065A]) [    ] o.a.s.c.SolrXmlConfig MBean server found: com.sun.jmx.mbeanserver.JmxMBeanServer@d98a41, but no JMX reporters were configured - adding default JMX reporter.
   [junit4]   2> 1016096 INFO  (TEST-DistributedMLTComponentTest.test-seed#[9B8713B795C8065A]) [    ] o.a.s.m.r.SolrJmxReporter JMX monitoring for 'solr.node' (registry 'solr.node') enabled at server: com.sun.jmx.mbeanserver.JmxMBeanServer@d98a41
   [junit4]   2> 1016103 INFO  (TEST-DistributedMLTComponentTest.test-seed#[9B8713B795C8065A]) [    ] o.a.s.m.r.SolrJmxReporter JMX monitoring for 'solr.jvm' (registry 'solr.jvm') enabled at server: com.sun.jmx.mbeanserver.JmxMBeanServer@d98a41
   [junit4]   2> 1016103 INFO  (TEST-DistributedMLTComponentTest.test-seed#[9B8713B795C8065A]) [    ] o.a.s.m.r.SolrJmxReporter JMX monitoring for 'solr.jetty' (registry 'solr.jetty') enabled at server: com.sun.jmx.mbeanserver.JmxMBeanServer@d98a41
   [junit4]   2> 1016106 INFO  (TEST-DistributedMLTComponentTest.test-seed#[9B8713B795C8065A]) [    ] o.a.s.c.CorePropertiesLocator Found 1 core definitions underneath C:\Users\jenkins\workspace\Lucene-Solr-7.x-Windows\solr\build\solr-core\test\J1\temp\solr.handler.component.DistributedMLTComponentTest_9B8713B795C8065A-001\tempDir-001\shard2\cores
   [junit4]   2> 1016106 INFO  (TEST-DistributedMLTComponentTest.test-seed#[9B8713B795C8065A]) [    ] o.a.s.c.CorePropertiesLocator Cores are: [collection1]
   [junit4]   2> 1016109 INFO  (coreLoadExecutor-4229-thread-1) [    ] o.a.s.c.TransientSolrCoreCacheDefault Allocating transient cache for 4 transient cores
   [junit4]   2> 1016110 INFO  (coreLoadExecutor-4229-thread-1) [    x:collection1] o.a.s.c.SolrResourceLoader [null] Added 2 libs to classloader, from paths: [/C:/Users/jenkins/workspace/Lucene-Solr-7.x-Windows/solr/core/src/test-files/solr/collection1/lib, /C:/Users/jenkins/workspace/Lucene-Solr-7.x-Windows/solr/core/src/test-files/solr/collection1/lib/classes]
   [junit4]   2> 1016177 INFO  (coreLoadExecutor-4229-thread-1) [    x:collection1] o.a.s.c.SolrConfig Using Lucene MatchVersion: 7.3.0
   [junit4]   2> 1016193 INFO  (coreLoadExecutor-4229-thread-1) [    x:collection1] o.a.s.s.IndexSchema [collection1] Schema name=test
   [junit4]   2> 1016292 INFO  (coreLoadExecutor-4229-thread-1) [    x:collection1] o.a.s.s.IndexSchema Loaded schema test/1.0 with uniqueid field id
   [junit4]   2> 1016302 INFO  (coreLoadExecutor-4229-thread-1) [    x:collection1] o.a.s.c.CoreContainer Creating SolrCore 'collection1' using configuration from configset C:\Users\jenkins\workspace\Lucene-Solr-7.x-Windows\solr\core\src\test-files\solr\collection1, trusted=true
   [junit4]   2> 1016303 INFO  (coreLoadExecutor-4229-thread-1) [    x:collection1] o.a.s.m.r.SolrJmxReporter JMX monitoring for 'solr.core.collection1' (registry 'solr.core.collection1') enabled at server: com.sun.jmx.mbeanserver.JmxMBeanServer@d98a41
   [junit4]   2> 1016303 INFO  (coreLoadExecutor-4229-thread-1) [    x:collection1] o.a.s.c.SolrCore solr.RecoveryStrategy.Builder
   [junit4]   2> 1016303 INFO  (coreLoadExecutor-4229-thread-1) [    x:collection1] o.a.s.c.SolrCore [[collection1] ] Opening new SolrCore at [C:\Users\jenkins\workspace\Lucene-Solr-7.x-Windows\solr\core\src\test-files\solr\collection1], dataDir=[C:\Users\jenkins\workspace\Lucene-Solr-7.x-Windows\solr\build\solr-core\test\J1\temp\solr.handler.component.DistributedMLTComponentTest_9B8713B795C8065A-001\tempDir-001\shard2\cores\collection1\data\]
   [junit4]   2> 1016305 INFO  (coreLoadExecutor-4229-thread-1) [    x:collection1] o.a.s.u.RandomMergePolicy RandomMergePolicy wrapping class org.apache.lucene.index.AlcoholicMergePolicy: [AlcoholicMergePolicy: minMergeSize=0, mergeFactor=10, maxMergeSize=922662550, maxMergeSizeForForcedMerge=9223372036854775807, calibrateSizeByDeletes=true, maxMergeDocs=2147483647, maxCFSSegmentSizeMB=8.796093022207999E12, noCFSRatio=0.1]
   [junit4]   2> 1016393 INFO  (coreLoadExecutor-4229-thread-1) [    x:collection1] o.a.s.u.UpdateHandler Using UpdateLog implementation: org.apache.solr.update.UpdateLog
   [junit4]   2> 1016393 INFO  (coreLoadExecutor-4229-thread-1) [    x:collection1] o.a.s.u.UpdateLog Initializing UpdateLog: dataDir= defaultSyncLevel=FLUSH numRecordsToKeep=100 maxNumLogsToKeep=10 numVersionBuckets=65536
   [junit4]   2> 1016395 INFO  (coreLoadExecutor-4229-thread-1) [    x:collection1] o.a.s.u.CommitTracker Hard AutoCommit: disabled
   [junit4]   2> 1016395 INFO  (coreLoadExecutor-4229-thread-1) [    x:collection1] o.a.s.u.CommitTracker Soft AutoCommit: disabled
   [junit4]   2> 1016396 INFO  (coreLoadExecutor-4229-thread-1) [    x:collection1] o.a.s.u.RandomMergePolicy RandomMergePolicy wrapping class org.apache.lucene.index.TieredMergePolicy: [TieredMergePolicy: maxMergeAtOnce=39, maxMergeAtOnceExplicit=19, maxMergedSegmentMB=78.716796875, floorSegmentMB=0.9990234375, forceMergeDeletesPctAllowed=6.163184102188505, segmentsPerTier=47.0, maxCFSSegmentSizeMB=8.796093022207999E12, noCFSRatio=1.0
   [junit4]   2> 1016396 INFO  (coreLoadExecutor-4229-thread-1) [    x:collection1] o.a.s.s.SolrIndexSearcher Opening [Searcher@8b0fec[collection1] main]
   [junit4]   2> 1016397 INFO  (coreLoadExecutor-4229-thread-1) [    x:collection1] o.a.s.h.c.SpellCheckComponent Initializing spell checkers
   [junit4]   2> 1016406 INFO  (coreLoadExecutor-4229-thread-1) [    x:collection1] o.a.s.s.DirectSolrSpellChecker init: {name=direct,classname=DirectSolrSpellChecker,field=lowerfilt,minQueryLength=3}
   [junit4]   2> 1016443 INFO  (coreLoadExecutor-4229-thread-1) [    x:collection1] o.a.s.h.ReplicationHandler Commits will be reserved for 10000ms.
   [junit4]   2> 1016443 INFO  (searcherExecutor-4230-thread-1-processing-x:collection1) [    x:collection1] o.a.s.h.c.SpellCheckComponent Loading spell index for spellchecker: default
   [junit4]   2> 1016443 INFO  (coreLoadExecutor-4229-thread-1) [    x:collection1] o.a.s.u.UpdateLog Could not find max version in index or recent updates, using new clock 1588392714646323200
   [junit4]   2> 1016444 INFO  (searcherExecutor-4230-thread-1-processing-x:collection1) [    x:collection1] o.a.s.h.c.SpellCheckComponent Loading spell index for spellchecker: direct
   [junit4]   2> 1016444 INFO  (searcherExecutor-4230-thread-1-processing-x:collection1) [    x:collection1] o.a.s.h.c.SpellCheckComponent Loading spell index for spellchecker: wordbreak
   [junit4]   2> 1016444 INFO  (searcherExecutor-4230-thread-1-processing-x:collection1) [    x:collection1] o.a.s.h.c.SpellCheckComponent Loading spell index for spellchecker: multipleFields
   [junit4]   2> 1016444 INFO  (searcherExecutor-4230-thread-1-processing-x:collection1) [    x:collection1] o.a.s.h.c.SpellCheckComponent Loading spell index for spellchecker: jarowinkler
   [junit4]   2> 1016444 INFO  (searcherExecutor-4230-thread-1-processing-x:collection1) [    x:collection1] o.a.s.h.c.SpellCheckComponent Loading spell index for spellchecker: external
   [junit4]   2> 1016445 INFO  (searcherExecutor-4230-thread-1-processing-x:collection1) [    x:collection1] o.a.s.h.c.SpellCheckComponent Loading spell index for spellchecker: freq
   [junit4]   2> 1016445 INFO  (searcherExecutor-4230-thread-1-processing-x:collection1) [    x:collection1] o.a.s.h.c.SpellCheckComponent Loading spell index for spellchecker: fqcn
   [junit4]   2> 1016445 INFO  (searcherExecutor-4230-thread-1-processing-x:collection1) [    x:collection1] o.a.s.h.c.SpellCheckComponent Loading spell index for spellchecker: perDict
   [junit4]   2> 1016446 INFO  (searcherExecutor-4230-thread-1-processing-x:collection1) [    x:collection1] o.a.s.c.SolrCore [collection1] Registered new searcher Searcher@8b0fec[collection1] main{ExitableDirectoryReader(UninvertingDirectoryReader())}
   [junit4]   2> 1016947 INFO  (TEST-DistributedMLTComponentTest.test-seed#[9B8713B795C8065A]) [    ] o.a.s.SolrTestCaseJ4 ###Starting test
   [junit4]   2> 1016983 INFO  (qtp31870468-13870) [    x:collection1] o.a.s.u.p.LogUpdateProcessorFactory [collection1]  webapp= path=/update params={wt=javabin&version=2}{deleteByQuery=*:* (-1588392715208359936)} 0 3
   [junit4]   2> 1017016 INFO  (qtp19051254-13890) [    x:collection1] o.a.s.u.p.LogUpdateProcessorFactory [collection1]  webapp= path=/update params={wt=javabin&version=2}{deleteByQuery=*:* (-1588392715244011520)} 0 2
   [junit4]   2> 1017048 INFO  (qtp4277545-13909) [    x:collection1] o.a.s.u.p.LogUpdateProcessorFactory [collection1]  webapp= path=/update params={wt=javabin&version=2}{deleteByQuery=*:* (-1588392715276517376)} 0 3
   [junit4]   2> 1017077 INFO  (qtp22807580-13923) [    x:collection1] o.a.s.u.p.LogUpdateProcessorFactory [collection1]  webapp= path=/update params={wt=javabin&version=2}{deleteByQuery=*:* (-1588392715306926080)} 0 3
   [junit4]   2> 1017081 INFO  (qtp31870468-13871) [    x:collection1] o.a.s.u.p.LogUpdateProcessorFactory [collection1]  webapp= path=/update params={wt=javabin&version=2}{add=[1 (1588392715312168960)]} 0 3
   [junit4]   2> 1017084 INFO  (qtp19051254-13889) [    x:collection1] o.a.s.u.p.LogUpdateProcessorFactory [collection1]  webapp= path=/update params={wt=javabin&version=2}{add=[1 (1588392715316363264)]} 0 1
   [junit4]   2> 1017085 INFO  (qtp31870468-13872) [    x:collection1] o.a.s.u.p.LogUpdateProcessorFactory [collection1]  webapp= path=/update params={wt=javabin&version=2}{add=[2 (1588392715319508992)]} 0 0
   [junit4]   2> 1017088 INFO  (qtp4277545-13908) [    x:collection1] o.a.s.u.p.LogUpdateProcessorFactory [collection1]  webapp= path=/update params={wt=javabin&version=2}{add=[2 (1588392715321606144)]} 0 1
   [junit4]   2> 1017089 INFO  (qtp31870468-13873) [    x:collection1] o.a.s.u.p.LogUpdateProcessorFactory [collection1]  webapp= path=/update params={wt=javabin&version=2}{add=[3 (1588392715322654720)]} 0 0
   [junit4]   2> 1017096 INFO  (qtp22807580-13932) [    x:collection1] o.a.s.u.p.LogUpdateProcessorFactory [collection1]  webapp= path=/update params={wt=javabin&version=2}{add=[3 (1588392715325800448)]} 0 5
   [junit4]   2> 1017097 INFO  (qtp31870468-13866) [    x:collection1] o.a.s.u.p.LogUpdateProcessorFactory [collection1]  webapp= path=/update params={wt=javabin&version=2}{add=[4 (1588392715332091904)]} 0 0
   [junit4]   2> 1017098 INFO  (qtp19051254-13888) [    x:collection1] o.a.s.u.p.LogUpdateProcessorFactory [collection1]  webapp= path=/update params={wt=javabin&version=2}{add=[4 (1588392715333140480)]} 0 0
   [junit4]   2> 1017099 INFO  (qtp31870468-13866) [    x:collection1] o.a.s.u.p.LogUpdateProcessorFactory [collection1]  webapp= path=/update params={wt=javabin&version=2}{add=[5 (1588392715334189056)]} 0 0
   [junit4]   2> 1017100 INFO  (qtp4277545-13906) [    x:collection1] o.a.s.u.p.LogUpdateProcessorFactory [collection1]  webapp= path=/update params={wt=javabin&version=2}{add=[5 (1588392715334189056)]} 0 0
   [junit4]   2> 1017101 INFO  (qtp31870468-13866) [    x:collection1] o.a.s.u.p.LogUpdateProcessorFactory [collection1]  webapp= path=/update params={wt=javabin&version=2}{add=[6 (1588392715336286208)]} 0 0
   [junit4]   2> 1017106 INFO  (qtp22807580-13932) [    x:collection1] o.a.s.u.p.LogUpdateProcessorFactory [collection1]  webapp= path=/update params={wt=javabin&version=2}{add=[6 (1588392715341529088)]} 0 0
   [junit4]   2> 1017107 INFO  (qtp31870468-13869) [    x:collection1] o.a.s.u.p.LogUpdateProcessorFactory [collection1]  webapp= path=/update params={wt=javabin&version=2}{add=[7 (1588392715342577664)]} 0 1
   [junit4]   2> 1017109 INFO  (qtp19051254-13888) [    x:collection1] o.a.s.u.p.LogUpdateProcessorFactory [collection1]  webapp= path=/update params={wt=javabin&version=2}{add=[7 (1588392715343626240)]} 0 0
   [junit4]   2> 1017110 INFO  (qtp31870468-13870) [    x:collection1] o.a.s.u.p.LogUpdateProcessorFactory [collection1]  webapp= path=/update params={wt=javabin&version=2}{add=[8 (1588392715344674816)]} 0 0
   [junit4]   2> 1017111 INFO  (qtp4277545-13905) [    x:collection1] o.a.s.u.p.LogUpdateProcessorFactory [collection1]  webapp= path=/update params={wt=javabin&version=2}{add=[8 (1588392715346771968)]} 0 0
   [junit4]   2> 1017112 INFO  (qtp31870468-13871) [    x:collection1] o.a.s.u.p.LogUpdateProcessorFactory [collection1]  webapp= path=/update params={wt=javabin&version=2}{add=[9 (1588392715347820544)]} 0 0
   [junit4]   2> 1017113 INFO  (qtp22807580-13930) [    x:collection1] o.a.s.u.p.LogUpdateProcessorFactory [collection1]  webapp= path=/update params={wt=javabin&version=2}{add=[9 (1588392715347820544)]} 0 0
   [junit4]   2> 1017114 INFO  (qtp31870468-13871) [    x:collection1] o.a.s.u.p.LogUpdateProcessorFactory [collection1]  webapp= path=/update params={wt=javabin&version=2}{add=[10 (1588392715349917696)]} 0 0
   [junit4]   2> 1017115 INFO  (qtp19051254-13886) [    x:collection1] o.a.s.u.p.LogUpdateProcessorFactory [collection1]  webapp= path=/update params={wt=javabin&version=2}{add=[10 (1588392715349917696)]} 0 0
   [junit4]   2> 1017116 INFO  (qtp31870468-13871) [    x:collection1] o.a.s.u.p.LogUpdateProcessorFactory [collection1]  webapp= path=/update params={wt=javabin&version=2}{add=[12 (1588392715352014848)]} 0 0
   [junit4]   2> 1017117 INFO  (qtp22807580-13930) [    x:collection1] o.a.s.u.p.LogUpdateProcessorFactory [collection1]  webapp= path=/update params={wt=javabin&version=2}{add=[12 (1588392715353063424)]} 0 0
   [junit4]   2> 1017117 INFO  (qtp31870468-13871) [    x:collection1] o.a.s.u.p.LogUpdateProcessorFactory [collection1]  webapp= path=/update params={wt=javabin&version=2}{add=[13 (1588392715353063424)]} 0 0
   [junit4]   2> 1017118 INFO  (qtp19051254-13885) [    x:collection1] o.a.s.u.p.LogUpdateProcessorFactory [collection1]  webapp= path=/update params={wt=javabin&version=2}{add=[13 (1588392715353063424)]} 0 0
   [junit4]   2> 1017119 INFO  (qtp31870468-13868) [    x:collection1] o.a.s.u.p.LogUpdateProcessorFactory [collection1]  webapp= path=/update params={wt=javabin&version=2}{add=[14 (1588392715355160576)]} 0 0
   [junit4]   2> 1017120 INFO  (qtp4277545-13905) [    x:collection1] o.a.s.u.p.LogUpdateProcessorFactory [collection1]  webapp= path=/update params={wt=javabin&version=2}{add=[14 (1588392715356209152)]} 0 0
   [junit4]   2> 1017121 INFO  (qtp31870468-13868) [    x:collection1] o.a.s.u.p.LogUpdateProcessorFactory [collection1]  webapp= path=/update params={wt=javabin&version=2}{add=[15 (1588392715357257728)]} 0 0
   [junit4]   2> 1017121 INFO  (qtp22807580-13930) [    x:collection1] o.a.s.u.p.LogUpdateProcessorFactory [collection1]  webapp= path=/update params={wt=javabin&version=2}{add=[15 (1588392715357257728)]} 0 0
   [junit4]   2> 1017122 INFO  (qtp31870468-13868) [    x:collection1] o.a.s.u.p.LogUpdateProcessorFactory [collection1]  webapp= path=/update params={wt=javabin&version=2}{add=[16 (1588392715358306304)]} 0 0
   [junit4]   2> 1017123 INFO  (qtp19051254-13885) [    x:collection1] o.a.s.u.p.LogUpdateProcessorFactory [collection1]  webapp= path=/update params={wt=javabin&version=2}{add=[16 (1588392715358306304)]} 0 0
   [junit4]   2> 1017123 INFO  (qtp31870468-13868) [    x:collection1] o.a.s.u.p.LogUpdateProcessorFactory [collection1]  webapp= path=/update params={wt=javabin&version=2}{add=[17 (1588392715359354880)]} 0 0
   [junit4]   2> 1017125 INFO  (qtp4277545-13905) [    x:collection1] o.a.s.u.p.LogUpdateProcessorFactory [collection1]  webapp= path=/update params={wt=javabin&version=2}{add=[17 (1588392715360403456)]} 0 0
   [junit4]   2> 1017125 INFO  (qtp31870468-13868) [    x:collection1] o.a.s.u.p.LogUpdateProcessorFactory [collection1]  webapp= path=/update params={wt=javabin&version=2}{add=[18 (1588392715361452032)]} 0 0
   [junit4]   2> 1017127 INFO  (qtp22807580-13928) [    x:collection1] o.a.s.u.p.LogUpdateProcessorFactory [collection1]  webapp= path=/update params={wt=javabin&version=2}{add=[18 (1588392715362500608)]} 0 1
   [junit4]   2> 1017127 INFO  (qtp31870468-13868) [    x:collection1] o.a.s.u.p.LogUpdateProcessorFactory [collection1]  webapp= path=/update params={wt=javabin&version=2}{add=[19 (1588392715363549184)]} 0 0
   [junit4]   2> 1017129 INFO  (qtp19051254-13883) [    x:collection1] o.a.s.u.p.LogUpdateProcessorFactory [collection1]  webapp= path=/update params={wt=javabin&version=2}{add=[19 (1588392715364597760)]} 0 0
   [junit4]   2> 1017129 INFO  (qtp31870468-13871) [    x:collection1] o.a.s.u.p.LogUpdateProcessorFactory [collection1]  webapp= path=/update params={wt=javabin&version=2}{add=[20 (1588392715365646336)]} 0 0
   [junit4]   2> 1017131 INFO  (qtp4277545-13903) [    x:collection1] o.a.s.u.p.LogUpdateProcessorFactory [collection1]  webapp= path=/update params={wt=javabin&version=2}{add=[20 (1588392715366694912)]} 0 0
   [junit4]   2> 1017131 INFO  (qtp31870468-13866) [    x:collection1] o.a.s.u.p.LogUpdateProcessorFactory [collection1]  webapp= path=/update params={wt=javabin&version=2}{add=[21 (1588392715367743488)]} 0 0
   [junit4]   2> 1017132 INFO  (qtp22807580-13927) [    x:collection1] o.a.s.u.p.LogUpdateProcessorFactory [collection1]  webapp= path=/update params={wt=javabin&version=2}{add=[21 (1588392715368792064)]} 0 0
   [junit4]   2> 1017133 INFO  (qtp31870468-13869) [    x:collection1] o.a.s.u.p.LogUpdateProcessorFactory [collection1]  webapp= path=/update params={wt=javabin&version=2}{add=[22 (1588392715369840640)]} 0 0
   [junit4]   2> 1017134 INFO  (qtp19051254-13892) [    x:collection1] o.a.s.u.p.LogUpdateProcessorFactory [collection1]  webapp= path=/update params={wt=javabin&version=2}{add=[22 (1588392715370889216)]} 0 0
   [junit4]   2> 1017135 INFO  (qtp31870468-13870) [    x:collection1] o.a.s.u.p.LogUpdateProcessorFactory [collection1]  webapp= path=/update params={wt=javabin&version=2}{add=[23 (1588392715371937792)]} 0 0
   [junit4]   2> 1017136 INFO  (qtp4277545-13912) [    x:collection1] o.a.s.u.p.LogUpdateProcessorFactory [collection1]  webapp= path=/update params={wt=javabin&version=2}{add=[23 (1588392715372986368)]} 0 0
   [junit4]   2> 1017137 INFO  (qtp31870468-13872) [    x:collection1] o.a.s.u.p.LogUpdateProcessorFactory [collection1]  webapp= path=/update params={wt=javabin&version=2}{add=[24 (1588392715374034944)]} 0 0
   [junit4]   2> 1017137 INFO  (qtp22807580-13926) [    x:collection1] o.a.s.u.p.LogUpdateProcessorFactory [collection1]  webapp= path=/update params={wt=javabin&version=2}{add=[24 (1588392715374034944)]} 0 0
   [junit4]   2> 1017138 INFO  (qtp31870468-13872) [    x:collection1] o.a.s.u.p.LogUpdateProcessorFactory [collection1]  webapp= path=/update params={wt=javabin&version=2}{add=[25 (1588392715375083520)]} 0 0
   [junit4]   2> 1017139 INFO  (qtp19051254-13890) [    x:collection1] o.a.s.u.p.LogUpdateProcessorFactory [collection1]  webapp= path=/update params={wt=javabin&version=2}{add=[25 (1588392715375083520)]} 0 0
   [junit4]   2> 1017139 INFO  (qtp31870468-13872) [    x:collection1] o.a.s.u.DirectUpdateHandler2 start commit{_version_=1588392715376132096,optimize=false,openSearcher=true,waitSearcher=true,expungeDeletes=false,softCommit=false,prepareCommit=false}
   [junit4]   2> 1017139 INFO  (qtp31870468-13872) [    x:collection1] o.a.s.u.SolrIndexWriter Calling setCommitData with IW:org.apache.solr.update.SolrIndexWriter@16b4302 commitCommandVersion:1588392715376132096
   [junit4]   2> 1017163 INFO  (qtp31870468-13872) [    x:collection1] o.a.s.s.SolrIndexSearcher Opening [Searcher@155b20d[collection1] main]
   [junit4]   2> 1017167 INFO  (searcherExecutor-4197-thread-1-processing-x:collection1) [    x:collection1] o.a.s.c.SolrCore [collection1] Registered new searcher Searcher@155b20d[collection1] main{ExitableDirectoryReader(UninvertingDirectoryReader(Uninverting(_0(7.3.0):C24)))}
   [junit4]   2> 1017168 INFO  (qtp31870468-13872) [    x:collection1] o.a.s.u.DirectUpdateHandler2 end_commit_flush
   [junit4]   2> 1017169 INFO  (qtp31870468-13872) [    x:collection1] o.a.s.u.p.LogUpdateProcessorFactory [collection1]  webapp= path=/update params={waitSearcher=true&commit=true&softCommit=false&wt=javabin&version=2}{commit=} 0 29
   [junit4]   2> 1017170 INFO  (qtp19051254-13890) [    x:collection1] o.a.s.u.DirectUpdateHandler2 start commit{_version_=1588392715408637952,optimize=false,openSearcher=true,waitSearcher=true,expungeDeletes=false,softCommit=false,prepareCommit=false}
   [junit4]   2> 1017170 INFO  (qtp19051254-13890) [    x:collection1] o.a.s.u.SolrIndexWriter Calling setCommitData with IW:org.apache.solr.update.SolrIndexWriter@5f810b commitCommandVersion:1588392715408637952
   [junit4]   2> 1017207 INFO  (qtp19051254-13890) [    x:collection1] o.a.s.s.SolrIndexSearcher Opening [Searcher@164c6d6[collection1] main]
   [junit4]   2> 1017216 INFO  (qtp19051254-13890) [    x:collection1] o.a.s.u.DirectUpdateHandler2 end_commit_flush
   [junit4]   2> 1017216 INFO  (searcherExecutor-4208-thread-1-processing-x:collection1) [    x:collection1] o.a.s.c.SolrCore [collection1] Registered new searcher Searcher@164c6d6[collection1] main{ExitableDirectoryReader(UninvertingDirectoryReader(Uninverting(_0(7.3.0):C9)))}
   [junit4]   2> 1017217 INFO  (qtp19051254-13890) [    x:collection1] o.a.s.u.p.LogUpdateProcessorFactory [collection1]  webapp= path=/update params={waitSearcher=true&commit=true&softCommit=false&wt=javabin&version=2}{commit=} 0 46
   [junit4]   2> 1017217 INFO  (qtp4277545-13912) [    x:collection1] o.a.s.u.DirectUpdateHandler2 start commit{_version_=1588392715457921024,optimize=false,openSearcher=true,waitSearcher=true,expungeDeletes=false,softCommit=false,prepareCommit=false}
   [junit4]   2> 1017217 INFO  (qtp4277545-13912) [    x:collection1] o.a.s.u.SolrIndexWriter Calling setCommitData with IW:org.apache.solr.update.SolrIndexWriter@1682c92 commitCommandVersion:1588392715457921024
   [junit4]   2> 1017222 INFO  (qtp4277545-13912) [    x:collection1] o.a.s.s.SolrIndexSearcher Opening [Searcher@71c097[collection1] main]
   [junit4]   2> 1017224 INFO  (qtp4277545-13912) [    x:collection1] o.a.s.u.DirectUpdateHandler2 end_commit_flush
   [junit4]   2> 1017225 INFO  (searcherExecutor-4219-thread-1-processing-x:collection1) [    x:collection1] o.a.s.c.SolrCore [collection1] Registered new searcher Searcher@71c097[collection1] main{ExitableDirectoryReader(UninvertingDirectoryReader(Uninverting(_0(7.3.0):C7)))}
   [junit4]   2> 1017225 INFO  (qtp4277545-13912) [    x:collection1] o.a.s.u.p.LogUpdateProcessorFactory [collection1]  webapp= path=/update params={waitSearcher=true&commit=true&softCommit=false&wt=javabin&version=2}{commit=} 0 8
   [junit4]   2> 1017226 INFO  (qtp22807580-13926) [    x:collection1] o.a.s.u.DirectUpdateHandler2 start commit{_version_=1588392715467358208,optimize=false,openSearcher=true,waitSearcher=true,expungeDeletes=false,softCommit=false,prepareCommit=false}
   [junit4]   2> 1017226 INFO  (qtp22807580-13926) [    x:collection1] o.a.s.u.SolrIndexWriter Calling setCommitData with IW:org.apache.solr.update.SolrIndexWriter@32a251 commitCommandVersion:1588392715467358208
   [junit4]   2> 1017231 INFO  (qtp22807580-13926) [    x:collection1] o.a.s.s.SolrIndexSearcher Opening [Searcher@1e96fe8[collection1] main]
   [junit4]   2> 1017232 INFO  (qtp22807580-13926) [    x:collection1] o.a.s.u.DirectUpdateHandler2 end_commit_flush
   [junit4]   2> 1017233 INFO  (searcherExecutor-4230-thread-1-processing-x:collection1) [    x:collection1] o.a.s.c.SolrCore [collection1] Registered new searcher Searcher@1e96fe8[collection1] main{ExitableDirectoryReader(UninvertingDirectoryReader(Uninverting(_0(7.3.0):C8)))}
   [junit4]   2> 1017233 INFO  (qtp22807580-13926) [    x:collection1] o.a.s.u.p.LogUpdateProcessorFactory [collection1]  webapp= path=/update params={waitSearcher=true&commit=true&softCommit=false&wt=javabin&version=2}{commit=} 0 7
   [junit4]   2> 1017239 INFO  (qtp31870468-13868) [    x:collection1] o.a.s.c.S.Request [collection1]  webapp= path=/select params={q=match_none&distrib=false&qt=mltrh&mlt=true&mlt.fl=lowerfilt&wt=javabin&version=2&shards.qt=mltrh} hits=0 status=0 QTime=4
   [junit4]   2> 1017257 INFO  (qtp22807580-13934) [    x:collection1] o.a.s.c.S.Request [collection1]  webapp= path=/select params={df=text&distrib=false&qt=mltrh&shards.purpose=32768&shard.url=https://127.0.0.1:60738//collection1&version=2&shards.qt=mltrh&q=match_none&mlt=false&NOW=1514809337122&mlt.fl=lowerfilt&isShard=true&wt=javabin} status=0 QTime=5
   [junit4]   2> 1017257 INFO  (qtp19051254-13894) [    x:collection1] o.a.s.c.S.Request [collection1]  webapp= path=/select params={df=text&distrib=false&qt=mltrh&shards.purpose=32768&shard.url=https://127.0.0.1:60726//collection1|[ff01::114]:33332/&version=2&shards.qt=mltrh&q=match_none&mlt=false&NOW=1514809337122&mlt.fl=lowerfilt&isShard=true&wt=javabin} status=0 QTime=6
   [junit4]   2> 1017262 INFO  (qtp4277545-13909) [    x:collection1] o.a.s.c.S.Request [collection1]  webapp= path=/select params={df=text&distrib=false&qt=mltrh&shards.purpose=32768&shard.url=[ff01::083]:33332/|https://127.0.0.1:60735//collection1|[ff01::213]:33332/&version=2&shards.qt=mltrh&q=match_none&mlt=false&NOW=1514809337122&mlt.fl=lowerfilt&isShard=true&wt=javabin} status=0 QTime=0
   [junit4]   2> 1017266 INFO  (qtp19051254-13885) [    x:collection1] o.a.s.c.S.Request [collection1]  webapp= path=/select params={df=text&distrib=false&qt=mltrh&fl=id&fl=score&shards.purpose=16388&start=0&fsv=true&shard.url=https://127.0.0.1:60726//collection1|[ff01::114]:33332/&rows=10&version=2&shards.qt=mltrh&q=match_none&mlt=true&NOW=1514809337122&mlt.fl=lowerfilt&isShard=true&wt=javabin} hits=0 status=0 QTime=0
   [junit4]   2> 1017266 INFO  (qtp4277545-13909) [    x:collection1] o.a.s.c.S.Request [collection1]  webapp= path=/select params={df=text&distrib=false&qt=mltrh&fl=id&fl=score&shards.purpose=16388&start=0&fsv=true&shard.url=[ff01::083]:33332/|https://127.0.0.1:60735//collection1|[ff01::213]:33332/&rows=10&version=2&shards.qt=mltrh&q=match_none&mlt=true&NOW=1514809337122&mlt.fl=lowerfilt&isShard=true&wt=javabin} hits=0 status=0 QTime=0
   [junit4]   2> 1017269 INFO  (qtp22807580-13929) [    x:collection1] o.a.s.c.S.Request [collection1]  webapp= path=/select params={df=text&distrib=false&qt=mltrh&fl=id&fl=score&shards.purpose=16388&start=0&fsv=true&shard.url=https://127.0.0.1:60738//collection1&rows=10&version=2&shards.qt=mltrh&q=match_none&mlt=true&NOW=1514809337122&mlt.fl=lowerfilt&isShard=true&wt=javabin} hits=0 status=0 QTime=0
   [junit4]   2> 1017270 INFO  (qtp19051254-13887) [    x:collection1] o.a.s.c.S.Request [collection1]  webapp= path=/select params={q=match_none&shards=https://127.0.0.1:60726//collection1|[ff01::114]:33332/,[ff01::083]:33332/|https://127.0.0.1:60735//collection1|[ff01::213]:33332/,https://127.0.0.1:60738//collection1&qt=mltrh&mlt=true&mlt.fl=lowerfilt&wt=javabin&version=2&shards.qt=mltrh} hits=0 status=0 QTime=30
   [junit4]   2> 1017272 INFO  (qtp31870468-13871) [    x:collection1] o.a.s.c.S.Request [collection1]  webapp= path=/select params={q=lowerfilt:sonata&distrib=false&qt=mltrh&mlt=true&mlt.fl=lowerfilt&wt=javabin&version=2&shards.qt=mltrh} hits=1 status=0 QTime=0
   [junit4]   2> 1017290 INFO  (qtp19051254-13890) [    x:collection1] o.a.s.c.S.Request [collection1]  webapp= path=/select params={df=text&distrib=false&qt=mltrh&shards.purpose=32768&shard.url=[ff01::083]:33332/|https://127.0.0.1:60726//collection1&version=2&shards.qt=mltrh&q=lowerfilt:sonata&mlt=false&NOW=1514809337154&mlt.fl=lowerfilt&isShard=true&wt=javabin} status=0 QTime=0
   [junit4]   2> 1017293 INFO  (qtp22807580-13927) [    x:collection1] o.a.s.c.S.Request [collection1]  webapp= path=/select params={df=text&distrib=false&qt=mltrh&shards.purpose=32768&shard.url=[ff01::083]:33332/|https://127.0.0.1:60738//collection1&version=2&shards.qt=mltrh&q=lowerfilt:sonata&mlt=false&NOW=1514809337154&mlt.fl=lowerfilt&isShard=true&wt=javabin} status=0 QTime=0
   [junit4]   2> 1017296 INFO  (qtp4277545-13914) [    x:collection1] o.a.s.c.S.Request [collection1]  webapp= path=/select params={df=text&distrib=false&qt=mltrh&shards.purpose=32768&shard.url=[ff01::083]:33332/|[ff01::114]:33332/|https://127.0.0.1:60735//collection1&version=2&shards.qt=mltrh&q=lowerfilt:sonata&mlt=false&NOW=1514809337154&mlt.fl=lowerfilt&isShard=true&wt=javabin} status=0 QTime=3
   [junit4]   2> 1017300 INFO  (qtp19051254-13888) [    x:collection1] o.a.s.c.S.Request [collection1]  webapp= path=/select params={df=text&distrib=false&qt=mltrh&fl=id&fl=score&shards.purpose=16388&start=0&fsv=true&org.apache.solr.stats.termStats=lowerfilt:sonata,1,1&shard.url=[ff01::083]:33332/|https://127.0.0.1:60726//collection1&rows=10&version=2&org.apache.solr.stats.colStats=lowerfilt,24,24,177,151&shards.qt=mltrh&q=lowerfilt:sonata&mlt=true&NOW=1514809337154&mlt.fl=lowerfilt&isShard=true&org.apache.solr.stats.terms=lowerfilt:sonata&wt=javabin} hits=0 status=0 QTime=0
   [junit4]   2> 1017302 INFO  (qtp4277545-13914) [    x:collection1] o.a.s.c.S.Request [collection1]  webapp= path=/select params={df=text&distrib=false&qt=mltrh&fl=id&fl=score&shards.purpose=16388&start=0&fsv=true&org.apache.solr.stats.termStats=lowerfilt:sonata,1,1&shard.url=[ff01::083]:33332/|[ff01::114]:33332/|https://127.0.0.1:60735//collection1&rows=10&version=2&org.apache.solr.stats.colStats=lowerfilt,24,24,177,151&shards.qt=mltrh&q=lowerfilt:sonata&mlt=true&NOW=1514809337154&mlt.fl=lowerfilt&isShard=true&org.apache.solr.stats.terms=lowerfilt:sonata&wt=javabin} hits=1 status=0 QTime=0
   [junit4]   2> 1017303 INFO  (qtp22807580-13927) [    x:collection1] o.a.s.c.S.Request [collection1]  webapp= path=/select params={df=text&distrib=false&qt=mltrh&fl=id&fl=score&shards.purpose=16388&start=0&fsv=true&org.apache.solr.stats.termStats=lowerfilt:sonata,1,1&shard.url=[ff01::083]:33332/|https://127.0.0.1:60738//collection1&rows=10&version=2&org.apache.solr.stats.colStats=lowerfilt,24,24,177,151&shards.qt=mltrh&q=lowerfilt:sonata&mlt=true&NOW=1514809337154&mlt.fl=lowerfilt&isShard=true&org.apache.solr.stats.terms=lowerfilt:sonata&wt=javabin} hits=0 status=0 QTime=0
   [junit4]   2> 1017304 INFO  (qtp4277545-13914) [    x:collection1] o.a.s.c.S.Request [collection1]  webapp= path=/select params={df=text&distrib=false&qt=mltrh&shards.purpose=64&shard.url=[ff01::083]:33332/|[ff01::114]:33332/|https://127.0.0.1:60735//collection1&version=2&shards.qt=mltrh&q=lowerfilt:sonata&mlt=false&NOW=1514809337154&mlt.fl=lowerfilt&ids=8&isShard=true&wt=javabin} status=0 QTime=0
   [junit4]   2> 1017305 INFO  (qtp22807580-13930) [    x:collection1] o.a.s.c.S.Request [collection1]  webapp= path=/select params={q=lowerfilt:sonata&shards=[ff01::083]:33332/|https://127.0.0.1:60726//collection1,[ff01::083]:33332/|[ff01::114]:33332/|https://127.0.0.1:60735//collection1,[ff01::083]:33332/|https://127.0.0.1:60738//collection1&qt=mltrh&mlt=true&mlt.fl=lowerfilt&wt=javabin&version=2&shards.qt=mltrh} hits=1 status=0 QTime=32
   [junit4]   2> 1017306 INFO  (qtp31870468-13871) [    x:collection1] o.a.s.c.S.Request [collection1]  webapp= path=/select params={distrib=false&qt=mltrh&fl=id&sort=id_i1+desc&mlt.count=20&version=2&mlt.mintf=2&shards.qt=mltrh&q=lowerfilt:moon&mlt=true&mlt.fl=lowerfilt&wt=javabin&mlt.mindf=1} hits=2 status=0 QTime=0
   [junit4]   2> 1017309 INFO  (qtp19051254-13888) [    x:collection1] o.a.s.c.S.Request [collection1]  webapp= path=/select params={df=text&distrib=false&qt=mltrh&fl=id&shards.purpose=68&start=0&fsv=true&sort=id_i1+desc&shard.url=https://127.0.0.1:60726//collection1&rows=10&mlt.count=20&version=2&mlt.mintf=2&shards.qt=mltrh&q=lowerfilt:moon&mlt=true&NOW=1514809337189&mlt.fl=lowerfilt&isShard=true&wt=javabin&mlt.mindf=1} hits=1 status=0 QTime=0
   [junit4]   2> 1017310 INFO  (qtp4277545-13914) [    x:collection1] o.a.s.c.S.Request [collection1]  webapp= path=/select params={df=text&distrib=false&qt=mltrh&fl=id&shards.purpose=68&start=0&fsv=true&sort=id_i1+desc&shard.url=https://127.0.0.1:60735//collection1|[ff01::083]:33332/|[ff01::114]:33332/|[ff01::213]:33332/&rows=10&mlt.count=20&version=2&mlt.mintf=2&shards.qt=mltrh&q=lowerfilt:moon&mlt=true&NOW=1514809337189&mlt.fl=lowerfilt&isShard=true&wt=javabin&mlt.mindf=1} hits=1 status=0 QTime=0
   [junit4]   2> 1017311 INFO  (qtp22807580-13926) [    x:collection1] o.a.s.c.S.Request [collection1]  webapp= path=/select params={df=text&distrib=false&qt=mltrh&fl=id&shards.purpose=68&start=0&fsv=true&sort=id_i1+desc&shard.url=[ff01::213]:33332/|[ff01::083]:33332/|https://127.0.0.1:60738//collection1|[ff01::114]:33332/&rows=10&mlt.count=20&version=2&mlt.mintf=2&shards.qt=mltrh&q=lowerfilt:moon&mlt=true&NOW=1514809337189&mlt.fl=lowerfilt&isShard=true&wt=javabin&mlt.mindf=1} hits=0 status=0 QTime=0
   [junit4]   2> 1017313 INFO  (qtp19051254-13888) [    x:collection1] o.a.s.c.S.Request [collection1]  webapp= path=/select params={df=text&distrib=false&qt=mltrh&fl=score,id&shards.purpose=4097&start=0&sort=score+desc&shard.url=https://127.0.0.1:60726//collection1&rows=20&mlt.count=20&version=2&mlt.mintf=2&shards.qt=mltrh&mlt.dist.id=7&q=%2B(lowerfilt:the+lowerfilt:and+lowerfilt:moon)+-id:7&mlt=true&NOW=1514809337189&mlt.fl=lowerfilt&isShard=true&wt=javabin&mlt.mindf=1} hits=4 status=0 QTime=0
   [junit4]   2> 1017313 INFO  (qtp4277545-13914) [    x:collection1] o.a.s.c.S.Request [collection1]  webapp= path=/select params={df=text&distrib=false&qt=mltrh&fl=score,id&shards.purpose=4097&start=0&sort=score+desc&shard.url=https://127.0.0.1:60735//collection1|[ff01::083]:33332/|[ff01::114]:33332/|[ff01::213]:33332/&rows=20&mlt.count=20&version=2&mlt.mintf=2&shards.qt=mltrh&mlt.dist.id=7&q=%2B(lowerfilt:the+lowerfilt:and+lowerfilt:moon)+-id:7&mlt=true&NOW=1514809337189&mlt.fl=lowerfilt&isShard=true&wt=javabin&mlt.mindf=1} hits=4 status=0 QTime=1
   [junit4]   2> 1017330 INFO  (qtp22807580-13926) [    x:collection1] o.a.s.c.S.Request [collection1]  webapp= path=/select params={df=text&distrib=false&qt=mltrh&fl=score,id&shards.purpose=4097&start=0&sort=score+desc&shard.url=[ff01::213]:33332/|[ff01::083]:33332/|https://127.0.0.1:60738//collection1|[ff01::114]:33332/&rows=20&mlt.count=20&version=2&mlt.mintf=2&shards.qt=mltrh&mlt.dist.id=7&q=%2B(lowerfilt:the+lowerfilt:and+lowerfilt:moon)+-id:7&mlt=true&NOW=1514809337189&mlt.fl=lowerfilt&isShard=true&wt=javabin&mlt.mindf=1} hits=5 status=0 QTime=11
   [junit4]   2> 1017340 INFO  (qtp4277545-13914) [    x:collection1] o.a.s.c.S.Request [collection1]  webapp= path=/select params={df=text&distrib=false&qt=mltrh&fl=score,id&shards.purpose=4097&start=0&sort=score+desc&shard.url=https://127.0.0.1:60735//collection1|[ff01::083]:33332/|[ff01::114]:33332/|[ff01::213]:33332/&rows=20&mlt.count=20&version=2&mlt.mintf=2&shards.qt=mltrh&mlt.dist.id=17&q=%2B(lowerfilt:the+lowerfilt:moon.+lowerfilt:and+lowerfilt:foxes+lowerfilt:moon)+-id:17&mlt=true&NOW=1514809337189&mlt.fl=lowerfilt&isShard=true&wt=javabin&mlt.mindf=1} hits=3 status=0 QTime=0
   [junit4]   2> 1017343 INFO  (qtp19051254-13888) [    x:collection1] o.a.s.c.S.Request [collection1]  webapp= path=/select params={df=text&distrib=false&qt=mltrh&fl=score,id&shards.purpose=4097&start=0&sort=score+desc&shard.url=https://127.0.0.1:60726//collection1&rows=20&mlt.count=20&version=2&mlt.mintf=2&shards.qt=mltrh&mlt.dist.id=17&q=%2B(lowerfilt:the+lowerfilt:moon.+lowerfilt:and+lowerfilt:foxes+lowerfilt:moon)+-id:17&mlt=true&NOW=1514809337189&mlt.fl=lowerfilt&isShard=true&wt=javabin&mlt.mindf=1} hits=5 status=0 QTime=0
   [junit4]   2> 1017343 INFO  (qtp22807580-13923) [    x:collection1] o.a.s.c.S.Request [collection1]  webapp= path=/select params=

[...truncated too long message...]

aluatorTest, SolrZkClientTest, FieldValueEvaluatorTest, SolrExampleBinaryTest, LargeVolumeJettyTest, JDBCStreamTest, NormalizeEvaluatorTest, ClientUtilsTest, TangentEvaluatorTest, EqualToEvaluatorTest, SolrSchemalessExampleTest, ModuloEvaluatorTest, SolrQueryTest, SquareRootEvaluatorTest, FacetFieldTest, AnlysisResponseBaseTest, CloudSolrClientCacheTest, LBHttpSolrClientBuilderTest, RegressionEvaluatorTest, SolrParamTest, BasicHttpSolrClientTest, SolrExampleStreamingBinaryTest, MergeIndexesEmbeddedTest, DivideEvaluatorTest, TestFastInputStream, TestSuggesterResponse, ConcurrentUpdateSolrClientTest, GraphExpressionTest, SolrPingTest, UniformDistributionEvaluatorTest, TestClusteringResponse, SolrExampleEmbeddedTest, TestSpellCheckResponse, QueryResponseTest, TestCoreAdmin, CloudSolrClientTest, StreamExpressionToExplanationTest, AbsoluteValueEvaluatorTest, AndEvaluatorTest, AppendEvaluatorTest, ArcCosineEvaluatorTest, ArcSineEvaluatorTest, ArcTangentEvaluatorTest, ArrayEvaluatorTest, AscEvaluatorTest, CeilingEvaluatorTest, CoalesceEvaluatorTest, CorrelationEvaluatorTest, CosineEvaluatorTest, CubedRootEvaluatorTest, CumulativeProbabilityEvaluatorTest, EmpiricalDistributionEvaluatorTest, FloorEvaluatorTest, HyperbolicCosineEvaluatorTest, HyperbolicTangentEvaluatorTest, LengthEvaluatorTest, LessThanEqualToEvaluatorTest, NotEvaluatorTest, RawValueEvaluatorTest, RoundEvaluatorTest, SubtractEvaluatorTest, StreamExpressionParserTest, OperationsTest, SchemaTest, TestCollectionAdminRequest, TestConfigSetAdminRequest, TestDelegationTokenRequest, TestV2Request, NoOpResponseParserTest]
   [junit4]   2> NOTE: reproduce with: ant test  -Dtestcase=NoOpResponseParserTest -Dtests.seed=40A866D1233695A4 -Dtests.slow=true -Dtests.locale=zh-CN -Dtests.timezone=Asia/Vladivostok -Dtests.asserts=true -Dtests.file.encoding=ISO-8859-1
   [junit4] ERROR   0.00s J1 | NoOpResponseParserTest (suite) <<<
   [junit4]    > Throwable #1: java.io.IOException: Could not remove the following files (in the order of attempts):
   [junit4]    >    C:\Users\jenkins\workspace\Lucene-Solr-7.x-Windows\solr\build\solr-solrj\test\J1\temp\solr.client.solrj.response.NoOpResponseParserTest_40A866D1233695A4-001\tempDir-001\collection1\conf: java.nio.file.DirectoryNotEmptyException: C:\Users\jenkins\workspace\Lucene-Solr-7.x-Windows\solr\build\solr-solrj\test\J1\temp\solr.client.solrj.response.NoOpResponseParserTest_40A866D1233695A4-001\tempDir-001\collection1\conf
   [junit4]    >    C:\Users\jenkins\workspace\Lucene-Solr-7.x-Windows\solr\build\solr-solrj\test\J1\temp\solr.client.solrj.response.NoOpResponseParserTest_40A866D1233695A4-001\tempDir-001\collection1: java.nio.file.DirectoryNotEmptyException: C:\Users\jenkins\workspace\Lucene-Solr-7.x-Windows\solr\build\solr-solrj\test\J1\temp\solr.client.solrj.response.NoOpResponseParserTest_40A866D1233695A4-001\tempDir-001\collection1
   [junit4]    >    C:\Users\jenkins\workspace\Lucene-Solr-7.x-Windows\solr\build\solr-solrj\test\J1\temp\solr.client.solrj.response.NoOpResponseParserTest_40A866D1233695A4-001\tempDir-001: java.nio.file.DirectoryNotEmptyException: C:\Users\jenkins\workspace\Lucene-Solr-7.x-Windows\solr\build\solr-solrj\test\J1\temp\solr.client.solrj.response.NoOpResponseParserTest_40A866D1233695A4-001\tempDir-001
   [junit4]    >    C:\Users\jenkins\workspace\Lucene-Solr-7.x-Windows\solr\build\solr-solrj\test\J1\temp\solr.client.solrj.response.NoOpResponseParserTest_40A866D1233695A4-001\tempDir-001\collection1\conf\xslt: java.nio.file.AccessDeniedException: C:\Users\jenkins\workspace\Lucene-Solr-7.x-Windows\solr\build\solr-solrj\test\J1\temp\solr.client.solrj.response.NoOpResponseParserTest_40A866D1233695A4-001\tempDir-001\collection1\conf\xslt
   [junit4]    >    C:\Users\jenkins\workspace\Lucene-Solr-7.x-Windows\solr\build\solr-solrj\test\J1\temp\solr.client.solrj.response.NoOpResponseParserTest_40A866D1233695A4-001: java.nio.file.DirectoryNotEmptyException: C:\Users\jenkins\workspace\Lucene-Solr-7.x-Windows\solr\build\solr-solrj\test\J1\temp\solr.client.solrj.response.NoOpResponseParserTest_40A866D1233695A4-001
   [junit4]    > 	at __randomizedtesting.SeedInfo.seed([40A866D1233695A4]:0)
   [junit4]    > 	at org.apache.lucene.util.IOUtils.rm(IOUtils.java:329)
   [junit4]    > 	at java.lang.Thread.run(Thread.java:748)
   [junit4] Completed [137/146 (1!)] on J1 in 2.59s, 3 tests, 1 error <<< FAILURES!

[...truncated 1500 lines...]
   [junit4] Suite: org.apache.solr.update.processor.TestOpenNLPExtractNamedEntitiesUpdateProcessorFactory
   [junit4]   2> Creating dataDir: C:\Users\jenkins\workspace\Lucene-Solr-7.x-Windows\solr\build\contrib\solr-analysis-extras\test\J1\temp\solr.update.processor.TestOpenNLPExtractNamedEntitiesUpdateProcessorFactory_89B597106A62D6B0-001\init-core-data-001
   [junit4]   2> log4j:WARN No appenders could be found for logger (org.apache.solr.SolrTestCaseJ4).
   [junit4]   2> log4j:WARN Please initialize the log4j system properly.
   [junit4]   2> log4j:WARN See http://logging.apache.org/log4j/1.2/faq.html#noconfig for more info.
   [junit4]   2> NOTE: test params are: codec=Asserting(Lucene70): {}, docValues:{}, maxPointsInLeafNode=1505, maxMBSortInHeap=6.347342960234055, sim=RandomSimilarity(queryNorm=false): {}, locale=id-ID, timezone=Iran
   [junit4]   2> NOTE: Windows 10 10.0 x86/Oracle Corporation 1.8.0_144 (32-bit)/cpus=3,threads=1,free=35048280,total=67108864
   [junit4]   2> NOTE: All tests run in this JVM: [TestOpenNLPExtractNamedEntitiesUpdateProcessorFactory]
   [junit4]   2> NOTE: reproduce with: ant test  -Dtestcase=TestOpenNLPExtractNamedEntitiesUpdateProcessorFactory -Dtests.seed=89B597106A62D6B0 -Dtests.slow=true -Dtests.locale=id-ID -Dtests.timezone=Iran -Dtests.asserts=true -Dtests.file.encoding=Cp1252
   [junit4] ERROR   0.00s J1 | TestOpenNLPExtractNamedEntitiesUpdateProcessorFactory (suite) <<<
   [junit4]    > Throwable #1: java.io.IOException: Could not remove the following files (in the order of attempts):
   [junit4]    >    C:\Users\jenkins\workspace\Lucene-Solr-7.x-Windows\solr\build\contrib\solr-analysis-extras\test\J1\temp\solr.update.processor.TestOpenNLPExtractNamedEntitiesUpdateProcessorFactory_89B597106A62D6B0-001\tempDir-001\collection1\conf: java.nio.file.DirectoryNotEmptyException: C:\Users\jenkins\workspace\Lucene-Solr-7.x-Windows\solr\build\contrib\solr-analysis-extras\test\J1\temp\solr.update.processor.TestOpenNLPExtractNamedEntitiesUpdateProcessorFactory_89B597106A62D6B0-001\tempDir-001\collection1\conf
   [junit4]    >    C:\Users\jenkins\workspace\Lucene-Solr-7.x-Windows\solr\build\contrib\solr-analysis-extras\test\J1\temp\solr.update.processor.TestOpenNLPExtractNamedEntitiesUpdateProcessorFactory_89B597106A62D6B0-001\tempDir-001\collection1: java.nio.file.DirectoryNotEmptyException: C:\Users\jenkins\workspace\Lucene-Solr-7.x-Windows\solr\build\contrib\solr-analysis-extras\test\J1\temp\solr.update.processor.TestOpenNLPExtractNamedEntitiesUpdateProcessorFactory_89B597106A62D6B0-001\tempDir-001\collection1
   [junit4]    >    C:\Users\jenkins\workspace\Lucene-Solr-7.x-Windows\solr\build\contrib\solr-analysis-extras\test\J1\temp\solr.update.processor.TestOpenNLPExtractNamedEntitiesUpdateProcessorFactory_89B597106A62D6B0-001\tempDir-001: java.nio.file.DirectoryNotEmptyException: C:\Users\jenkins\workspace\Lucene-Solr-7.x-Windows\solr\build\contrib\solr-analysis-extras\test\J1\temp\solr.update.processor.TestOpenNLPExtractNamedEntitiesUpdateProcessorFactory_89B597106A62D6B0-001\tempDir-001
   [junit4]    >    C:\Users\jenkins\workspace\Lucene-Solr-7.x-Windows\solr\build\contrib\solr-analysis-extras\test\J1\temp\solr.update.processor.TestOpenNLPExtractNamedEntitiesUpdateProcessorFactory_89B597106A62D6B0-001\tempDir-001\collection1\conf\en-test-tokenizer.bin: java.nio.file.AccessDeniedException: C:\Users\jenkins\workspace\Lucene-Solr-7.x-Windows\solr\build\contrib\solr-analysis-extras\test\J1\temp\solr.update.processor.TestOpenNLPExtractNamedEntitiesUpdateProcessorFactory_89B597106A62D6B0-001\tempDir-001\collection1\conf\en-test-tokenizer.bin
   [junit4]    >    C:\Users\jenkins\workspace\Lucene-Solr-7.x-Windows\solr\build\contrib\solr-analysis-extras\test\J1\temp\solr.update.processor.TestOpenNLPExtractNamedEntitiesUpdateProcessorFactory_89B597106A62D6B0-001\tempDir-001\collection1\conf\en-test-ner-person.bin: java.nio.file.AccessDeniedException: C:\Users\jenkins\workspace\Lucene-Solr-7.x-Windows\solr\build\contrib\solr-analysis-extras\test\J1\temp\solr.update.processor.TestOpenNLPExtractNamedEntitiesUpdateProcessorFactory_89B597106A62D6B0-001\tempDir-001\collection1\conf\en-test-ner-person.bin
   [junit4]    >    C:\Users\jenkins\workspace\Lucene-Solr-7.x-Windows\solr\build\contrib\solr-analysis-extras\test\J1\temp\solr.update.processor.TestOpenNLPExtractNamedEntitiesUpdateProcessorFactory_89B597106A62D6B0-001\tempDir-001\collection1\conf\en-test-sent.bin: java.nio.file.AccessDeniedException: C:\Users\jenkins\workspace\Lucene-Solr-7.x-Windows\solr\build\contrib\solr-analysis-extras\test\J1\temp\solr.update.processor.TestOpenNLPExtractNamedEntitiesUpdateProcessorFactory_89B597106A62D6B0-001\tempDir-001\collection1\conf\en-test-sent.bin
   [junit4]    >    C:\Users\jenkins\workspace\Lucene-Solr-7.x-Windows\solr\build\contrib\solr-analysis-extras\test\J1\temp\solr.update.processor.TestOpenNLPExtractNamedEntitiesUpdateProcessorFactory_89B597106A62D6B0-001: java.nio.file.DirectoryNotEmptyException: C:\Users\jenkins\workspace\Lucene-Solr-7.x-Windows\solr\build\contrib\solr-analysis-extras\test\J1\temp\solr.update.processor.TestOpenNLPExtractNamedEntitiesUpdateProcessorFactory_89B597106A62D6B0-001
   [junit4]    > 	at __randomizedtesting.SeedInfo.seed([89B597106A62D6B0]:0)
   [junit4]    > 	at org.apache.lucene.util.IOUtils.rm(IOUtils.java:329)
   [junit4]    > 	at java.lang.Thread.run(Thread.java:748)
   [junit4] Completed [1/5 (1!)] on J1 in 14.12s, 8 tests, 1 error <<< FAILURES!

[...truncated 41513 lines...]

Mime
View raw message