lucene-dev mailing list archives

Site index · List index
Message view « Date » · « Thread »
Top « Date » · « Thread »
From Policeman Jenkins Server <jenk...@thetaphi.de>
Subject [JENKINS] Lucene-Solr-7.x-Windows (32bit/jdk1.8.0_144) - Build # 403 - Still Unstable!
Date Tue, 16 Jan 2018 02:01:37 GMT
Build: https://jenkins.thetaphi.de/job/Lucene-Solr-7.x-Windows/403/
Java: 32bit/jdk1.8.0_144 -server -XX:+UseG1GC

6 tests failed.
FAILED:  junit.framework.TestSuite.org.apache.lucene.store.TestRAFDirectory

Error Message:
Could not remove the following files (in the order of attempts):    C:\Users\jenkins\workspace\Lucene-Solr-7.x-Windows\lucene\build\misc\test\J1\temp\lucene.store.TestRAFDirectory_36061B5464419403-001\tempDir-002: java.nio.file.AccessDeniedException: C:\Users\jenkins\workspace\Lucene-Solr-7.x-Windows\lucene\build\misc\test\J1\temp\lucene.store.TestRAFDirectory_36061B5464419403-001\tempDir-002    C:\Users\jenkins\workspace\Lucene-Solr-7.x-Windows\lucene\build\misc\test\J1\temp\lucene.store.TestRAFDirectory_36061B5464419403-001: java.nio.file.DirectoryNotEmptyException: C:\Users\jenkins\workspace\Lucene-Solr-7.x-Windows\lucene\build\misc\test\J1\temp\lucene.store.TestRAFDirectory_36061B5464419403-001 

Stack Trace:
java.io.IOException: Could not remove the following files (in the order of attempts):
   C:\Users\jenkins\workspace\Lucene-Solr-7.x-Windows\lucene\build\misc\test\J1\temp\lucene.store.TestRAFDirectory_36061B5464419403-001\tempDir-002: java.nio.file.AccessDeniedException: C:\Users\jenkins\workspace\Lucene-Solr-7.x-Windows\lucene\build\misc\test\J1\temp\lucene.store.TestRAFDirectory_36061B5464419403-001\tempDir-002
   C:\Users\jenkins\workspace\Lucene-Solr-7.x-Windows\lucene\build\misc\test\J1\temp\lucene.store.TestRAFDirectory_36061B5464419403-001: java.nio.file.DirectoryNotEmptyException: C:\Users\jenkins\workspace\Lucene-Solr-7.x-Windows\lucene\build\misc\test\J1\temp\lucene.store.TestRAFDirectory_36061B5464419403-001

	at __randomizedtesting.SeedInfo.seed([36061B5464419403]:0)
	at org.apache.lucene.util.IOUtils.rm(IOUtils.java:329)
	at org.apache.lucene.util.TestRuleTemporaryFilesCleanup.afterAlways(TestRuleTemporaryFilesCleanup.java:216)
	at com.carrotsearch.randomizedtesting.rules.TestRuleAdapter$1.afterAlways(TestRuleAdapter.java:31)
	at com.carrotsearch.randomizedtesting.rules.StatementAdapter.evaluate(StatementAdapter.java:43)
	at com.carrotsearch.randomizedtesting.rules.StatementAdapter.evaluate(StatementAdapter.java:36)
	at org.apache.lucene.util.TestRuleAssertionsRequired$1.evaluate(TestRuleAssertionsRequired.java:53)
	at org.apache.lucene.util.TestRuleMarkFailure$1.evaluate(TestRuleMarkFailure.java:47)
	at org.apache.lucene.util.TestRuleIgnoreAfterMaxFailures$1.evaluate(TestRuleIgnoreAfterMaxFailures.java:64)
	at org.apache.lucene.util.TestRuleIgnoreTestSuites$1.evaluate(TestRuleIgnoreTestSuites.java:54)
	at com.carrotsearch.randomizedtesting.rules.StatementAdapter.evaluate(StatementAdapter.java:36)
	at com.carrotsearch.randomizedtesting.ThreadLeakControl$StatementRunner.run(ThreadLeakControl.java:368)
	at java.lang.Thread.run(Thread.java:748)


FAILED:  junit.framework.TestSuite.org.apache.lucene.search.suggest.analyzing.BlendedInfixSuggesterTest

Error Message:
Could not remove the following files (in the order of attempts):    C:\Users\jenkins\workspace\Lucene-Solr-7.x-Windows\lucene\build\suggest\test\J1\temp\lucene.search.suggest.analyzing.BlendedInfixSuggesterTest_16B71EB4EBD47F7C-001\BlendedInfixSuggesterTest-005: java.nio.file.AccessDeniedException: C:\Users\jenkins\workspace\Lucene-Solr-7.x-Windows\lucene\build\suggest\test\J1\temp\lucene.search.suggest.analyzing.BlendedInfixSuggesterTest_16B71EB4EBD47F7C-001\BlendedInfixSuggesterTest-005    C:\Users\jenkins\workspace\Lucene-Solr-7.x-Windows\lucene\build\suggest\test\J1\temp\lucene.search.suggest.analyzing.BlendedInfixSuggesterTest_16B71EB4EBD47F7C-001: java.nio.file.DirectoryNotEmptyException: C:\Users\jenkins\workspace\Lucene-Solr-7.x-Windows\lucene\build\suggest\test\J1\temp\lucene.search.suggest.analyzing.BlendedInfixSuggesterTest_16B71EB4EBD47F7C-001 

Stack Trace:
java.io.IOException: Could not remove the following files (in the order of attempts):
   C:\Users\jenkins\workspace\Lucene-Solr-7.x-Windows\lucene\build\suggest\test\J1\temp\lucene.search.suggest.analyzing.BlendedInfixSuggesterTest_16B71EB4EBD47F7C-001\BlendedInfixSuggesterTest-005: java.nio.file.AccessDeniedException: C:\Users\jenkins\workspace\Lucene-Solr-7.x-Windows\lucene\build\suggest\test\J1\temp\lucene.search.suggest.analyzing.BlendedInfixSuggesterTest_16B71EB4EBD47F7C-001\BlendedInfixSuggesterTest-005
   C:\Users\jenkins\workspace\Lucene-Solr-7.x-Windows\lucene\build\suggest\test\J1\temp\lucene.search.suggest.analyzing.BlendedInfixSuggesterTest_16B71EB4EBD47F7C-001: java.nio.file.DirectoryNotEmptyException: C:\Users\jenkins\workspace\Lucene-Solr-7.x-Windows\lucene\build\suggest\test\J1\temp\lucene.search.suggest.analyzing.BlendedInfixSuggesterTest_16B71EB4EBD47F7C-001

	at __randomizedtesting.SeedInfo.seed([16B71EB4EBD47F7C]:0)
	at org.apache.lucene.util.IOUtils.rm(IOUtils.java:329)
	at org.apache.lucene.util.TestRuleTemporaryFilesCleanup.afterAlways(TestRuleTemporaryFilesCleanup.java:216)
	at com.carrotsearch.randomizedtesting.rules.TestRuleAdapter$1.afterAlways(TestRuleAdapter.java:31)
	at com.carrotsearch.randomizedtesting.rules.StatementAdapter.evaluate(StatementAdapter.java:43)
	at com.carrotsearch.randomizedtesting.rules.StatementAdapter.evaluate(StatementAdapter.java:36)
	at org.apache.lucene.util.TestRuleAssertionsRequired$1.evaluate(TestRuleAssertionsRequired.java:53)
	at org.apache.lucene.util.TestRuleMarkFailure$1.evaluate(TestRuleMarkFailure.java:47)
	at org.apache.lucene.util.TestRuleIgnoreAfterMaxFailures$1.evaluate(TestRuleIgnoreAfterMaxFailures.java:64)
	at org.apache.lucene.util.TestRuleIgnoreTestSuites$1.evaluate(TestRuleIgnoreTestSuites.java:54)
	at com.carrotsearch.randomizedtesting.rules.StatementAdapter.evaluate(StatementAdapter.java:36)
	at com.carrotsearch.randomizedtesting.ThreadLeakControl$StatementRunner.run(ThreadLeakControl.java:368)
	at java.lang.Thread.run(Thread.java:748)


FAILED:  junit.framework.TestSuite.org.apache.solr.AnalysisAfterCoreReloadTest

Error Message:
Could not remove the following files (in the order of attempts):    C:\Users\jenkins\workspace\Lucene-Solr-7.x-Windows\solr\build\solr-core\test\J1\temp\solr.AnalysisAfterCoreReloadTest_B73082041491C2BE-001\init-core-data-001: java.nio.file.DirectoryNotEmptyException: C:\Users\jenkins\workspace\Lucene-Solr-7.x-Windows\solr\build\solr-core\test\J1\temp\solr.AnalysisAfterCoreReloadTest_B73082041491C2BE-001\init-core-data-001 

Stack Trace:
java.io.IOException: Could not remove the following files (in the order of attempts):
   C:\Users\jenkins\workspace\Lucene-Solr-7.x-Windows\solr\build\solr-core\test\J1\temp\solr.AnalysisAfterCoreReloadTest_B73082041491C2BE-001\init-core-data-001: java.nio.file.DirectoryNotEmptyException: C:\Users\jenkins\workspace\Lucene-Solr-7.x-Windows\solr\build\solr-core\test\J1\temp\solr.AnalysisAfterCoreReloadTest_B73082041491C2BE-001\init-core-data-001

	at __randomizedtesting.SeedInfo.seed([B73082041491C2BE]:0)
	at org.apache.lucene.util.IOUtils.rm(IOUtils.java:329)
	at org.apache.lucene.util.TestRuleTemporaryFilesCleanup.afterAlways(TestRuleTemporaryFilesCleanup.java:216)
	at com.carrotsearch.randomizedtesting.rules.TestRuleAdapter$1.afterAlways(TestRuleAdapter.java:31)
	at com.carrotsearch.randomizedtesting.rules.StatementAdapter.evaluate(StatementAdapter.java:43)
	at com.carrotsearch.randomizedtesting.rules.StatementAdapter.evaluate(StatementAdapter.java:36)
	at org.apache.lucene.util.TestRuleAssertionsRequired$1.evaluate(TestRuleAssertionsRequired.java:53)
	at org.apache.lucene.util.TestRuleMarkFailure$1.evaluate(TestRuleMarkFailure.java:47)
	at org.apache.lucene.util.TestRuleIgnoreAfterMaxFailures$1.evaluate(TestRuleIgnoreAfterMaxFailures.java:64)
	at org.apache.lucene.util.TestRuleIgnoreTestSuites$1.evaluate(TestRuleIgnoreTestSuites.java:54)
	at com.carrotsearch.randomizedtesting.rules.StatementAdapter.evaluate(StatementAdapter.java:36)
	at com.carrotsearch.randomizedtesting.ThreadLeakControl$StatementRunner.run(ThreadLeakControl.java:368)
	at java.lang.Thread.run(Thread.java:748)


FAILED:  org.apache.solr.cloud.FullSolrCloudDistribCmdsTest.test

Error Message:
Could not find collection:collection2

Stack Trace:
java.lang.AssertionError: Could not find collection:collection2
	at __randomizedtesting.SeedInfo.seed([B73082041491C2BE:3F64BDDEBA6DAF46]:0)
	at org.junit.Assert.fail(Assert.java:93)
	at org.junit.Assert.assertTrue(Assert.java:43)
	at org.junit.Assert.assertNotNull(Assert.java:526)
	at org.apache.solr.cloud.AbstractDistribZkTestBase.waitForRecoveriesToFinish(AbstractDistribZkTestBase.java:155)
	at org.apache.solr.cloud.AbstractDistribZkTestBase.waitForRecoveriesToFinish(AbstractDistribZkTestBase.java:140)
	at org.apache.solr.cloud.AbstractDistribZkTestBase.waitForRecoveriesToFinish(AbstractDistribZkTestBase.java:135)
	at org.apache.solr.cloud.AbstractFullDistribZkTestBase.waitForRecoveriesToFinish(AbstractFullDistribZkTestBase.java:913)
	at org.apache.solr.cloud.FullSolrCloudDistribCmdsTest.testIndexingBatchPerRequestWithHttpSolrClient(FullSolrCloudDistribCmdsTest.java:612)
	at org.apache.solr.cloud.FullSolrCloudDistribCmdsTest.test(FullSolrCloudDistribCmdsTest.java:152)
	at sun.reflect.NativeMethodAccessorImpl.invoke0(Native Method)
	at sun.reflect.NativeMethodAccessorImpl.invoke(NativeMethodAccessorImpl.java:62)
	at sun.reflect.DelegatingMethodAccessorImpl.invoke(DelegatingMethodAccessorImpl.java:43)
	at java.lang.reflect.Method.invoke(Method.java:498)
	at com.carrotsearch.randomizedtesting.RandomizedRunner.invoke(RandomizedRunner.java:1737)
	at com.carrotsearch.randomizedtesting.RandomizedRunner$8.evaluate(RandomizedRunner.java:934)
	at com.carrotsearch.randomizedtesting.RandomizedRunner$9.evaluate(RandomizedRunner.java:970)
	at com.carrotsearch.randomizedtesting.RandomizedRunner$10.evaluate(RandomizedRunner.java:984)
	at org.apache.solr.BaseDistributedSearchTestCase$ShardsRepeatRule$ShardsFixedStatement.callStatement(BaseDistributedSearchTestCase.java:993)
	at org.apache.solr.BaseDistributedSearchTestCase$ShardsRepeatRule$ShardsStatement.evaluate(BaseDistributedSearchTestCase.java:968)
	at com.carrotsearch.randomizedtesting.rules.SystemPropertiesRestoreRule$1.evaluate(SystemPropertiesRestoreRule.java:57)
	at org.apache.lucene.util.TestRuleSetupTeardownChained$1.evaluate(TestRuleSetupTeardownChained.java:49)
	at org.apache.lucene.util.AbstractBeforeAfterRule$1.evaluate(AbstractBeforeAfterRule.java:45)
	at org.apache.lucene.util.TestRuleThreadAndTestName$1.evaluate(TestRuleThreadAndTestName.java:48)
	at org.apache.lucene.util.TestRuleIgnoreAfterMaxFailures$1.evaluate(TestRuleIgnoreAfterMaxFailures.java:64)
	at org.apache.lucene.util.TestRuleMarkFailure$1.evaluate(TestRuleMarkFailure.java:47)
	at com.carrotsearch.randomizedtesting.rules.StatementAdapter.evaluate(StatementAdapter.java:36)
	at com.carrotsearch.randomizedtesting.ThreadLeakControl$StatementRunner.run(ThreadLeakControl.java:368)
	at com.carrotsearch.randomizedtesting.ThreadLeakControl.forkTimeoutingTask(ThreadLeakControl.java:817)
	at com.carrotsearch.randomizedtesting.ThreadLeakControl$3.evaluate(ThreadLeakControl.java:468)
	at com.carrotsearch.randomizedtesting.RandomizedRunner.runSingleTest(RandomizedRunner.java:943)
	at com.carrotsearch.randomizedtesting.RandomizedRunner$5.evaluate(RandomizedRunner.java:829)
	at com.carrotsearch.randomizedtesting.RandomizedRunner$6.evaluate(RandomizedRunner.java:879)
	at com.carrotsearch.randomizedtesting.RandomizedRunner$7.evaluate(RandomizedRunner.java:890)
	at com.carrotsearch.randomizedtesting.rules.StatementAdapter.evaluate(StatementAdapter.java:36)
	at com.carrotsearch.randomizedtesting.rules.SystemPropertiesRestoreRule$1.evaluate(SystemPropertiesRestoreRule.java:57)
	at org.apache.lucene.util.AbstractBeforeAfterRule$1.evaluate(AbstractBeforeAfterRule.java:45)
	at com.carrotsearch.randomizedtesting.rules.StatementAdapter.evaluate(StatementAdapter.java:36)
	at org.apache.lucene.util.TestRuleStoreClassName$1.evaluate(TestRuleStoreClassName.java:41)
	at com.carrotsearch.randomizedtesting.rules.NoShadowingOrOverridesOnMethodsRule$1.evaluate(NoShadowingOrOverridesOnMethodsRule.java:40)
	at com.carrotsearch.randomizedtesting.rules.NoShadowingOrOverridesOnMethodsRule$1.evaluate(NoShadowingOrOverridesOnMethodsRule.java:40)
	at com.carrotsearch.randomizedtesting.rules.StatementAdapter.evaluate(StatementAdapter.java:36)
	at com.carrotsearch.randomizedtesting.rules.StatementAdapter.evaluate(StatementAdapter.java:36)
	at com.carrotsearch.randomizedtesting.rules.StatementAdapter.evaluate(StatementAdapter.java:36)
	at org.apache.lucene.util.TestRuleAssertionsRequired$1.evaluate(TestRuleAssertionsRequired.java:53)
	at org.apache.lucene.util.TestRuleMarkFailure$1.evaluate(TestRuleMarkFailure.java:47)
	at org.apache.lucene.util.TestRuleIgnoreAfterMaxFailures$1.evaluate(TestRuleIgnoreAfterMaxFailures.java:64)
	at org.apache.lucene.util.TestRuleIgnoreTestSuites$1.evaluate(TestRuleIgnoreTestSuites.java:54)
	at com.carrotsearch.randomizedtesting.rules.StatementAdapter.evaluate(StatementAdapter.java:36)
	at com.carrotsearch.randomizedtesting.ThreadLeakControl$StatementRunner.run(ThreadLeakControl.java:368)
	at java.lang.Thread.run(Thread.java:748)


FAILED:  junit.framework.TestSuite.org.apache.solr.client.solrj.request.SchemaTest

Error Message:
Could not remove the following files (in the order of attempts):    C:\Users\jenkins\workspace\Lucene-Solr-7.x-Windows\solr\build\solr-solrj\test\J0\temp\solr.client.solrj.request.SchemaTest_C36D19DD3401DA4F-001\init-core-data-001: java.nio.file.AccessDeniedException: C:\Users\jenkins\workspace\Lucene-Solr-7.x-Windows\solr\build\solr-solrj\test\J0\temp\solr.client.solrj.request.SchemaTest_C36D19DD3401DA4F-001\init-core-data-001 

Stack Trace:
java.io.IOException: Could not remove the following files (in the order of attempts):
   C:\Users\jenkins\workspace\Lucene-Solr-7.x-Windows\solr\build\solr-solrj\test\J0\temp\solr.client.solrj.request.SchemaTest_C36D19DD3401DA4F-001\init-core-data-001: java.nio.file.AccessDeniedException: C:\Users\jenkins\workspace\Lucene-Solr-7.x-Windows\solr\build\solr-solrj\test\J0\temp\solr.client.solrj.request.SchemaTest_C36D19DD3401DA4F-001\init-core-data-001

	at __randomizedtesting.SeedInfo.seed([C36D19DD3401DA4F]:0)
	at org.apache.lucene.util.IOUtils.rm(IOUtils.java:329)
	at org.apache.lucene.util.TestRuleTemporaryFilesCleanup.afterAlways(TestRuleTemporaryFilesCleanup.java:216)
	at com.carrotsearch.randomizedtesting.rules.TestRuleAdapter$1.afterAlways(TestRuleAdapter.java:31)
	at com.carrotsearch.randomizedtesting.rules.StatementAdapter.evaluate(StatementAdapter.java:43)
	at com.carrotsearch.randomizedtesting.rules.StatementAdapter.evaluate(StatementAdapter.java:36)
	at org.apache.lucene.util.TestRuleAssertionsRequired$1.evaluate(TestRuleAssertionsRequired.java:53)
	at org.apache.lucene.util.TestRuleMarkFailure$1.evaluate(TestRuleMarkFailure.java:47)
	at org.apache.lucene.util.TestRuleIgnoreAfterMaxFailures$1.evaluate(TestRuleIgnoreAfterMaxFailures.java:64)
	at org.apache.lucene.util.TestRuleIgnoreTestSuites$1.evaluate(TestRuleIgnoreTestSuites.java:54)
	at com.carrotsearch.randomizedtesting.rules.StatementAdapter.evaluate(StatementAdapter.java:36)
	at com.carrotsearch.randomizedtesting.ThreadLeakControl$StatementRunner.run(ThreadLeakControl.java:368)
	at java.lang.Thread.run(Thread.java:748)


FAILED:  junit.framework.TestSuite.org.apache.solr.update.processor.TestOpenNLPExtractNamedEntitiesUpdateProcessorFactory

Error Message:
Could not remove the following files (in the order of attempts):    C:\Users\jenkins\workspace\Lucene-Solr-7.x-Windows\solr\build\contrib\solr-analysis-extras\test\J1\temp\solr.update.processor.TestOpenNLPExtractNamedEntitiesUpdateProcessorFactory_F83E1BACA71E4C1E-001\tempDir-001\collection1\conf: java.nio.file.DirectoryNotEmptyException: C:\Users\jenkins\workspace\Lucene-Solr-7.x-Windows\solr\build\contrib\solr-analysis-extras\test\J1\temp\solr.update.processor.TestOpenNLPExtractNamedEntitiesUpdateProcessorFactory_F83E1BACA71E4C1E-001\tempDir-001\collection1\conf    C:\Users\jenkins\workspace\Lucene-Solr-7.x-Windows\solr\build\contrib\solr-analysis-extras\test\J1\temp\solr.update.processor.TestOpenNLPExtractNamedEntitiesUpdateProcessorFactory_F83E1BACA71E4C1E-001\tempDir-001\collection1: java.nio.file.DirectoryNotEmptyException: C:\Users\jenkins\workspace\Lucene-Solr-7.x-Windows\solr\build\contrib\solr-analysis-extras\test\J1\temp\solr.update.processor.TestOpenNLPExtractNamedEntitiesUpdateProcessorFactory_F83E1BACA71E4C1E-001\tempDir-001\collection1    C:\Users\jenkins\workspace\Lucene-Solr-7.x-Windows\solr\build\contrib\solr-analysis-extras\test\J1\temp\solr.update.processor.TestOpenNLPExtractNamedEntitiesUpdateProcessorFactory_F83E1BACA71E4C1E-001\tempDir-001: java.nio.file.DirectoryNotEmptyException: C:\Users\jenkins\workspace\Lucene-Solr-7.x-Windows\solr\build\contrib\solr-analysis-extras\test\J1\temp\solr.update.processor.TestOpenNLPExtractNamedEntitiesUpdateProcessorFactory_F83E1BACA71E4C1E-001\tempDir-001    C:\Users\jenkins\workspace\Lucene-Solr-7.x-Windows\solr\build\contrib\solr-analysis-extras\test\J1\temp\solr.update.processor.TestOpenNLPExtractNamedEntitiesUpdateProcessorFactory_F83E1BACA71E4C1E-001\tempDir-001\collection1\conf\en-test-tokenizer.bin: java.nio.file.AccessDeniedException: C:\Users\jenkins\workspace\Lucene-Solr-7.x-Windows\solr\build\contrib\solr-analysis-extras\test\J1\temp\solr.update.processor.TestOpenNLPExtractNamedEntitiesUpdateProcessorFactory_F83E1BACA71E4C1E-001\tempDir-001\collection1\conf\en-test-tokenizer.bin    C:\Users\jenkins\workspace\Lucene-Solr-7.x-Windows\solr\build\contrib\solr-analysis-extras\test\J1\temp\solr.update.processor.TestOpenNLPExtractNamedEntitiesUpdateProcessorFactory_F83E1BACA71E4C1E-001\tempDir-001\collection1\conf\en-test-ner-person.bin: java.nio.file.AccessDeniedException: C:\Users\jenkins\workspace\Lucene-Solr-7.x-Windows\solr\build\contrib\solr-analysis-extras\test\J1\temp\solr.update.processor.TestOpenNLPExtractNamedEntitiesUpdateProcessorFactory_F83E1BACA71E4C1E-001\tempDir-001\collection1\conf\en-test-ner-person.bin    C:\Users\jenkins\workspace\Lucene-Solr-7.x-Windows\solr\build\contrib\solr-analysis-extras\test\J1\temp\solr.update.processor.TestOpenNLPExtractNamedEntitiesUpdateProcessorFactory_F83E1BACA71E4C1E-001\tempDir-001\collection1\conf\en-test-sent.bin: java.nio.file.AccessDeniedException: C:\Users\jenkins\workspace\Lucene-Solr-7.x-Windows\solr\build\contrib\solr-analysis-extras\test\J1\temp\solr.update.processor.TestOpenNLPExtractNamedEntitiesUpdateProcessorFactory_F83E1BACA71E4C1E-001\tempDir-001\collection1\conf\en-test-sent.bin    C:\Users\jenkins\workspace\Lucene-Solr-7.x-Windows\solr\build\contrib\solr-analysis-extras\test\J1\temp\solr.update.processor.TestOpenNLPExtractNamedEntitiesUpdateProcessorFactory_F83E1BACA71E4C1E-001: java.nio.file.DirectoryNotEmptyException: C:\Users\jenkins\workspace\Lucene-Solr-7.x-Windows\solr\build\contrib\solr-analysis-extras\test\J1\temp\solr.update.processor.TestOpenNLPExtractNamedEntitiesUpdateProcessorFactory_F83E1BACA71E4C1E-001 

Stack Trace:
java.io.IOException: Could not remove the following files (in the order of attempts):
   C:\Users\jenkins\workspace\Lucene-Solr-7.x-Windows\solr\build\contrib\solr-analysis-extras\test\J1\temp\solr.update.processor.TestOpenNLPExtractNamedEntitiesUpdateProcessorFactory_F83E1BACA71E4C1E-001\tempDir-001\collection1\conf: java.nio.file.DirectoryNotEmptyException: C:\Users\jenkins\workspace\Lucene-Solr-7.x-Windows\solr\build\contrib\solr-analysis-extras\test\J1\temp\solr.update.processor.TestOpenNLPExtractNamedEntitiesUpdateProcessorFactory_F83E1BACA71E4C1E-001\tempDir-001\collection1\conf
   C:\Users\jenkins\workspace\Lucene-Solr-7.x-Windows\solr\build\contrib\solr-analysis-extras\test\J1\temp\solr.update.processor.TestOpenNLPExtractNamedEntitiesUpdateProcessorFactory_F83E1BACA71E4C1E-001\tempDir-001\collection1: java.nio.file.DirectoryNotEmptyException: C:\Users\jenkins\workspace\Lucene-Solr-7.x-Windows\solr\build\contrib\solr-analysis-extras\test\J1\temp\solr.update.processor.TestOpenNLPExtractNamedEntitiesUpdateProcessorFactory_F83E1BACA71E4C1E-001\tempDir-001\collection1
   C:\Users\jenkins\workspace\Lucene-Solr-7.x-Windows\solr\build\contrib\solr-analysis-extras\test\J1\temp\solr.update.processor.TestOpenNLPExtractNamedEntitiesUpdateProcessorFactory_F83E1BACA71E4C1E-001\tempDir-001: java.nio.file.DirectoryNotEmptyException: C:\Users\jenkins\workspace\Lucene-Solr-7.x-Windows\solr\build\contrib\solr-analysis-extras\test\J1\temp\solr.update.processor.TestOpenNLPExtractNamedEntitiesUpdateProcessorFactory_F83E1BACA71E4C1E-001\tempDir-001
   C:\Users\jenkins\workspace\Lucene-Solr-7.x-Windows\solr\build\contrib\solr-analysis-extras\test\J1\temp\solr.update.processor.TestOpenNLPExtractNamedEntitiesUpdateProcessorFactory_F83E1BACA71E4C1E-001\tempDir-001\collection1\conf\en-test-tokenizer.bin: java.nio.file.AccessDeniedException: C:\Users\jenkins\workspace\Lucene-Solr-7.x-Windows\solr\build\contrib\solr-analysis-extras\test\J1\temp\solr.update.processor.TestOpenNLPExtractNamedEntitiesUpdateProcessorFactory_F83E1BACA71E4C1E-001\tempDir-001\collection1\conf\en-test-tokenizer.bin
   C:\Users\jenkins\workspace\Lucene-Solr-7.x-Windows\solr\build\contrib\solr-analysis-extras\test\J1\temp\solr.update.processor.TestOpenNLPExtractNamedEntitiesUpdateProcessorFactory_F83E1BACA71E4C1E-001\tempDir-001\collection1\conf\en-test-ner-person.bin: java.nio.file.AccessDeniedException: C:\Users\jenkins\workspace\Lucene-Solr-7.x-Windows\solr\build\contrib\solr-analysis-extras\test\J1\temp\solr.update.processor.TestOpenNLPExtractNamedEntitiesUpdateProcessorFactory_F83E1BACA71E4C1E-001\tempDir-001\collection1\conf\en-test-ner-person.bin
   C:\Users\jenkins\workspace\Lucene-Solr-7.x-Windows\solr\build\contrib\solr-analysis-extras\test\J1\temp\solr.update.processor.TestOpenNLPExtractNamedEntitiesUpdateProcessorFactory_F83E1BACA71E4C1E-001\tempDir-001\collection1\conf\en-test-sent.bin: java.nio.file.AccessDeniedException: C:\Users\jenkins\workspace\Lucene-Solr-7.x-Windows\solr\build\contrib\solr-analysis-extras\test\J1\temp\solr.update.processor.TestOpenNLPExtractNamedEntitiesUpdateProcessorFactory_F83E1BACA71E4C1E-001\tempDir-001\collection1\conf\en-test-sent.bin
   C:\Users\jenkins\workspace\Lucene-Solr-7.x-Windows\solr\build\contrib\solr-analysis-extras\test\J1\temp\solr.update.processor.TestOpenNLPExtractNamedEntitiesUpdateProcessorFactory_F83E1BACA71E4C1E-001: java.nio.file.DirectoryNotEmptyException: C:\Users\jenkins\workspace\Lucene-Solr-7.x-Windows\solr\build\contrib\solr-analysis-extras\test\J1\temp\solr.update.processor.TestOpenNLPExtractNamedEntitiesUpdateProcessorFactory_F83E1BACA71E4C1E-001

	at __randomizedtesting.SeedInfo.seed([F83E1BACA71E4C1E]:0)
	at org.apache.lucene.util.IOUtils.rm(IOUtils.java:329)
	at org.apache.lucene.util.TestRuleTemporaryFilesCleanup.afterAlways(TestRuleTemporaryFilesCleanup.java:216)
	at com.carrotsearch.randomizedtesting.rules.TestRuleAdapter$1.afterAlways(TestRuleAdapter.java:31)
	at com.carrotsearch.randomizedtesting.rules.StatementAdapter.evaluate(StatementAdapter.java:43)
	at com.carrotsearch.randomizedtesting.rules.StatementAdapter.evaluate(StatementAdapter.java:36)
	at org.apache.lucene.util.TestRuleAssertionsRequired$1.evaluate(TestRuleAssertionsRequired.java:53)
	at org.apache.lucene.util.TestRuleMarkFailure$1.evaluate(TestRuleMarkFailure.java:47)
	at org.apache.lucene.util.TestRuleIgnoreAfterMaxFailures$1.evaluate(TestRuleIgnoreAfterMaxFailures.java:64)
	at org.apache.lucene.util.TestRuleIgnoreTestSuites$1.evaluate(TestRuleIgnoreTestSuites.java:54)
	at com.carrotsearch.randomizedtesting.rules.StatementAdapter.evaluate(StatementAdapter.java:36)
	at com.carrotsearch.randomizedtesting.ThreadLeakControl$StatementRunner.run(ThreadLeakControl.java:368)
	at java.lang.Thread.run(Thread.java:748)




Build Log:
[...truncated 8162 lines...]
   [junit4] Suite: org.apache.lucene.store.TestRAFDirectory
   [junit4]   2> NOTE: test params are: codec=Lucene70, sim=RandomSimilarity(queryNorm=false): {}, locale=cs, timezone=Etc/GMT+9
   [junit4]   2> NOTE: Windows 10 10.0 x86/Oracle Corporation 1.8.0_144 (32-bit)/cpus=3,threads=1,free=18942928,total=67108864
   [junit4]   2> NOTE: All tests run in this JVM: [TestLazyDocument, SweetSpotSimilarityTest, TestHardLinkCopyDirectoryWrapper, TestRAFDirectory]
   [junit4]   2> NOTE: reproduce with: ant test  -Dtestcase=TestRAFDirectory -Dtests.seed=36061B5464419403 -Dtests.slow=true -Dtests.locale=cs -Dtests.timezone=Etc/GMT+9 -Dtests.asserts=true -Dtests.file.encoding=Cp1252
   [junit4] ERROR   0.00s J1 | TestRAFDirectory (suite) <<<
   [junit4]    > Throwable #1: java.io.IOException: Could not remove the following files (in the order of attempts):
   [junit4]    >    C:\Users\jenkins\workspace\Lucene-Solr-7.x-Windows\lucene\build\misc\test\J1\temp\lucene.store.TestRAFDirectory_36061B5464419403-001\tempDir-002: java.nio.file.AccessDeniedException: C:\Users\jenkins\workspace\Lucene-Solr-7.x-Windows\lucene\build\misc\test\J1\temp\lucene.store.TestRAFDirectory_36061B5464419403-001\tempDir-002
   [junit4]    >    C:\Users\jenkins\workspace\Lucene-Solr-7.x-Windows\lucene\build\misc\test\J1\temp\lucene.store.TestRAFDirectory_36061B5464419403-001: java.nio.file.DirectoryNotEmptyException: C:\Users\jenkins\workspace\Lucene-Solr-7.x-Windows\lucene\build\misc\test\J1\temp\lucene.store.TestRAFDirectory_36061B5464419403-001
   [junit4]    > 	at __randomizedtesting.SeedInfo.seed([36061B5464419403]:0)
   [junit4]    > 	at org.apache.lucene.util.IOUtils.rm(IOUtils.java:329)
   [junit4]    > 	at java.lang.Thread.run(Thread.java:748)
   [junit4] Completed [13/13 (1!)] on J1 in 1.40s, 42 tests, 1 error <<< FAILURES!

[...truncated 1883 lines...]
   [junit4] Suite: org.apache.lucene.search.suggest.analyzing.BlendedInfixSuggesterTest
   [junit4]   2> NOTE: test params are: codec=Lucene70, sim=RandomSimilarity(queryNorm=true): {}, locale=ja, timezone=Atlantic/Canary
   [junit4]   2> NOTE: Windows 10 10.0 x86/Oracle Corporation 1.8.0_144 (32-bit)/cpus=3,threads=1,free=47054736,total=185597952
   [junit4]   2> NOTE: All tests run in this JVM: [TestPrefixCompletionQuery, TestLuceneDictionary, TestSuggestField, DocumentValueSourceDictionaryTest, WFSTCompletionTest, FuzzySuggesterTest, TestPlainTextDictionary, TestSpellChecker, AnalyzingSuggesterTest, TestDirectSpellChecker, TestLevenshteinDistance, TestHighFrequencyDictionary, TestJaroWinklerDistance, TestInputIterator, BlendedInfixSuggesterTest]
   [junit4]   2> NOTE: reproduce with: ant test  -Dtestcase=BlendedInfixSuggesterTest -Dtests.seed=16B71EB4EBD47F7C -Dtests.slow=true -Dtests.locale=ja -Dtests.timezone=Atlantic/Canary -Dtests.asserts=true -Dtests.file.encoding=ISO-8859-1
   [junit4] ERROR   0.00s J1 | BlendedInfixSuggesterTest (suite) <<<
   [junit4]    > Throwable #1: java.io.IOException: Could not remove the following files (in the order of attempts):
   [junit4]    >    C:\Users\jenkins\workspace\Lucene-Solr-7.x-Windows\lucene\build\suggest\test\J1\temp\lucene.search.suggest.analyzing.BlendedInfixSuggesterTest_16B71EB4EBD47F7C-001\BlendedInfixSuggesterTest-005: java.nio.file.AccessDeniedException: C:\Users\jenkins\workspace\Lucene-Solr-7.x-Windows\lucene\build\suggest\test\J1\temp\lucene.search.suggest.analyzing.BlendedInfixSuggesterTest_16B71EB4EBD47F7C-001\BlendedInfixSuggesterTest-005
   [junit4]    >    C:\Users\jenkins\workspace\Lucene-Solr-7.x-Windows\lucene\build\suggest\test\J1\temp\lucene.search.suggest.analyzing.BlendedInfixSuggesterTest_16B71EB4EBD47F7C-001: java.nio.file.DirectoryNotEmptyException: C:\Users\jenkins\workspace\Lucene-Solr-7.x-Windows\lucene\build\suggest\test\J1\temp\lucene.search.suggest.analyzing.BlendedInfixSuggesterTest_16B71EB4EBD47F7C-001
   [junit4]    > 	at __randomizedtesting.SeedInfo.seed([16B71EB4EBD47F7C]:0)
   [junit4]    > 	at org.apache.lucene.util.IOUtils.rm(IOUtils.java:329)
   [junit4]    > 	at java.lang.Thread.run(Thread.java:748)
   [junit4] Completed [24/32 (1!)] on J1 in 1.79s, 6 tests, 1 error <<< FAILURES!

[...truncated 1827 lines...]
   [junit4] Suite: org.apache.solr.AnalysisAfterCoreReloadTest
   [junit4]   2> Creating dataDir: C:\Users\jenkins\workspace\Lucene-Solr-7.x-Windows\solr\build\solr-core\test\J1\temp\solr.AnalysisAfterCoreReloadTest_B73082041491C2BE-001\init-core-data-001
   [junit4]   2> 187044 WARN  (SUITE-AnalysisAfterCoreReloadTest-seed#[B73082041491C2BE]-worker) [    ] o.a.s.SolrTestCaseJ4 startTrackingSearchers: numOpens=21 numCloses=21
   [junit4]   2> 187045 INFO  (SUITE-AnalysisAfterCoreReloadTest-seed#[B73082041491C2BE]-worker) [    ] o.a.s.SolrTestCaseJ4 Using PointFields (NUMERIC_POINTS_SYSPROP=true) w/NUMERIC_DOCVALUES_SYSPROP=false
   [junit4]   2> 187051 INFO  (SUITE-AnalysisAfterCoreReloadTest-seed#[B73082041491C2BE]-worker) [    ] o.a.s.SolrTestCaseJ4 Randomized ssl (false) and clientAuth (true) via: @org.apache.solr.util.RandomizeSSL(reason=, value=NaN, ssl=NaN, clientAuth=NaN)
   [junit4]   2> 187051 INFO  (SUITE-AnalysisAfterCoreReloadTest-seed#[B73082041491C2BE]-worker) [    ] o.a.s.SolrTestCaseJ4 SecureRandom sanity checks: test.solr.allowed.securerandom=null & java.security.egd=file:/dev/./urandom
   [junit4]   2> 188479 INFO  (SUITE-AnalysisAfterCoreReloadTest-seed#[B73082041491C2BE]-worker) [    ] o.a.s.SolrTestCaseJ4 ####initCore
   [junit4]   2> 188546 INFO  (SUITE-AnalysisAfterCoreReloadTest-seed#[B73082041491C2BE]-worker) [    ] o.a.s.c.SolrResourceLoader [null] Added 2 libs to classloader, from paths: [/C:/Users/jenkins/workspace/Lucene-Solr-7.x-Windows/solr/build/solr-core/test/J1/temp/solr.AnalysisAfterCoreReloadTest_B73082041491C2BE-001/tempDir-001/collection1/lib, /C:/Users/jenkins/workspace/Lucene-Solr-7.x-Windows/solr/build/solr-core/test/J1/temp/solr.AnalysisAfterCoreReloadTest_B73082041491C2BE-001/tempDir-001/collection1/lib/classes]
   [junit4]   2> 188949 INFO  (SUITE-AnalysisAfterCoreReloadTest-seed#[B73082041491C2BE]-worker) [    ] o.a.s.c.SolrConfig Using Lucene MatchVersion: 7.3.0
   [junit4]   2> 188999 INFO  (SUITE-AnalysisAfterCoreReloadTest-seed#[B73082041491C2BE]-worker) [    ] o.a.s.s.IndexSchema [null] Schema name=test
   [junit4]   2> 189441 INFO  (SUITE-AnalysisAfterCoreReloadTest-seed#[B73082041491C2BE]-worker) [    ] o.a.s.s.IndexSchema Loaded schema test/1.0 with uniqueid field id
   [junit4]   2> 189959 INFO  (SUITE-AnalysisAfterCoreReloadTest-seed#[B73082041491C2BE]-worker) [    ] o.a.s.m.r.SolrJmxReporter JMX monitoring for 'solr.node' (registry 'solr.node') enabled at server: com.sun.jmx.mbeanserver.JmxMBeanServer@2a1f90
   [junit4]   2> 189973 INFO  (SUITE-AnalysisAfterCoreReloadTest-seed#[B73082041491C2BE]-worker) [    ] o.a.s.m.r.SolrJmxReporter JMX monitoring for 'solr.jvm' (registry 'solr.jvm') enabled at server: com.sun.jmx.mbeanserver.JmxMBeanServer@2a1f90
   [junit4]   2> 189973 INFO  (SUITE-AnalysisAfterCoreReloadTest-seed#[B73082041491C2BE]-worker) [    ] o.a.s.m.r.SolrJmxReporter JMX monitoring for 'solr.jetty' (registry 'solr.jetty') enabled at server: com.sun.jmx.mbeanserver.JmxMBeanServer@2a1f90
   [junit4]   2> 189977 INFO  (coreLoadExecutor-493-thread-1) [    ] o.a.s.c.TransientSolrCoreCacheDefault Allocating transient cache for 2147483647 transient cores
   [junit4]   2> 189979 INFO  (coreLoadExecutor-493-thread-1) [    x:collection1] o.a.s.c.SolrResourceLoader [null] Added 2 libs to classloader, from paths: [/C:/Users/jenkins/workspace/Lucene-Solr-7.x-Windows/solr/build/solr-core/test/J1/temp/solr.AnalysisAfterCoreReloadTest_B73082041491C2BE-001/tempDir-001/collection1/lib, /C:/Users/jenkins/workspace/Lucene-Solr-7.x-Windows/solr/build/solr-core/test/J1/temp/solr.AnalysisAfterCoreReloadTest_B73082041491C2BE-001/tempDir-001/collection1/lib/classes]
   [junit4]   2> 190219 INFO  (coreLoadExecutor-493-thread-1) [    x:collection1] o.a.s.c.SolrConfig Using Lucene MatchVersion: 7.3.0
   [junit4]   2> 190299 INFO  (coreLoadExecutor-493-thread-1) [    x:collection1] o.a.s.s.IndexSchema [collection1] Schema name=test
   [junit4]   2> 190558 INFO  (coreLoadExecutor-493-thread-1) [    x:collection1] o.a.s.s.IndexSchema Loaded schema test/1.0 with uniqueid field id
   [junit4]   2> 190621 INFO  (coreLoadExecutor-493-thread-1) [    x:collection1] o.a.s.c.CoreContainer Creating SolrCore 'collection1' using configuration from instancedir C:\Users\jenkins\workspace\Lucene-Solr-7.x-Windows\solr\build\solr-core\test\J1\temp\solr.AnalysisAfterCoreReloadTest_B73082041491C2BE-001\tempDir-001\collection1, trusted=true
   [junit4]   2> 190623 INFO  (coreLoadExecutor-493-thread-1) [    x:collection1] o.a.s.m.r.SolrJmxReporter JMX monitoring for 'solr.core.collection1' (registry 'solr.core.collection1') enabled at server: com.sun.jmx.mbeanserver.JmxMBeanServer@2a1f90
   [junit4]   2> 190624 INFO  (coreLoadExecutor-493-thread-1) [    x:collection1] o.a.s.c.SolrCore solr.RecoveryStrategy.Builder
   [junit4]   2> 190624 INFO  (coreLoadExecutor-493-thread-1) [    x:collection1] o.a.s.c.SolrCore [[collection1] ] Opening new SolrCore at [C:\Users\jenkins\workspace\Lucene-Solr-7.x-Windows\solr\build\solr-core\test\J1\temp\solr.AnalysisAfterCoreReloadTest_B73082041491C2BE-001\tempDir-001\collection1], dataDir=[C:\Users\jenkins\workspace\Lucene-Solr-7.x-Windows\solr\build\solr-core\test\J1\temp\solr.AnalysisAfterCoreReloadTest_B73082041491C2BE-001\init-core-data-001\]
   [junit4]   2> 190928 INFO  (coreLoadExecutor-493-thread-1) [    x:collection1] o.a.s.u.RandomMergePolicy RandomMergePolicy wrapping class org.apache.lucene.index.TieredMergePolicy: [TieredMergePolicy: maxMergeAtOnce=18, maxMergeAtOnceExplicit=24, maxMergedSegmentMB=50.8671875, floorSegmentMB=1.8935546875, forceMergeDeletesPctAllowed=23.957993237656904, segmentsPerTier=35.0, maxCFSSegmentSizeMB=8.796093022207999E12, noCFSRatio=1.0
   [junit4]   2> 191408 INFO  (coreLoadExecutor-493-thread-1) [    x:collection1] o.a.s.u.UpdateHandler Using UpdateLog implementation: org.apache.solr.update.UpdateLog
   [junit4]   2> 191408 INFO  (coreLoadExecutor-493-thread-1) [    x:collection1] o.a.s.u.UpdateLog Initializing UpdateLog: dataDir= defaultSyncLevel=FLUSH numRecordsToKeep=100 maxNumLogsToKeep=10 numVersionBuckets=65536
   [junit4]   2> 191410 INFO  (coreLoadExecutor-493-thread-1) [    x:collection1] o.a.s.u.CommitTracker Hard AutoCommit: disabled
   [junit4]   2> 191410 INFO  (coreLoadExecutor-493-thread-1) [    x:collection1] o.a.s.u.CommitTracker Soft AutoCommit: disabled
   [junit4]   2> 191412 INFO  (coreLoadExecutor-493-thread-1) [    x:collection1] o.a.s.u.RandomMergePolicy RandomMergePolicy wrapping class org.apache.lucene.index.LogDocMergePolicy: [LogDocMergePolicy: minMergeSize=1000, mergeFactor=20, maxMergeSize=9223372036854775807, maxMergeSizeForForcedMerge=9223372036854775807, calibrateSizeByDeletes=false, maxMergeDocs=2147483647, maxCFSSegmentSizeMB=8.796093022207999E12, noCFSRatio=0.7825653364292181]
   [junit4]   2> 191413 INFO  (coreLoadExecutor-493-thread-1) [    x:collection1] o.a.s.s.SolrIndexSearcher Opening [Searcher@511afe[collection1] main]
   [junit4]   2> 191414 INFO  (coreLoadExecutor-493-thread-1) [    x:collection1] o.a.s.h.c.SpellCheckComponent Initializing spell checkers
   [junit4]   2> 191440 INFO  (coreLoadExecutor-493-thread-1) [    x:collection1] o.a.s.s.DirectSolrSpellChecker init: {name=direct,classname=DirectSolrSpellChecker,field=lowerfilt,minQueryLength=3}
   [junit4]   2> 191606 INFO  (coreLoadExecutor-493-thread-1) [    x:collection1] o.a.s.h.ReplicationHandler Commits will be reserved for 10000ms.
   [junit4]   2> 191607 INFO  (searcherExecutor-494-thread-1-processing-x:collection1) [    x:collection1] o.a.s.h.c.SpellCheckComponent Loading spell index for spellchecker: default
   [junit4]   2> 191607 INFO  (coreLoadExecutor-493-thread-1) [    x:collection1] o.a.s.u.UpdateLog Could not find max version in index or recent updates, using new clock 1589707032188944384
   [junit4]   2> 191608 INFO  (searcherExecutor-494-thread-1-processing-x:collection1) [    x:collection1] o.a.s.h.c.SpellCheckComponent Loading spell index for spellchecker: direct
   [junit4]   2> 191608 INFO  (searcherExecutor-494-thread-1-processing-x:collection1) [    x:collection1] o.a.s.h.c.SpellCheckComponent Loading spell index for spellchecker: wordbreak
   [junit4]   2> 191608 INFO  (searcherExecutor-494-thread-1-processing-x:collection1) [    x:collection1] o.a.s.h.c.SpellCheckComponent Loading spell index for spellchecker: multipleFields
   [junit4]   2> 191610 INFO  (searcherExecutor-494-thread-1-processing-x:collection1) [    x:collection1] o.a.s.h.c.SpellCheckComponent Loading spell index for spellchecker: jarowinkler
   [junit4]   2> 191614 INFO  (searcherExecutor-494-thread-1-processing-x:collection1) [    x:collection1] o.a.s.h.c.SpellCheckComponent Loading spell index for spellchecker: external
   [junit4]   2> 191615 INFO  (searcherExecutor-494-thread-1-processing-x:collection1) [    x:collection1] o.a.s.h.c.SpellCheckComponent Loading spell index for spellchecker: freq
   [junit4]   2> 191615 INFO  (SUITE-AnalysisAfterCoreReloadTest-seed#[B73082041491C2BE]-worker) [    ] o.a.s.SolrTestCaseJ4 ####initCore end
   [junit4]   2> 191617 INFO  (searcherExecutor-494-thread-1-processing-x:collection1) [    x:collection1] o.a.s.h.c.SpellCheckComponent Loading spell index for spellchecker: fqcn
   [junit4]   2> 191619 INFO  (searcherExecutor-494-thread-1-processing-x:collection1) [    x:collection1] o.a.s.h.c.SpellCheckComponent Loading spell index for spellchecker: perDict
   [junit4]   2> 191626 INFO  (TEST-AnalysisAfterCoreReloadTest.testStopwordsAfterCoreReload-seed#[B73082041491C2BE]) [    ] o.a.s.SolrTestCaseJ4 ###Starting testStopwordsAfterCoreReload
   [junit4]   2> 191626 INFO  (searcherExecutor-494-thread-1-processing-x:collection1) [    x:collection1] o.a.s.c.SolrCore [collection1] Registered new searcher Searcher@511afe[collection1] main{ExitableDirectoryReader(UninvertingDirectoryReader())}
   [junit4]   2> 191824 INFO  (TEST-AnalysisAfterCoreReloadTest.testStopwordsAfterCoreReload-seed#[B73082041491C2BE]) [    ] o.a.s.u.DirectUpdateHandler2 start commit{_version_=1589707032416485376,optimize=false,openSearcher=true,waitSearcher=true,expungeDeletes=false,softCommit=false,prepareCommit=false}
   [junit4]   2> 191824 INFO  (TEST-AnalysisAfterCoreReloadTest.testStopwordsAfterCoreReload-seed#[B73082041491C2BE]) [    ] o.a.s.u.SolrIndexWriter Calling setCommitData with IW:org.apache.solr.update.SolrIndexWriter@d8ca37 commitCommandVersion:1589707032416485376
   [junit4]   2> 191996 INFO  (TEST-AnalysisAfterCoreReloadTest.testStopwordsAfterCoreReload-seed#[B73082041491C2BE]) [    ] o.a.s.s.SolrIndexSearcher Opening [Searcher@461f13[collection1] main]
   [junit4]   2> 191996 INFO  (TEST-AnalysisAfterCoreReloadTest.testStopwordsAfterCoreReload-seed#[B73082041491C2BE]) [    ] o.a.s.u.DirectUpdateHandler2 end_commit_flush
   [junit4]   2> 192028 INFO  (searcherExecutor-494-thread-1) [    ] o.a.s.c.SolrCore [collection1] Registered new searcher Searcher@461f13[collection1] main{ExitableDirectoryReader(UninvertingDirectoryReader(Uninverting(_0(7.3.0):c1)))}
   [junit4]   2> 192036 INFO  (TEST-AnalysisAfterCoreReloadTest.testStopwordsAfterCoreReload-seed#[B73082041491C2BE]) [    ] o.a.s.u.p.LogUpdateProcessorFactory [collection1]  webapp=null path=/update params={commit=true&softCommit=false&waitSearcher=true}{add=[42 (1589707032279121920)],commit=} 0 382
   [junit4]   2> 192068 INFO  (TEST-AnalysisAfterCoreReloadTest.testStopwordsAfterCoreReload-seed#[B73082041491C2BE]) [    ] o.a.s.c.S.Request [collection1]  webapp=null path=/select params={q=teststop:terma} hits=1 status=0 QTime=31
   [junit4]   2> 192073 INFO  (TEST-AnalysisAfterCoreReloadTest.testStopwordsAfterCoreReload-seed#[B73082041491C2BE]) [    ] o.a.s.c.S.Request [collection1]  webapp=null path=/select params={q=teststop:stopworda} hits=0 status=0 QTime=0
   [junit4]   2> 192074 INFO  (TEST-AnalysisAfterCoreReloadTest.testStopwordsAfterCoreReload-seed#[B73082041491C2BE]) [    ] o.a.s.c.S.Request [collection1]  webapp=null path=/select params={q=teststop:stopwordb} hits=0 status=0 QTime=0
   [junit4]   2> 192076 INFO  (TEST-AnalysisAfterCoreReloadTest.testStopwordsAfterCoreReload-seed#[B73082041491C2BE]) [    ] o.a.s.c.S.Request [collection1]  webapp=null path=/select params={q=teststop:stopwordc} hits=1 status=0 QTime=0
   [junit4]   2> 192081 ERROR (TEST-AnalysisAfterCoreReloadTest.testStopwordsAfterCoreReload-seed#[B73082041491C2BE]) [    ] o.a.s.c.CorePropertiesLocator Couldn't load core descriptor from C:\Users\jenkins\workspace\Lucene-Solr-7.x-Windows\solr\build\solr-core\test\J1\temp\solr.AnalysisAfterCoreReloadTest_B73082041491C2BE-001\tempDir-001\collection1\core.properties:java.nio.file.NoSuchFileException: C:\Users\jenkins\workspace\Lucene-Solr-7.x-Windows\solr\build\solr-core\test\J1\temp\solr.AnalysisAfterCoreReloadTest_B73082041491C2BE-001\tempDir-001\collection1\core.properties
   [junit4]   2> 192083 INFO  (TEST-AnalysisAfterCoreReloadTest.testStopwordsAfterCoreReload-seed#[B73082041491C2BE]) [    ] o.a.s.c.SolrResourceLoader [null] Added 2 libs to classloader, from paths: [/C:/Users/jenkins/workspace/Lucene-Solr-7.x-Windows/solr/build/solr-core/test/J1/temp/solr.AnalysisAfterCoreReloadTest_B73082041491C2BE-001/tempDir-001/collection1/lib, /C:/Users/jenkins/workspace/Lucene-Solr-7.x-Windows/solr/build/solr-core/test/J1/temp/solr.AnalysisAfterCoreReloadTest_B73082041491C2BE-001/tempDir-001/collection1/lib/classes]
   [junit4]   2> 192195 INFO  (TEST-AnalysisAfterCoreReloadTest.testStopwordsAfterCoreReload-seed#[B73082041491C2BE]) [    ] o.a.s.c.SolrConfig Using Lucene MatchVersion: 7.3.0
   [junit4]   2> 192226 INFO  (TEST-AnalysisAfterCoreReloadTest.testStopwordsAfterCoreReload-seed#[B73082041491C2BE]) [    ] o.a.s.s.IndexSchema [collection1] Schema name=test
   [junit4]   2> 192493 INFO  (TEST-AnalysisAfterCoreReloadTest.testStopwordsAfterCoreReload-seed#[B73082041491C2BE]) [    ] o.a.s.s.IndexSchema Loaded schema test/1.0 with uniqueid field id
   [junit4]   2> 192552 INFO  (TEST-AnalysisAfterCoreReloadTest.testStopwordsAfterCoreReload-seed#[B73082041491C2BE]) [    ] o.a.s.c.CoreContainer Reloading SolrCore 'collection1' using configuration from instancedir C:\Users\jenkins\workspace\Lucene-Solr-7.x-Windows\solr\build\solr-core\test\J1\temp\solr.AnalysisAfterCoreReloadTest_B73082041491C2BE-001\tempDir-001\collection1
   [junit4]   2> 192657 INFO  (TEST-AnalysisAfterCoreReloadTest.testStopwordsAfterCoreReload-seed#[B73082041491C2BE]) [    x:collection1] o.a.s.m.r.SolrJmxReporter JMX monitoring for 'solr.core.collection1' (registry 'solr.core.collection1') enabled at server: com.sun.jmx.mbeanserver.JmxMBeanServer@2a1f90
   [junit4]   2> 192657 INFO  (TEST-AnalysisAfterCoreReloadTest.testStopwordsAfterCoreReload-seed#[B73082041491C2BE]) [    x:collection1] o.a.s.c.SolrCore [[collection1] ] Opening new SolrCore at [C:\Users\jenkins\workspace\Lucene-Solr-7.x-Windows\solr\build\solr-core\test\J1\temp\solr.AnalysisAfterCoreReloadTest_B73082041491C2BE-001\tempDir-001\collection1], dataDir=[C:\Users\jenkins\workspace\Lucene-Solr-7.x-Windows\solr\build\solr-core\test\J1\temp\solr.AnalysisAfterCoreReloadTest_B73082041491C2BE-001\init-core-data-001\]
   [junit4]   2> 193138 INFO  (TEST-AnalysisAfterCoreReloadTest.testStopwordsAfterCoreReload-seed#[B73082041491C2BE]) [    x:collection1] o.a.s.u.CommitTracker Hard AutoCommit: disabled
   [junit4]   2> 193139 INFO  (TEST-AnalysisAfterCoreReloadTest.testStopwordsAfterCoreReload-seed#[B73082041491C2BE]) [    x:collection1] o.a.s.u.CommitTracker Soft AutoCommit: disabled
   [junit4]   2> 193144 INFO  (TEST-AnalysisAfterCoreReloadTest.testStopwordsAfterCoreReload-seed#[B73082041491C2BE]) [    x:collection1] o.a.s.s.SolrIndexSearcher Opening [Searcher@14138ea[collection1] main]
   [junit4]   2> 193146 INFO  (TEST-AnalysisAfterCoreReloadTest.testStopwordsAfterCoreReload-seed#[B73082041491C2BE]) [    x:collection1] o.a.s.h.c.SpellCheckComponent Initializing spell checkers
   [junit4]   2> 193153 INFO  (TEST-AnalysisAfterCoreReloadTest.testStopwordsAfterCoreReload-seed#[B73082041491C2BE]) [    x:collection1] o.a.s.s.DirectSolrSpellChecker init: {name=direct,classname=DirectSolrSpellChecker,field=lowerfilt,minQueryLength=3}
   [junit4]   2> 193186 INFO  (TEST-AnalysisAfterCoreReloadTest.testStopwordsAfterCoreReload-seed#[B73082041491C2BE]) [    x:collection1] o.a.s.h.ReplicationHandler Commits will be reserved for 10000ms.
   [junit4]   2> 193211 INFO  (TEST-AnalysisAfterCoreReloadTest.testStopwordsAfterCoreReload-seed#[B73082041491C2BE]) [    x:collection1] o.a.s.u.RandomMergePolicy RandomMergePolicy wrapping class org.apache.lucene.index.LogDocMergePolicy: [LogDocMergePolicy: minMergeSize=1000, mergeFactor=30, maxMergeSize=9223372036854775807, maxMergeSizeForForcedMerge=9223372036854775807, calibrateSizeByDeletes=true, maxMergeDocs=2147483647, maxCFSSegmentSizeMB=8.796093022207999E12, noCFSRatio=0.6874743916446102]
   [junit4]   2> 193213 INFO  (searcherExecutor-499-thread-1-processing-x:collection1) [    x:collection1] o.a.s.h.c.SpellCheckComponent Loading spell index for spellchecker: default
   [junit4]   2> 193215 INFO  (searcherExecutor-499-thread-1-processing-x:collection1) [    x:collection1] o.a.s.h.c.SpellCheckComponent Loading spell index for spellchecker: direct
   [junit4]   2> 193215 INFO  (searcherExecutor-499-thread-1-processing-x:collection1) [    x:collection1] o.a.s.h.c.SpellCheckComponent Loading spell index for spellchecker: wordbreak
   [junit4]   2> 193215 INFO  (searcherExecutor-499-thread-1-processing-x:collection1) [    x:collection1] o.a.s.h.c.SpellCheckComponent Loading spell index for spellchecker: multipleFields
   [junit4]   2> 193216 INFO  (searcherExecutor-499-thread-1-processing-x:collection1) [    x:collection1] o.a.s.h.c.SpellCheckComponent Loading spell index for spellchecker: jarowinkler
   [junit4]   2> 193217 INFO  (searcherExecutor-499-thread-1-processing-x:collection1) [    x:collection1] o.a.s.h.c.SpellCheckComponent Loading spell index for spellchecker: external
   [junit4]   2> 193220 INFO  (TEST-AnalysisAfterCoreReloadTest.testStopwordsAfterCoreReload-seed#[B73082041491C2BE]) [    x:collection1] o.a.s.u.DefaultSolrCoreState New IndexWriter is ready to be used.
   [junit4]   2> 193237 INFO  (searcherExecutor-499-thread-1-processing-x:collection1) [    x:collection1] o.a.s.h.c.SpellCheckComponent Loading spell index for spellchecker: freq
   [junit4]   2> 193237 INFO  (searcherExecutor-499-thread-1-processing-x:collection1) [    x:collection1] o.a.s.h.c.SpellCheckComponent Loading spell index for spellchecker: fqcn
   [junit4]   2> 193239 INFO  (searcherExecutor-499-thread-1-processing-x:collection1) [    x:collection1] o.a.s.h.c.SpellCheckComponent Loading spell index for spellchecker: perDict
   [junit4]   2> 193249 INFO  (searcherExecutor-499-thread-1-processing-x:collection1) [    x:collection1] o.a.s.c.SolrCore [collection1] Registered new searcher Searcher@14138ea[collection1] main{ExitableDirectoryReader(UninvertingDirectoryReader(Uninverting(_0(7.3.0):c1)))}
   [junit4]   2> 193255 INFO  (TEST-AnalysisAfterCoreReloadTest.testStopwordsAfterCoreReload-seed#[B73082041491C2BE]) [    x:collection1] o.a.s.s.SolrIndexSearcher Opening [Searcher@1036973[collection1] main]
   [junit4]   2> 193264 INFO  (searcherExecutor-499-thread-1-processing-x:collection1) [    x:collection1] o.a.s.c.SolrCore [collection1] Registered new searcher Searcher@1036973[collection1] main{ExitableDirectoryReader(UninvertingDirectoryReader(Uninverting(_0(7.3.0):c1)))}
   [junit4]   2> 193286 INFO  (TEST-AnalysisAfterCoreReloadTest.testStopwordsAfterCoreReload-seed#[B73082041491C2BE]) [    x:collection1] o.a.s.c.SolrCore [collection1]  CLOSING SolrCore org.apache.solr.core.SolrCore@4b467d
   [junit4]   2> 193286 INFO  (TEST-AnalysisAfterCoreReloadTest.testStopwordsAfterCoreReload-seed#[B73082041491C2BE]) [    x:collection1] o.a.s.m.SolrMetricManager Closing metric reporters for registry=solr.core.collection1, tag=4933245
   [junit4]   2> 193287 INFO  (TEST-AnalysisAfterCoreReloadTest.testStopwordsAfterCoreReload-seed#[B73082041491C2BE]) [    x:collection1] o.a.s.m.r.SolrJmxReporter Closing reporter [org.apache.solr.metrics.reporters.SolrJmxReporter@18dacec: rootName = null, domain = solr.core.collection1, service url = null, agent id = null] for registry solr.core.collection1 / com.codahale.metrics.MetricRegistry@b5f292
   [junit4]   2> 193362 INFO  (TEST-AnalysisAfterCoreReloadTest.testStopwordsAfterCoreReload-seed#[B73082041491C2BE]) [    x:collection1] o.a.s.u.DirectUpdateHandler2 start commit{_version_=1589707034029195264,optimize=false,openSearcher=true,waitSearcher=true,expungeDeletes=false,softCommit=false,prepareCommit=false}
   [junit4]   2> 193363 INFO  (TEST-AnalysisAfterCoreReloadTest.testStopwordsAfterCoreReload-seed#[B73082041491C2BE]) [    x:collection1] o.a.s.u.SolrIndexWriter Calling setCommitData with IW:org.apache.solr.update.SolrIndexWriter@42d2bd commitCommandVersion:1589707034029195264
   [junit4]   2> 193424 INFO  (TEST-AnalysisAfterCoreReloadTest.testStopwordsAfterCoreReload-seed#[B73082041491C2BE]) [    x:collection1] o.a.s.s.SolrIndexSearcher Opening [Searcher@1c051b5[collection1] main]
   [junit4]   2> 193426 INFO  (TEST-AnalysisAfterCoreReloadTest.testStopwordsAfterCoreReload-seed#[B73082041491C2BE]) [    x:collection1] o.a.s.u.DirectUpdateHandler2 end_commit_flush
   [junit4]   2> 193430 INFO  (searcherExecutor-499-thread-1-processing-x:collection1) [    x:collection1] o.a.s.c.SolrCore [collection1] Registered new searcher Searcher@1c051b5[collection1] main{ExitableDirectoryReader(UninvertingDirectoryReader(Uninverting(_1(7.3.0):c1)))}
   [junit4]   2> 193431 INFO  (TEST-AnalysisAfterCoreReloadTest.testStopwordsAfterCoreReload-seed#[B73082041491C2BE]) [    x:collection1] o.a.s.u.p.LogUpdateProcessorFactory [collection1]  webapp=null path=/update params={commit=true&softCommit=false&waitSearcher=true}{add=[42 (1589707034014515200)],commit=} 0 84
   [junit4]   2> 193433 INFO  (TEST-AnalysisAfterCoreReloadTest.testStopwordsAfterCoreReload-seed#[B73082041491C2BE]) [    x:collection1] o.a.s.c.S.Request [collection1]  webapp=null path=/select params={q=teststop:terma} hits=1 status=0 QTime=1
   [junit4]   2> 193437 INFO  (TEST-AnalysisAfterCoreReloadTest.testStopwordsAfterCoreReload-seed#[B73082041491C2BE]) [    x:collection1] o.a.s.c.S.Request [collection1]  webapp=null path=/select params={q=teststop:stopworda} hits=1 status=0 QTime=3
   [junit4]   2> 193441 INFO  (TEST-AnalysisAfterCoreReloadTest.testStopwordsAfterCoreReload-seed#[B73082041491C2BE]) [    x:collection1] o.a.s.c.S.Request [collection1]  webapp=null path=/select params={q=teststop:stopwordb} hits=1 status=0 QTime=0
   [junit4]   2> 193442 INFO  (TEST-AnalysisAfterCoreReloadTest.testStopwordsAfterCoreReload-seed#[B73082041491C2BE]) [    x:collection1] o.a.s.c.S.Request [collection1]  webapp=null path=/select params={q=teststop:stopwordc} hits=0 status=0 QTime=0
   [junit4]   2> 193442 INFO  (TEST-AnalysisAfterCoreReloadTest.testStopwordsAfterCoreReload-seed#[B73082041491C2BE]) [    x:collection1] o.a.s.SolrTestCaseJ4 ###Ending testStopwordsAfterCoreReload
   [junit4]   2> 193454 INFO  (SUITE-AnalysisAfterCoreReloadTest-seed#[B73082041491C2BE]-worker) [    x:collection1] o.a.s.SolrTestCaseJ4 ###deleteCore
   [junit4]   2> 193454 INFO  (SUITE-AnalysisAfterCoreReloadTest-seed#[B73082041491C2BE]-worker) [    x:collection1] o.a.s.c.CoreContainer Shutting down CoreContainer instance=27999557
   [junit4]   2> 193454 INFO  (SUITE-AnalysisAfterCoreReloadTest-seed#[B73082041491C2BE]-worker) [    x:collection1] o.a.s.m.SolrMetricManager Closing metric reporters for registry=solr.node, tag=null
   [junit4]   2> 193454 INFO  (SUITE-AnalysisAfterCoreReloadTest-seed#[B73082041491C2BE]-worker) [    x:collection1] o.a.s.m.r.SolrJmxReporter Closing reporter [org.apache.solr.metrics.reporters.SolrJmxReporter@13f4334: rootName = null, domain = solr.node, service url = null, agent id = null] for registry solr.node / com.codahale.metrics.MetricRegistry@11579c6
   [junit4]   2> 193456 INFO  (SUITE-AnalysisAfterCoreReloadTest-seed#[B73082041491C2BE]-worker) [    x:collection1] o.a.s.m.SolrMetricManager Closing metric reporters for registry=solr.jvm, tag=null
   [junit4]   2> 193456 INFO  (SUITE-AnalysisAfterCoreReloadTest-seed#[B73082041491C2BE]-worker) [    x:collection1] o.a.s.m.r.SolrJmxReporter Closing reporter [org.apache.solr.metrics.reporters.SolrJmxReporter@1651231: rootName = null, domain = solr.jvm, service url = null, agent id = null] for registry solr.jvm / com.codahale.metrics.MetricRegistry@1247d08
   [junit4]   2> 193464 INFO  (SUITE-AnalysisAfterCoreReloadTest-seed#[B73082041491C2BE]-worker) [    x:collection1] o.a.s.m.SolrMetricManager Closing metric reporters for registry=solr.jetty, tag=null
   [junit4]   2> 193464 INFO  (SUITE-AnalysisAfterCoreReloadTest-seed#[B73082041491C2BE]-worker) [    x:collection1] o.a.s.m.r.SolrJmxReporter Closing reporter [org.apache.solr.metrics.reporters.SolrJmxReporter@30d897: rootName = null, domain = solr.jetty, service url = null, agent id = null] for registry solr.jetty / com.codahale.metrics.MetricRegistry@1449bf9
   [junit4]   2> 193469 INFO  (coreCloseExecutor-503-thread-1-processing-x:collection1) [    x:collection1] o.a.s.c.SolrCore [collection1]  CLOSING SolrCore org.apache.solr.core.SolrCore@f6f036
   [junit4]   2> 193470 INFO  (coreCloseExecutor-503-thread-1-processing-x:collection1) [    x:collection1] o.a.s.m.SolrMetricManager Closing metric reporters for registry=solr.core.collection1, tag=16183350
   [junit4]   2> 193470 INFO  (coreCloseExecutor-503-thread-1-processing-x:collection1) [    x:collection1] o.a.s.m.r.SolrJmxReporter Closing reporter [org.apache.solr.metrics.reporters.SolrJmxReporter@1dc15e8: rootName = null, domain = solr.core.collection1, service url = null, agent id = null] for registry solr.core.collection1 / com.codahale.metrics.MetricRegistry@b5f292
   [junit4]   2> 193509 INFO  (SUITE-AnalysisAfterCoreReloadTest-seed#[B73082041491C2BE]-worker) [    x:collection1] o.a.s.SolrTestCaseJ4 ------------------------------------------------------- Done waiting for tracked resources to be released
   [junit4]   2> NOTE: test params are: codec=Asserting(Lucene70): {multiDefault=BlockTreeOrds(blocksize=128), teststop=BlockTreeOrds(blocksize=128), id=PostingsFormat(name=Memory)}, docValues:{range_facet_l_dv=DocValuesFormat(name=Memory), _version_=DocValuesFormat(name=Lucene70), range_facet_i_dv=DocValuesFormat(name=Direct), intDvoDefault=DocValuesFormat(name=Memory), timestamp=DocValuesFormat(name=Direct)}, maxPointsInLeafNode=415, maxMBSortInHeap=6.50259707677198, sim=RandomSimilarity(queryNorm=true): {}, locale=sl, timezone=America/Lower_Princes
   [junit4]   2> NOTE: Windows 10 10.0 x86/Oracle Corporation 1.8.0_144 (32-bit)/cpus=3,threads=1,free=358447872,total=536870912
   [junit4]   2> NOTE: All tests run in this JVM: [HLLUtilTest, TestUtilizeNode, ReplicaListTransformerTest, ChaosMonkeyNothingIsSafeWithPullReplicasTest, TestSolrCoreParser, FullHLLTest, ComputePlanActionTest, TestRequestForwarding, TestNRTOpen, OverseerCollectionConfigSetProcessorTest, TestExpandComponent, AnalysisAfterCoreReloadTest]
   [junit4]   2> NOTE: reproduce with: ant test  -Dtestcase=AnalysisAfterCoreReloadTest -Dtests.seed=B73082041491C2BE -Dtests.slow=true -Dtests.locale=sl -Dtests.timezone=America/Lower_Princes -Dtests.asserts=true -Dtests.file.encoding=UTF-8
   [junit4] ERROR   0.00s J1 | AnalysisAfterCoreReloadTest (suite) <<<
   [junit4]    > Throwable #1: java.io.IOException: Could not remove the following files (in the order of attempts):
   [junit4]    >    C:\Users\jenkins\workspace\Lucene-Solr-7.x-Windows\solr\build\solr-core\test\J1\temp\solr.AnalysisAfterCoreReloadTest_B73082041491C2BE-001\init-core-data-001: java.nio.file.DirectoryNotEmptyException: C:\Users\jenkins\workspace\Lucene-Solr-7.x-Windows\solr\build\solr-core\test\J1\temp\solr.AnalysisAfterCoreReloadTest_B73082041491C2BE-001\init-core-data-001
   [junit4]    > 	at __randomizedtesting.SeedInfo.seed([B73082041491C2BE]:0)
   [junit4]    > 	at org.apache.lucene.util.IOUtils.rm(IOUtils.java:329)
   [junit4]    > 	at java.lang.Thread.run(Thread.java:748)
   [junit4] Completed [52/767 (1!)] on J1 in 7.17s, 1 test, 1 error <<< FAILURES!

[...truncated 1408 lines...]
   [junit4] Suite: org.apache.solr.cloud.FullSolrCloudDistribCmdsTest
   [junit4]   2> 2473344 INFO  (SUITE-FullSolrCloudDistribCmdsTest-seed#[B73082041491C2BE]-worker) [    ] o.a.s.SolrTestCaseJ4 SecureRandom sanity checks: test.solr.allowed.securerandom=null & java.security.egd=file:/dev/./urandom
   [junit4]   2> Creating dataDir: C:\Users\jenkins\workspace\Lucene-Solr-7.x-Windows\solr\build\solr-core\test\J1\temp\solr.cloud.FullSolrCloudDistribCmdsTest_B73082041491C2BE-001\init-core-data-001
   [junit4]   2> 2473345 INFO  (SUITE-FullSolrCloudDistribCmdsTest-seed#[B73082041491C2BE]-worker) [    ] o.a.s.SolrTestCaseJ4 Using PointFields (NUMERIC_POINTS_SYSPROP=true) w/NUMERIC_DOCVALUES_SYSPROP=true
   [junit4]   2> 2473346 INFO  (SUITE-FullSolrCloudDistribCmdsTest-seed#[B73082041491C2BE]-worker) [    ] o.a.s.SolrTestCaseJ4 Randomized ssl (false) and clientAuth (false) via: @org.apache.solr.SolrTestCaseJ4$SuppressSSL(bugUrl=https://issues.apache.org/jira/browse/SOLR-5776)
   [junit4]   2> 2473346 INFO  (SUITE-FullSolrCloudDistribCmdsTest-seed#[B73082041491C2BE]-worker) [    ] o.a.s.BaseDistributedSearchTestCase Setting hostContext system property: /uk/c
   [junit4]   2> 2473347 INFO  (TEST-FullSolrCloudDistribCmdsTest.test-seed#[B73082041491C2BE]) [    ] o.a.s.c.ZkTestServer STARTING ZK TEST SERVER
   [junit4]   2> 2473347 INFO  (Thread-2476) [    ] o.a.s.c.ZkTestServer client port:0.0.0.0/0.0.0.0:0
   [junit4]   2> 2473347 INFO  (Thread-2476) [    ] o.a.s.c.ZkTestServer Starting server
   [junit4]   2> 2473353 ERROR (Thread-2476) [    ] o.a.z.s.ZooKeeperServer ZKShutdownHandler is not registered, so ZooKeeper server won't take any action on ERROR or SHUTDOWN server state changes
   [junit4]   2> 2473448 INFO  (TEST-FullSolrCloudDistribCmdsTest.test-seed#[B73082041491C2BE]) [    ] o.a.s.c.ZkTestServer start zk server on port:50457
   [junit4]   2> 2473455 INFO  (zkConnectionManagerCallback-2476-thread-1) [    ] o.a.s.c.c.ConnectionManager zkClient has connected
   [junit4]   2> 2473466 INFO  (zkConnectionManagerCallback-2478-thread-1) [    ] o.a.s.c.c.ConnectionManager zkClient has connected
   [junit4]   2> 2473478 INFO  (TEST-FullSolrCloudDistribCmdsTest.test-seed#[B73082041491C2BE]) [    ] o.a.s.c.AbstractZkTestCase put C:\Users\jenkins\workspace\Lucene-Solr-7.x-Windows\solr\core\src\test-files\solr\collection1\conf\solrconfig-tlog.xml to /configs/conf1/solrconfig.xml
   [junit4]   2> 2473484 INFO  (TEST-FullSolrCloudDistribCmdsTest.test-seed#[B73082041491C2BE]) [    ] o.a.s.c.AbstractZkTestCase put C:\Users\jenkins\workspace\Lucene-Solr-7.x-Windows\solr\core\src\test-files\solr\collection1\conf\schema15.xml to /configs/conf1/schema.xml
   [junit4]   2> 2473487 INFO  (TEST-FullSolrCloudDistribCmdsTest.test-seed#[B73082041491C2BE]) [    ] o.a.s.c.AbstractZkTestCase put C:\Users\jenkins\workspace\Lucene-Solr-7.x-Windows\solr\core\src\test-files\solr\collection1\conf\solrconfig.snippet.randomindexconfig.xml to /configs/conf1/solrconfig.snippet.randomindexconfig.xml
   [junit4]   2> 2473489 INFO  (TEST-FullSolrCloudDistribCmdsTest.test-seed#[B73082041491C2BE]) [    ] o.a.s.c.AbstractZkTestCase put C:\Users\jenkins\workspace\Lucene-Solr-7.x-Windows\solr\core\src\test-files\solr\collection1\conf\stopwords.txt to /configs/conf1/stopwords.txt
   [junit4]   2> 2473493 INFO  (TEST-FullSolrCloudDistribCmdsTest.test-seed#[B73082041491C2BE]) [    ] o.a.s.c.AbstractZkTestCase put C:\Users\jenkins\workspace\Lucene-Solr-7.x-Windows\solr\core\src\test-files\solr\collection1\conf\protwords.txt to /configs/conf1/protwords.txt
   [junit4]   2> 2473494 INFO  (TEST-FullSolrCloudDistribCmdsTest.test-seed#[B73082041491C2BE]) [    ] o.a.s.c.AbstractZkTestCase put C:\Users\jenkins\workspace\Lucene-Solr-7.x-Windows\solr\core\src\test-files\solr\collection1\conf\currency.xml to /configs/conf1/currency.xml
   [junit4]   2> 2473495 INFO  (TEST-FullSolrCloudDistribCmdsTest.test-seed#[B73082041491C2BE]) [    ] o.a.s.c.AbstractZkTestCase put C:\Users\jenkins\workspace\Lucene-Solr-7.x-Windows\solr\core\src\test-files\solr\collection1\conf\enumsConfig.xml to /configs/conf1/enumsConfig.xml
   [junit4]   2> 2473497 INFO  (TEST-FullSolrCloudDistribCmdsTest.test-seed#[B73082041491C2BE]) [    ] o.a.s.c.AbstractZkTestCase put C:\Users\jenkins\workspace\Lucene-Solr-7.x-Windows\solr\core\src\test-files\solr\collection1\conf\open-exchange-rates.json to /configs/conf1/open-exchange-rates.json
   [junit4]   2> 2473499 INFO  (TEST-FullSolrCloudDistribCmdsTest.test-seed#[B73082041491C2BE]) [    ] o.a.s.c.AbstractZkTestCase put C:\Users\jenkins\workspace\Lucene-Solr-7.x-Windows\solr\core\src\test-files\solr\collection1\conf\mapping-ISOLatin1Accent.txt to /configs/conf1/mapping-ISOLatin1Accent.txt
   [junit4]   2> 2473501 INFO  (TEST-FullSolrCloudDistribCmdsTest.test-seed#[B73082041491C2BE]) [    ] o.a.s.c.AbstractZkTestCase put C:\Users\jenkins\workspace\Lucene-Solr-7.x-Windows\solr\core\src\test-files\solr\collection1\conf\old_synonyms.txt to /configs/conf1/old_synonyms.txt
   [junit4]   2> 2473503 INFO  (TEST-FullSolrCloudDistribCmdsTest.test-seed#[B73082041491C2BE]) [    ] o.a.s.c.AbstractZkTestCase put C:\Users\jenkins\workspace\Lucene-Solr-7.x-Windows\solr\core\src\test-files\solr\collection1\conf\synonyms.txt to /configs/conf1/synonyms.txt
   [junit4]   2> 2473504 WARN  (NIOServerCxn.Factory:0.0.0.0/0.0.0.0:0) [    ] o.a.z.s.NIOServerCnxn caught end of stream exception
   [junit4]   2> EndOfStreamException: Unable to read additional data from client sessionid 0x160fc84c97b0001, likely client has closed socket
   [junit4]   2> 	at org.apache.zookeeper.server.NIOServerCnxn.doIO(NIOServerCnxn.java:239)
   [junit4]   2> 	at org.apache.zookeeper.server.NIOServerCnxnFactory.run(NIOServerCnxnFactory.java:203)
   [junit4]   2> 	at java.lang.Thread.run(Thread.java:748)
   [junit4]   2> 2473505 INFO  (TEST-FullSolrCloudDistribCmdsTest.test-seed#[B73082041491C2BE]) [    ] o.a.s.c.AbstractFullDistribZkTestBase Will use NRT replicas unless explicitly asked otherwise
   [junit4]   2> 2473931 INFO  (TEST-FullSolrCloudDistribCmdsTest.test-seed#[B73082041491C2BE]) [    ] o.e.j.s.Server jetty-9.3.20.v20170531
   [junit4]   2> 2473932 INFO  (TEST-FullSolrCloudDistribCmdsTest.test-seed#[B73082041491C2BE]) [    ] o.e.j.s.h.ContextHandler Started o.e.j.s.ServletContextHandler@14169cd{/uk/c,null,AVAILABLE}
   [junit4]   2> 2473932 INFO  (TEST-FullSolrCloudDistribCmdsTest.test-seed#[B73082041491C2BE]) [    ] o.e.j.s.AbstractConnector Started ServerConnector@f4ce1d{HTTP/1.1,[http/1.1]}{127.0.0.1:50464}
   [junit4]   2> 2473932 INFO  (TEST-FullSolrCloudDistribCmdsTest.test-seed#[B73082041491C2BE]) [    ] o.e.j.s.Server Started @2482317ms
   [junit4]   2> 2473932 INFO  (TEST-FullSolrCloudDistribCmdsTest.test-seed#[B73082041491C2BE]) [    ] o.a.s.c.s.e.JettySolrRunner Jetty properties: {solr.data.dir=C:\Users\jenkins\workspace\Lucene-Solr-7.x-Windows\solr\build\solr-core\test\J1\temp\solr.cloud.FullSolrCloudDistribCmdsTest_B73082041491C2BE-001\tempDir-001/control/data, hostContext=/uk/c, hostPort=50464, coreRootDirectory=C:\Users\jenkins\workspace\Lucene-Solr-7.x-Windows\solr\build\solr-core\test\J1\temp\solr.cloud.FullSolrCloudDistribCmdsTest_B73082041491C2BE-001\control-001\cores}
   [junit4]   2> 2473932 ERROR (TEST-FullSolrCloudDistribCmdsTest.test-seed#[B73082041491C2BE]) [    ] o.a.s.u.StartupLoggingUtils Missing Java Option solr.log.dir. Logging may be missing or incomplete.
   [junit4]   2> 2473934 INFO  (TEST-FullSolrCloudDistribCmdsTest.test-seed#[B73082041491C2BE]) [    ] o.a.s.s.SolrDispatchFilter  ___      _       Welcome to Apache Solr™ version 7.3.0
   [junit4]   2> 2473934 INFO  (TEST-FullSolrCloudDistribCmdsTest.test-seed#[B73082041491C2BE]) [    ] o.a.s.s.SolrDispatchFilter / __| ___| |_ _   Starting in cloud mode on port null
   [junit4]   2> 2473934 INFO  (TEST-FullSolrCloudDistribCmdsTest.test-seed#[B73082041491C2BE]) [    ] o.a.s.s.SolrDispatchFilter \__ \/ _ \ | '_|  Install dir: null
   [junit4]   2> 2473934 INFO  (TEST-FullSolrCloudDistribCmdsTest.test-seed#[B73082041491C2BE]) [    ] o.a.s.s.SolrDispatchFilter |___/\___/_|_|    Start time: 2018-01-16T01:10:49.536Z
   [junit4]   2> 2473937 INFO  (zkConnectionManagerCallback-2480-thread-1) [    ] o.a.s.c.c.ConnectionManager zkClient has connected
   [junit4]   2> 2473938 INFO  (TEST-FullSolrCloudDistribCmdsTest.test-seed#[B73082041491C2BE]) [    ] o.a.s.s.SolrDispatchFilter Loading solr.xml from SolrHome (not found in ZooKeeper)
   [junit4]   2> 2473938 INFO  (TEST-FullSolrCloudDistribCmdsTest.test-seed#[B73082041491C2BE]) [    ] o.a.s.c.SolrXmlConfig Loading container configuration from C:\Users\jenkins\workspace\Lucene-Solr-7.x-Windows\solr\build\solr-core\test\J1\temp\solr.cloud.FullSolrCloudDistribCmdsTest_B73082041491C2BE-001\control-001\solr.xml
   [junit4]   2> 2473945 INFO  (TEST-FullSolrCloudDistribCmdsTest.test-seed#[B73082041491C2BE]) [    ] o.a.s.c.SolrXmlConfig Configuration parameter autoReplicaFailoverWorkLoopDelay is ignored
   [junit4]   2> 2473945 INFO  (TEST-FullSolrCloudDistribCmdsTest.test-seed#[B73082041491C2BE]) [    ] o.a.s.c.SolrXmlConfig Configuration parameter autoReplicaFailoverBadNodeExpiration is ignored
   [junit4]   2> 2473946 INFO  (TEST-FullSolrCloudDistribCmdsTest.test-seed#[B73082041491C2BE]) [    ] o.a.s.c.SolrXmlConfig MBean server found: com.sun.jmx.mbeanserver.JmxMBeanServer@2a1f90, but no JMX reporters were configured - adding default JMX reporter.
   [junit4]   2> 2473950 INFO  (TEST-FullSolrCloudDistribCmdsTest.test-seed#[B73082041491C2BE]) [    ] o.a.s.c.ZkContainer Zookeeper client=127.0.0.1:50457/solr
   [junit4]   2> 2473952 INFO  (zkConnectionManagerCallback-2484-thread-1) [    ] o.a.s.c.c.ConnectionManager zkClient has connected
   [junit4]   2> 2473953 WARN  (NIOServerCxn.Factory:0.0.0.0/0.0.0.0:0) [    ] o.a.z.s.NIOServerCnxn caught end of stream exception
   [junit4]   2> EndOfStreamException: Unable to read additional data from client sessionid 0x160fc84c97b0003, likely client has closed socket
   [junit4]   2> 	at org.apache.zookeeper.server.NIOServerCnxn.doIO(NIOServerCnxn.java:239)
   [junit4]   2> 	at org.apache.zookeeper.server.NIOServerCnxnFactory.run(NIOServerCnxnFactory.java:203)
   [junit4]   2> 	at java.lang.Thread.run(Thread.java:748)
   [junit4]   2> 2473956 INFO  (zkConnectionManagerCallback-2486-thread-1-processing-n:127.0.0.1:50464_uk%2Fc) [n:127.0.0.1:50464_uk%2Fc    ] o.a.s.c.c.ConnectionManager zkClient has connected
   [junit4]   2> 2474031 INFO  (TEST-FullSolrCloudDistribCmdsTest.test-seed#[B73082041491C2BE]) [n:127.0.0.1:50464_uk%2Fc    ] o.a.s.c.Overseer Overseer (id=null) closing
   [junit4]   2> 2474031 INFO  (TEST-FullSolrCloudDistribCmdsTest.test-seed#[B73082041491C2BE]) [n:127.0.0.1:50464_uk%2Fc    ] o.a.s.c.OverseerElectionContext I am going to be the leader 127.0.0.1:50464_uk%2Fc
   [junit4]   2> 2474031 INFO  (TEST-FullSolrCloudDistribCmdsTest.test-seed#[B73082041491C2BE]) [n:127.0.0.1:50464_uk%2Fc    ] o.a.s.c.Overseer Overseer (id=99356839048314884-127.0.0.1:50464_uk%2Fc-n_0000000000) starting
   [junit4]   2> 2474040 INFO  (TEST-FullSolrCloudDistribCmdsTest.test-seed#[B73082041491C2BE]) [n:127.0.0.1:50464_uk%2Fc    ] o.a.s.c.ZkController Register node as live in ZooKeeper:/live_nodes/127.0.0.1:50464_uk%2Fc
   [junit4]   2> 2474047 INFO  (OverseerStateUpdate-99356839048314884-127.0.0.1:50464_uk%2Fc-n_0000000000) [n:127.0.0.1:50464_uk%2Fc    ] o.a.s.c.c.ZkStateReader Updated live nodes from ZooKeeper... (0) -> (1)
   [junit4]   2> 2474127 INFO  (TEST-FullSolrCloudDistribCmdsTest.test-seed#[B73082041491C2BE]) [n:127.0.0.1:50464_uk%2Fc    ] o.a.s.m.r.SolrJmxReporter JMX monitoring for 'solr.node' (registry 'solr.node') enabled at server: com.sun.jmx.mbeanserver.JmxMBeanServer@2a1f90
   [junit4]   2> 2474133 INFO  (TEST-FullSolrCloudDistribCmdsTest.test-seed#[B73082041491C2BE]) [n:127.0.0.1:50464_uk%2Fc    ] o.a.s.m.r.SolrJmxReporter JMX monitoring for 'solr.jvm' (registry 'solr.jvm') enabled at server: com.sun.jmx.mbeanserver.JmxMBeanServer@2a1f90
   [junit4]   2> 2474133 INFO  (TEST-FullSolrCloudDistribCmdsTest.test-seed#[B73082041491C2BE]) [n:127.0.0.1:50464_uk%2Fc    ] o.a.s.m.r.SolrJmxReporter JMX monitoring for 'solr.jetty' (registry 'solr.jetty') enabled at server: com.sun.jmx.mbeanserver.JmxMBeanServer@2a1f90
   [junit4]   2> 2474135 INFO  (TEST-FullSolrCloudDistribCmdsTest.test-seed#[B73082041491C2BE]) [n:127.0.0.1:50464_uk%2Fc    ] o.a.s.c.CorePropertiesLocator Found 0 core definitions underneath C:\Users\jenkins\workspace\Lucene-Solr-7.x-Windows\solr\build\solr-core\test\J1\temp\solr.cloud.FullSolrCloudDistribCmdsTest_B73082041491C2BE-001\control-001\cores
   [junit4]   2> 2474161 INFO  (zkConnectionManagerCallback-2492-thread-1) [    ] o.a.s.c.c.ConnectionManager zkClient has connected
   [junit4]   2> 2474162 INFO  (TEST-FullSolrCloudDistribCmdsTest.test-seed#[B73082041491C2BE]) [    ] o.a.s.c.c.ZkStateReader Updated live nodes from ZooKeeper... (0) -> (1)
   [junit4]   2> 2474162 INFO  (TEST-FullSolrCloudDistribCmdsTest.test-seed#[B73082041491C2BE]) [    ] o.a.s.c.s.i.ZkClientClusterStateProvider Cluster at 127.0.0.1:50457/solr ready
   [junit4]   2> 2474165 INFO  (qtp6142691-13429) [n:127.0.0.1:50464_uk%2Fc    ] o.a.s.h.a.CollectionsHandler Invoked Collection Action :create with params replicationFactor=1&collection.configName=conf1&name=control_collection&nrtReplicas=1&action=CREATE&numShards=1&createNodeSet=127.0.0.1:50464_uk%252Fc&wt=javabin&version=2 and sendToOCPQueue=true
   [junit4]   2> 2474168 INFO  (OverseerThreadFactory-4939-thread-1-processing-n:127.0.0.1:50464_uk%2Fc) [n:127.0.0.1:50464_uk%2Fc    ] o.a.s.c.CreateCollectionCmd Create collection control_collection
   [junit4]   2> 2474288 INFO  (qtp6142691-13427) [n:127.0.0.1:50464_uk%2Fc    ] o.a.s.h.a.CoreAdminOperation core create command qt=/admin/cores&collection.configName=conf1&newCollection=true&name=control_collection_shard1_replica_n1&action=CREATE&numShards=1&collection=control_collection&shard=shard1&wt=javabin&version=2&replicaType=NRT
   [junit4]   2> 2474289 INFO  (qtp6142691-13427) [n:127.0.0.1:50464_uk%2Fc    ] o.a.s.c.TransientSolrCoreCacheDefault Allocating transient cache for 4 transient cores
   [junit4]   2> 2474395 INFO  (zkCallback-2485-thread-1-processing-n:127.0.0.1:50464_uk%2Fc) [n:127.0.0.1:50464_uk%2Fc    ] o.a.s.c.c.ZkStateReader A cluster state change: [WatchedEvent state:SyncConnected type:NodeDataChanged path:/collections/control_collection/state.json] for collection [control_collection] has occurred - updating... (live nodes size: [1])
   [junit4]   2> 2475316 INFO  (qtp6142691-13427) [n:127.0.0.1:50464_uk%2Fc c:control_collection s:shard1  x:control_collection_shard1_replica_n1] o.a.s.c.SolrConfig Using Lucene MatchVersion: 7.3.0
   [junit4]   2> 2475327 INFO  (qtp6142691-13427) [n:127.0.0.1:50464_uk%2Fc c:control_collection s:shard1  x:control_collection_shard1_replica_n1] o.a.s.s.IndexSchema [control_collection_shard1_replica_n1] Schema name=test
   [junit4]   2> 2475396 INFO  (qtp6142691-13427) [n:127.0.0.1:50464_uk%2Fc c:control_collection s:shard1  x:control_collection_shard1_replica_n1] o.a.s.s.IndexSchema Loaded schema test/1.6 with uniqueid field id
   [junit4]   2> 2475410 INFO  (qtp6142691-13427) [n:127.0.0.1:50464_uk%2Fc c:control_collection s:shard1  x:control_collection_shard1_replica_n1] o.a.s.c.CoreContainer Creating SolrCore 'control_collection_shard1_replica_n1' using configuration from collection control_collection, trusted=true
   [junit4]   2> 2475411 INFO  (qtp6142691-13427) [n:127.0.0.1:50464_uk%2Fc c:control_collection s:shard1  x:control_collection_shard1_replica_n1] o.a.s.m.r.SolrJmxReporter JMX monitoring for 'solr.core.control_collection.shard1.replica_n1' (registry 'solr.core.control_collection.shard1.replica_n1') enabled at server: com.sun.jmx.mbeanserver.JmxMBeanServer@2a1f90
   [junit4]   2> 2475411 INFO  (qtp6142691-13427) [n:127.0.0.1:50464_uk%2Fc c:control_collection s:shard1  x:control_collection_shard1_replica_n1] o.a.s.c.SolrCore solr.RecoveryStrategy.Builder
   [junit4]   2> 2475411 INFO  (qtp6142691-13427) [n:127.0.0.1:50464_uk%2Fc c:control_collection s:shard1  x:control_collection_shard1_replica_n1] o.a.s.c.SolrCore [[control_collection_shard1_replica_n1] ] Opening new SolrCore at [C:\Users\jenkins\workspace\Lucene-Solr-7.x-Windows\solr\build\solr-core\test\J1\temp\solr.cloud.FullSolrCloudDistribCmdsTest_B73082041491C2BE-001\control-001\cores\control_collection_shard1_replica_n1], dataDir=[C:\Users\jenkins\workspace\Lucene-Solr-7.x-Windows\solr\build\solr-core\test\J1\temp\solr.cloud.FullSolrCloudDistribCmdsTest_B73082041491C2BE-001\control-001\cores\control_collection_shard1_replica_n1\data\]
   [junit4]   2> 2475413 INFO  (qtp6142691-13427) [n:127.0.0.1:50464_uk%2Fc c:control_collection s:shard1  x:control_collection_shard1_replica_n1] o.a.s.u.RandomMergePolicy RandomMergePolicy wrapping class org.apache.lucene.index.TieredMergePolicy: [TieredMergePolicy: maxMergeAtOnce=18, maxMergeAtOnceExplicit=48, maxMergedSegmentMB=23.126953125, floorSegmentMB=1.1357421875, forceMergeDeletesPctAllowed=11.306249523787672, segmentsPerTier=12.0, maxCFSSegmentSizeMB=8.796093022207999E12, noCFSRatio=0.3953567058796913
   [junit4]   2> 2475415 WARN  (qtp6142691-13427) [n:127.0.0.1:50464_uk%2Fc c:control_collection s:shard1  x:control_collection_shard1_replica_n1] o.a.s.c.RequestHandlers INVALID paramSet a in requestHandler {type = requestHandler,name = /dump,class = DumpRequestHandler,attributes = {initParams=a, name=/dump, class=DumpRequestHandler},args = {defaults={a=A,b=B}}}
   [junit4]   2> 2475486 INFO  (qtp6142691-13427) [n:127.0.0.1:50464_uk%2Fc c:control_collection s:shard1  x:control_collection_shard1_replica_n1] o.a.s.u.UpdateHandler Using UpdateLog implementation: org.apache.solr.update.UpdateLog
   [junit4]   2> 2475486 INFO  (qtp6142691-13427) [n:127.0.0.1:50464_uk%2Fc c:control_collection s:shard1  x:control_collection_shard1_replica_n1] o.a.s.u.UpdateLog Initializing UpdateLog: dataDir= defaultSyncLevel=FLUSH numRecordsToKeep=100 maxNumLogsToKeep=10 numVersionBuckets=65536
   [junit4]   2> 2475489 INFO  (qtp6142691-13427) [n:127.0.0.1:50464_uk%2Fc c:control_collection s:shard1  x:control_collection_shard1_replica_n1] o.a.s.u.CommitTracker Hard AutoCommit: disabled
   [junit4]   2> 2475489 INFO  (qtp6142691-13427) [n:127.0.0.1:50464_uk%2Fc c:control_collection s:shard1  x:control_collection_shard1_replica_n1] o.a.s.u.CommitTracker Soft AutoCommit: disabled
   [junit4]   2> 2475490 INFO  (qtp6142691-13427) [n:127.0.0.1:50464_uk%2Fc c:control_collection s:shard1  x:control_collection_shard1_replica_n1] o.a.s.u.RandomMergePolicy RandomMergePolicy wrapping class org.apache.lucene.index.LogByteSizeMergePolicy: [LogByteSizeMergePolicy: minMergeSize=1677721, mergeFactor=11, maxMergeSize=2147483648, maxMergeSizeForForcedMerge=9223372036854775807, calibrateSizeByDeletes=false, maxMergeDocs=2147483647, maxCFSSegmentSizeMB=8.796093022207999E12, noCFSRatio=0.3130811722640433]
   [junit4]   2> 2475490 INFO  (qtp6142691-13427) [n:127.0.0.1:50464_uk%2Fc c:control_collection s:shard1  x:control_collection_shard1_replica_n1] o.a.s.s.SolrIndexSearcher Opening [Searcher@d1a44e[control_collection_shard1_replica_n1] main]
   [junit4]   2> 2475491 INFO  (qtp6142691-13427) [n:127.0.0.1:50464_uk%2Fc c:control_collection s:shard1  x:control_collection_shard1_replica_n1] o.a.s.r.ManagedResourceStorage Configured ZooKeeperStorageIO with znodeBase: /configs/conf1
   [junit4]   2> 2475491 INFO  (qtp6142691-13427) [n:127.0.0.1:50464_uk%2Fc c:control_collection s:shard1  x:control_collection_shard1_replica_n1] o.a.s.r.ManagedResourceStorage Loaded null at path _rest_managed.json using ZooKeeperStorageIO:path=/configs/conf1
   [junit4]   2> 2475492 INFO  (qtp6142691-13427) [n:127.0.0.1:50464_uk%2Fc c:control_collection s:shard1  x:control_collection_shard1_replica_n1] o.a.s.h.ReplicationHandler Commits will be reserved for 10000ms.
   [junit4]   2> 2475492 INFO  (qtp6142691-13427) [n:127.0.0.1:50464_uk%2Fc c:control_collection s:shard1  x:control_collection_shard1_replica_n1] o.a.s.u.UpdateLog Could not find max version in index or recent updates, using new clock 1589709427015942144
   [junit4]   2> 2475492 INFO  (searcherExecutor-4942-thread-1-processing-n:127.0.0.1:50464_uk%2Fc x:control_collection_shard1_replica_n1 s:shard1 c:control_collection) [n:127.0.0.1:50464_uk%2Fc c:control_collection s:shard1  x:control_collection_shard1_replica_n1] o.a.s.c.SolrCore [control_collection_shard1_replica_n1] Registered new searcher Searcher@d1a44e[control_collection_shard1_replica_n1] main{ExitableDirectoryReader(UninvertingDirectoryReader())}
   [junit4]   2> 2475497 INFO  (qtp6142691-13427) [n:127.0.0.1:50464_uk%2Fc c:control_collection s:shard1  x:control_collection_shard1_replica_n1] o.a.s.c.ShardLeaderElectionContext Enough replicas found to continue.
   [junit4]   2> 2475497 INFO  (qtp6142691-13427) [n:127.0.0.1:50464_uk%2Fc c:control_collection s:shard1  x:control_collection_shard1_replica_n1] o.a.s.c.ShardLeaderElectionContext I may be the new leader - try and sync
   [junit4]   2> 2475497 INFO  (qtp6142691-13427) [n:127.0.0.1:50464_uk%2Fc c:control_collection s:shard1  x:control_collection_shard1_replica_n1] o.a.s.c.SyncStrategy Sync replicas to http://127.0.0.1:50464/uk/c/control_collection_shard1_replica_n1/
   [junit4]   2> 2475497 INFO  (qtp6142691-13427) [n:127.0.0.1:50464_uk%2Fc c:control_collection s:shard1  x:control_collection_shard1_replica_n1] o.a.s.c.SyncStrategy Sync Success - now sync replicas to me
   [junit4]   2> 2475497 INFO  (qtp6142691-13427) [n:127.0.0.1:50464_uk%2Fc c:control_collection s:shard1  x:control_collection_shard1_replica_n1] o.a.s.c.SyncStrategy http://127.0.0.1:50464/uk/c/control_collection_shard1_replica_n1/ has no replicas
   [junit4]   2> 2475497 INFO  (qtp6142691-13427) [n:127.0.0.1:50464_uk%2Fc c:control_collection s:shard1  x:control_collection_shard1_replica_n1] o.a.s.c.ShardLeaderElectionContext Found all replicas participating in election, clear LIR
   [junit4]   2> 2475500 INFO  (qtp6142691-13427) [n:127.0.0.1:50464_uk%2Fc c:control_collection s:shard1  x:control_collection_shard1_replica_n1] o.a.s.c.ShardLeaderElectionContext I am the new leader: http://127.0.0.1:50464/uk/c/control_collection_shard1_replica_n1/ shard1
   [junit4]   2> 2475602 INFO  (zkCallback-2485-thread-1-processing-n:127.0.0.1:50464_uk%2Fc) [n:127.0.0.1:50464_uk%2Fc    ] o.a.s.c.c.ZkStateReader A cluster state change: [WatchedEvent state:SyncConnected type:NodeDataChanged path:/collections/control_collection/state.json] for collection [control_collection] has occurred - updating... (live nodes size: [1])
   [junit4]   2> 2475654 INFO  (qtp6142691-13427) [n:127.0.0.1:50464_uk%2Fc c:control_collection s:shard1  x:control_collection_shard1_replica_n1] o.a.s.c.ZkController I am the leader, no recovery necessary
   [junit4]   2> 2475656 INFO  (qtp6142691-13427) [n:127.0.0.1:50464_uk%2Fc c:control_collection s:shard1  x:control_collection_shard1_replica_n1] o.a.s.s.HttpSolrCall [admin] webapp=null path=/admin/cores params={qt=/admin/cores&collection.configName=conf1&newCollection=true&name=control_collection_shard1_replica_n1&action=CREATE&numShards=1&collection=control_collection&shard=shard1&wt=javabin&version=2&replicaType=NRT} status=0 QTime=1367
   [junit4]   2> 2475658 INFO  (qtp6142691-13429) [n:127.0.0.1:50464_uk%2Fc    ] o.a.s.h.a.CollectionsHandler Wait for new collection to be active for at most 30 seconds. Check all shard replicas
   [junit4]   2> 2475756 INFO  (zkCallback-2485-thread-2-processing-n:127.0.0.1:50464_uk%2Fc) [n:127.0.0.1:50464_uk%2Fc    ] o.a.s.c.c.ZkStateReader A cluster state change: [WatchedEvent state:SyncConnected type:NodeDataChanged path:/collections/control_collection/state.json] for collection [control_collection] has occurred - updating... (live nodes size: [1])
   [junit4]   2> 2476171 INFO  (OverseerCollectionConfigSetProcessor-99356839048314884-127.0.0.1:50464_uk%2Fc-n_0000000000) [n:127.0.0.1:50464_uk%2Fc    ] o.a.s.c.OverseerTaskQueue Response ZK path: /overseer/collection-queue-work/qnr-0000000000 doesn't exist.  Requestor may have disconnected from ZooKeeper
   [junit4]   2> 2476659 INFO  (qtp6142691-13429) [n:127.0.0.1:50464_uk%2Fc    ] o.a.s.s.HttpSolrCall [admin] webapp=null path=/admin/collections params={replicationFactor=1&collection.configName=conf1&name=control_collection&nrtReplicas=1&action=CREATE&numShards=1&createNodeSet=127.0.0.1:50464_uk%252Fc&wt=javabin&version=2} status=0 QTime=2493
   [junit4]   2> 2476666 INFO  (zkConnectionManagerCallback-2496-thread-1) [    ] o.a.s.c.c.ConnectionManager zkClient has connected
   [junit4]   2> 2476667 INFO  (TEST-FullSolrCloudDistribCmdsTest.test-seed#[B73082041491C2BE]) [    ] o.a.s.c.c.ZkStateReader Updated live nodes from ZooKeeper... (0) -> (1)
   [junit4]   2> 2476669 INFO  (TEST-FullSolrCloudDistribCmdsTest.test-seed#[B73082041491C2BE]) [    ] o.a.s.c.s.i.ZkClientClusterStateProvider Cluster at 127.0.0.1:50457/solr ready
   [junit4]   2> 2476669 INFO  (TEST-FullSolrCloudDistribCmdsTest.test-seed#[B73082041491C2BE]) [    ] o.a.s.c.ChaosMonkey monkey: init - expire sessions:false cause connection loss:false
   [junit4]   2> 2476669 INFO  (qtp6142691-13423) [n:127.0.0.1:50464_uk%2Fc    ] o.a.s.h.a.CollectionsHandler Invoked Collection Action :create with params replicationFactor=1&collection.configName=conf1&name=collection1&nrtReplicas=1&action=CREATE&numShards=3&createNodeSet=&stateFormat=1&wt=javabin&version=2 and sendToOCPQueue=true
   [junit4]   2> 2476671 INFO  (OverseerThreadFactory-4939-thread-2-processing-n:127.0.0.1:50464_uk%2Fc) [n:127.0.0.1:50464_uk%2Fc    ] o.a.s.c.CreateCollectionCmd Create collection collection1
   [junit4]   2> 2476672 WARN  (OverseerThreadFactory-4939-thread-2-processing-n:127.0.0.1:50464_uk%2Fc) [n:127.0.0.1:50464_uk%2Fc    ] o.a.s.c.CreateCollectionCmd It is unusual to create a collection (collection1) without cores.
   [junit4]   2> 2476877 INFO  (qtp6142691-13423) [n:127.0.0.1:50464_uk%2Fc    ] o.a.s.h.a.CollectionsHandler Wait for new collection to be active for at most 30 seconds. Check all shard replicas
   [junit4]   2> 2476877 INFO  (qtp6142691-13423) [n:127.0.0.1:50464_uk%2Fc    ] o.a.s.s.HttpSolrCall [admin] webapp=null path=/admin/collections params={replicationFactor=1&collection.configName=conf1&name=collection1&nrtReplicas=1&action=CREATE&numShards=3&createNodeSet=&stateFormat=1&wt=javabin&version=2} status=0 QTime=208
   [junit4]   2> 2477371 INFO  (TEST-FullSolrCloudDistribCmdsTest.test-seed#[B73082041491C2BE]) [    ] o.a.s.c.AbstractFullDistribZkTestBase create jetty 1 in directory C:\Users\jenkins\workspace\Lucene-Solr-7.x-Windows\solr\build\solr-core\test\J1\temp\solr.cloud.FullSolrCloudDistribCmdsTest_B73082041491C2BE-001\shard-1-001 of type NRT
   [junit4]   2> 2477372 INFO  (TEST-FullSolrCloudDistribCmdsTest.test-seed#[B73082041491C2BE]) [    ] o.e.j.s.Server jetty-9.3.20.v20170531
   [junit4]   2> 2477372 INFO  (TEST-FullSolrCloudDistribCmdsTest.test-seed#[B73082041491C2BE]) [    ] o.e.j.s.h.ContextHandler Started o.e.j.s.ServletContextHandler@157b379{/uk/c,null,AVAILABLE}
   [junit4]   2> 2477373 INFO  (TEST-FullSolrCloudDistribCmdsTest.test-seed#[B73082041491C2BE]) [    ] o.e.j.s.AbstractConnector Started ServerConnector@99cc35{HTTP/1.1,[http/1.1]}{127.0.0.1:50487}
   [junit4]   2> 2477373 INFO  (TEST-FullSolrCloudDistribCmdsTest.test-seed#[B73082041491C2BE]) [    ] o.e.j.s.Server Started @2485757ms
   [junit4]   2> 2477373 INFO  (TEST-FullSolrCloudDistribCmdsTest.test-seed#[B73082041491C2BE]) [    ] o.a.s.c.s.e.JettySolrRunner Jetty properties: {solr.data.dir=C:\Users\jenkins\workspace\Lucene-Solr-7.x-Windows\solr\build\solr-core\test\J1\temp\solr.cloud.FullSolrCloudDistribCmdsTest_B73082041491C2BE-001\tempDir-001/jetty1, solrconfig=solrconfig.xml, hostContext=/uk/c, hostPort=50487, coreRootDirectory=C:\Users\jenkins\workspace\Lucene-Solr-7.x-Windows\solr\build\solr-core\test\J1\temp\solr.cloud.FullSolrCloudDistribCmdsTest_B73082041491C2BE-001\shard-1-001\cores}
   [junit4]   2> 2477373 ERROR (TEST-FullSolrCloudDistribCmdsTest.test-seed#[B73082041491C2BE]) [    ] o.a.s.u.StartupLoggingUtils Missing Java Option solr.log.dir. Logging may be missing or incomplete.
   [junit4]   2> 2477373 INFO  (TEST-FullSolrCloudDistribCmdsTest.test-seed#[B73082041491C2BE]) [    ] o.a.s.s.SolrDispatchFilter  ___      _       Welcome to Apache Solr™ version 7.3.0
   [junit4]   2> 2477375 INFO  (TEST-FullSolrCloudDistribCmdsTest.test-seed#[B73082041491C2BE]) [    ] o.a.s.s.SolrDispatchFilter / __| ___| |_ _   Starting in cloud mode on port null
   [junit4]   2> 2477375 INFO  (TEST-FullSolrCloudDistribCmdsTest.test-seed#[B73082041491C2BE]) [    ] o.a.s.s.SolrDispatchFilter \__ \/ _ \ | '_|  Install dir: null
   [junit4]   2> 2477375 INFO  (TEST-FullSolrCloudDistribCmdsTest.test-seed#[B73082041491C2BE]) [    ] o.a.s.s.SolrDispatchFilter |___/\___/_|_|    Start time: 2018-01-16T01:10:52.977Z
   [junit4]   2> 2477377 INFO  (zkConnectionManagerCallback-2498-thread-1) [    ] o.a.s.c.c.ConnectionManager zkClient has connected
   [junit4]   2> 2477378 WARN  (NIOServerCxn.Factory:0.0.0.0/0.0.0.0:0) [    ] o.a.z.s.NIOServerCnxn caught end of stream exception
   [junit4]   2> EndOfStreamException: Unable to read additional data from client sessionid 0x160fc84c97b0007, likely client has closed socket
   [junit4]   2> 	at org.apache.zookeeper.server.NIOServerCnxn.doIO(NIOServerCnxn.java:239)
   [junit4]   2> 	at org.apache.zookeeper.server.NIOServerCnxnFactory.run(NIOServerCnxnFactory.java:203)
   [junit4]   2> 	at java.lang.Thread.run(Thread.java:748)
   [junit4]   2> 2477379 INFO  (TEST-FullSolrCloudDistribCmdsTest.test-seed#[B73082041491C2BE]) [    ] o.a.s.s.SolrDispatchFilter Loading solr.xml from SolrHome (not found in ZooKeeper)
   [junit4]   2> 2477379 INFO  (TEST-FullSolrCloudDistribCmdsTest.test-seed#[B73082041491C2BE]) [    ] o.a.s.c.SolrXmlConfig Loading container configuration from C:\Users\jenkins\workspace\Lucene-Solr-7.x-Windows\solr\build\solr-core\test\J1\temp\solr.cloud.FullSolrCloudDistribCmdsTest_B73082041491C2BE-001\shard-1-001\solr.xml
   [junit4]   2> 2477384 INFO  (TEST-FullSolrCloudDistribCmdsTest.test-seed#[B73082041491C2BE]) [    ] o.a.s.c.SolrXmlConfig Configuration parameter autoReplicaFailoverWorkLoopDelay is ignored
   [junit4]   2> 2477384 INFO  (TEST-FullSolrCloudDistribCmdsTest.test-seed#[B73082041491C2BE]) [    ] o.a.s.c.SolrXmlConfig Configuration parameter autoReplicaFailoverBadNodeExpiration is ignored
   [junit4]   2> 2477385 INFO  (TEST-FullSolrCloudDistribCmdsTest.test-seed#[B73082041491C2BE]) [    ] o.a.s.c.SolrXmlConfig MBean server found: com.sun.jmx.mbeanserver.JmxMBeanServer@2a1f90, but no JMX reporters were configured - adding default JMX reporter.
   [junit4]   2> 2477390 INFO  (TEST-FullSolrCloudDistribCmdsTest.test-seed#[B73082041491C2BE]) [    ] o.a.s.c.ZkContainer Zookeeper client=127.0.0.1:50457/solr
   [junit4]   2> 2477391 INFO  (zkConnectionManagerCallback-2502-thread-1) [    ] o.a.s.c.c.ConnectionManager zkClient has connected
   [junit4]   2> 2477395 INFO  (zkConnectionManagerCallback-2504-thread-1-processing-n:127.0.0.1:50487_uk%2Fc) [n:127.0.0.1:50487_uk%2Fc    ] o.a.s.c.c.ConnectionManager zkClient has connected
   [junit4]   2> 2477401 INFO  (TEST-FullSolrCloudDistribCmdsTest.test-seed#[B73082041491C2BE]) [n:127.0.0.1:50487_uk%2Fc    ] o.a.s.c.c.ZkStateReader Updated live nodes from ZooKeeper... (0) -> (1)
   [junit4]   2> 2477403 INFO  (TEST-FullSolrCloudDistribCmdsTest.test-seed#[B73082041491C2BE]) [n:127.0.0.1:50487_uk%2Fc    ] o.a.s.c.Overseer Overseer (id=null) closing
   [junit4]   2> 2477405 INFO  (TEST-FullSolrCloudDistribCmdsTest.test-seed#[B73082041491C2BE]) [n:127.0.0.1:50487_uk%2Fc    ] o.a.s.c.ZkController Register node as live in ZooKeeper:/live_nodes/127.0.0.1:50487_uk%2Fc
   [junit4]   2> 2477406 INFO  (zkCallback-2485-thread-2-processing-n:127.0.0.1:50464_uk%2Fc) [n:127.0.0.1:50464_uk%2Fc    ] o.a.s.c.c.ZkStateReader Updated live nodes from ZooKeeper... (1) -> (2)
   [junit4]   2> 2477406 INFO  (zkCallback-2495-thread-1) [    ] o.a.s.c.c.ZkStateReader Updated live nodes from ZooKeeper... (1) -> (2)
   [junit4]   2> 2477407 INFO  (zkCallback-2503-thread-1-processing-n:127.0.0.1:50487_uk%2Fc) [n:127.0.0.1:50487_uk%2Fc    ] o.a.s.c.c.ZkStateReader Updated live nodes from ZooKeeper... (1) -> (2)
   [junit4]   2> 2477536 INFO  (TEST-FullSolrCloudDistribCmdsTest.test-seed#[B73082041491C2BE]) [n:127.0.0.1:50487_uk%2Fc    ] o.a.s.m.r.SolrJmxReporter JMX monitoring for 'solr.node' (registry 'solr.node') enabled at server: com.sun.jmx.mbeanserver.JmxMBeanServer@2a1f90
   [junit4]   2> 2477542 INFO  (TEST-FullSolrCloudDistribCmdsTest.test-seed#[B73082041491C2BE]) [n:127.0.0.1:50487_uk%2Fc    ] o.a.s.m.r.SolrJmxReporter JMX monitoring for 'solr.jvm' (registry 'solr.jvm') enabled at server: com.sun.jmx.mbeanserver.JmxMBeanServer@2a1f90
   [junit4]   2> 2477543 INFO  (TEST-FullSo

[...truncated too long message...]

 reporters for registry=solr.core.collection1, tag=3317134
   [junit4]   2> 262879 INFO  (coreCloseExecutor-1212-thread-1) [    x:collection1] o.a.s.m.r.SolrJmxReporter Closing reporter [org.apache.solr.metrics.reporters.SolrJmxReporter@f7a438: rootName = null, domain = solr.core.collection1, service url = null, agent id = null] for registry solr.core.collection1 / com.codahale.metrics.MetricRegistry@186812d
   [junit4]   2> 262901 INFO  (TEST-SchemaTest.testDeleteFieldTypeAccuracy-seed#[C36D19DD3401DA4F]) [    ] o.e.j.s.h.ContextHandler Stopped o.e.j.s.ServletContextHandler@50e65c{/solr,null,UNAVAILABLE}
   [junit4]   2> 262903 INFO  (TEST-SchemaTest.testDeleteFieldTypeAccuracy-seed#[C36D19DD3401DA4F]) [    ] o.a.s.SolrTestCaseJ4 ###Ending testDeleteFieldTypeAccuracy
   [junit4]   2> 262904 INFO  (SUITE-SchemaTest-seed#[C36D19DD3401DA4F]-worker) [    ] o.a.s.SolrTestCaseJ4 ------------------------------------------------------- Done waiting for tracked resources to be released
   [junit4]   2> NOTE: test params are: codec=Asserting(Lucene70): {}, docValues:{}, maxPointsInLeafNode=580, maxMBSortInHeap=5.329346736847651, sim=RandomSimilarity(queryNorm=true): {}, locale=hu-HU, timezone=Etc/Zulu
   [junit4]   2> NOTE: Windows 10 10.0 x86/Oracle Corporation 1.8.0_144 (32-bit)/cpus=3,threads=1,free=61325096,total=296747008
   [junit4]   2> NOTE: All tests run in this JVM: [AppendEvaluatorTest, SineEvaluatorTest, SolrExampleXMLTest, CloudSolrClientBuilderTest, EmpiricalDistributionEvaluatorTest, GraphTest, JettyWebappTest, TestXMLEscaping, HyperbolicSineEvaluatorTest, FloorEvaluatorTest, TestBatchUpdate, NormalDistributionEvaluatorTest, NotEvaluatorTest, TestCoreAdmin, ExclusiveOrEvaluatorTest, ConcatOperationTest, GreaterThanEvaluatorTest, SolrDocumentTest, FieldAnalysisResponseTest, AddEvaluatorTest, TestRetryUtil, SolrExampleStreamingTest, ShardParamsTest, TestCloudSolrClientConnections, CosineEvaluatorTest, TestV1toV2ApiMapper, NoOpResponseParserTest, TestUpdateRequestCodec, TestSpellCheckResponse, TestCollectionAdminRequest, TermsResponseTest, JdbcTest, TestHash, CumulativeProbabilityEvaluatorTest, UsingSolrJRefGuideExamplesTest, SolrExampleStreamingBinaryTest, SolrExampleEmbeddedTest, ModifiableSolrParamsTest, ClientUtilsTest, AnlysisResponseBaseTest, CollectionAdminRequestRequiredParamsTest, TestLBHttpSolrClient, CloudSolrClientCacheTest, CloudSolrClientMultiConstructorTest, CloudSolrClientTest, StreamExpressionToExpessionTest, StreamExpressionToExplanationTest, StreamingTest, AndEvaluatorTest, ArcSineEvaluatorTest, ArcTangentEvaluatorTest, ArrayEvaluatorTest, CeilingEvaluatorTest, CorrelationEvaluatorTest, DivideEvaluatorTest, EqualToEvaluatorTest, FieldValueEvaluatorTest, GreaterThanEqualToEvaluatorTest, HyperbolicTangentEvaluatorTest, LengthEvaluatorTest, LessThanEvaluatorTest, MultiplyEvaluatorTest, NaturalLogEvaluatorTest, PowerEvaluatorTest, RecursiveEvaluatorTest, RegressionEvaluatorTest, ReverseEvaluatorTest, RoundEvaluatorTest, SubtractEvaluatorTest, TangentEvaluatorTest, UniformDistributionEvaluatorTest, UuidEvaluatorTest, SchemaTest]
   [junit4]   2> NOTE: reproduce with: ant test  -Dtestcase=SchemaTest -Dtests.seed=C36D19DD3401DA4F -Dtests.slow=true -Dtests.locale=hu-HU -Dtests.timezone=Etc/Zulu -Dtests.asserts=true -Dtests.file.encoding=ISO-8859-1
   [junit4] ERROR   0.00s J0 | SchemaTest (suite) <<<
   [junit4]    > Throwable #1: java.io.IOException: Could not remove the following files (in the order of attempts):
   [junit4]    >    C:\Users\jenkins\workspace\Lucene-Solr-7.x-Windows\solr\build\solr-solrj\test\J0\temp\solr.client.solrj.request.SchemaTest_C36D19DD3401DA4F-001\init-core-data-001: java.nio.file.AccessDeniedException: C:\Users\jenkins\workspace\Lucene-Solr-7.x-Windows\solr\build\solr-solrj\test\J0\temp\solr.client.solrj.request.SchemaTest_C36D19DD3401DA4F-001\init-core-data-001
   [junit4]    > 	at __randomizedtesting.SeedInfo.seed([C36D19DD3401DA4F]:0)
   [junit4]    > 	at org.apache.lucene.util.IOUtils.rm(IOUtils.java:329)
   [junit4]    > 	at java.lang.Thread.run(Thread.java:748)
   [junit4] Completed [135/146 (1!)] on J0 in 62.94s, 35 tests, 1 error <<< FAILURES!

[...truncated 1488 lines...]
   [junit4] Suite: org.apache.solr.update.processor.TestOpenNLPExtractNamedEntitiesUpdateProcessorFactory
   [junit4]   2> log4j:WARN No appenders could be found for logger (org.apache.solr.SolrTestCaseJ4).
   [junit4]   2> log4j:WARN Please initialize the log4j system properly.
   [junit4]   2> log4j:WARN See http://logging.apache.org/log4j/1.2/faq.html#noconfig for more info.
   [junit4]   2> Creating dataDir: C:\Users\jenkins\workspace\Lucene-Solr-7.x-Windows\solr\build\contrib\solr-analysis-extras\test\J1\temp\solr.update.processor.TestOpenNLPExtractNamedEntitiesUpdateProcessorFactory_F83E1BACA71E4C1E-001\init-core-data-001
   [junit4]   2> NOTE: test params are: codec=FastDecompressionCompressingStoredFields(storedFieldsFormat=CompressingStoredFieldsFormat(compressionMode=FAST_DECOMPRESSION, chunkSize=23697, maxDocsPerChunk=9, blockSize=470), termVectorsFormat=CompressingTermVectorsFormat(compressionMode=FAST_DECOMPRESSION, chunkSize=23697, blockSize=470)), sim=RandomSimilarity(queryNorm=false): {}, locale=es-PA, timezone=Africa/Douala
   [junit4]   2> NOTE: Windows 10 10.0 x86/Oracle Corporation 1.8.0_144 (32-bit)/cpus=3,threads=1,free=31094512,total=67108864
   [junit4]   2> NOTE: All tests run in this JVM: [TestOpenNLPExtractNamedEntitiesUpdateProcessorFactory]
   [junit4]   2> NOTE: reproduce with: ant test  -Dtestcase=TestOpenNLPExtractNamedEntitiesUpdateProcessorFactory -Dtests.seed=F83E1BACA71E4C1E -Dtests.slow=true -Dtests.locale=es-PA -Dtests.timezone=Africa/Douala -Dtests.asserts=true -Dtests.file.encoding=ISO-8859-1
   [junit4] ERROR   0.00s J1 | TestOpenNLPExtractNamedEntitiesUpdateProcessorFactory (suite) <<<
   [junit4]    > Throwable #1: java.io.IOException: Could not remove the following files (in the order of attempts):
   [junit4]    >    C:\Users\jenkins\workspace\Lucene-Solr-7.x-Windows\solr\build\contrib\solr-analysis-extras\test\J1\temp\solr.update.processor.TestOpenNLPExtractNamedEntitiesUpdateProcessorFactory_F83E1BACA71E4C1E-001\tempDir-001\collection1\conf: java.nio.file.DirectoryNotEmptyException: C:\Users\jenkins\workspace\Lucene-Solr-7.x-Windows\solr\build\contrib\solr-analysis-extras\test\J1\temp\solr.update.processor.TestOpenNLPExtractNamedEntitiesUpdateProcessorFactory_F83E1BACA71E4C1E-001\tempDir-001\collection1\conf
   [junit4]    >    C:\Users\jenkins\workspace\Lucene-Solr-7.x-Windows\solr\build\contrib\solr-analysis-extras\test\J1\temp\solr.update.processor.TestOpenNLPExtractNamedEntitiesUpdateProcessorFactory_F83E1BACA71E4C1E-001\tempDir-001\collection1: java.nio.file.DirectoryNotEmptyException: C:\Users\jenkins\workspace\Lucene-Solr-7.x-Windows\solr\build\contrib\solr-analysis-extras\test\J1\temp\solr.update.processor.TestOpenNLPExtractNamedEntitiesUpdateProcessorFactory_F83E1BACA71E4C1E-001\tempDir-001\collection1
   [junit4]    >    C:\Users\jenkins\workspace\Lucene-Solr-7.x-Windows\solr\build\contrib\solr-analysis-extras\test\J1\temp\solr.update.processor.TestOpenNLPExtractNamedEntitiesUpdateProcessorFactory_F83E1BACA71E4C1E-001\tempDir-001: java.nio.file.DirectoryNotEmptyException: C:\Users\jenkins\workspace\Lucene-Solr-7.x-Windows\solr\build\contrib\solr-analysis-extras\test\J1\temp\solr.update.processor.TestOpenNLPExtractNamedEntitiesUpdateProcessorFactory_F83E1BACA71E4C1E-001\tempDir-001
   [junit4]    >    C:\Users\jenkins\workspace\Lucene-Solr-7.x-Windows\solr\build\contrib\solr-analysis-extras\test\J1\temp\solr.update.processor.TestOpenNLPExtractNamedEntitiesUpdateProcessorFactory_F83E1BACA71E4C1E-001\tempDir-001\collection1\conf\en-test-tokenizer.bin: java.nio.file.AccessDeniedException: C:\Users\jenkins\workspace\Lucene-Solr-7.x-Windows\solr\build\contrib\solr-analysis-extras\test\J1\temp\solr.update.processor.TestOpenNLPExtractNamedEntitiesUpdateProcessorFactory_F83E1BACA71E4C1E-001\tempDir-001\collection1\conf\en-test-tokenizer.bin
   [junit4]    >    C:\Users\jenkins\workspace\Lucene-Solr-7.x-Windows\solr\build\contrib\solr-analysis-extras\test\J1\temp\solr.update.processor.TestOpenNLPExtractNamedEntitiesUpdateProcessorFactory_F83E1BACA71E4C1E-001\tempDir-001\collection1\conf\en-test-ner-person.bin: java.nio.file.AccessDeniedException: C:\Users\jenkins\workspace\Lucene-Solr-7.x-Windows\solr\build\contrib\solr-analysis-extras\test\J1\temp\solr.update.processor.TestOpenNLPExtractNamedEntitiesUpdateProcessorFactory_F83E1BACA71E4C1E-001\tempDir-001\collection1\conf\en-test-ner-person.bin
   [junit4]    >    C:\Users\jenkins\workspace\Lucene-Solr-7.x-Windows\solr\build\contrib\solr-analysis-extras\test\J1\temp\solr.update.processor.TestOpenNLPExtractNamedEntitiesUpdateProcessorFactory_F83E1BACA71E4C1E-001\tempDir-001\collection1\conf\en-test-sent.bin: java.nio.file.AccessDeniedException: C:\Users\jenkins\workspace\Lucene-Solr-7.x-Windows\solr\build\contrib\solr-analysis-extras\test\J1\temp\solr.update.processor.TestOpenNLPExtractNamedEntitiesUpdateProcessorFactory_F83E1BACA71E4C1E-001\tempDir-001\collection1\conf\en-test-sent.bin
   [junit4]    >    C:\Users\jenkins\workspace\Lucene-Solr-7.x-Windows\solr\build\contrib\solr-analysis-extras\test\J1\temp\solr.update.processor.TestOpenNLPExtractNamedEntitiesUpdateProcessorFactory_F83E1BACA71E4C1E-001: java.nio.file.DirectoryNotEmptyException: C:\Users\jenkins\workspace\Lucene-Solr-7.x-Windows\solr\build\contrib\solr-analysis-extras\test\J1\temp\solr.update.processor.TestOpenNLPExtractNamedEntitiesUpdateProcessorFactory_F83E1BACA71E4C1E-001
   [junit4]    > 	at __randomizedtesting.SeedInfo.seed([F83E1BACA71E4C1E]:0)
   [junit4]    > 	at org.apache.lucene.util.IOUtils.rm(IOUtils.java:329)
   [junit4]    > 	at java.lang.Thread.run(Thread.java:748)
   [junit4] Completed [1/5 (1!)] on J1 in 20.84s, 8 tests, 1 error <<< FAILURES!

[...truncated 41538 lines...]

Mime
View raw message