lucene-dev mailing list archives

Site index · List index
Message view « Date » · « Thread »
Top « Date » · « Thread »
From Policeman Jenkins Server <jenk...@thetaphi.de>
Subject [JENKINS] Lucene-Solr-master-Solaris (64bit/jdk1.8.0) - Build # 1618 - Still Unstable!
Date Wed, 10 Jan 2018 21:42:08 GMT
Build: https://jenkins.thetaphi.de/job/Lucene-Solr-master-Solaris/1618/
Java: 64bit/jdk1.8.0 -XX:+UseCompressedOops -XX:+UseConcMarkSweepGC

2 tests failed.
FAILED:  org.apache.solr.cloud.autoscaling.sim.TestDistribStateManager.testGetSetRemoveData

Error Message:
Node watch should have fired!

Stack Trace:
java.lang.AssertionError: Node watch should have fired!
	at __randomizedtesting.SeedInfo.seed([851D5DC2D290708A:A38DB290861EB680]:0)
	at org.junit.Assert.fail(Assert.java:93)
	at org.apache.solr.cloud.autoscaling.sim.TestDistribStateManager.testGetSetRemoveData(TestDistribStateManager.java:256)
	at sun.reflect.NativeMethodAccessorImpl.invoke0(Native Method)
	at sun.reflect.NativeMethodAccessorImpl.invoke(NativeMethodAccessorImpl.java:62)
	at sun.reflect.DelegatingMethodAccessorImpl.invoke(DelegatingMethodAccessorImpl.java:43)
	at java.lang.reflect.Method.invoke(Method.java:498)
	at com.carrotsearch.randomizedtesting.RandomizedRunner.invoke(RandomizedRunner.java:1737)
	at com.carrotsearch.randomizedtesting.RandomizedRunner$8.evaluate(RandomizedRunner.java:934)
	at com.carrotsearch.randomizedtesting.RandomizedRunner$9.evaluate(RandomizedRunner.java:970)
	at com.carrotsearch.randomizedtesting.RandomizedRunner$10.evaluate(RandomizedRunner.java:984)
	at com.carrotsearch.randomizedtesting.rules.SystemPropertiesRestoreRule$1.evaluate(SystemPropertiesRestoreRule.java:57)
	at org.apache.lucene.util.TestRuleSetupTeardownChained$1.evaluate(TestRuleSetupTeardownChained.java:49)
	at org.apache.lucene.util.AbstractBeforeAfterRule$1.evaluate(AbstractBeforeAfterRule.java:45)
	at org.apache.lucene.util.TestRuleThreadAndTestName$1.evaluate(TestRuleThreadAndTestName.java:48)
	at org.apache.lucene.util.TestRuleIgnoreAfterMaxFailures$1.evaluate(TestRuleIgnoreAfterMaxFailures.java:64)
	at org.apache.lucene.util.TestRuleMarkFailure$1.evaluate(TestRuleMarkFailure.java:47)
	at com.carrotsearch.randomizedtesting.rules.StatementAdapter.evaluate(StatementAdapter.java:36)
	at com.carrotsearch.randomizedtesting.ThreadLeakControl$StatementRunner.run(ThreadLeakControl.java:368)
	at com.carrotsearch.randomizedtesting.ThreadLeakControl.forkTimeoutingTask(ThreadLeakControl.java:817)
	at com.carrotsearch.randomizedtesting.ThreadLeakControl$3.evaluate(ThreadLeakControl.java:468)
	at com.carrotsearch.randomizedtesting.RandomizedRunner.runSingleTest(RandomizedRunner.java:943)
	at com.carrotsearch.randomizedtesting.RandomizedRunner$5.evaluate(RandomizedRunner.java:829)
	at com.carrotsearch.randomizedtesting.RandomizedRunner$6.evaluate(RandomizedRunner.java:879)
	at com.carrotsearch.randomizedtesting.RandomizedRunner$7.evaluate(RandomizedRunner.java:890)
	at com.carrotsearch.randomizedtesting.rules.StatementAdapter.evaluate(StatementAdapter.java:36)
	at com.carrotsearch.randomizedtesting.rules.SystemPropertiesRestoreRule$1.evaluate(SystemPropertiesRestoreRule.java:57)
	at org.apache.lucene.util.AbstractBeforeAfterRule$1.evaluate(AbstractBeforeAfterRule.java:45)
	at com.carrotsearch.randomizedtesting.rules.StatementAdapter.evaluate(StatementAdapter.java:36)
	at org.apache.lucene.util.TestRuleStoreClassName$1.evaluate(TestRuleStoreClassName.java:41)
	at com.carrotsearch.randomizedtesting.rules.NoShadowingOrOverridesOnMethodsRule$1.evaluate(NoShadowingOrOverridesOnMethodsRule.java:40)
	at com.carrotsearch.randomizedtesting.rules.NoShadowingOrOverridesOnMethodsRule$1.evaluate(NoShadowingOrOverridesOnMethodsRule.java:40)
	at com.carrotsearch.randomizedtesting.rules.StatementAdapter.evaluate(StatementAdapter.java:36)
	at com.carrotsearch.randomizedtesting.rules.StatementAdapter.evaluate(StatementAdapter.java:36)
	at com.carrotsearch.randomizedtesting.rules.StatementAdapter.evaluate(StatementAdapter.java:36)
	at org.apache.lucene.util.TestRuleAssertionsRequired$1.evaluate(TestRuleAssertionsRequired.java:53)
	at org.apache.lucene.util.TestRuleMarkFailure$1.evaluate(TestRuleMarkFailure.java:47)
	at org.apache.lucene.util.TestRuleIgnoreAfterMaxFailures$1.evaluate(TestRuleIgnoreAfterMaxFailures.java:64)
	at org.apache.lucene.util.TestRuleIgnoreTestSuites$1.evaluate(TestRuleIgnoreTestSuites.java:54)
	at com.carrotsearch.randomizedtesting.rules.StatementAdapter.evaluate(StatementAdapter.java:36)
	at com.carrotsearch.randomizedtesting.ThreadLeakControl$StatementRunner.run(ThreadLeakControl.java:368)
	at java.lang.Thread.run(Thread.java:748)


FAILED:  junit.framework.TestSuite.org.apache.solr.security.hadoop.TestImpersonationWithHadoopAuth

Error Message:
2 threads leaked from SUITE scope at org.apache.solr.security.hadoop.TestImpersonationWithHadoopAuth:     1) Thread[id=15864, name=jetty-launcher-3520-thread-2-EventThread, state=TIMED_WAITING, group=TGRP-TestImpersonationWithHadoopAuth]         at sun.misc.Unsafe.park(Native Method)         at java.util.concurrent.locks.LockSupport.parkNanos(LockSupport.java:215)         at java.util.concurrent.locks.AbstractQueuedSynchronizer.doAcquireSharedNanos(AbstractQueuedSynchronizer.java:1037)         at java.util.concurrent.locks.AbstractQueuedSynchronizer.tryAcquireSharedNanos(AbstractQueuedSynchronizer.java:1328)         at java.util.concurrent.CountDownLatch.await(CountDownLatch.java:277)         at org.apache.curator.CuratorZookeeperClient.internalBlockUntilConnectedOrTimedOut(CuratorZookeeperClient.java:323)         at org.apache.curator.RetryLoop.callWithRetry(RetryLoop.java:105)         at org.apache.curator.framework.imps.GetDataBuilderImpl.pathInForeground(GetDataBuilderImpl.java:288)         at org.apache.curator.framework.imps.GetDataBuilderImpl.forPath(GetDataBuilderImpl.java:279)         at org.apache.curator.framework.imps.GetDataBuilderImpl.forPath(GetDataBuilderImpl.java:41)         at org.apache.curator.framework.recipes.shared.SharedValue.readValue(SharedValue.java:244)         at org.apache.curator.framework.recipes.shared.SharedValue.access$100(SharedValue.java:44)         at org.apache.curator.framework.recipes.shared.SharedValue$1.process(SharedValue.java:61)         at org.apache.curator.framework.imps.NamespaceWatcher.process(NamespaceWatcher.java:67)         at org.apache.zookeeper.ClientCnxn$EventThread.processEvent(ClientCnxn.java:530)         at org.apache.zookeeper.ClientCnxn$EventThread.run(ClientCnxn.java:505)    2) Thread[id=15854, name=jetty-launcher-3520-thread-1-EventThread, state=TIMED_WAITING, group=TGRP-TestImpersonationWithHadoopAuth]         at sun.misc.Unsafe.park(Native Method)         at java.util.concurrent.locks.LockSupport.parkNanos(LockSupport.java:215)         at java.util.concurrent.locks.AbstractQueuedSynchronizer.doAcquireSharedNanos(AbstractQueuedSynchronizer.java:1037)         at java.util.concurrent.locks.AbstractQueuedSynchronizer.tryAcquireSharedNanos(AbstractQueuedSynchronizer.java:1328)         at java.util.concurrent.CountDownLatch.await(CountDownLatch.java:277)         at org.apache.curator.CuratorZookeeperClient.internalBlockUntilConnectedOrTimedOut(CuratorZookeeperClient.java:323)         at org.apache.curator.RetryLoop.callWithRetry(RetryLoop.java:105)         at org.apache.curator.framework.imps.GetDataBuilderImpl.pathInForeground(GetDataBuilderImpl.java:288)         at org.apache.curator.framework.imps.GetDataBuilderImpl.forPath(GetDataBuilderImpl.java:279)         at org.apache.curator.framework.imps.GetDataBuilderImpl.forPath(GetDataBuilderImpl.java:41)         at org.apache.curator.framework.recipes.shared.SharedValue.readValue(SharedValue.java:244)         at org.apache.curator.framework.recipes.shared.SharedValue.access$100(SharedValue.java:44)         at org.apache.curator.framework.recipes.shared.SharedValue$1.process(SharedValue.java:61)         at org.apache.curator.framework.imps.NamespaceWatcher.process(NamespaceWatcher.java:67)         at org.apache.zookeeper.ClientCnxn$EventThread.processEvent(ClientCnxn.java:530)         at org.apache.zookeeper.ClientCnxn$EventThread.run(ClientCnxn.java:505)

Stack Trace:
com.carrotsearch.randomizedtesting.ThreadLeakError: 2 threads leaked from SUITE scope at org.apache.solr.security.hadoop.TestImpersonationWithHadoopAuth: 
   1) Thread[id=15864, name=jetty-launcher-3520-thread-2-EventThread, state=TIMED_WAITING, group=TGRP-TestImpersonationWithHadoopAuth]
        at sun.misc.Unsafe.park(Native Method)
        at java.util.concurrent.locks.LockSupport.parkNanos(LockSupport.java:215)
        at java.util.concurrent.locks.AbstractQueuedSynchronizer.doAcquireSharedNanos(AbstractQueuedSynchronizer.java:1037)
        at java.util.concurrent.locks.AbstractQueuedSynchronizer.tryAcquireSharedNanos(AbstractQueuedSynchronizer.java:1328)
        at java.util.concurrent.CountDownLatch.await(CountDownLatch.java:277)
        at org.apache.curator.CuratorZookeeperClient.internalBlockUntilConnectedOrTimedOut(CuratorZookeeperClient.java:323)
        at org.apache.curator.RetryLoop.callWithRetry(RetryLoop.java:105)
        at org.apache.curator.framework.imps.GetDataBuilderImpl.pathInForeground(GetDataBuilderImpl.java:288)
        at org.apache.curator.framework.imps.GetDataBuilderImpl.forPath(GetDataBuilderImpl.java:279)
        at org.apache.curator.framework.imps.GetDataBuilderImpl.forPath(GetDataBuilderImpl.java:41)
        at org.apache.curator.framework.recipes.shared.SharedValue.readValue(SharedValue.java:244)
        at org.apache.curator.framework.recipes.shared.SharedValue.access$100(SharedValue.java:44)
        at org.apache.curator.framework.recipes.shared.SharedValue$1.process(SharedValue.java:61)
        at org.apache.curator.framework.imps.NamespaceWatcher.process(NamespaceWatcher.java:67)
        at org.apache.zookeeper.ClientCnxn$EventThread.processEvent(ClientCnxn.java:530)
        at org.apache.zookeeper.ClientCnxn$EventThread.run(ClientCnxn.java:505)
   2) Thread[id=15854, name=jetty-launcher-3520-thread-1-EventThread, state=TIMED_WAITING, group=TGRP-TestImpersonationWithHadoopAuth]
        at sun.misc.Unsafe.park(Native Method)
        at java.util.concurrent.locks.LockSupport.parkNanos(LockSupport.java:215)
        at java.util.concurrent.locks.AbstractQueuedSynchronizer.doAcquireSharedNanos(AbstractQueuedSynchronizer.java:1037)
        at java.util.concurrent.locks.AbstractQueuedSynchronizer.tryAcquireSharedNanos(AbstractQueuedSynchronizer.java:1328)
        at java.util.concurrent.CountDownLatch.await(CountDownLatch.java:277)
        at org.apache.curator.CuratorZookeeperClient.internalBlockUntilConnectedOrTimedOut(CuratorZookeeperClient.java:323)
        at org.apache.curator.RetryLoop.callWithRetry(RetryLoop.java:105)
        at org.apache.curator.framework.imps.GetDataBuilderImpl.pathInForeground(GetDataBuilderImpl.java:288)
        at org.apache.curator.framework.imps.GetDataBuilderImpl.forPath(GetDataBuilderImpl.java:279)
        at org.apache.curator.framework.imps.GetDataBuilderImpl.forPath(GetDataBuilderImpl.java:41)
        at org.apache.curator.framework.recipes.shared.SharedValue.readValue(SharedValue.java:244)
        at org.apache.curator.framework.recipes.shared.SharedValue.access$100(SharedValue.java:44)
        at org.apache.curator.framework.recipes.shared.SharedValue$1.process(SharedValue.java:61)
        at org.apache.curator.framework.imps.NamespaceWatcher.process(NamespaceWatcher.java:67)
        at org.apache.zookeeper.ClientCnxn$EventThread.processEvent(ClientCnxn.java:530)
        at org.apache.zookeeper.ClientCnxn$EventThread.run(ClientCnxn.java:505)
	at __randomizedtesting.SeedInfo.seed([851D5DC2D290708A]:0)




Build Log:
[...truncated 12579 lines...]
   [junit4] Suite: org.apache.solr.security.hadoop.TestImpersonationWithHadoopAuth
   [junit4]   2> 2095132 INFO  (SUITE-TestImpersonationWithHadoopAuth-seed#[851D5DC2D290708A]-worker) [    ] o.a.s.SolrTestCaseJ4 SecureRandom sanity checks: test.solr.allowed.securerandom=null & java.security.egd=file:/dev/./urandom
   [junit4]   2> Creating dataDir: /export/home/jenkins/workspace/Lucene-Solr-master-Solaris/solr/build/solr-core/test/J0/temp/solr.security.hadoop.TestImpersonationWithHadoopAuth_851D5DC2D290708A-001/init-core-data-001
   [junit4]   2> 2095133 WARN  (SUITE-TestImpersonationWithHadoopAuth-seed#[851D5DC2D290708A]-worker) [    ] o.a.s.SolrTestCaseJ4 startTrackingSearchers: numOpens=8 numCloses=8
   [junit4]   2> 2095133 INFO  (SUITE-TestImpersonationWithHadoopAuth-seed#[851D5DC2D290708A]-worker) [    ] o.a.s.SolrTestCaseJ4 Using PointFields (NUMERIC_POINTS_SYSPROP=true) w/NUMERIC_DOCVALUES_SYSPROP=true
   [junit4]   2> 2095136 INFO  (SUITE-TestImpersonationWithHadoopAuth-seed#[851D5DC2D290708A]-worker) [    ] o.a.s.SolrTestCaseJ4 Randomized ssl (false) and clientAuth (false) via: @org.apache.solr.util.RandomizeSSL(reason=, value=NaN, ssl=NaN, clientAuth=NaN)
   [junit4]   2> 2095172 INFO  (SUITE-TestImpersonationWithHadoopAuth-seed#[851D5DC2D290708A]-worker) [    ] o.a.s.c.MiniSolrCloudCluster Starting cluster of 2 servers in /export/home/jenkins/workspace/Lucene-Solr-master-Solaris/solr/build/solr-core/test/J0/temp/solr.security.hadoop.TestImpersonationWithHadoopAuth_851D5DC2D290708A-001/tempDir-001
   [junit4]   2> 2095172 INFO  (SUITE-TestImpersonationWithHadoopAuth-seed#[851D5DC2D290708A]-worker) [    ] o.a.s.c.ZkTestServer STARTING ZK TEST SERVER
   [junit4]   2> 2095172 INFO  (Thread-3303) [    ] o.a.s.c.ZkTestServer client port:0.0.0.0/0.0.0.0:0
   [junit4]   2> 2095172 INFO  (Thread-3303) [    ] o.a.s.c.ZkTestServer Starting server
   [junit4]   2> 2095174 ERROR (Thread-3303) [    ] o.a.z.s.ZooKeeperServer ZKShutdownHandler is not registered, so ZooKeeper server won't take any action on ERROR or SHUTDOWN server state changes
   [junit4]   2> 2095274 INFO  (SUITE-TestImpersonationWithHadoopAuth-seed#[851D5DC2D290708A]-worker) [    ] o.a.s.c.ZkTestServer start zk server on port:36743
   [junit4]   2> 2095279 INFO  (zkConnectionManagerCallback-3523-thread-1) [    ] o.a.s.c.c.ConnectionManager zkClient has connected
   [junit4]   2> 2095293 INFO  (jetty-launcher-3520-thread-2) [    ] o.e.j.s.Server jetty-9.3.20.v20170531
   [junit4]   2> 2095293 INFO  (jetty-launcher-3520-thread-1) [    ] o.e.j.s.Server jetty-9.3.20.v20170531
   [junit4]   2> 2095297 INFO  (jetty-launcher-3520-thread-2) [    ] o.e.j.s.h.ContextHandler Started o.e.j.s.ServletContextHandler@4611587e{/solr,null,AVAILABLE}
   [junit4]   2> 2095298 INFO  (jetty-launcher-3520-thread-2) [    ] o.e.j.s.AbstractConnector Started ServerConnector@12f2aab9{HTTP/1.1,[http/1.1]}{127.0.0.1:36163}
   [junit4]   2> 2095298 INFO  (jetty-launcher-3520-thread-2) [    ] o.e.j.s.Server Started @2099107ms
   [junit4]   2> 2095298 INFO  (jetty-launcher-3520-thread-2) [    ] o.a.s.c.s.e.JettySolrRunner Jetty properties: {hostContext=/solr, hostPort=36163}
   [junit4]   2> 2095298 ERROR (jetty-launcher-3520-thread-2) [    ] o.a.s.u.StartupLoggingUtils Missing Java Option solr.log.dir. Logging may be missing or incomplete.
   [junit4]   2> 2095298 INFO  (jetty-launcher-3520-thread-2) [    ] o.a.s.s.SolrDispatchFilter  ___      _       Welcome to Apache Solr? version 8.0.0
   [junit4]   2> 2095298 INFO  (jetty-launcher-3520-thread-2) [    ] o.a.s.s.SolrDispatchFilter / __| ___| |_ _   Starting in cloud mode on port null
   [junit4]   2> 2095299 INFO  (jetty-launcher-3520-thread-2) [    ] o.a.s.s.SolrDispatchFilter \__ \/ _ \ | '_|  Install dir: null
   [junit4]   2> 2095299 INFO  (jetty-launcher-3520-thread-2) [    ] o.a.s.s.SolrDispatchFilter |___/\___/_|_|    Start time: 2018-01-10T20:44:12.267Z
   [junit4]   2> 2095299 INFO  (jetty-launcher-3520-thread-1) [    ] o.e.j.s.h.ContextHandler Started o.e.j.s.ServletContextHandler@ad65f21{/solr,null,AVAILABLE}
   [junit4]   2> 2095300 INFO  (jetty-launcher-3520-thread-1) [    ] o.e.j.s.AbstractConnector Started ServerConnector@3c3d26ca{HTTP/1.1,[http/1.1]}{127.0.0.1:59851}
   [junit4]   2> 2095300 INFO  (jetty-launcher-3520-thread-1) [    ] o.e.j.s.Server Started @2099110ms
   [junit4]   2> 2095300 INFO  (jetty-launcher-3520-thread-1) [    ] o.a.s.c.s.e.JettySolrRunner Jetty properties: {hostContext=/solr, hostPort=59851}
   [junit4]   2> 2095301 ERROR (jetty-launcher-3520-thread-1) [    ] o.a.s.u.StartupLoggingUtils Missing Java Option solr.log.dir. Logging may be missing or incomplete.
   [junit4]   2> 2095301 INFO  (jetty-launcher-3520-thread-1) [    ] o.a.s.s.SolrDispatchFilter  ___      _       Welcome to Apache Solr? version 8.0.0
   [junit4]   2> 2095301 INFO  (jetty-launcher-3520-thread-1) [    ] o.a.s.s.SolrDispatchFilter / __| ___| |_ _   Starting in cloud mode on port null
   [junit4]   2> 2095301 INFO  (jetty-launcher-3520-thread-1) [    ] o.a.s.s.SolrDispatchFilter \__ \/ _ \ | '_|  Install dir: null
   [junit4]   2> 2095301 INFO  (jetty-launcher-3520-thread-1) [    ] o.a.s.s.SolrDispatchFilter |___/\___/_|_|    Start time: 2018-01-10T20:44:12.269Z
   [junit4]   2> 2095306 INFO  (zkConnectionManagerCallback-3525-thread-1) [    ] o.a.s.c.c.ConnectionManager zkClient has connected
   [junit4]   2> 2095307 INFO  (zkConnectionManagerCallback-3527-thread-1) [    ] o.a.s.c.c.ConnectionManager zkClient has connected
   [junit4]   2> 2095307 INFO  (jetty-launcher-3520-thread-2) [    ] o.a.s.s.SolrDispatchFilter solr.xml found in ZooKeeper. Loading...
   [junit4]   2> 2095308 INFO  (jetty-launcher-3520-thread-1) [    ] o.a.s.s.SolrDispatchFilter solr.xml found in ZooKeeper. Loading...
   [junit4]   2> 2095319 INFO  (jetty-launcher-3520-thread-1) [    ] o.a.s.c.ZkContainer Zookeeper client=127.0.0.1:36743/solr
   [junit4]   2> 2095319 INFO  (jetty-launcher-3520-thread-2) [    ] o.a.s.c.ZkContainer Zookeeper client=127.0.0.1:36743/solr
   [junit4]   2> 2095323 INFO  (zkConnectionManagerCallback-3535-thread-1) [    ] o.a.s.c.c.ConnectionManager zkClient has connected
   [junit4]   2> 2095324 INFO  (zkConnectionManagerCallback-3533-thread-1) [    ] o.a.s.c.c.ConnectionManager zkClient has connected
   [junit4]   2> 2095327 INFO  (zkConnectionManagerCallback-3539-thread-1-processing-n:127.0.0.1:59851_solr) [n:127.0.0.1:59851_solr    ] o.a.s.c.c.ConnectionManager zkClient has connected
   [junit4]   2> 2095328 INFO  (zkConnectionManagerCallback-3537-thread-1-processing-n:127.0.0.1:36163_solr) [n:127.0.0.1:36163_solr    ] o.a.s.c.c.ConnectionManager zkClient has connected
   [junit4]   2> 2095454 INFO  (jetty-launcher-3520-thread-1) [n:127.0.0.1:59851_solr    ] o.a.s.c.Overseer Overseer (id=null) closing
   [junit4]   2> 2095455 INFO  (jetty-launcher-3520-thread-1) [n:127.0.0.1:59851_solr    ] o.a.s.c.OverseerElectionContext I am going to be the leader 127.0.0.1:59851_solr
   [junit4]   2> 2095456 INFO  (jetty-launcher-3520-thread-1) [n:127.0.0.1:59851_solr    ] o.a.s.c.Overseer Overseer (id=99327479129178117-127.0.0.1:59851_solr-n_0000000000) starting
   [junit4]   2> 2095457 INFO  (jetty-launcher-3520-thread-2) [n:127.0.0.1:36163_solr    ] o.a.s.c.Overseer Overseer (id=null) closing
   [junit4]   2> 2095459 INFO  (jetty-launcher-3520-thread-2) [n:127.0.0.1:36163_solr    ] o.a.s.c.ZkController Register node as live in ZooKeeper:/live_nodes/127.0.0.1:36163_solr
   [junit4]   2> 2095460 INFO  (zkCallback-3536-thread-1-processing-n:127.0.0.1:36163_solr) [n:127.0.0.1:36163_solr    ] o.a.s.c.c.ZkStateReader Updated live nodes from ZooKeeper... (0) -> (1)
   [junit4]   2> 2095461 INFO  (zkCallback-3538-thread-1-processing-n:127.0.0.1:59851_solr) [n:127.0.0.1:59851_solr    ] o.a.s.c.c.ZkStateReader Updated live nodes from ZooKeeper... (0) -> (1)
   [junit4]   2> 2095468 INFO  (jetty-launcher-3520-thread-1) [n:127.0.0.1:59851_solr    ] o.a.s.c.ZkController Register node as live in ZooKeeper:/live_nodes/127.0.0.1:59851_solr
   [junit4]   2> 2095469 INFO  (zkCallback-3536-thread-1-processing-n:127.0.0.1:36163_solr) [n:127.0.0.1:36163_solr    ] o.a.s.c.c.ZkStateReader Updated live nodes from ZooKeeper... (1) -> (2)
   [junit4]   2> 2095470 INFO  (zkCallback-3538-thread-1-processing-n:127.0.0.1:59851_solr) [n:127.0.0.1:59851_solr    ] o.a.s.c.c.ZkStateReader Updated live nodes from ZooKeeper... (1) -> (2)
   [junit4]   2> 2095511 INFO  (jetty-launcher-3520-thread-1) [n:127.0.0.1:59851_solr    ] o.a.s.c.CoreContainer Initializing authentication plugin: org.apache.solr.security.HadoopAuthPlugin
   [junit4]   2> 2095512 INFO  (jetty-launcher-3520-thread-1) [n:127.0.0.1:59851_solr    ] o.a.s.s.HadoopAuthPlugin Params: {proxyuser.anyHostUsersGroup.hosts=*, proxyuser.wrongHost.hosts=1.1.1.1.1.1, proxyuser.bogusGroup.groups=__some_bogus_group, proxyuser.localHostAnyGroup.groups=*, cookie.domain=127.0.0.1, proxyuser.wrongHost.groups=*, type=simple, proxyuser.noHosts.groups=*, proxyuser.anyHostUsersGroup.groups=staff, proxyuser.noGroups.hosts=*, proxyuser.anyHostAnyUser.groups=*, delegation-token.token-kind=solr-dt, proxyuser.bogusGroup.hosts=*, zk-dt-secret-manager.znodeWorkingPath=solr/security/zkdtsm, signer.secret.provider.zookeeper.path=/token, zk-dt-secret-manager.enable=true, proxyuser.localHostAnyGroup.hosts=serv1-vm3,localhost,127.0.0.1, proxyuser.anyHostAnyUser.hosts=*, signer.secret.provider=zookeeper}
   [junit4]   2> 2095513 INFO  (jetty-launcher-3520-thread-1) [n:127.0.0.1:59851_solr    ] o.a.c.f.i.CuratorFrameworkImpl Starting
   [junit4]   2> 2095515 INFO  (jetty-launcher-3520-thread-1-EventThread) [n:127.0.0.1:59851_solr    ] o.a.c.f.s.ConnectionStateManager State change: CONNECTED
   [junit4]   2> 2095531 INFO  (jetty-launcher-3520-thread-1) [n:127.0.0.1:59851_solr    ] o.a.s.c.CoreContainer PKIAuthenticationPlugin is managing internode requests
   [junit4]   2> 2095565 INFO  (jetty-launcher-3520-thread-2) [n:127.0.0.1:36163_solr    ] o.a.s.c.CoreContainer Initializing authentication plugin: org.apache.solr.security.HadoopAuthPlugin
   [junit4]   2> 2095565 INFO  (jetty-launcher-3520-thread-2) [n:127.0.0.1:36163_solr    ] o.a.s.s.HadoopAuthPlugin Params: {proxyuser.anyHostUsersGroup.hosts=*, proxyuser.wrongHost.hosts=1.1.1.1.1.1, proxyuser.bogusGroup.groups=__some_bogus_group, proxyuser.localHostAnyGroup.groups=*, cookie.domain=127.0.0.1, proxyuser.wrongHost.groups=*, type=simple, proxyuser.noHosts.groups=*, proxyuser.anyHostUsersGroup.groups=staff, proxyuser.noGroups.hosts=*, proxyuser.anyHostAnyUser.groups=*, delegation-token.token-kind=solr-dt, proxyuser.bogusGroup.hosts=*, zk-dt-secret-manager.znodeWorkingPath=solr/security/zkdtsm, signer.secret.provider.zookeeper.path=/token, zk-dt-secret-manager.enable=true, proxyuser.localHostAnyGroup.hosts=serv1-vm3,localhost,127.0.0.1, proxyuser.anyHostAnyUser.hosts=*, signer.secret.provider=zookeeper}
   [junit4]   2> 2095567 INFO  (jetty-launcher-3520-thread-2) [n:127.0.0.1:36163_solr    ] o.a.c.f.i.CuratorFrameworkImpl Starting
   [junit4]   2> 2095568 INFO  (jetty-launcher-3520-thread-1) [n:127.0.0.1:59851_solr    ] o.a.s.m.r.SolrJmxReporter JMX monitoring for 'solr_59851.solr.node' (registry 'solr.node') enabled at server: com.sun.jmx.mbeanserver.JmxMBeanServer@4775f0b2
   [junit4]   2> 2095570 INFO  (jetty-launcher-3520-thread-2-EventThread) [n:127.0.0.1:36163_solr    ] o.a.c.f.s.ConnectionStateManager State change: CONNECTED
   [junit4]   2> 2095575 INFO  (jetty-launcher-3520-thread-1) [n:127.0.0.1:59851_solr    ] o.a.s.m.r.SolrJmxReporter JMX monitoring for 'solr_59851.solr.jvm' (registry 'solr.jvm') enabled at server: com.sun.jmx.mbeanserver.JmxMBeanServer@4775f0b2
   [junit4]   2> 2095575 INFO  (jetty-launcher-3520-thread-1) [n:127.0.0.1:59851_solr    ] o.a.s.m.r.SolrJmxReporter JMX monitoring for 'solr_59851.solr.jetty' (registry 'solr.jetty') enabled at server: com.sun.jmx.mbeanserver.JmxMBeanServer@4775f0b2
   [junit4]   2> 2095575 INFO  (jetty-launcher-3520-thread-1) [n:127.0.0.1:59851_solr    ] o.a.s.c.CorePropertiesLocator Found 0 core definitions underneath /export/home/jenkins/workspace/Lucene-Solr-master-Solaris/solr/build/solr-core/test/J0/temp/solr.security.hadoop.TestImpersonationWithHadoopAuth_851D5DC2D290708A-001/tempDir-001/node1/.
   [junit4]   2> 2095585 INFO  (jetty-launcher-3520-thread-2) [n:127.0.0.1:36163_solr    ] o.a.s.c.CoreContainer PKIAuthenticationPlugin is managing internode requests
   [junit4]   2> 2095614 INFO  (jetty-launcher-3520-thread-2) [n:127.0.0.1:36163_solr    ] o.a.s.m.r.SolrJmxReporter JMX monitoring for 'solr_36163.solr.node' (registry 'solr.node') enabled at server: com.sun.jmx.mbeanserver.JmxMBeanServer@4775f0b2
   [junit4]   2> 2095619 INFO  (jetty-launcher-3520-thread-2) [n:127.0.0.1:36163_solr    ] o.a.s.m.r.SolrJmxReporter JMX monitoring for 'solr_36163.solr.jvm' (registry 'solr.jvm') enabled at server: com.sun.jmx.mbeanserver.JmxMBeanServer@4775f0b2
   [junit4]   2> 2095619 INFO  (jetty-launcher-3520-thread-2) [n:127.0.0.1:36163_solr    ] o.a.s.m.r.SolrJmxReporter JMX monitoring for 'solr_36163.solr.jetty' (registry 'solr.jetty') enabled at server: com.sun.jmx.mbeanserver.JmxMBeanServer@4775f0b2
   [junit4]   2> 2095620 INFO  (jetty-launcher-3520-thread-2) [n:127.0.0.1:36163_solr    ] o.a.s.c.CorePropertiesLocator Found 0 core definitions underneath /export/home/jenkins/workspace/Lucene-Solr-master-Solaris/solr/build/solr-core/test/J0/temp/solr.security.hadoop.TestImpersonationWithHadoopAuth_851D5DC2D290708A-001/tempDir-001/node2/.
   [junit4]   2> 2095638 INFO  (zkConnectionManagerCallback-3545-thread-1) [    ] o.a.s.c.c.ConnectionManager zkClient has connected
   [junit4]   2> 2095641 INFO  (zkConnectionManagerCallback-3549-thread-1) [    ] o.a.s.c.c.ConnectionManager zkClient has connected
   [junit4]   2> 2095643 INFO  (SUITE-TestImpersonationWithHadoopAuth-seed#[851D5DC2D290708A]-worker) [    ] o.a.s.c.c.ZkStateReader Updated live nodes from ZooKeeper... (0) -> (2)
   [junit4]   2> 2095644 INFO  (SUITE-TestImpersonationWithHadoopAuth-seed#[851D5DC2D290708A]-worker) [    ] o.a.s.c.s.i.ZkClientClusterStateProvider Cluster at 127.0.0.1:36743/solr ready
   [junit4]   2> 2095666 INFO  (TEST-TestImpersonationWithHadoopAuth.testProxyInvalidGroup-seed#[851D5DC2D290708A]) [    ] o.a.s.SolrTestCaseJ4 ###Starting testProxyInvalidGroup
   [junit4]   2> 2095700 WARN  (qtp1285912474-15815) [    ] o.a.h.s.ShellBasedUnixGroupsMapping got exception trying to get groups for user bar: id: invalid user name: "bar"
   [junit4]   2> id: invalid user name: "bar"
   [junit4]   2> 
   [junit4]   2> 2095714 WARN  (TEST-TestImpersonationWithHadoopAuth.testProxyInvalidGroup-seed#[851D5DC2D290708A]) [    ] o.a.h.c.p.ResponseProcessCookies Invalid cookie header: "Set-Cookie: hadoop.auth="u=bogusGroup&p=bogusGroup&t=simple-dt&e=1515653052644&s=rbTMj3F84gN3k3qNXVOO4wH4RMM="; Domain=127.0.0.1; Expires=Do, 11-Jan-2018 06:44:12 GMT; HttpOnly". Invalid 'expires' attribute: Do, 11-Jan-2018 06:44:12 GMT
   [junit4]   2> 2095715 INFO  (TEST-TestImpersonationWithHadoopAuth.testProxyInvalidGroup-seed#[851D5DC2D290708A]) [    ] o.a.s.SolrTestCaseJ4 ###Ending testProxyInvalidGroup
   [junit4]   2> 2095731 INFO  (TEST-TestImpersonationWithHadoopAuth.testProxyInvalidProxyUser-seed#[851D5DC2D290708A]) [    ] o.a.s.SolrTestCaseJ4 ###Starting testProxyInvalidProxyUser
   [junit4]   2> 2095737 WARN  (TEST-TestImpersonationWithHadoopAuth.testProxyInvalidProxyUser-seed#[851D5DC2D290708A]) [    ] o.a.h.c.p.ResponseProcessCookies Invalid cookie header: "Set-Cookie: hadoop.auth="u=bar&p=bar&t=simple-dt&e=1515653052701&s=RpQdDLhBDWgIGsAxBvzjrQGROnk="; Domain=127.0.0.1; Expires=Do, 11-Jan-2018 06:44:12 GMT; HttpOnly". Invalid 'expires' attribute: Do, 11-Jan-2018 06:44:12 GMT
   [junit4]   2> 2095738 INFO  (TEST-TestImpersonationWithHadoopAuth.testProxyInvalidProxyUser-seed#[851D5DC2D290708A]) [    ] o.a.s.SolrTestCaseJ4 ###Ending testProxyInvalidProxyUser
   [junit4]   2> 2095758 INFO  (TEST-TestImpersonationWithHadoopAuth.testProxyValidateGroup-seed#[851D5DC2D290708A]) [    ] o.a.s.SolrTestCaseJ4 ###Starting testProxyValidateGroup
   [junit4]   2> 2095763 INFO  (qtp1285912474-15815) [n:127.0.0.1:59851_solr    ] o.a.s.h.a.CollectionsHandler Invoked Collection Action :list with params doAs=jenkins&action=LIST&user.name=anyHostUsersGroup&wt=javabin&version=2 and sendToOCPQueue=true
   [junit4]   2> 2095763 INFO  (qtp1285912474-15815) [n:127.0.0.1:59851_solr    ] o.a.s.s.HttpSolrCall [admin] webapp=null path=/admin/collections params={doAs=jenkins&action=LIST&user.name=anyHostUsersGroup&wt=javabin&version=2} status=0 QTime=0
   [junit4]   2> 2095763 WARN  (TEST-TestImpersonationWithHadoopAuth.testProxyValidateGroup-seed#[851D5DC2D290708A]) [    ] o.a.h.c.p.ResponseProcessCookies Invalid cookie header: "Set-Cookie: hadoop.auth="u=anyHostUsersGroup&p=anyHostUsersGroup&t=simple-dt&e=1515653052728&s=+bW+bt92I58Qm3U7F+UXdG/Glvw="; Domain=127.0.0.1; Expires=Do, 11-Jan-2018 06:44:12 GMT; HttpOnly". Invalid 'expires' attribute: Do, 11-Jan-2018 06:44:12 GMT
   [junit4]   2> 2095764 INFO  (TEST-TestImpersonationWithHadoopAuth.testProxyValidateGroup-seed#[851D5DC2D290708A]) [    ] o.a.s.SolrTestCaseJ4 ###Ending testProxyValidateGroup
   [junit4]   2> 2095784 INFO  (TEST-TestImpersonationWithHadoopAuth.testProxyValidateAnyHostAnyUser-seed#[851D5DC2D290708A]) [    ] o.a.s.SolrTestCaseJ4 ###Starting testProxyValidateAnyHostAnyUser
   [junit4]   2> 2095787 INFO  (qtp1285912474-15820) [n:127.0.0.1:59851_solr    ] o.a.s.h.a.CollectionsHandler Invoked Collection Action :list with params doAs=bar&action=LIST&user.name=anyHostAnyUser&wt=javabin&version=2 and sendToOCPQueue=true
   [junit4]   2> 2095787 INFO  (qtp1285912474-15820) [n:127.0.0.1:59851_solr    ] o.a.s.s.HttpSolrCall [admin] webapp=null path=/admin/collections params={doAs=bar&action=LIST&user.name=anyHostAnyUser&wt=javabin&version=2} status=0 QTime=0
   [junit4]   2> 2095787 WARN  (TEST-TestImpersonationWithHadoopAuth.testProxyValidateAnyHostAnyUser-seed#[851D5DC2D290708A]) [    ] o.a.h.c.p.ResponseProcessCookies Invalid cookie header: "Set-Cookie: hadoop.auth="u=anyHostAnyUser&p=anyHostAnyUser&t=simple-dt&e=1515653052754&s=sbpIKglhm9V8V42lWDYXesvziyI="; Domain=127.0.0.1; Expires=Do, 11-Jan-2018 06:44:12 GMT; HttpOnly". Invalid 'expires' attribute: Do, 11-Jan-2018 06:44:12 GMT
   [junit4]   2> 2095788 INFO  (TEST-TestImpersonationWithHadoopAuth.testProxyValidateAnyHostAnyUser-seed#[851D5DC2D290708A]) [    ] o.a.s.SolrTestCaseJ4 ###Ending testProxyValidateAnyHostAnyUser
   [junit4]   2> 2095822 INFO  (TEST-TestImpersonationWithHadoopAuth.testProxyNoConfigGroups-seed#[851D5DC2D290708A]) [    ] o.a.s.SolrTestCaseJ4 ###Starting testProxyNoConfigGroups
   [junit4]   2> 2095826 WARN  (TEST-TestImpersonationWithHadoopAuth.testProxyNoConfigGroups-seed#[851D5DC2D290708A]) [    ] o.a.h.c.p.ResponseProcessCookies Invalid cookie header: "Set-Cookie: hadoop.auth="u=noGroups&p=noGroups&t=simple-dt&e=1515653052792&s=GvVL+wyrRBc18O5uDIRCWDqjjgc="; Domain=127.0.0.1; Expires=Do, 11-Jan-2018 06:44:12 GMT; HttpOnly". Invalid 'expires' attribute: Do, 11-Jan-2018 06:44:12 GMT
   [junit4]   2> 2095826 INFO  (TEST-TestImpersonationWithHadoopAuth.testProxyNoConfigGroups-seed#[851D5DC2D290708A]) [    ] o.a.s.SolrTestCaseJ4 ###Ending testProxyNoConfigGroups
   [junit4]   2> 2095849 INFO  (TEST-TestImpersonationWithHadoopAuth.testProxyNoConfigHosts-seed#[851D5DC2D290708A]) [    ] o.a.s.SolrTestCaseJ4 ###Starting testProxyNoConfigHosts
   [junit4]   2> 2095852 WARN  (TEST-TestImpersonationWithHadoopAuth.testProxyNoConfigHosts-seed#[851D5DC2D290708A]) [    ] o.a.h.c.p.ResponseProcessCookies Invalid cookie header: "Set-Cookie: hadoop.auth="u=noHosts&p=noHosts&t=simple-dt&e=1515653052818&s=26wfpcm2qOVQ2SNR6tYvwSC0oZM="; Domain=127.0.0.1; Expires=Do, 11-Jan-2018 06:44:12 GMT; HttpOnly". Invalid 'expires' attribute: Do, 11-Jan-2018 06:44:12 GMT
   [junit4]   2> 2095852 INFO  (TEST-TestImpersonationWithHadoopAuth.testProxyNoConfigHosts-seed#[851D5DC2D290708A]) [    ] o.a.s.SolrTestCaseJ4 ###Ending testProxyNoConfigHosts
   [junit4]   2> 2095875 INFO  (TEST-TestImpersonationWithHadoopAuth.testProxyValidateHost-seed#[851D5DC2D290708A]) [    ] o.a.s.SolrTestCaseJ4 ###Starting testProxyValidateHost
   [junit4]   2> 2095877 INFO  (qtp1285912474-15815) [n:127.0.0.1:59851_solr    ] o.a.s.h.a.CollectionsHandler Invoked Collection Action :list with params doAs=bar&action=LIST&user.name=localHostAnyGroup&wt=javabin&version=2 and sendToOCPQueue=true
   [junit4]   2> 2095877 INFO  (qtp1285912474-15815) [n:127.0.0.1:59851_solr    ] o.a.s.s.HttpSolrCall [admin] webapp=null path=/admin/collections params={doAs=bar&action=LIST&user.name=localHostAnyGroup&wt=javabin&version=2} status=0 QTime=0
   [junit4]   2> 2095878 WARN  (TEST-TestImpersonationWithHadoopAuth.testProxyValidateHost-seed#[851D5DC2D290708A]) [    ] o.a.h.c.p.ResponseProcessCookies Invalid cookie header: "Set-Cookie: hadoop.auth="u=localHostAnyGroup&p=localHostAnyGroup&t=simple-dt&e=1515653052845&s=ETu66+SaghjR4I7tfLleKniOS4U="; Domain=127.0.0.1; Expires=Do, 11-Jan-2018 06:44:12 GMT; HttpOnly". Invalid 'expires' attribute: Do, 11-Jan-2018 06:44:12 GMT
   [junit4]   2> 2095878 INFO  (TEST-TestImpersonationWithHadoopAuth.testProxyValidateHost-seed#[851D5DC2D290708A]) [    ] o.a.s.SolrTestCaseJ4 ###Ending testProxyValidateHost
   [junit4] IGNOR/A 0.00s J0 | TestImpersonationWithHadoopAuth.testForwarding
   [junit4]    > Assumption #1: 'awaitsfix' test group is disabled (@AwaitsFix(bugUrl=https://issues.apache.org/jira/browse/HADOOP-9893))
   [junit4]   2> 2095904 INFO  (TEST-TestImpersonationWithHadoopAuth.testProxyNullProxyUser-seed#[851D5DC2D290708A]) [    ] o.a.s.SolrTestCaseJ4 ###Starting testProxyNullProxyUser
   [junit4]   2> 2095906 INFO  (qtp1285912474-15820) [n:127.0.0.1:59851_solr    ] o.a.s.s.SolrDispatchFilter Error authenticating
   [junit4]   2> java.lang.IllegalArgumentException: userName is NULL, empty or contains a '&'
   [junit4]   2> 	at org.apache.hadoop.security.authentication.util.AuthToken.checkForIllegalArgument(AuthToken.java:87)
   [junit4]   2> 	at org.apache.hadoop.security.authentication.util.AuthToken.<init>(AuthToken.java:70)
   [junit4]   2> 	at org.apache.hadoop.security.authentication.server.AuthenticationToken.<init>(AuthenticationToken.java:58)
   [junit4]   2> 	at org.apache.hadoop.security.authentication.server.PseudoAuthenticationHandler.authenticate(PseudoAuthenticationHandler.java:195)
   [junit4]   2> 	at org.apache.hadoop.security.token.delegation.web.DelegationTokenAuthenticationHandler.authenticate(DelegationTokenAuthenticationHandler.java:348)
   [junit4]   2> 	at org.apache.solr.security.RequestContinuesRecorderAuthenticationHandler.authenticate(RequestContinuesRecorderAuthenticationHandler.java:69)
   [junit4]   2> 	at org.apache.hadoop.security.authentication.server.AuthenticationFilter.doFilter(AuthenticationFilter.java:518)
   [junit4]   2> 	at org.apache.solr.security.HadoopAuthFilter.doFilter(HadoopAuthFilter.java:110)
   [junit4]   2> 	at org.apache.solr.security.HadoopAuthPlugin.doAuthenticate(HadoopAuthPlugin.java:245)
   [junit4]   2> 	at org.apache.solr.servlet.SolrDispatchFilter.authenticateRequest(SolrDispatchFilter.java:449)
   [junit4]   2> 	at org.apache.solr.servlet.SolrDispatchFilter.doFilter(SolrDispatchFilter.java:349)
   [junit4]   2> 	at org.apache.solr.servlet.SolrDispatchFilter.doFilter(SolrDispatchFilter.java:326)
   [junit4]   2> 	at org.eclipse.jetty.servlet.ServletHandler$CachedChain.doFilter(ServletHandler.java:1759)
   [junit4]   2> 	at org.apache.solr.client.solrj.embedded.JettySolrRunner$DebugFilter.doFilter(JettySolrRunner.java:139)
   [junit4]   2> 	at org.eclipse.jetty.servlet.ServletHandler$CachedChain.doFilter(ServletHandler.java:1759)
   [junit4]   2> 	at org.eclipse.jetty.servlet.ServletHandler.doHandle(ServletHandler.java:582)
   [junit4]   2> 	at org.eclipse.jetty.server.session.SessionHandler.doHandle(SessionHandler.java:224)
   [junit4]   2> 	at org.eclipse.jetty.server.handler.ContextHandler.doHandle(ContextHandler.java:1180)
   [junit4]   2> 	at org.eclipse.jetty.servlet.ServletHandler.doScope(ServletHandler.java:512)
   [junit4]   2> 	at org.eclipse.jetty.server.session.SessionHandler.doScope(SessionHandler.java:185)
   [junit4]   2> 	at org.eclipse.jetty.server.handler.ContextHandler.doScope(ContextHandler.java:1112)
   [junit4]   2> 	at org.eclipse.jetty.server.handler.ScopedHandler.handle(ScopedHandler.java:141)
   [junit4]   2> 	at org.eclipse.jetty.server.handler.gzip.GzipHandler.handle(GzipHandler.java:493)
   [junit4]   2> 	at org.eclipse.jetty.server.handler.HandlerWrapper.handle(HandlerWrapper.java:134)
   [junit4]   2> 	at org.eclipse.jetty.server.Server.handle(Server.java:534)
   [junit4]   2> 	at org.eclipse.jetty.server.HttpChannel.handle(HttpChannel.java:320)
   [junit4]   2> 	at org.eclipse.jetty.server.HttpConnection.onFillable(HttpConnection.java:251)
   [junit4]   2> 	at org.eclipse.jetty.io.AbstractConnection$ReadCallback.succeeded(AbstractConnection.java:283)
   [junit4]   2> 	at org.eclipse.jetty.io.FillInterest.fillable(FillInterest.java:108)
   [junit4]   2> 	at org.eclipse.jetty.io.SelectChannelEndPoint$2.run(SelectChannelEndPoint.java:93)
   [junit4]   2> 	at org.eclipse.jetty.util.thread.strategy.ExecuteProduceConsume.executeProduceConsume(ExecuteProduceConsume.java:303)
   [junit4]   2> 	at org.eclipse.jetty.util.thread.strategy.ExecuteProduceConsume.produceConsume(ExecuteProduceConsume.java:148)
   [junit4]   2> 	at org.eclipse.jetty.util.thread.strategy.ExecuteProduceConsume.run(ExecuteProduceConsume.java:136)
   [junit4]   2> 	at org.eclipse.jetty.util.thread.QueuedThreadPool.runJob(QueuedThreadPool.java:671)
   [junit4]   2> 	at org.eclipse.jetty.util.thread.QueuedThreadPool$2.run(QueuedThreadPool.java:589)
   [junit4]   2> 	at java.lang.Thread.run(Thread.java:748)
   [junit4]   2> 2095906 WARN  (qtp1285912474-15820) [n:127.0.0.1:59851_solr    ] o.e.j.s.ServletHandler /solr/admin/collections
   [junit4]   2> org.apache.solr.common.SolrException: Error during request authentication, 
   [junit4]   2> 	at org.apache.solr.servlet.SolrDispatchFilter.authenticateRequest(SolrDispatchFilter.java:455)
   [junit4]   2> 	at org.apache.solr.servlet.SolrDispatchFilter.doFilter(SolrDispatchFilter.java:349)
   [junit4]   2> 	at org.apache.solr.servlet.SolrDispatchFilter.doFilter(SolrDispatchFilter.java:326)
   [junit4]   2> 	at org.eclipse.jetty.servlet.ServletHandler$CachedChain.doFilter(ServletHandler.java:1759)
   [junit4]   2> 	at org.apache.solr.client.solrj.embedded.JettySolrRunner$DebugFilter.doFilter(JettySolrRunner.java:139)
   [junit4]   2> 	at org.eclipse.jetty.servlet.ServletHandler$CachedChain.doFilter(ServletHandler.java:1759)
   [junit4]   2> 	at org.eclipse.jetty.servlet.ServletHandler.doHandle(ServletHandler.java:582)
   [junit4]   2> 	at org.eclipse.jetty.server.session.SessionHandler.doHandle(SessionHandler.java:224)
   [junit4]   2> 	at org.eclipse.jetty.server.handler.ContextHandler.doHandle(ContextHandler.java:1180)
   [junit4]   2> 	at org.eclipse.jetty.servlet.ServletHandler.doScope(ServletHandler.java:512)
   [junit4]   2> 	at org.eclipse.jetty.server.session.SessionHandler.doScope(SessionHandler.java:185)
   [junit4]   2> 	at org.eclipse.jetty.server.handler.ContextHandler.doScope(ContextHandler.java:1112)
   [junit4]   2> 	at org.eclipse.jetty.server.handler.ScopedHandler.handle(ScopedHandler.java:141)
   [junit4]   2> 	at org.eclipse.jetty.server.handler.gzip.GzipHandler.handle(GzipHandler.java:493)
   [junit4]   2> 	at org.eclipse.jetty.server.handler.HandlerWrapper.handle(HandlerWrapper.java:134)
   [junit4]   2> 	at org.eclipse.jetty.server.Server.handle(Server.java:534)
   [junit4]   2> 	at org.eclipse.jetty.server.HttpChannel.handle(HttpChannel.java:320)
   [junit4]   2> 	at org.eclipse.jetty.server.HttpConnection.onFillable(HttpConnection.java:251)
   [junit4]   2> 	at org.eclipse.jetty.io.AbstractConnection$ReadCallback.succeeded(AbstractConnection.java:283)
   [junit4]   2> 	at org.eclipse.jetty.io.FillInterest.fillable(FillInterest.java:108)
   [junit4]   2> 	at org.eclipse.jetty.io.SelectChannelEndPoint$2.run(SelectChannelEndPoint.java:93)
   [junit4]   2> 	at org.eclipse.jetty.util.thread.strategy.ExecuteProduceConsume.executeProduceConsume(ExecuteProduceConsume.java:303)
   [junit4]   2> 	at org.eclipse.jetty.util.thread.strategy.ExecuteProduceConsume.produceConsume(ExecuteProduceConsume.java:148)
   [junit4]   2> 	at org.eclipse.jetty.util.thread.strategy.ExecuteProduceConsume.run(ExecuteProduceConsume.java:136)
   [junit4]   2> 	at org.eclipse.jetty.util.thread.QueuedThreadPool.runJob(QueuedThreadPool.java:671)
   [junit4]   2> 	at org.eclipse.jetty.util.thread.QueuedThreadPool$2.run(QueuedThreadPool.java:589)
   [junit4]   2> 	at java.lang.Thread.run(Thread.java:748)
   [junit4]   2> Caused by: java.lang.IllegalArgumentException: userName is NULL, empty or contains a '&'
   [junit4]   2> 	at org.apache.hadoop.security.authentication.util.AuthToken.checkForIllegalArgument(AuthToken.java:87)
   [junit4]   2> 	at org.apache.hadoop.security.authentication.util.AuthToken.<init>(AuthToken.java:70)
   [junit4]   2> 	at org.apache.hadoop.security.authentication.server.AuthenticationToken.<init>(AuthenticationToken.java:58)
   [junit4]   2> 	at org.apache.hadoop.security.authentication.server.PseudoAuthenticationHandler.authenticate(PseudoAuthenticationHandler.java:195)
   [junit4]   2> 	at org.apache.hadoop.security.token.delegation.web.DelegationTokenAuthenticationHandler.authenticate(DelegationTokenAuthenticationHandler.java:348)
   [junit4]   2> 	at org.apache.solr.security.RequestContinuesRecorderAuthenticationHandler.authenticate(RequestContinuesRecorderAuthenticationHandler.java:69)
   [junit4]   2> 	at org.apache.hadoop.security.authentication.server.AuthenticationFilter.doFilter(AuthenticationFilter.java:518)
   [junit4]   2> 	at org.apache.solr.security.HadoopAuthFilter.doFilter(HadoopAuthFilter.java:110)
   [junit4]   2> 	at org.apache.solr.security.HadoopAuthPlugin.doAuthenticate(HadoopAuthPlugin.java:245)
   [junit4]   2> 	at org.apache.solr.servlet.SolrDispatchFilter.authenticateRequest(SolrDispatchFilter.java:449)
   [junit4]   2> 	... 26 more
   [junit4]   2> 2095907 INFO  (TEST-TestImpersonationWithHadoopAuth.testProxyNullProxyUser-seed#[851D5DC2D290708A]) [    ] o.a.s.SolrTestCaseJ4 ###Ending testProxyNullProxyUser
   [junit4]   2> 2095936 INFO  (TEST-TestImpersonationWithHadoopAuth.testProxyWrongHost-seed#[851D5DC2D290708A]) [    ] o.a.s.SolrTestCaseJ4 ###Starting testProxyWrongHost
   [junit4]   2> 2110496 WARN  (jetty-launcher-3520-thread-2-SendThread(127.0.0.1:36743)) [n:127.0.0.1:36163_solr    ] o.a.z.ClientCnxn Client session timed out, have not heard from server in 14875ms for sessionid 0x160e1d0e5ee0006
   [junit4]   2> 2110496 WARN  (jetty-launcher-3520-thread-1-SendThread(127.0.0.1:36743)) [n:127.0.0.1:59851_solr    ] o.a.z.ClientCnxn Client session timed out, have not heard from server in 14904ms for sessionid 0x160e1d0e5ee0007
   [junit4]   2> 2110496 WARN  (NIOServerCxn.Factory:0.0.0.0/0.0.0.0:0) [    ] o.a.z.s.NIOServerCnxn caught end of stream exception
   [junit4]   2> EndOfStreamException: Unable to read additional data from client sessionid 0x160e1d0e5ee0007, likely client has closed socket
   [junit4]   2> 	at org.apache.zookeeper.server.NIOServerCnxn.doIO(NIOServerCnxn.java:239)
   [junit4]   2> 	at org.apache.zookeeper.server.NIOServerCnxnFactory.run(NIOServerCnxnFactory.java:203)
   [junit4]   2> 	at java.lang.Thread.run(Thread.java:748)
   [junit4]   2> 2110496 WARN  (jetty-launcher-3520-thread-2-SendThread(127.0.0.1:36743)) [n:127.0.0.1:36163_solr    ] o.a.z.ClientCnxn Client session timed out, have not heard from server in 14904ms for sessionid 0x160e1d0e5ee0008
   [junit4]   2> 2110497 WARN  (NIOServerCxn.Factory:0.0.0.0/0.0.0.0:0) [    ] o.a.z.s.NIOServerCnxn caught end of stream exception
   [junit4]   2> EndOfStreamException: Unable to read additional data from client sessionid 0x160e1d0e5ee0006, likely client has closed socket
   [junit4]   2> 	at org.apache.zookeeper.server.NIOServerCnxn.doIO(NIOServerCnxn.java:239)
   [junit4]   2> 	at org.apache.zookeeper.server.NIOServerCnxnFactory.run(NIOServerCnxnFactory.java:203)
   [junit4]   2> 	at java.lang.Thread.run(Thread.java:748)
   [junit4]   2> 2110497 WARN  (jetty-launcher-3520-thread-1-SendThread(127.0.0.1:36743)) [n:127.0.0.1:59851_solr    ] o.a.z.ClientCnxn Client session timed out, have not heard from server in 14921ms for sessionid 0x160e1d0e5ee0005
   [junit4]   2> 2110497 WARN  (NIOServerCxn.Factory:0.0.0.0/0.0.0.0:0) [    ] o.a.z.s.NIOServerCnxn caught end of stream exception
   [junit4]   2> EndOfStreamException: Unable to read additional data from client sessionid 0x160e1d0e5ee0008, likely client has closed socket
   [junit4]   2> 	at org.apache.zookeeper.server.NIOServerCnxn.doIO(NIOServerCnxn.java:239)
   [junit4]   2> 	at org.apache.zookeeper.server.NIOServerCnxnFactory.run(NIOServerCnxnFactory.java:203)
   [junit4]   2> 	at java.lang.Thread.run(Thread.java:748)
   [junit4]   2> 2110498 WARN  (NIOServerCxn.Factory:0.0.0.0/0.0.0.0:0) [    ] o.a.z.s.NIOServerCnxn caught end of stream exception
   [junit4]   2> EndOfStreamException: Unable to read additional data from client sessionid 0x160e1d0e5ee0005, likely client has closed socket
   [junit4]   2> 	at org.apache.zookeeper.server.NIOServerCnxn.doIO(NIOServerCnxn.java:239)
   [junit4]   2> 	at org.apache.zookeeper.server.NIOServerCnxnFactory.run(NIOServerCnxnFactory.java:203)
   [junit4]   2> 	at java.lang.Thread.run(Thread.java:748)
   [junit4]   2> 2110498 WARN  (TEST-TestImpersonationWithHadoopAuth.testProxyWrongHost-seed#[851D5DC2D290708A]) [    ] o.a.h.c.p.ResponseProcessCookies Invalid cookie header: "Set-Cookie: hadoop.auth="u=wrongHost&p=wrongHost&t=simple-dt&e=1515653052906&s=Kv1xMn4IqyZLHxfCnA78J3UQNP8="; Domain=127.0.0.1; Expires=Do, 11-Jan-2018 06:44:12 GMT; HttpOnly". Invalid 'expires' attribute: Do, 11-Jan-2018 06:44:12 GMT
   [junit4]   2> 2110498 INFO  (TEST-TestImpersonationWithHadoopAuth.testProxyWrongHost-seed#[851D5DC2D290708A]) [    ] o.a.s.SolrTestCaseJ4 ###Ending testProxyWrongHost
   [junit4]   2> 2110597 WARN  (zkConnectionManagerCallback-3537-thread-1-processing-n:127.0.0.1:36163_solr) [n:127.0.0.1:36163_solr    ] o.a.s.c.c.ConnectionManager Watcher org.apache.solr.common.cloud.ConnectionManager@73af6067 name: ZooKeeperConnection Watcher:127.0.0.1:36743/solr got event WatchedEvent state:Disconnected type:None path:null path: null type: None
   [junit4]   2> 2110597 WARN  (zkConnectionManagerCallback-3537-thread-1-processing-n:127.0.0.1:36163_solr) [n:127.0.0.1:36163_solr    ] o.a.s.c.c.ConnectionManager zkClient has disconnected
   [junit4]   2> 2110599 INFO  (jetty-launcher-3520-thread-2-EventThread) [n:127.0.0.1:36163_solr    ] o.a.c.f.s.ConnectionStateManager State change: SUSPENDED
   [junit4]   2> 2110600 INFO  (jetty-closer-3521-thread-2) [    ] o.e.j.s.AbstractConnector Stopped ServerConnector@12f2aab9{HTTP/1.1,[http/1.1]}{127.0.0.1:0}
   [junit4]   2> 2110601 WARN  (zkConnectionManagerCallback-3539-thread-1-processing-n:127.0.0.1:59851_solr) [n:127.0.0.1:59851_solr    ] o.a.s.c.c.ConnectionManager Watcher org.apache.solr.common.cloud.ConnectionManager@1b4ec54b name: ZooKeeperConnection Watcher:127.0.0.1:36743/solr got event WatchedEvent state:Disconnected type:None path:null path: null type: None
   [junit4]   2> 2110601 WARN  (zkConnectionManagerCallback-3539-thread-1-processing-n:127.0.0.1:59851_solr) [n:127.0.0.1:59851_solr    ] o.a.s.c.c.ConnectionManager zkClient has disconnected
   [junit4]   2> 2110602 INFO  (jetty-closer-3521-thread-2) [    ] o.a.s.c.CoreContainer Shutting down CoreContainer instance=1629213414
   [junit4]   2> 2110603 INFO  (jetty-closer-3521-thread-2) [    ] o.a.s.m.SolrMetricManager Closing metric reporters for registry=solr.node, tag=null
   [junit4]   2> 2110603 INFO  (jetty-closer-3521-thread-2) [    ] o.a.s.m.r.SolrJmxReporter Closing reporter [org.apache.solr.metrics.reporters.SolrJmxReporter@630c8485: rootName = solr_36163, domain = solr.node, service url = null, agent id = null] for registry solr.node / com.codahale.metrics.MetricRegistry@4fe36ac7
   [junit4]   2> 2110610 INFO  (jetty-closer-3521-thread-1) [    ] o.e.j.s.AbstractConnector Stopped ServerConnector@3c3d26ca{HTTP/1.1,[http/1.1]}{127.0.0.1:0}
   [junit4]   2> 2110610 INFO  (jetty-closer-3521-thread-1) [    ] o.a.s.c.CoreContainer Shutting down CoreContainer instance=1736720723
   [junit4]   2> 2110611 INFO  (jetty-closer-3521-thread-1) [    ] o.a.s.m.SolrMetricManager Closing metric reporters for registry=solr.node, tag=null
   [junit4]   2> 2110611 INFO  (jetty-closer-3521-thread-1) [    ] o.a.s.m.r.SolrJmxReporter Closing reporter [org.apache.solr.metrics.reporters.SolrJmxReporter@7cca4ff7: rootName = solr_59851, domain = solr.node, service url = null, agent id = null] for registry solr.node / com.codahale.metrics.MetricRegistry@26d4c10e
   [junit4]   2> 2110615 INFO  (jetty-closer-3521-thread-2) [    ] o.a.s.m.SolrMetricManager Closing metric reporters for registry=solr.jvm, tag=null
   [junit4]   2> 2110615 INFO  (jetty-closer-3521-thread-2) [    ] o.a.s.m.r.SolrJmxReporter Closing reporter [org.apache.solr.metrics.reporters.SolrJmxReporter@4c8098a3: rootName = solr_36163, domain = solr.jvm, service url = null, agent id = null] for registry solr.jvm / com.codahale.metrics.MetricRegistry@49a6d11e
   [junit4]   2> 2110627 INFO  (jetty-closer-3521-thread-2) [    ] o.a.s.m.SolrMetricManager Closing metric reporters for registry=solr.jetty, tag=null
   [junit4]   2> 2110627 INFO  (jetty-closer-3521-thread-2) [    ] o.a.s.m.r.SolrJmxReporter Closing reporter [org.apache.solr.metrics.reporters.SolrJmxReporter@14999a5f: rootName = solr_36163, domain = solr.jetty, service url = null, agent id = null] for registry solr.jetty / com.codahale.metrics.MetricRegistry@624e0b7b
   [junit4]   2> 2110627 INFO  (jetty-closer-3521-thread-1) [    ] o.a.s.m.SolrMetricManager Closing metric reporters for registry=solr.jvm, tag=null
   [junit4]   2> 2110627 INFO  (jetty-closer-3521-thread-1) [    ] o.a.s.m.r.SolrJmxReporter Closing reporter [org.apache.solr.metrics.reporters.SolrJmxReporter@5a82191c: rootName = solr_59851, domain = solr.jvm, service url = null, agent id = null] for registry solr.jvm / com.codahale.metrics.MetricRegistry@49a6d11e
   [junit4]   2> 2110631 INFO  (jetty-closer-3521-thread-1) [    ] o.a.s.m.SolrMetricManager Closing metric reporters for registry=solr.jetty, tag=null
   [junit4]   2> 2110631 INFO  (jetty-closer-3521-thread-1) [    ] o.a.s.m.r.SolrJmxReporter Closing reporter [org.apache.solr.metrics.reporters.SolrJmxReporter@68edf9ba: rootName = solr_59851, domain = solr.jetty, service url = null, agent id = null] for registry solr.jetty / com.codahale.metrics.MetricRegistry@624e0b7b
   [junit4]   2> 2111893 INFO  (jetty-launcher-3520-thread-1-EventThread) [n:127.0.0.1:59851_solr    ] o.a.c.f.s.ConnectionStateManager State change: SUSPENDED
   [junit4]   2> 2112070 INFO  (zkConnectionManagerCallback-3537-thread-1-processing-n:127.0.0.1:36163_solr) [n:127.0.0.1:36163_solr    ] o.a.s.c.c.ConnectionManager zkClient has connected
   [junit4]   2> 2112074 INFO  (jetty-closer-3521-thread-2) [    ] o.a.s.c.ZkController Remove node as live in ZooKeeper:/live_nodes/127.0.0.1:36163_solr
   [junit4]   2> 2112076 INFO  (jetty-closer-3521-thread-2) [    ] o.a.s.m.SolrMetricManager Closing metric reporters for registry=solr.cluster, tag=null
   [junit4]   2> 2112077 INFO  (jetty-closer-3521-thread-2) [    ] o.a.s.c.TransientSolrCoreCacheDefault Allocating transient cache for 2147483647 transient cores
   [junit4]   2> 2112077 INFO  (zkCallback-3536-thread-2-processing-n:127.0.0.1:36163_solr) [n:127.0.0.1:36163_solr    ] o.a.s.c.c.ZkStateReader Updated live nodes from ZooKeeper... (2) -> (1)
   [junit4]   2> 2112080 ERROR (Thread[Thread-3323,5,TGRP-TestImpersonationWithHadoopAuth]) [n:127.0.0.1:36163_solr    ] o.a.h.s.t.d.AbstractDelegationTokenSecretManager ExpiredTokenRemover received java.lang.InterruptedException: sleep interrupted
   [junit4]   2> 2112086 INFO  (jetty-closer-3521-thread-2) [    ] o.e.j.s.h.ContextHandler Stopped o.e.j.s.ServletContextHandler@4611587e{/solr,null,UNAVAILABLE}
   [junit4]   2> 2112102 INFO  (zkConnectionManagerCallback-3539-thread-1-processing-n:127.0.0.1:59851_solr) [n:127.0.0.1:59851_solr    ] o.a.s.c.c.ConnectionManager zkClient has connected
   [junit4]   2> 2112104 INFO  (zkCallback-3538-thread-5-processing-n:127.0.0.1:59851_solr) [n:127.0.0.1:59851_solr    ] o.a.s.c.c.ZkStateReader Updated live nodes from ZooKeeper... (2) -> (1)
   [junit4]   2> 2112106 INFO  (jetty-closer-3521-thread-1) [    ] o.a.s.c.ZkController Remove node as live in ZooKeeper:/live_nodes/127.0.0.1:59851_solr
   [junit4]   2> 2112108 INFO  (jetty-closer-3521-thread-1) [    ] o.a.s.m.SolrMetricManager Closing metric reporters for registry=solr.cluster, tag=null
   [junit4]   2> 2112108 INFO  (jetty-closer-3521-thread-1) [    ] o.a.s.c.TransientSolrCoreCacheDefault Allocating transient cache for 2147483647 transient cores
   [junit4]   2> 2112108 INFO  (jetty-closer-3521-thread-1) [    ] o.a.s.c.Overseer Overseer (id=99327479129178117-127.0.0.1:59851_solr-n_0000000000) closing
   [junit4]   2> 2112108 WARN  (OverseerAutoScalingTriggerThread-99327479129178117-127.0.0.1:59851_solr-n_0000000000) [n:127.0.0.1:59851_solr    ] o.a.s.c.a.OverseerTriggerThread OverseerTriggerThread woken up but we are closed, exiting.
   [junit4]   2> 2112110 INFO  (OverseerStateUpdate-99327479129178117-127.0.0.1:59851_solr-n_0000000000) [n:127.0.0.1:59851_solr    ] o.a.s.c.Overseer Overseer Loop exiting : 127.0.0.1:59851_solr
   [junit4]   2> 2112112 INFO  (zkCallback-3538-thread-5-processing-n:127.0.0.1:59851_solr) [n:127.0.0.1:59851_solr    ] o.a.s.c.c.ZkStateReader Updated live nodes from ZooKeeper... (1) -> (0)
   [junit4]   2> 2112116 WARN  (NIOServerCxn.Factory:0.0.0.0/0.0.0.0:0) [    ] o.a.z.s.NIOServerCnxn caught end of stream exception
   [junit4]   2> EndOfStreamException: Unable to read additional data from client sessionid 0x160e1d0e5ee0005, likely client has closed socket
   [junit4]   2> 	at org.apache.zookeeper.server.NIOServerCnxn.doIO(NIOServerCnxn.java:239)
   [junit4]   2> 	at org.apache.zookeeper.server.NIOServerCnxnFactory.run(NIOServerCnxnFactory.java:203)
   [junit4]   2> 	at java.lang.Thread.run(Thread.java:748)
   [junit4]   2> 2112117 ERROR (Thread[Thread-3320,5,TGRP-TestImpersonationWithHadoopAuth]) [n:127.0.0.1:59851_solr    ] o.a.h.s.t.d.AbstractDelegationTokenSecretManager ExpiredTokenRemover received java.lang.InterruptedException: sleep interrupted
   [junit4]   2> 2112125 WARN  (NIOServerCxn.Factory:0.0.0.0/0.0.0.0:0) [    ] o.a.z.s.NIOServerCnxn caught end of stream exception
   [junit4]   2> EndOfStreamException: Unable to read additional data from client sessionid 0x160e1d0e5ee0007, likely client has closed socket
   [junit4]   2> 	at org.apache.zookeeper.server.NIOServerCnxn.doIO(NIOServerCnxn.java:239)
   [junit4]   2> 	at org.apache.zookeeper.server.NIOServerCnxnFactory.run(NIOServerCnxnFactory.java:203)
   [junit4]   2> 	at java.lang.Thread.run(Thread.java:748)
   [junit4]   2> 2112125 INFO  (jetty-closer-3521-thread-1) [    ] o.e.j.s.h.ContextHandler Stopped o.e.j.s.ServletContextHandler@ad65f21{/solr,null,UNAVAILABLE}
   [junit4]   2> 2112128 ERROR (SUITE-TestImpersonationWithHadoopAuth-seed#[851D5DC2D290708A]-worker) [    ] o.a.z.s.ZooKeeperServer ZKShutdownHandler is not registered, so ZooKeeper server won't take any action on ERROR or SHUTDOWN server state changes
   [junit4]   2> 2112128 INFO  (SUITE-TestImpersonationWithHadoopAuth-seed#[851D5DC2D290708A]-worker) [    ] o.a.s.c.ZkTestServer connecting to 127.0.0.1:36743 36743
   [junit4]   2> 2114657 INFO  (Thread-3303) [    ] o.a.s.c.ZkTestServer connecting to 127.0.0.1:36743 36743
   [junit4]   2> 2114658 WARN  (Thread-3303) [    ] o.a.s.c.ZkTestServer Watch limit violations: 
   [junit4]   2> Maximum concurrent create/delete watches above limit:
   [junit4]   2> 
   [junit4]   2> 	3	/solr/aliases.json
   [junit4]   2> 	3	/solr/clusterprops.json
   [junit4]   2> 	2	/solr/security.json
   [junit4]   2> 
   [junit4]   2> Maximum concurrent data watches above limit:
   [junit4]   2> 
   [junit4]   2> 	3	/solr/security/zkdtsm/ZKDTSMRoot/ZKDTSMKeyIdRoot
   [junit4]   2> 	3	/solr/clusterstate.json
   [junit4]   2> 	3	/solr/security/zkdtsm/ZKDTSMRoot/ZKDTSMSeqNumRoot
   [junit4]   2> 	2	/solr/security/zkdtsm/ZKDTSMRoot/ZKDTSMMasterKeyRoot/DK_1
   [junit4]   2> 	2	/solr/security/zkdtsm/ZKDTSMRoot/ZKDTSMMasterKeyRoot/DK_3
   [junit4]   2> 	2	/solr/security/zkdtsm/ZKDTSMRoot/ZKDTSMMasterKeyRoot/DK_2
   [junit4]   2> 	2	/solr/security/zkdtsm/ZKDTSMRoot/ZKDTSMMasterKeyRoot/DK_4
   [junit4]   2> 
   [junit4]   2> Maximum concurrent children watches above limit:
   [junit4]   2> 
   [junit4]   2> 	3	/solr/live_nodes
   [junit4]   2> 	3	/solr/collections
   [junit4]   2> 	3	/solr/security/zkdtsm/ZKDTSMRoot/ZKDTSMMasterKeyRoot
   [junit4]   2> 	2	/solr/security/zkdtsm/ZKDTSMRoot/ZKDTSMTokensRoot
   [junit4]   2> 
   [junit4]   2> 2114658 INFO  (SUITE-TestImpersonationWithHadoopAuth-seed#[851D5DC2D290708A]-worker) [    ] o.a.s.SolrTestCaseJ4 ------------------------------------------------------- Done waiting for tracked resources to be released
   [junit4]   2> Jan 10, 2018 8:44:31 PM com.carrotsearch.randomizedtesting.ThreadLeakControl checkThreadLeaks
   [junit4]   2> WARNING: Will linger awaiting termination of 2 leaked thread(s).
   [junit4]   2> Jan 10, 2018 8:44:51 PM com.carrotsearch.randomizedtesting.ThreadLeakControl checkThreadLeaks
   [junit4]   2> SEVERE: 2 threads leaked from SUITE scope at org.apache.solr.security.hadoop.TestImpersonationWithHadoopAuth: 
   [junit4]   2>    1) Thread[id=15864, name=jetty-launcher-3520-thread-2-EventThread, state=TIMED_WAITING, group=TGRP-TestImpersonationWithHadoopAuth]
   [junit4]   2>         at sun.misc.Unsafe.park(Native Method)
   [junit4]   2>         at java.util.concurrent.locks.LockSupport.parkNanos(LockSupport.java:215)
   [junit4]   2>         at java.util.concurrent.locks.AbstractQueuedSynchronizer.doAcquireSharedNanos(AbstractQueuedSynchronizer.java:1037)
   [junit4]   2>         at java.util.concurrent.locks.AbstractQueuedSynchronizer.tryAcquireSharedNanos(AbstractQueuedSynchronizer.java:1328)
   [junit4]   2>         at java.util.concurrent.CountDownLatch.await(CountDownLatch.java:277)
   [junit4]   2>         at org.apache.curator.CuratorZookeeperClient.internalBlockUntilConnectedOrTimedOut(CuratorZookeeperClient.java:323)
   [junit4]   2>         at org.apache.curator.RetryLoop.callWithRetry(RetryLoop.java:105)
   [junit4]   2>         at org.apache.curator.framework.imps.GetDataBuilderImpl.pathInForeground(GetDataBuilderImpl.java:288)
   [junit4]   2>         at org.apache.curator.framework.imps.GetDataBuilderImpl.forPath(GetDataBuilderImpl.java:279)
   [junit4]   2>         at org.apache.curator.framework.imps.GetDataBuilderImpl.forPath(GetDataBuilderImpl.java:41)
   [junit4]   2>         at org.apache.curator.framework.recipes.shared.SharedValue.readValue(SharedValue.java:244)
   [junit4]   2>         at org.apache.curator.framework.recipes.shared.SharedValue.access$100(SharedValue.java:44)
   [junit4]   2>         at org.apache.curator.framework.recipes.shared.SharedValue$1.process(SharedValue.java:61)
   [junit4]   2>         at org.apache.curator.framework.imps.NamespaceWatcher.process(NamespaceWatcher.java:67)
   [junit4]   2>         at org.apache.zookeeper.ClientCnxn$EventThread.processEvent(ClientCnxn.java:530)
   [junit4]   2>         at org.apache.zookeeper.ClientCnxn$EventThread.run(ClientCnxn.java:505)
   [junit4]   2>    2) Thread[id=15854, name=jetty-launcher-3520-thread-1-EventThread, state=TIMED_WAITING, group=TGRP-TestImpersonationWithHadoopAuth]
   [junit4]   2>         at sun.misc.Unsafe.park(Native Method)
   [junit4]   2>         at java.util.concurrent.locks.LockSupport.parkNanos(LockSupport.java:215)
   [junit4]   2>         at java.util.concurrent.locks.AbstractQueuedSynchronizer.doAcquireSharedNanos(AbstractQueuedSynchronizer.java:1037)
   [junit4]   2>         at java.util.concurrent.locks.AbstractQueuedSynchronizer.tryAcquireSharedNanos(AbstractQueuedSynchronizer.java:1328)
   [junit4]   2>         at java.util.concurrent.CountDownLatch.await(CountDownLatch.java:277)
   [junit4]   2>         at org.apache.curator.CuratorZookeeperClient.internalBlockUntilConnectedOrTimedOut(CuratorZookeeperClient.java:323)
   [junit4]   2>         at org.apache.curator.RetryLoop.callWithRetry(RetryLoop.java:105)
   [junit4]   2>         at org.apache.curator.framework.imps.GetDataBuilderImpl.pathInForeground(GetDataBuilderImpl.java:288)
   [junit4]   2>         at org.apache.curator.framework.imps.GetDataBuilderImpl.forPath(GetDataBuilderImpl.java:279)
   [junit4]   2>         at org.apache.curator.framework.imps.GetDataBuilderImpl.forPath(GetDataBuilderImpl.java:41)
   [junit4]   2>         at org.apache.curator.framework.recipes.shared.SharedValue.readValue(SharedValue.java:244)
   [junit4]   2>         at org.apache.curator.framework.recipes.shared.SharedValue.access$100(SharedValue.java:44)
   [junit4]   2>         at org.apache.curator.framework.recipes.shared.SharedValue$1.process(SharedValue.java:61)
   [junit4]   2>         at org.apache.curator.framework.imps.NamespaceWatcher.process(NamespaceWatcher.java:67)
   [junit4]   2>         at org.apache.zookeeper.ClientCnxn$EventThread.processEvent(ClientCnxn.java:530)
   [junit4]   2>         at org.apache.zookeeper.ClientCnxn$EventThread.run(ClientCnxn.java:505)
   [junit4]   2> Jan 10, 2018 8:44:51 PM com.carrotsearch.randomizedtesting.ThreadLeakControl tryToInterruptAll
   [junit4]   2> INFO: Starting to interrupt leaked threads:
   [junit4]   2>    1) Thread[id=15864, name=jetty-launcher-3520-thread-2-EventThread, state=TIMED_WAITING, group=TGRP-TestImpersonationWithHadoopAuth]
   [junit4]   2>    2) Thread[id=15854, name=jetty-launcher-3520-thread-1-EventThread, state=TIMED_WAITING, group=TGRP-TestImpersonationWithHadoopAuth]
   [junit4]   2> 2134681 ERROR (jetty-launcher-3520-thread-2-EventThread) [n:127.0.0.1:36163_solr    ] o.a.c.f.i.CuratorFrameworkImpl Watcher exception
   [junit4]   2> java.lang.InterruptedException
   [junit4]   2> 	at java.util.concurrent.locks.AbstractQueuedSynchronizer.doAcquireSharedNanos(AbstractQueuedSynchronizer.java:1039)
   [junit4]   2> 	at java.util.concurrent.locks.AbstractQueuedSynchronizer.tryAcquireSharedNanos(AbstractQueuedSynchronizer.java:1328)
   [junit4]   2> 	at java.util.concurrent.CountDownLatch.await(CountDownLatch.java:277)
   [junit4]   2> 	at org.apache.curator.CuratorZookeeperClient.internalBlockUntilConnectedOrTimedOut(CuratorZookeeperClient.java:323)
   [junit4]   2> 	at org.apache.curator.RetryLoop.callWithRetry(RetryLoop.java:105)
   [junit4]   2> 	at org.apache.curator.framework.imps.GetDataBuilderImpl.pathInForeground(GetDataBuilderImpl.java:288)
   [junit4]   2> 	at org.apache.curator.framework.imps.GetDataBuilderImpl.forPath(GetDataBuilderImpl.java:279)
   [junit4]   2> 	at org.apache.curator.framework.imps.GetDataBuilderImpl.forPath(GetDataBuilderImpl.java:41)
   [junit4]   2> 	at org.apache.curator.framework.recipes.shared.SharedValue.readValue(SharedValue.java:244)
   [junit4]   2> 	at org.apache.curator.framework.recipes.shared.SharedValue.access$100(SharedValue.java:44)
   [junit4]   2> 	at org.apache.curator.framework.recipes.shared.SharedValue$1.process(SharedValue.java:61)
   [junit4]   2> 	at org.apache.curator.framework.imps.NamespaceWatcher.process(NamespaceWatcher.java:67)
   [junit4]   2> 	at org.apache.zookeeper.ClientCnxn$EventThread.processEvent(ClientCnxn.java:530)
   [junit4]   2> 	at org.apache.zookeeper.ClientCnxn$EventThread.run(ClientCnxn.java:505)
   [junit4]   2> 2134681 ERROR (jetty-launcher-3520-thread-1-EventThread) [n:127.0.0.1:59851_solr    ] o.a.c.f.i.CuratorFrameworkImpl Watcher exception
   [junit4]   2> java.lang.InterruptedException
   [junit4]   2> 	at java.util.concurrent.locks.AbstractQueuedSynchronizer.doAcquireSharedNanos(AbstractQueuedSynchronizer.java:1039)
   [junit4]   2> 	at java.util.concurrent.locks.AbstractQueuedSynchronizer.tryAcquireSharedNanos(AbstractQueuedSynchronizer.java:1328)
   [junit4]   2> 	at java.util.concurrent.CountDownLatch.await(CountDownLatch.java:277)
   [junit4]   2> 	at org.apache.curator.CuratorZookeeperClient.internalBlockUntilConnectedOrTimedOut(CuratorZookeeperClient.java:323)
   [junit4]   2> 	at org.apache.curator.RetryLoop.callWithRetry(RetryLoop.java:105)
   [junit4]   2> 	at org.apache.curator.framework.imps.GetDataBuilderImpl.pathInForeground(GetDataBuilderImpl.java:288)
   [junit4]   2> 	at org.apache.curator.framework.imps.GetDataBuilderImpl.forPath(GetDataBuilderImpl.java:279)
   [junit4]   2> 	at org.apache.curator.framework.imps.GetDataBuilderImpl.forPath(GetDataBuilderImpl.java:41)
   [junit4]   2> 	at org.apache.curator.framework.recipes.shared.SharedValue.readValue(SharedValue.java:244)
   [junit4]   2> 	at org.apache.curator.framework.recipes.shared.SharedValue.access$100(SharedValue.java:44)
   [junit4]   2> 	at org.apache.curator.framework.recipes.shared.SharedValue$1.process(SharedValue.java:61)
   [junit4]   2> 	at org.apache.curator.framework.imps.NamespaceWatcher.process(NamespaceWatcher.java:67)
   [junit4]   2> 	at org.apache.zookeeper.ClientCnxn$EventThread.processEvent(ClientCnxn.java:530)
   [junit4]   2> 	at org.apache.zookeeper.ClientCnxn$EventThread.run(ClientCnxn.java:505)
   [junit4]   2> Jan 10, 2018 8:44:51 PM com.carrotsearch.randomizedtesting.ThreadLeakControl tryToInterruptAll
   [junit4]   2> INFO: All leaked threads terminated.
   [junit4]   2> NOTE: test params are: codec=Asserting(Lucene70): {}, docValues:{}, maxPointsInLeafNode=349, maxMBSortInHeap=6.21218971288237, sim=Asserting(org.apache.lucene.search.similarities.AssertingSimilarity@248115e5), locale=de-GR, timezone=US/Eastern
   [junit4]   2> NOTE: SunOS 5.11 amd64/Oracle Corporation 1.8.0_152 (64-bit)/cpus=3,threads=1,free=114756192,total=459157504
   [junit4]   2> NOTE: All tests run in this JVM: [ZkStateWriterTest, MissingSegmentRecoveryTest, ClassificationUpdateProcessorFactoryTest, TestScoreJoinQPScore, BufferStoreTest, GraphQueryTest, TestLegacyFieldReuse, TestMaxScoreQueryParser, TestRebalanceLeaders, SolrShardReporterTest, PKIAuthenticationIntegrationTest, TestSurroundQueryParser, BooleanFieldTest, TriggerIntegrationTest, CollectionsAPISolrJTest, DistributedFacetSimpleRefinementLongTailTest, TestDynamicLoading, FieldAnalysisRequestHandlerTest, OverseerTest, TestDocBasedVersionConstraints, DistanceUnitsTest, CollectionTooManyReplicasTest, DateFieldTest, TestLegacyTerms, AutoAddReplicasPlanActionTest, TestLFUCache, TestHdfsUpdateLog, TestPHPSerializedResponseWriter, SpatialRPTFieldTypeTest, ShardSplitTest, TestTestInjection, RequiredFieldsTest, TestNumericTerms64, TestSolr4Spatial, IndexSchemaTest, TestManagedSynonymGraphFilterFactory, AssignBackwardCompatibilityTest, TestLargeCluster, ConvertedLegacyTest, DistributedExpandComponentTest, SignatureUpdateProcessorFactoryTest, ChaosMonkeySafeLeaderWithPullReplicasTest, SolrCloudExampleTest, TestPhraseSuggestions, TestDistribDocBasedVersion, HdfsChaosMonkeySafeLeaderTest, SolrSlf4jReporterTest, SortSpecParsingTest, BlockCacheTest, TestSchemaManager, HdfsAutoAddReplicasIntegrationTest, CoreAdminRequestStatusTest, TestNonDefinedSimilarityFactory, ComputePlanActionTest, CSVRequestHandlerTest, CloudMLTQParserTest, SolrMetricReporterTest, TestXIncludeConfig, CircularListTest, FastVectorHighlighterTest, DisMaxRequestHandlerTest, TestReRankQParserPlugin, TestBinaryResponseWriter, TestMultiWordSynonyms, TestCryptoKeys, TestClusterStateMutator, TestNRTOpen, LeaderElectionTest, MetricTriggerTest, DirectUpdateHandlerTest, FacetPivotSmallTest, V2ApiIntegrationTest, TestCloudInspectUtil, ClusterStateUpdateTest, TestAuthenticationFramework, URLClassifyProcessorTest, TestCollectionsAPIViaSolrCloudCluster, TestCloudPivotFacet, DefaultValueUpdateProcessorTest, TestEmbeddedSolrServerSchemaAPI, PrimitiveFieldTypeTest, BlobRepositoryCloudTest, TestRandomCollapseQParserPlugin, HdfsNNFailoverTest, SolrGangliaReporterTest, TestLeaderInitiatedRecoveryThread, SpellCheckCollatorWithCollapseTest, TestRTimerTree, TestBlobHandler, DeleteInactiveReplicaTest, SpellCheckComponentTest, TestSerializedLuceneMatchVersion, TestZkAclsWithHadoopAuth, DistributedFacetPivotSmallAdvancedTest, TimeZoneUtilsTest, JvmMetricsTest, TestFuzzyAnalyzedSuggestions, DocExpirationUpdateProcessorFactoryTest, RequestHandlersTest, DistributedVersionInfoTest, TestSQLHandlerNonCloud, TestShortCircuitedRequests, TestWriterPerf, LeaderFailoverAfterPartitionTest, TestCollapseQParserPlugin, MultiThreadedOCPTest, SolrJmxReporterCloudTest, TestImpersonationWithHadoopAuth]
   [junit4]   2> NOTE: reproduce with: ant test  -Dtestcase=TestImpersonationWithHadoopAuth -Dtests.seed=851D5DC2D290708A -Dtests.slow=true -Dtests.locale=de-GR -Dtests.timezone=US/Eastern -Dtests.asserts=true -Dtests.file.encoding=ISO-8859-1
   [junit4] ERROR   0.00s J0 | TestImpersonationWithHadoopAuth (suite) <<<
   [junit4]    > Throwable #1: com.carrotsearch.randomizedtesting.ThreadLeakError: 2 threads leaked from SUITE scope at org.apache.solr.security.hadoop.TestImpersonationWithHadoopAuth: 
   [junit4]    >    1) Thread[id=15864, name=jetty-launcher-3520-thread-2-EventThread, state=TIMED_WAITING, group=TGRP-TestImpersonationWithHadoopAuth]
   [junit4]    >         at sun.misc.Unsafe.park(Native Method)
   [junit4]    >         at java.util.concurrent.locks.LockSupport.parkNanos(LockSupport.java:215)
   [junit4]    >         at java.util.concurrent.locks.AbstractQueuedSynchronizer.doAcquireSharedNanos(AbstractQueuedSynchronizer.java:1037)
   [junit4]    >         at java.util.concurrent.locks.AbstractQueuedSynchronizer.tryAcquireSharedNanos(AbstractQueuedSynchronizer.java:1328)
   [junit4]    >         at java.util.concurrent.CountDownLatch.await(CountDownLatch.java:277)
   [junit4]    >         at org.apache.curator.CuratorZookeeperClient.internalBlockUntilConnectedOrTimedOut(CuratorZookeeperClient.java:323)
   [junit4]    >         at org.apache.curator.RetryLoop.callWithRetry(RetryLoop.java:105)
   [junit4]    >         at org.apache.curator.framework.imps.GetDataBuilderImpl.pathInForeground(GetDataBuilderImpl.java:288)
   [junit4]    >         at org.apache.curator.framework.imps.GetDataBuilderImpl.forPath(GetDataBuilderImpl.java:279)
   [junit4]    >         at org.apache.curator.framework.imps.GetDataBuilderImpl.forPath(GetDataBuilderImpl.java:41)
   [junit4]    >         at org.apache.curator.framework.recipes.shared.SharedValue.readValue(SharedValue.java:244)
   [junit4]    >         at org.apache.curator.framework.recipes.shared.SharedValue.access$100(SharedValue.java:44)
   [junit4]    >         at org.apache.curator.framework.recipes.shared.SharedValue$1.process(SharedValue.java:61)
   [junit4]    >         at org.apache.curator.framework.imps.NamespaceWatcher.process(NamespaceWatcher.java:67)
   [junit4]    >         at org.apache.zookeeper.ClientCnxn$EventThread.processEvent(ClientCnxn.java:530)
   [junit4]    >         at org.apache.zookeeper.ClientCnxn$EventThread.run(ClientCnxn.java:505)
   [junit4]    >    2) Thread[id=15854, name=jetty-launcher-3520-thread-1-EventThread, state=TIMED_WAITING, group=TGRP-TestImpersonationWithHadoopAuth]
   [junit4]    >         at sun.misc.Unsafe.park(Native Method)
   [junit4]    >         at java.util.concurrent.locks.LockSupport.parkNanos(LockSupport.java:215)
   [junit4]    >         at java.util.concurrent.locks.AbstractQueuedSynchronizer.doAcquireSharedNanos(AbstractQueuedSynchronizer.java:1037)
   [junit4]    >         at java.util.concurrent.locks.AbstractQueuedSynchronizer.tryAcquireSharedNanos(AbstractQueuedSynchronizer.java:1328)
   [junit4]    >         at java.util.concurrent.CountDownLatch.await(CountDownLatch.java:277)
   [junit4]    >         at org.apache.curator.CuratorZookeeperClient.internalBlockUntilConnectedOrTimedOut(CuratorZookeeperClient.java:323)
   [junit4]    >         at org.apache.curator.RetryLoop.callWithRetry(RetryLoop.java:105)
   [junit4]    >         at org.apache.curator.framework.imps.GetDataBuilderImpl.pathInForeground(GetDataBuilderImpl.java:288)
   [junit4]    >         at org.apache.curator.framework.imps.GetDataBuilderImpl.forPath(GetDataBuilderImpl.java:279)
   [junit4]    >         at org.apache.curator.framework.imps.GetDataBuilderImpl.forPath(GetDataBuilderImpl.java:41)
   [junit4]    >         at org.apache.curator.framework.recipes.shared.SharedValue.readValue(SharedValue.java:244)
   [junit4]    >         at org.apache.curator.framework.recipes.shared.SharedValue.access$100(SharedValue.java:44)
   [junit4]    >         at org.apache.curator.framework.recipes.shared.SharedValue$1.process(SharedValue.java:61)
   [junit4]    >         at org.apache.curator.framework.imps.NamespaceWatcher.process(NamespaceWatcher.java:67)
   [junit4]    >         at org.apache.zookeeper.ClientCnxn$EventThread.processEvent(ClientCnxn.java:530)
   [junit4]    >         at org.apache.zookeeper.ClientCnxn$EventThread.run(ClientCnxn.java:505)
   [junit4]    > 	at __randomizedtesting.SeedInfo.seed([851D5DC2D290708A]:0)
   [junit4] Completed [305/767 (1!)] on J0 in 39.57s, 10 tests, 1 error, 1 skipped <<< FAILURES!

[...truncated 870 lines...]
   [junit4] Suite: org.apache.solr.cloud.autoscaling.sim.TestDistribStateManager
   [junit4]   2> 3727535 INFO  (SUITE-TestDistribStateManager-seed#[851D5DC2D290708A]-worker) [    ] o.a.s.SolrTestCaseJ4 SecureRandom sanity checks: test.solr.allowed.securerandom=null & java.security.egd=file:/dev/./urandom
   [junit4]   2> Creating dataDir: /export/home/jenkins/workspace/Lucene-Solr-master-Solaris/solr/build/solr-core/test/J1/temp/solr.cloud.autoscaling.sim.TestDistribStateManager_851D5DC2D290708A-001/init-core-data-001
   [junit4]   2> 3727535 INFO  (SUITE-TestDistribStateManager-seed#[851D5DC2D290708A]-worker) [    ] o.a.s.SolrTestCaseJ4 Using TrieFields (NUMERIC_POINTS_SYSPROP=false) w/NUMERIC_DOCVALUES_SYSPROP=false
   [junit4]   2> 3727536 INFO  (SUITE-TestDistribStateManager-seed#[851D5DC2D290708A]-worker) [    ] o.a.s.SolrTestCaseJ4 Randomized ssl (false) and clientAuth (false) via: @org.apache.solr.util.RandomizeSSL(reason=, value=NaN, ssl=NaN, clientAuth=NaN)
   [junit4]   2> 3727546 INFO  (TEST-TestDistribStateManager.testListData-seed#[851D5DC2D290708A]) [    ] o.a.s.SolrTestCaseJ4 ###Starting testListData
   [junit4]   2> 3727547 INFO  (TEST-TestDistribStateManager.testListData-seed#[851D5DC2D290708A]) [    ] o.a.s.c.a.s.TestDistribStateManager Using org.apache.solr.cloud.autoscaling.sim.SimDistribStateManager
   [junit4]   2> 3727547 INFO  (TEST-TestDistribStateManager.testListData-seed#[851D5DC2D290708A]) [    ] o.a.s.SolrTestCaseJ4 ###Ending testListData
   [junit4]   2> 3727560 INFO  (TEST-TestDistribStateManager.testHasData-seed#[851D5DC2D290708A]) [    ] o.a.s.SolrTestCaseJ4 ###Starting testHasData
   [junit4]   2> 3727560 INFO  (TEST-TestDistribStateManager.testHasData-seed#[851D5DC2D290708A]) [    ] o.a.s.c.ZkTestServer STARTING ZK TEST SERVER
   [junit4]   2> 3727561 INFO  (Thread-8018) [    ] o.a.s.c.ZkTestServer client port:0.0.0.0/0.0.0.0:0
   [junit4]   2> 3727561 INFO  (Thread-8018) [    ] o.a.s.c.ZkTestServer Starting server
   [junit4]   2> 3727565 ERROR (Thread-8018) [    ] o.a.z.s.ZooKeeperServer ZKShutdownHandler is not registered, so ZooKeeper server won't take any action on ERROR or SHUTDOWN server state changes
   [junit4]   2> 3727661 INFO  (TEST-TestDistribStateManager.testHasData-seed#[851D5DC2D290708A]) [    ] o.a.s.c.ZkTestServer start zk server on port:49908
   [junit4]   2> 3727668 INFO  (zkConnectionManagerCallback-8657-thread-1) [    ] o.a.s.c.c.ConnectionManager zkClient has connected
   [junit4]   2> 3727669 INFO  (TEST-TestDistribStateManager.testHasData-seed#[851D5DC2D290708A]) [    ] o.a.s.c.a.s.TestDistribStateManager Using org.apache.solr.client.solrj.impl.ZkDistribStateManager
   [junit4]   2> 3727680 ERROR (TEST-TestDistribStateManager.testHasData-seed#[851D5DC2D290708A]) [    ] o.a.z.s.ZooKeeperServer ZKShutdownHandler is not registered, so ZooKeeper server won't take any action on ERROR or SHUTDOWN server state changes
   [junit4]   2> 3727683 INFO  (TEST-TestDistribStateManager.testHasData-seed#[851D5DC2D290708A]) [    ] o.a.s.c.ZkTestServer connecting to 127.0.0.1:49908 49908
   [junit4]   2> 3736387 INFO  (Thread-8018) [    ] o.a.s.c.ZkTestServer connecting to 127.0.0.1:49908 49908
   [junit4]   2> 3736400 INFO  (TEST-TestDistribStateManager.testHasData-seed#[851D5DC2D290708A]) [    ] o.a.s.SolrTestCaseJ4 ###Ending testHasData
   [junit4]   2> 3736411 INFO  (TEST-TestDistribStateManager.testGetSetRemoveData-seed#[851D5DC2D290708A]) [    ] o.a.s.SolrTestCaseJ4 ###Starting testGetSetRemoveData
   [junit4]   2> 3736411 INFO  (TEST-TestDistribStateManager.testGetSetRemoveData-seed#[851D5DC2D290708A]) [    ] o.a.s.c.ZkTestServer STARTING ZK TEST SERVER
   [junit4]   2> 3736411 INFO  (Thread-8019) [    ] o.a.s.c.ZkTestServer client port:0.0.0.0/0.0.0.0:0
   [junit4]   2> 3736412 INFO  (Thread-8019) [    ] o.a.s.c.ZkTestServer Starting server
   [junit4]   2> 3736412 ERROR (Thread-8019) [    ] o.a.z.s.ZooKeeperServer ZKShutdownHandler is not registered, so ZooKeeper server won't take any action on ERROR or SHUTDOWN server state changes
   [junit4]   2> 3736512 INFO  (TEST-TestDistribStateManager.testGetSetRemoveData-seed#[851D5DC2D290708A]) [    ] o.a.s.c.ZkTestServer start zk server on port:49794
   [junit4]   2> 3736518 INFO  (zkConnectionManagerCallback-8659-thread-1) [    ] o.a.s.c.c.ConnectionManager zkClient has connected
   [junit4]   2> 3736519 INFO  (TEST-TestDistribStateManager.testGetSetRemoveData-seed#[851D5DC2D290708A]) [    ] o.a.s.c.a.s.TestDistribStateManager Using org.apache.solr.client.solrj.impl.ZkDistribStateManager
   [junit4]   2> 3736535 INFO  (zkConnectionManagerCallback-8661-thread-1) [    ] o.a.s.c.c.ConnectionManager zkClient has connected
   [junit4]   2> 3736536 INFO  (TEST-TestDistribStateManager.testGetSetRemoveData-seed#[851D5DC2D290708A]) [    ] o.a.s.c.a.s.TestDistribStateManager Using org.apache.solr.client.solrj.impl.ZkDistribStateManager
   [junit4]   2> 3741542 ERROR (TEST-TestDistribStateManager.testGetSetRemoveData-seed#[851D5DC2D290708A]) [    ] o.a.z.s.ZooKeeperServer ZKShutdownHandler is not registered, so ZooKeeper server won't take any action on ERROR or SHUTDOWN server state changes
   [junit4]   2> 3741543 INFO  (TEST-TestDistribStateManager.testGetSetRemoveData-seed#[851D5DC2D290708A]) [    ] o.a.s.c.ZkTestServer connecting to 127.0.0.1:49794 49794
   [junit4]   2> 3741766 INFO  (Thread-8019) [    ] o.a.s.c.ZkTestServer connecting to 127.0.0.1:49794 49794
   [junit4]   2> 3741769 INFO  (TEST-TestDistribStateManager.testGetSetRemoveData-seed#[851D5DC2D290708A]) [    ] o.a.s.SolrTestCaseJ4 ###Ending testGetSetRemoveData
   [junit4]   2> NOTE: reproduce with: ant test  -Dtestcase=TestDistribStateManager -Dtests.method=testGetSetRemoveData -Dtests.seed=851D5DC2D290708A -Dtests.slow=true -Dtests.locale=en-AU -Dtests.timezone=Pacific/Chuuk -Dtests.asserts=true -Dtests.file.encoding=ISO-8859-1
   [junit4] FAILURE 5.37s J1 | TestDistribStateManager.testGetSetRemoveData <<<
   [junit4]    > Throwable #1: java.lang.AssertionError: Node watch should have fired!
   [junit4]    > 	at __randomizedtesting.SeedInfo.seed([851D5DC2D290708A:A38DB290861EB680]:0)
   [junit4]    > 	at org.apache.solr.cloud.autoscaling.sim.TestDistribStateManager.testGetSetRemoveData(TestDistribStateManager.java:256)
   [junit4]    > 	at java.lang.Thread.run(Thread.java:748)
   [junit4]   2> 3741788 INFO  (TEST-TestDistribStateManager.testCreateMode-seed#[851D5DC2D290708A]) [    ] o.a.s.SolrTestCaseJ4 ###Starting testCreateMode
   [junit4]   2> 3741789 INFO  (TEST-TestDistribStateManager.testCreateMode-seed#[851D5DC2D290708A]) [    ] o.a.s.c.ZkTestServer STARTING ZK TEST SERVER
   [junit4]   2> 3741789 INFO  (Thread-8020) [    ] o.a.s.c.ZkTestServer client port:0.0.0.0/0.0.0.0:0
   [junit4]   2> 3741789 INFO  (Thread-8020) [    ] o.a.s.c.ZkTestServer Starting server
   [junit4]   2> 3741793 ERROR (Thread-8020) [    ] o.a.z.s.ZooKeeperServer ZKShutdownHandler is not registered, so ZooKeeper server won't take any action on ERROR or SHUTDOWN server state changes
   [junit4]   2> 3741889 INFO  (TEST-TestDistribStateManager.testCreateMode-seed#[851D5DC2D290708A]) [    ] o.a.s.c.ZkTestServer start zk server on port:49867
   [junit4]   2> 3741896 INFO  (zkConnectionManagerCallback-8663-thread-1) [    ] o.a.s.c.c.ConnectionManager zkClient has connected
   [junit4]   2> 3741896 INFO  (TEST-TestDistribStateManager.testCreateMode-seed#[851D5DC2D290708A]) [    ] o.a.s.c.a.s.TestDistribStateManager Using org.apache.solr.client.solrj.impl.ZkDistribStateManager
   [junit4]   2> 3741923 WARN  (NIOServerCxn.Factory:0.0.0.0/0.0.0.0:0) [    ] o.a.z.s.NIOServerCnxn caught end of stream exception
   [junit4]   2> EndOfStreamException: Unable to read additional data from client sessionid 0x160e1ea06860000, likely client has closed socket
   [junit4]   2> 	at org.apache.zookeeper.server.NIOServerCnxn.doIO(NIOServerCnxn.java:239)
   [junit4]   2> 	at org.apache.zookeeper.server.NIOServerCnxnFactory.run(NIOServerCnxnFactory.java:203)
   [junit4]   2> 	at java.lang.Thread.run(Thread.java:748)
   [junit4]   2> 3741928 INFO  (zkConnectionManagerCallback-8665-thread-1) [    ] o.a.s.c.c.ConnectionManager zkClient has connected
   [junit4]   2> 3741929 INFO  (TEST-TestDistribStateManager.testCreateMode-seed#[851D5DC2D290708A]) [    ] o.a.s.c.a.s.TestDistribStateManager Using org.apache.solr.client.solrj.impl.ZkDistribStateManager
   [junit4]   2> 3741935 WARN  (NIOServerCxn.Factory:0.0.0.0/0.0.0.0:0) [    ] o.a.z.s.NIOServerCnxn caught end of stream exception
   [junit4]   2> EndOfStreamException: Unable to read additional data from client sessionid 0x160e1ea06860001, likely client has closed socket
   [junit4]   2> 	at org.apache.zookeeper.server.NIOServerCnxn.doIO(NIOServerCnxn.java:239)
   [junit4]   2> 	at org.apache.zookeeper.server.NIOServerCnxnFactory.run(NIOServerCnxnFactory.java:203)
   [junit4]   2> 	at java.lang.Thread.run(Thread.java:748)
   [junit4]   2> 3741935 ERROR (TEST-TestDistribStateManager.testCreateMode-seed#[851D5DC2D290708A]) [    ] o.a.z.s.ZooKeeperServer ZKShutdownHandler is not registered, so ZooKeeper server won't take any action on ERROR or SHUTDOWN server state changes
   [junit4]   2> 3741938 INFO  (TEST-TestDistribStateManager.testCreateMode-seed#[851D5DC2D290708A]) [    ] o.a.s.c.ZkTestServer connecting to 127.0.0.1:49867 49867
   [junit4]   2> 3751983 INFO  (Thread-8020) [    ] o.a.s.c.ZkTestServer connecting to 127.0.0.1:49867 49867
   [junit4]   2> 3751987 INFO  (TEST-TestDistribStateManager.testCreateMode-seed#[851D5DC2D290708A]) [    ] o.a.s.SolrTestCaseJ4 ###Ending testCreateMode
   [junit4]   2> 3752000 INFO  (TEST-TestDistribStateManager.testMulti-seed#[851D5DC2D290708A]) [    ] o.a.s.SolrTestCaseJ4 ###Starting testMulti
   [junit4]   2> 3752000 INFO  (TEST-TestDistribStateManager.testMulti-seed#[851D5DC2D290708A]) [    ] o.a.s.c.a.s.TestDistribStateManager Using org.apache.solr.cloud.autoscaling.sim.SimDistribStateManager
   [junit4]   2> 3752000 INFO  (TEST-TestDistribStateManager.testMulti-seed#[851D5DC2D290708A]) [    ] o.a.s.SolrTestCaseJ4 ###Ending testMulti
   [junit4]   2> NOTE: leaving temporary files on disk at: /export/home/jenkins/workspace/Lucene-Solr-master-Solaris/solr/build/solr-core/test/J1/temp/solr.cloud.autoscaling.sim.TestDistribStateManager_851D5DC2D290708A-001
   [junit4]   2> NOTE: test params are: codec=Asserting(Lucene70), sim=Asserting(org.apache.lucene.search.similarities.AssertingSimilarity@5345ef08), locale=en-AU, timezone=Pacific/Chuuk
   [junit4]   2> NOTE: SunOS 5.11 amd64/Oracle Corporation 1.8.0_152 (64-bit)/cpus=3,threads=1,free=67959168,total=474611712
   [junit4]   2> NOTE: All tests run in this JVM: [DeleteLastCustomShardedReplicaTest, BasicDistributedZk2Test, TestCollationField, UpdateLogTest, TestCharFilters, DistributedIntervalFacetingTest, DOMUtilTest, IndexSchemaRuntimeFieldTest, TestSolrCoreSnapshots, ImplicitSnitchTest, TestLMJelinekMercerSimilarityFactory, RegexBytesRefFilterTest, TestNumericTerms32, TestFastWriter, TestCustomDocTransformer, SolrCoreCheckLockOnStartupTest, TestRequestStatusCollectionAPI, TestCollectionAPI, TestCloudPseudoReturnFields, TestPolicyCloud, QueryElevationComponentTest, TestSubQueryTransformerCrossCore, SearchRateTriggerTest, TestChildDocTransformer, CopyFieldTest, TestStressVersions, ExternalFileFieldSortTest, TestWordDelimiterFilterFactory, TestFieldTypeResource, TestDocumentBuilder, TestUseDocValuesAsStored2, SolrCLIZkUtilsTest, TestCustomSort, SOLR749Test, PeerSyncReplicationTest, TestGenericDistributedQueue, TermsComponentTest, TestCloudJSONFacetJoinDomain, AddSchemaFieldsUpdateProcessorFactoryTest, TestFieldCacheReopen, SecurityConfHandlerTest, TestInPlaceUpdatesDistrib, TestSlowCompositeReaderWrapper, TestQueryTypes, MoreLikeThisHandlerTest, TestLuceneIndexBackCompat, SuggestComponentContextFilterQueryTest, TestCloudSearcherWarming, TestSolrCoreParser, TestPointFields, MigrateRouteKeyTest, LukeRequestHandlerTest, TestQueryWrapperFilter, TlogReplayBufferedWhileIndexingTest, TestHashPartitioner, TestRTGBase, FullHLLTest, ZkSolrClientTest, TestNodeAddedTrigger, DistributedFacetPivotSmallTest, TestDynamicFieldResource, TestSort, CollectionStateFormat2Test, TestEmbeddedSolrServerConstructors, TestRestManager, TestAnalyzeInfixSuggestions, DeleteReplicaTest, BadCopyFieldTest, ClassificationUpdateProcessorIntegrationTest, RemoteQueryErrorTest, TermVectorComponentDistributedTest, HdfsUnloadDistributedZkTest, OverseerModifyCollectionTest, TestConfigSets, TestLRUStatsCache, SolrIndexMetricsTest, TestManagedResource, SampleTest, TestSolrConfigHandlerCloud, TestAnalyzedSuggestions, TestAuthorizationFramework, TestTrie, TestSolrXml, SaslZkACLProviderTest, TestPostingsSolrHighlighter, TestFunctionQuery, TestNoOpRegenerator, TestRuleBasedAuthorizationPlugin, HdfsRecoverLeaseTest, BlockJoinFacetSimpleTest, TestMergePolicyConfig, EchoParamsTest, MoveReplicaTest, OpenCloseCoreStressTest, TermVectorComponentTest, TestLuceneMatchVersion, TestFilteredDocIdSet, CdcrRequestHandlerTest, TestZkChroot, TestRawResponseWriter, DataDrivenBlockJoinTest, FileUtilsTest, TestCrossCoreJoin, TestRandomFaceting, HLLUtilTest, TestRecoveryHdfs, TestXmlQParserPlugin, SolrIndexSplitterTest, PreAnalyzedFieldTest, DistributedSuggestComponentTest, TestExtendedDismaxParser, TestBadConfig, TestDocSet, SpellPossibilityIteratorTest, TestFieldCacheSortRandom, TestLegacyNumericRangeQueryBuilder, CoreAdminCreateDiscoverTest, TestSolrCloudWithDelegationTokens, HttpSolrCallGetCoreTest, CollectionsAPIAsyncDistributedZkTest, HighlighterMaxOffsetTest, MetricsConfigTest, TestSimpleTextCodec, TestHighFrequencyDictionaryFactory, TestSQLHandler, TestDeleteCollectionOnDownNodes, AtomicUpdatesTest, AutoScalingHandlerTest, TestSearchPerf, TestCSVLoader, TestSolrCloudWithHadoopAuthPlugin, ConfigureRecoveryStrategyTest, TestSchemaResource, SolrGraphiteReporterTest, TestHdfsCloudBackupRestore, LeaderElectionIntegrationTest, TestCopyFieldCollectionResource, TestTriggerIntegration, SolrIndexConfigTest, TestLegacyField, TestSystemCollAutoCreate, ConcurrentDeleteAndCreateCollectionTest, TestHashQParserPlugin, TestStressReorder, BasicAuthStandaloneTest, TestTolerantUpdateProcessorRandomCloud, NodeAddedTriggerTest, TestPayloadCheckQParserPlugin, TestDFISimilarityFactory, HdfsCollectionsAPIDistributedZkTest, TestHttpShardHandlerFactory, PeerSyncTest, OverriddenZkACLAndCredentialsProvidersTest, PolyFieldTest, ChaosMonkeySafeLeaderTest, LargeFieldTest, BigEndianAscendingWordDeserializerTest, TestReplicaProperties, TestStandardQParsers, SolrXmlInZkTest, UpdateRequestProcessorFactoryTest, SynonymTokenizerTest, TestConfigSetsAPIZkFailure, TestClusterStateProvider, RankQueryTest, HealthCheckHandlerTest, HdfsDirectoryTest, TestPrepRecovery, V2StandaloneTest, SimpleFacetsTest, SharedFSAutoReplicaFailoverTest, CollectionsAPIDistributedZkTest, TestPerFieldSimilarityWithDefaultOverride, BlockDirectoryTest, TemplateUpdateProcessorTest, HdfsRestartWhileUpdatingTest, SolrMetricManagerTest, UUIDUpdateProcessorFallbackTest, TestSortByMinMaxFunction, AssignTest, FileBasedSpellCheckerTest, TestFastLRUCache, TestPullReplicaErrorHandling, TestSchemalessBufferedUpdates, PingRequestHandlerTest, SoftAutoCommitTest, TestSolrQueryParser, UnloadDistributedZkTest, ShardRoutingTest, BasicZkTest, RecoveryZkTest, FullSolrCloudDistribCmdsTest, TestReplicationHandler, ZkCLITest, ShardRoutingCustomTest, TestDistributedSearch, TestDistributedGrouping, TestFaceting, DistributedSpellCheckComponentTest, ZkControllerTest, TestRealTimeGet, TestReload, DistributedTermsComponentTest, TestRangeQuery, TestCoreContainer, SolrCoreTest, TestGroupingSearch, SolrCmdDistributorTest, BadIndexSchemaTest, TestFiltering, BasicFunctionalityTest, TestIndexSearcher, HighlighterTest, ShowFileRequestHandlerTest, DistributedQueryElevationComponentTest, SimplePostToolTest, AnalysisAfterCoreReloadTest, SpellCheckCollatorTest, SuggesterFSTTest, CoreAdminHandlerTest, TestFoldingMultitermQuery, DocValuesTest, SuggesterTSTTest, SuggesterTest, TestStressLucene, SpatialFilterTest, SuggesterWFSTTest, NoCacheHeaderTest, SchemaVersionSpecificBehaviorTest, TestPseudoReturnFields, TestUpdate, FieldMutatingUpdateProcessorTest, TestAtomicUpdateErrorCases, QueryEqualityTest, StatelessScriptUpdateProcessorFactoryTest, SortByFunctionTest, TestRemoteStreaming, DocValuesMultiTest, DistanceFunctionTest, TestSolrDeletionPolicy1, SolrInfoBeanTest, DebugComponentTest, CacheHeaderTest, TestQueryUtils, DirectSolrSpellCheckerTest, DocumentAnalysisRequestHandlerTest, TestOmitPositions, XmlUpdateRequestHandlerTest, DocumentBuilderTest, TestValueSourceCache, LoggingHandlerTest, RegexBoostProcessorTest, SolrPluginUtilsTest, TestJmxIntegration, TestCSVResponseWriter, MBeansHandlerTest, QueryParsingTest, UniqFieldsUpdateProcessorFactoryTest, JsonLoaderTest, BinaryUpdateRequestHandlerTest, TestPartialUpdateDeduplication, TestComponentsName, SearchHandlerTest, HighlighterConfigTest, TestQuerySenderListener, UpdateParamsTest, AlternateDirectoryTest, TestSolrIndexConfig, ResponseLogComponentTest, BadComponentTest, TestStressRecovery, TestSolrDeletionPolicy2, NumericFieldsTest, MinimalSchemaTest, TestElisionMultitermQuery, TestConfig, OutputWriterTest, TestSolrCoreProperties, DirectSolrConnectionTest, NotRequiredUniqueKeyTest, TestCodecSupport, TestSweetSpotSimilarityFactory, TestDFRSimilarityFactory, TestPerFieldSimilarity, TestLMDirichletSimilarityFactory, TestIBSimilarityFactory, TestBM25SimilarityFactory, TestFastOutputStream, OpenExchangeRatesOrgProviderTest, PluginInfoTest, DateMathParserTest, TestSystemIdResolver, TestSuggestSpellingConverter, SpellingQueryConverterTest, RAMDirectoryFactoryTest, ClusterStateTest, TestSolrJ, TestLRUCache, TestUtils, ZkNodePropsTest, SliceStateTest, SystemInfoHandlerTest, UUIDFieldTest, DistributedMLTComponentTest, CursorPagingTest, SolrTestCaseJ4Test, TestCursorMarkWithoutUniqueKey, TestDistributedMissingSort, TestHighlightDedupGrouping, TestSimpleTrackingShardHandler, TestTolerantSearch, TestJettySolrRunner, ConnectionReuseTest, ActionThrottleTest, AliasIntegrationTest, AsyncCallRequestStatusResponseTest, ChaosMonkeyNothingIsSafeWithPullReplicasTest, CleanupOldIndexTest, CloudExitableDirectoryReaderTest, CollectionReloadTest, ConfigSetsAPITest, ConnectionManagerTest, CreateCollectionCleanupTest, CustomCollectionTest, DeleteNodeTest, DeleteStatusTest, DistribDocExpirationUpdateProcessorTest, DistribJoinFromCollectionTest, DistributedQueueTest, DocValuesNotIndexedTest, ForceLeaderTest, LeaderInitiatedRecoveryOnCommitTest, NodeMutatorTest, OutOfBoxZkACLAndCredentialsProvidersTest, OverseerCollectionConfigSetProcessorTest, OverseerRolesTest, OverseerStatusTest, OverseerTaskQueueTest, ReplicationFactorTest, RestartWhileUpdatingTest, RollingRestartTest, TestClusterProperties, TestConfigSetsAPI, TestLocalFSCloudBackupRestore, TestPullReplica, TestSizeLimitedDistributedMap, TestStressInPlaceUpdates, TestUtilizeNode, VMParamsZkACLAndCredentialsProvidersTest, AutoAddReplicasIntegrationTest, HttpTriggerListenerTest, NodeLostTriggerTest, TestComputePlanAction, TestDistribStateManager]
   [junit4] Completed [584/767 (2!)] on J1 in 24.49s, 5 tests, 1 failure <<< FAILURES!

[...truncated 48756 lines...]

Mime
View raw message