lucene-dev mailing list archives

Site index · List index
Message view « Date » · « Thread »
Top « Date » · « Thread »
From Apache Jenkins Server <jenk...@builds.apache.org>
Subject [JENKINS] Lucene-Solr-NightlyTests-7.x - Build # 220 - Still unstable
Date Thu, 17 May 2018 08:31:38 GMT
Build: https://builds.apache.org/job/Lucene-Solr-NightlyTests-7.x/220/

3 tests failed.
FAILED:  org.apache.solr.cloud.autoscaling.IndexSizeTriggerTest.testTrigger

Error Message:
waitFor not elapsed but produced an event

Stack Trace:
java.lang.AssertionError: waitFor not elapsed but produced an event
	at __randomizedtesting.SeedInfo.seed([22B4683D20069F6E:417F5EBFB9C9EC43]:0)
	at org.junit.Assert.fail(Assert.java:93)
	at org.junit.Assert.assertTrue(Assert.java:43)
	at org.junit.Assert.assertNull(Assert.java:551)
	at org.apache.solr.cloud.autoscaling.IndexSizeTriggerTest.testTrigger(IndexSizeTriggerTest.java:180)
	at sun.reflect.NativeMethodAccessorImpl.invoke0(Native Method)
	at sun.reflect.NativeMethodAccessorImpl.invoke(NativeMethodAccessorImpl.java:62)
	at sun.reflect.DelegatingMethodAccessorImpl.invoke(DelegatingMethodAccessorImpl.java:43)
	at java.lang.reflect.Method.invoke(Method.java:498)
	at com.carrotsearch.randomizedtesting.RandomizedRunner.invoke(RandomizedRunner.java:1737)
	at com.carrotsearch.randomizedtesting.RandomizedRunner$8.evaluate(RandomizedRunner.java:934)
	at com.carrotsearch.randomizedtesting.RandomizedRunner$9.evaluate(RandomizedRunner.java:970)
	at com.carrotsearch.randomizedtesting.RandomizedRunner$10.evaluate(RandomizedRunner.java:984)
	at com.carrotsearch.randomizedtesting.rules.SystemPropertiesRestoreRule$1.evaluate(SystemPropertiesRestoreRule.java:57)
	at org.apache.lucene.util.TestRuleSetupTeardownChained$1.evaluate(TestRuleSetupTeardownChained.java:49)
	at org.apache.lucene.util.AbstractBeforeAfterRule$1.evaluate(AbstractBeforeAfterRule.java:45)
	at org.apache.lucene.util.TestRuleThreadAndTestName$1.evaluate(TestRuleThreadAndTestName.java:48)
	at org.apache.lucene.util.TestRuleIgnoreAfterMaxFailures$1.evaluate(TestRuleIgnoreAfterMaxFailures.java:64)
	at org.apache.lucene.util.TestRuleMarkFailure$1.evaluate(TestRuleMarkFailure.java:47)
	at com.carrotsearch.randomizedtesting.rules.StatementAdapter.evaluate(StatementAdapter.java:36)
	at com.carrotsearch.randomizedtesting.ThreadLeakControl$StatementRunner.run(ThreadLeakControl.java:368)
	at com.carrotsearch.randomizedtesting.ThreadLeakControl.forkTimeoutingTask(ThreadLeakControl.java:817)
	at com.carrotsearch.randomizedtesting.ThreadLeakControl$3.evaluate(ThreadLeakControl.java:468)
	at com.carrotsearch.randomizedtesting.RandomizedRunner.runSingleTest(RandomizedRunner.java:943)
	at com.carrotsearch.randomizedtesting.RandomizedRunner$5.evaluate(RandomizedRunner.java:829)
	at com.carrotsearch.randomizedtesting.RandomizedRunner$6.evaluate(RandomizedRunner.java:879)
	at com.carrotsearch.randomizedtesting.RandomizedRunner$7.evaluate(RandomizedRunner.java:890)
	at com.carrotsearch.randomizedtesting.rules.StatementAdapter.evaluate(StatementAdapter.java:36)
	at com.carrotsearch.randomizedtesting.rules.SystemPropertiesRestoreRule$1.evaluate(SystemPropertiesRestoreRule.java:57)
	at org.apache.lucene.util.AbstractBeforeAfterRule$1.evaluate(AbstractBeforeAfterRule.java:45)
	at com.carrotsearch.randomizedtesting.rules.StatementAdapter.evaluate(StatementAdapter.java:36)
	at org.apache.lucene.util.TestRuleStoreClassName$1.evaluate(TestRuleStoreClassName.java:41)
	at com.carrotsearch.randomizedtesting.rules.NoShadowingOrOverridesOnMethodsRule$1.evaluate(NoShadowingOrOverridesOnMethodsRule.java:40)
	at com.carrotsearch.randomizedtesting.rules.NoShadowingOrOverridesOnMethodsRule$1.evaluate(NoShadowingOrOverridesOnMethodsRule.java:40)
	at com.carrotsearch.randomizedtesting.rules.StatementAdapter.evaluate(StatementAdapter.java:36)
	at com.carrotsearch.randomizedtesting.rules.StatementAdapter.evaluate(StatementAdapter.java:36)
	at com.carrotsearch.randomizedtesting.rules.StatementAdapter.evaluate(StatementAdapter.java:36)
	at org.apache.lucene.util.TestRuleAssertionsRequired$1.evaluate(TestRuleAssertionsRequired.java:53)
	at org.apache.lucene.util.TestRuleMarkFailure$1.evaluate(TestRuleMarkFailure.java:47)
	at org.apache.lucene.util.TestRuleIgnoreAfterMaxFailures$1.evaluate(TestRuleIgnoreAfterMaxFailures.java:64)
	at org.apache.lucene.util.TestRuleIgnoreTestSuites$1.evaluate(TestRuleIgnoreTestSuites.java:54)
	at com.carrotsearch.randomizedtesting.rules.StatementAdapter.evaluate(StatementAdapter.java:36)
	at com.carrotsearch.randomizedtesting.ThreadLeakControl$StatementRunner.run(ThreadLeakControl.java:368)
	at java.lang.Thread.run(Thread.java:748)


FAILED:  org.apache.solr.cloud.hdfs.HdfsUnloadDistributedZkTest.test

Error Message:
Error from server at http://127.0.0.1:34398/rgc/k: ADDREPLICA failed to create replica

Stack Trace:
org.apache.solr.client.solrj.impl.HttpSolrClient$RemoteSolrException: Error from server at http://127.0.0.1:34398/rgc/k: ADDREPLICA failed to create replica
	at __randomizedtesting.SeedInfo.seed([22B4683D20069F6E:AAE057E78EFAF296]:0)
	at org.apache.solr.client.solrj.impl.HttpSolrClient.executeMethod(HttpSolrClient.java:643)
	at org.apache.solr.client.solrj.impl.HttpSolrClient.request(HttpSolrClient.java:255)
	at org.apache.solr.client.solrj.impl.HttpSolrClient.request(HttpSolrClient.java:244)
	at org.apache.solr.client.solrj.impl.LBHttpSolrClient.doRequest(LBHttpSolrClient.java:483)
	at org.apache.solr.client.solrj.impl.LBHttpSolrClient.request(LBHttpSolrClient.java:413)
	at org.apache.solr.client.solrj.impl.CloudSolrClient.sendRequest(CloudSolrClient.java:1106)
	at org.apache.solr.client.solrj.impl.CloudSolrClient.requestWithRetryOnStaleState(CloudSolrClient.java:886)
	at org.apache.solr.client.solrj.impl.CloudSolrClient.request(CloudSolrClient.java:819)
	at org.apache.solr.client.solrj.SolrRequest.process(SolrRequest.java:194)
	at org.apache.solr.client.solrj.SolrRequest.process(SolrRequest.java:211)
	at org.apache.solr.cloud.UnloadDistributedZkTest.testUnloadShardAndCollection(UnloadDistributedZkTest.java:125)
	at org.apache.solr.cloud.UnloadDistributedZkTest.test(UnloadDistributedZkTest.java:72)
	at sun.reflect.NativeMethodAccessorImpl.invoke0(Native Method)
	at sun.reflect.NativeMethodAccessorImpl.invoke(NativeMethodAccessorImpl.java:62)
	at sun.reflect.DelegatingMethodAccessorImpl.invoke(DelegatingMethodAccessorImpl.java:43)
	at java.lang.reflect.Method.invoke(Method.java:498)
	at com.carrotsearch.randomizedtesting.RandomizedRunner.invoke(RandomizedRunner.java:1737)
	at com.carrotsearch.randomizedtesting.RandomizedRunner$8.evaluate(RandomizedRunner.java:934)
	at com.carrotsearch.randomizedtesting.RandomizedRunner$9.evaluate(RandomizedRunner.java:970)
	at com.carrotsearch.randomizedtesting.RandomizedRunner$10.evaluate(RandomizedRunner.java:984)
	at org.apache.solr.BaseDistributedSearchTestCase$ShardsRepeatRule$ShardsFixedStatement.callStatement(BaseDistributedSearchTestCase.java:993)
	at org.apache.solr.BaseDistributedSearchTestCase$ShardsRepeatRule$ShardsStatement.evaluate(BaseDistributedSearchTestCase.java:968)
	at com.carrotsearch.randomizedtesting.rules.SystemPropertiesRestoreRule$1.evaluate(SystemPropertiesRestoreRule.java:57)
	at org.apache.lucene.util.TestRuleSetupTeardownChained$1.evaluate(TestRuleSetupTeardownChained.java:49)
	at org.apache.lucene.util.AbstractBeforeAfterRule$1.evaluate(AbstractBeforeAfterRule.java:45)
	at org.apache.lucene.util.TestRuleThreadAndTestName$1.evaluate(TestRuleThreadAndTestName.java:48)
	at org.apache.lucene.util.TestRuleIgnoreAfterMaxFailures$1.evaluate(TestRuleIgnoreAfterMaxFailures.java:64)
	at org.apache.lucene.util.TestRuleMarkFailure$1.evaluate(TestRuleMarkFailure.java:47)
	at com.carrotsearch.randomizedtesting.rules.StatementAdapter.evaluate(StatementAdapter.java:36)
	at com.carrotsearch.randomizedtesting.ThreadLeakControl$StatementRunner.run(ThreadLeakControl.java:368)
	at com.carrotsearch.randomizedtesting.ThreadLeakControl.forkTimeoutingTask(ThreadLeakControl.java:817)
	at com.carrotsearch.randomizedtesting.ThreadLeakControl$3.evaluate(ThreadLeakControl.java:468)
	at com.carrotsearch.randomizedtesting.RandomizedRunner.runSingleTest(RandomizedRunner.java:943)
	at com.carrotsearch.randomizedtesting.RandomizedRunner$5.evaluate(RandomizedRunner.java:829)
	at com.carrotsearch.randomizedtesting.RandomizedRunner$6.evaluate(RandomizedRunner.java:879)
	at com.carrotsearch.randomizedtesting.RandomizedRunner$7.evaluate(RandomizedRunner.java:890)
	at com.carrotsearch.randomizedtesting.rules.StatementAdapter.evaluate(StatementAdapter.java:36)
	at com.carrotsearch.randomizedtesting.rules.SystemPropertiesRestoreRule$1.evaluate(SystemPropertiesRestoreRule.java:57)
	at org.apache.lucene.util.AbstractBeforeAfterRule$1.evaluate(AbstractBeforeAfterRule.java:45)
	at com.carrotsearch.randomizedtesting.rules.StatementAdapter.evaluate(StatementAdapter.java:36)
	at org.apache.lucene.util.TestRuleStoreClassName$1.evaluate(TestRuleStoreClassName.java:41)
	at com.carrotsearch.randomizedtesting.rules.NoShadowingOrOverridesOnMethodsRule$1.evaluate(NoShadowingOrOverridesOnMethodsRule.java:40)
	at com.carrotsearch.randomizedtesting.rules.NoShadowingOrOverridesOnMethodsRule$1.evaluate(NoShadowingOrOverridesOnMethodsRule.java:40)
	at com.carrotsearch.randomizedtesting.rules.StatementAdapter.evaluate(StatementAdapter.java:36)
	at com.carrotsearch.randomizedtesting.rules.StatementAdapter.evaluate(StatementAdapter.java:36)
	at com.carrotsearch.randomizedtesting.rules.StatementAdapter.evaluate(StatementAdapter.java:36)
	at org.apache.lucene.util.TestRuleAssertionsRequired$1.evaluate(TestRuleAssertionsRequired.java:53)
	at org.apache.lucene.util.TestRuleMarkFailure$1.evaluate(TestRuleMarkFailure.java:47)
	at org.apache.lucene.util.TestRuleIgnoreAfterMaxFailures$1.evaluate(TestRuleIgnoreAfterMaxFailures.java:64)
	at org.apache.lucene.util.TestRuleIgnoreTestSuites$1.evaluate(TestRuleIgnoreTestSuites.java:54)
	at com.carrotsearch.randomizedtesting.rules.StatementAdapter.evaluate(StatementAdapter.java:36)
	at com.carrotsearch.randomizedtesting.ThreadLeakControl$StatementRunner.run(ThreadLeakControl.java:368)
	at java.lang.Thread.run(Thread.java:748)


FAILED:  org.apache.solr.handler.TestReplicationHandler.doTestIndexFetchWithMasterUrl

Error Message:
expected:<null> but was:<.numFound:495!=498>

Stack Trace:
java.lang.AssertionError: expected:<null> but was:<.numFound:495!=498>
	at __randomizedtesting.SeedInfo.seed([22B4683D20069F6E:390F994241B9E7D8]:0)
	at org.junit.Assert.fail(Assert.java:93)
	at org.junit.Assert.failNotEquals(Assert.java:647)
	at org.junit.Assert.assertEquals(Assert.java:128)
	at org.junit.Assert.assertEquals(Assert.java:147)
	at org.apache.solr.handler.TestReplicationHandler.doTestIndexFetchWithMasterUrl(TestReplicationHandler.java:770)
	at sun.reflect.NativeMethodAccessorImpl.invoke0(Native Method)
	at sun.reflect.NativeMethodAccessorImpl.invoke(NativeMethodAccessorImpl.java:62)
	at sun.reflect.DelegatingMethodAccessorImpl.invoke(DelegatingMethodAccessorImpl.java:43)
	at java.lang.reflect.Method.invoke(Method.java:498)
	at com.carrotsearch.randomizedtesting.RandomizedRunner.invoke(RandomizedRunner.java:1737)
	at com.carrotsearch.randomizedtesting.RandomizedRunner$8.evaluate(RandomizedRunner.java:934)
	at com.carrotsearch.randomizedtesting.RandomizedRunner$9.evaluate(RandomizedRunner.java:970)
	at com.carrotsearch.randomizedtesting.RandomizedRunner$10.evaluate(RandomizedRunner.java:984)
	at com.carrotsearch.randomizedtesting.rules.SystemPropertiesRestoreRule$1.evaluate(SystemPropertiesRestoreRule.java:57)
	at org.apache.lucene.util.TestRuleSetupTeardownChained$1.evaluate(TestRuleSetupTeardownChained.java:49)
	at org.apache.lucene.util.AbstractBeforeAfterRule$1.evaluate(AbstractBeforeAfterRule.java:45)
	at org.apache.lucene.util.TestRuleThreadAndTestName$1.evaluate(TestRuleThreadAndTestName.java:48)
	at org.apache.lucene.util.TestRuleIgnoreAfterMaxFailures$1.evaluate(TestRuleIgnoreAfterMaxFailures.java:64)
	at org.apache.lucene.util.TestRuleMarkFailure$1.evaluate(TestRuleMarkFailure.java:47)
	at com.carrotsearch.randomizedtesting.rules.StatementAdapter.evaluate(StatementAdapter.java:36)
	at com.carrotsearch.randomizedtesting.ThreadLeakControl$StatementRunner.run(ThreadLeakControl.java:368)
	at com.carrotsearch.randomizedtesting.ThreadLeakControl.forkTimeoutingTask(ThreadLeakControl.java:817)
	at com.carrotsearch.randomizedtesting.ThreadLeakControl$3.evaluate(ThreadLeakControl.java:468)
	at com.carrotsearch.randomizedtesting.RandomizedRunner.runSingleTest(RandomizedRunner.java:943)
	at com.carrotsearch.randomizedtesting.RandomizedRunner$5.evaluate(RandomizedRunner.java:829)
	at com.carrotsearch.randomizedtesting.RandomizedRunner$6.evaluate(RandomizedRunner.java:879)
	at com.carrotsearch.randomizedtesting.RandomizedRunner$7.evaluate(RandomizedRunner.java:890)
	at com.carrotsearch.randomizedtesting.rules.StatementAdapter.evaluate(StatementAdapter.java:36)
	at com.carrotsearch.randomizedtesting.rules.SystemPropertiesRestoreRule$1.evaluate(SystemPropertiesRestoreRule.java:57)
	at org.apache.lucene.util.AbstractBeforeAfterRule$1.evaluate(AbstractBeforeAfterRule.java:45)
	at com.carrotsearch.randomizedtesting.rules.StatementAdapter.evaluate(StatementAdapter.java:36)
	at org.apache.lucene.util.TestRuleStoreClassName$1.evaluate(TestRuleStoreClassName.java:41)
	at com.carrotsearch.randomizedtesting.rules.NoShadowingOrOverridesOnMethodsRule$1.evaluate(NoShadowingOrOverridesOnMethodsRule.java:40)
	at com.carrotsearch.randomizedtesting.rules.NoShadowingOrOverridesOnMethodsRule$1.evaluate(NoShadowingOrOverridesOnMethodsRule.java:40)
	at com.carrotsearch.randomizedtesting.rules.StatementAdapter.evaluate(StatementAdapter.java:36)
	at com.carrotsearch.randomizedtesting.rules.StatementAdapter.evaluate(StatementAdapter.java:36)
	at com.carrotsearch.randomizedtesting.rules.StatementAdapter.evaluate(StatementAdapter.java:36)
	at org.apache.lucene.util.TestRuleAssertionsRequired$1.evaluate(TestRuleAssertionsRequired.java:53)
	at org.apache.lucene.util.TestRuleMarkFailure$1.evaluate(TestRuleMarkFailure.java:47)
	at org.apache.lucene.util.TestRuleIgnoreAfterMaxFailures$1.evaluate(TestRuleIgnoreAfterMaxFailures.java:64)
	at org.apache.lucene.util.TestRuleIgnoreTestSuites$1.evaluate(TestRuleIgnoreTestSuites.java:54)
	at com.carrotsearch.randomizedtesting.rules.StatementAdapter.evaluate(StatementAdapter.java:36)
	at com.carrotsearch.randomizedtesting.ThreadLeakControl$StatementRunner.run(ThreadLeakControl.java:368)
	at java.lang.Thread.run(Thread.java:748)




Build Log:
[...truncated 14384 lines...]
   [junit4] Suite: org.apache.solr.handler.TestReplicationHandler
   [junit4]   2> 2682113 INFO  (SUITE-TestReplicationHandler-seed#[22B4683D20069F6E]-worker) [    ] o.a.s.SolrTestCaseJ4 SecureRandom sanity checks: test.solr.allowed.securerandom=null & java.security.egd=file:/dev/./urandom
   [junit4]   2> Creating dataDir: /x1/jenkins/jenkins-slave/workspace/Lucene-Solr-NightlyTests-7.x/checkout/solr/build/solr-core/test/J2/temp/solr.handler.TestReplicationHandler_22B4683D20069F6E-001/init-core-data-001
   [junit4]   2> 2682114 WARN  (SUITE-TestReplicationHandler-seed#[22B4683D20069F6E]-worker) [    ] o.a.s.SolrTestCaseJ4 startTrackingSearchers: numOpens=469 numCloses=469
   [junit4]   2> 2682114 INFO  (SUITE-TestReplicationHandler-seed#[22B4683D20069F6E]-worker) [    ] o.a.s.SolrTestCaseJ4 Using PointFields (NUMERIC_POINTS_SYSPROP=true) w/NUMERIC_DOCVALUES_SYSPROP=true
   [junit4]   2> 2682116 INFO  (SUITE-TestReplicationHandler-seed#[22B4683D20069F6E]-worker) [    ] o.a.s.SolrTestCaseJ4 Randomized ssl (false) and clientAuth (false) via: @org.apache.solr.SolrTestCaseJ4$SuppressSSL(bugUrl=None)
   [junit4]   2> 2682158 INFO  (TEST-TestReplicationHandler.testEmptyCommits-seed#[22B4683D20069F6E]) [    ] o.a.s.SolrTestCaseJ4 ###Starting testEmptyCommits
   [junit4]   2> 2682159 INFO  (TEST-TestReplicationHandler.testEmptyCommits-seed#[22B4683D20069F6E]) [    ] o.a.s.SolrTestCaseJ4 Writing core.properties file to /x1/jenkins/jenkins-slave/workspace/Lucene-Solr-NightlyTests-7.x/checkout/solr/build/solr-core/test/J2/temp/solr.handler.TestReplicationHandler_22B4683D20069F6E-001/solr-instance-001/collection1
   [junit4]   2> 2682163 INFO  (TEST-TestReplicationHandler.testEmptyCommits-seed#[22B4683D20069F6E]) [    ] o.e.j.s.Server jetty-9.4.10.v20180503; built: 2018-05-03T15:56:21.710Z; git: daa59876e6f384329b122929e70a80934569428c; jvm 1.8.0_172-b11
   [junit4]   2> 2682216 INFO  (TEST-TestReplicationHandler.testEmptyCommits-seed#[22B4683D20069F6E]) [    ] o.e.j.s.session DefaultSessionIdManager workerName=node0
   [junit4]   2> 2682216 INFO  (TEST-TestReplicationHandler.testEmptyCommits-seed#[22B4683D20069F6E]) [    ] o.e.j.s.session No SessionScavenger set, using defaults
   [junit4]   2> 2682216 INFO  (TEST-TestReplicationHandler.testEmptyCommits-seed#[22B4683D20069F6E]) [    ] o.e.j.s.session node0 Scavenging every 600000ms
   [junit4]   2> 2682224 INFO  (TEST-TestReplicationHandler.testEmptyCommits-seed#[22B4683D20069F6E]) [    ] o.e.j.s.h.ContextHandler Started o.e.j.s.ServletContextHandler@5ddddf7{/solr,null,AVAILABLE}
   [junit4]   2> 2682225 INFO  (TEST-TestReplicationHandler.testEmptyCommits-seed#[22B4683D20069F6E]) [    ] o.e.j.s.AbstractConnector Started ServerConnector@5e7b20cd{HTTP/1.1,[http/1.1]}{127.0.0.1:37114}
   [junit4]   2> 2682225 INFO  (TEST-TestReplicationHandler.testEmptyCommits-seed#[22B4683D20069F6E]) [    ] o.e.j.s.Server Started @2682407ms
   [junit4]   2> 2682225 INFO  (TEST-TestReplicationHandler.testEmptyCommits-seed#[22B4683D20069F6E]) [    ] o.a.s.c.s.e.JettySolrRunner Jetty properties: {solr.data.dir=/x1/jenkins/jenkins-slave/workspace/Lucene-Solr-NightlyTests-7.x/checkout/solr/build/solr-core/test/J2/temp/solr.handler.TestReplicationHandler_22B4683D20069F6E-001/solr-instance-001/collection1/data, hostContext=/solr, hostPort=37114}
   [junit4]   2> 2682225 ERROR (TEST-TestReplicationHandler.testEmptyCommits-seed#[22B4683D20069F6E]) [    ] o.a.s.u.StartupLoggingUtils Missing Java Option solr.log.dir. Logging may be missing or incomplete.
   [junit4]   2> 2682225 INFO  (TEST-TestReplicationHandler.testEmptyCommits-seed#[22B4683D20069F6E]) [    ] o.a.s.s.SolrDispatchFilter Using logger factory org.apache.logging.slf4j.Log4jLoggerFactory
   [junit4]   2> 2682225 INFO  (TEST-TestReplicationHandler.testEmptyCommits-seed#[22B4683D20069F6E]) [    ] o.a.s.s.SolrDispatchFilter  ___      _       Welcome to Apache Solr? version 7.4.0
   [junit4]   2> 2682225 INFO  (TEST-TestReplicationHandler.testEmptyCommits-seed#[22B4683D20069F6E]) [    ] o.a.s.s.SolrDispatchFilter / __| ___| |_ _   Starting in standalone mode on port null
   [junit4]   2> 2682225 INFO  (TEST-TestReplicationHandler.testEmptyCommits-seed#[22B4683D20069F6E]) [    ] o.a.s.s.SolrDispatchFilter \__ \/ _ \ | '_|  Install dir: null
   [junit4]   2> 2682225 INFO  (TEST-TestReplicationHandler.testEmptyCommits-seed#[22B4683D20069F6E]) [    ] o.a.s.s.SolrDispatchFilter |___/\___/_|_|    Start time: 2018-05-17T06:53:06.084Z
   [junit4]   2> 2682226 INFO  (TEST-TestReplicationHandler.testEmptyCommits-seed#[22B4683D20069F6E]) [    ] o.a.s.c.SolrXmlConfig Loading container configuration from /x1/jenkins/jenkins-slave/workspace/Lucene-Solr-NightlyTests-7.x/checkout/solr/build/solr-core/test/J2/temp/solr.handler.TestReplicationHandler_22B4683D20069F6E-001/solr-instance-001/solr.xml
   [junit4]   2> 2682230 INFO  (TEST-TestReplicationHandler.testEmptyCommits-seed#[22B4683D20069F6E]) [    ] o.a.s.c.SolrXmlConfig Configuration parameter autoReplicaFailoverWorkLoopDelay is ignored
   [junit4]   2> 2682230 INFO  (TEST-TestReplicationHandler.testEmptyCommits-seed#[22B4683D20069F6E]) [    ] o.a.s.c.SolrXmlConfig Configuration parameter autoReplicaFailoverBadNodeExpiration is ignored
   [junit4]   2> 2682231 INFO  (TEST-TestReplicationHandler.testEmptyCommits-seed#[22B4683D20069F6E]) [    ] o.a.s.c.SolrXmlConfig MBean server found: com.sun.jmx.mbeanserver.JmxMBeanServer@6b966107, but no JMX reporters were configured - adding default JMX reporter.
   [junit4]   2> 2682301 INFO  (TEST-TestReplicationHandler.testEmptyCommits-seed#[22B4683D20069F6E]) [    ] o.a.s.m.r.SolrJmxReporter JMX monitoring for 'solr.node' (registry 'solr.node') enabled at server: com.sun.jmx.mbeanserver.JmxMBeanServer@6b966107
   [junit4]   2> 2682323 INFO  (TEST-TestReplicationHandler.testEmptyCommits-seed#[22B4683D20069F6E]) [    ] o.a.s.m.r.SolrJmxReporter JMX monitoring for 'solr.jvm' (registry 'solr.jvm') enabled at server: com.sun.jmx.mbeanserver.JmxMBeanServer@6b966107
   [junit4]   2> 2682324 INFO  (TEST-TestReplicationHandler.testEmptyCommits-seed#[22B4683D20069F6E]) [    ] o.a.s.m.r.SolrJmxReporter JMX monitoring for 'solr.jetty' (registry 'solr.jetty') enabled at server: com.sun.jmx.mbeanserver.JmxMBeanServer@6b966107
   [junit4]   2> 2682326 INFO  (TEST-TestReplicationHandler.testEmptyCommits-seed#[22B4683D20069F6E]) [    ] o.a.s.c.CorePropertiesLocator Found 1 core definitions underneath /x1/jenkins/jenkins-slave/workspace/Lucene-Solr-NightlyTests-7.x/checkout/solr/build/solr-core/test/J2/temp/solr.handler.TestReplicationHandler_22B4683D20069F6E-001/solr-instance-001/.
   [junit4]   2> 2682326 INFO  (TEST-TestReplicationHandler.testEmptyCommits-seed#[22B4683D20069F6E]) [    ] o.a.s.c.CorePropertiesLocator Cores are: [collection1]
   [junit4]   2> 2682331 INFO  (coreLoadExecutor-5293-thread-1) [    ] o.a.s.c.TransientSolrCoreCacheDefault Allocating transient cache for 4 transient cores
   [junit4]   2> 2682350 INFO  (coreLoadExecutor-5293-thread-1) [    x:collection1] o.a.s.c.SolrConfig Using Lucene MatchVersion: 7.4.0
   [junit4]   2> 2682367 INFO  (coreLoadExecutor-5293-thread-1) [    x:collection1] o.a.s.s.IndexSchema [collection1] Schema name=test
   [junit4]   2> 2682369 INFO  (coreLoadExecutor-5293-thread-1) [    x:collection1] o.a.s.s.IndexSchema Loaded schema test/1.2 with uniqueid field id
   [junit4]   2> 2682370 INFO  (coreLoadExecutor-5293-thread-1) [    x:collection1] o.a.s.c.CoreContainer Creating SolrCore 'collection1' using configuration from instancedir /x1/jenkins/jenkins-slave/workspace/Lucene-Solr-NightlyTests-7.x/checkout/solr/build/solr-core/test/J2/temp/solr.handler.TestReplicationHandler_22B4683D20069F6E-001/solr-instance-001/./collection1, trusted=true
   [junit4]   2> 2682370 INFO  (coreLoadExecutor-5293-thread-1) [    x:collection1] o.a.s.m.r.SolrJmxReporter JMX monitoring for 'solr.core.collection1' (registry 'solr.core.collection1') enabled at server: com.sun.jmx.mbeanserver.JmxMBeanServer@6b966107
   [junit4]   2> 2682370 INFO  (coreLoadExecutor-5293-thread-1) [    x:collection1] o.a.s.c.SolrCore solr.RecoveryStrategy.Builder
   [junit4]   2> 2682370 INFO  (coreLoadExecutor-5293-thread-1) [    x:collection1] o.a.s.c.SolrCore [[collection1] ] Opening new SolrCore at [/x1/jenkins/jenkins-slave/workspace/Lucene-Solr-NightlyTests-7.x/checkout/solr/build/solr-core/test/J2/temp/solr.handler.TestReplicationHandler_22B4683D20069F6E-001/solr-instance-001/collection1], dataDir=[/x1/jenkins/jenkins-slave/workspace/Lucene-Solr-NightlyTests-7.x/checkout/solr/build/solr-core/test/J2/temp/solr.handler.TestReplicationHandler_22B4683D20069F6E-001/solr-instance-001/./collection1/data/]
   [junit4]   2> 2682372 INFO  (coreLoadExecutor-5293-thread-1) [    x:collection1] o.a.s.u.RandomMergePolicy RandomMergePolicy wrapping class org.apache.lucene.index.LogByteSizeMergePolicy: [LogByteSizeMergePolicy: minMergeSize=1677721, mergeFactor=49, maxMergeSize=2147483648, maxMergeSizeForForcedMerge=9223372036854775807, calibrateSizeByDeletes=true, maxMergeDocs=2147483647, maxCFSSegmentSizeMB=8.796093022207999E12, noCFSRatio=0.0]
   [junit4]   2> 2682434 INFO  (coreLoadExecutor-5293-thread-1) [    x:collection1] o.a.s.u.CommitTracker Hard AutoCommit: disabled
   [junit4]   2> 2682435 INFO  (coreLoadExecutor-5293-thread-1) [    x:collection1] o.a.s.u.CommitTracker Soft AutoCommit: disabled
   [junit4]   2> 2682436 INFO  (coreLoadExecutor-5293-thread-1) [    x:collection1] o.a.s.u.RandomMergePolicy RandomMergePolicy wrapping class org.apache.lucene.index.TieredMergePolicy: [TieredMergePolicy: maxMergeAtOnce=8, maxMergeAtOnceExplicit=5, maxMergedSegmentMB=38.072265625, floorSegmentMB=1.626953125, forceMergeDeletesPctAllowed=21.305491120853432, segmentsPerTier=30.0, maxCFSSegmentSizeMB=8.796093022207999E12, noCFSRatio=0.34815928142357866
   [junit4]   2> 2682437 INFO  (coreLoadExecutor-5293-thread-1) [    x:collection1] o.a.s.s.SolrIndexSearcher Opening [Searcher@6ed3cc39[collection1] main]
   [junit4]   2> 2682437 INFO  (coreLoadExecutor-5293-thread-1) [    x:collection1] o.a.s.r.ManagedResourceStorage File-based storage initialized to use dir: /x1/jenkins/jenkins-slave/workspace/Lucene-Solr-NightlyTests-7.x/checkout/solr/build/solr-core/test/J2/temp/solr.handler.TestReplicationHandler_22B4683D20069F6E-001/solr-instance-001/collection1/conf
   [junit4]   2> 2682438 INFO  (coreLoadExecutor-5293-thread-1) [    x:collection1] o.a.s.h.ReplicationHandler Replication enabled for following config files: schema.xml,xslt/dummy.xsl
   [junit4]   2> 2682438 INFO  (coreLoadExecutor-5293-thread-1) [    x:collection1] o.a.s.h.ReplicationHandler Commits will be reserved for 10000ms.
   [junit4]   2> 2682456 INFO  (searcherExecutor-5294-thread-1-processing-x:collection1) [    x:collection1] o.a.s.c.SolrCore [collection1] Registered new searcher Searcher@6ed3cc39[collection1] main{ExitableDirectoryReader(UninvertingDirectoryReader())}
   [junit4]   2> 2682943 INFO  (TEST-TestReplicationHandler.testEmptyCommits-seed#[22B4683D20069F6E]) [    ] o.a.s.SolrTestCaseJ4 Writing core.properties file to /x1/jenkins/jenkins-slave/workspace/Lucene-Solr-NightlyTests-7.x/checkout/solr/build/solr-core/test/J2/temp/solr.handler.TestReplicationHandler_22B4683D20069F6E-001/solr-instance-002/collection1
   [junit4]   2> 2682946 INFO  (TEST-TestReplicationHandler.testEmptyCommits-seed#[22B4683D20069F6E]) [    ] o.e.j.s.Server jetty-9.4.10.v20180503; built: 2018-05-03T15:56:21.710Z; git: daa59876e6f384329b122929e70a80934569428c; jvm 1.8.0_172-b11
   [junit4]   2> 2682949 INFO  (TEST-TestReplicationHandler.testEmptyCommits-seed#[22B4683D20069F6E]) [    ] o.e.j.s.session DefaultSessionIdManager workerName=node0
   [junit4]   2> 2682949 INFO  (TEST-TestReplicationHandler.testEmptyCommits-seed#[22B4683D20069F6E]) [    ] o.e.j.s.session No SessionScavenger set, using defaults
   [junit4]   2> 2682949 INFO  (TEST-TestReplicationHandler.testEmptyCommits-seed#[22B4683D20069F6E]) [    ] o.e.j.s.session node0 Scavenging every 660000ms
   [junit4]   2> 2682950 INFO  (TEST-TestReplicationHandler.testEmptyCommits-seed#[22B4683D20069F6E]) [    ] o.e.j.s.h.ContextHandler Started o.e.j.s.ServletContextHandler@3a6aeab4{/solr,null,AVAILABLE}
   [junit4]   2> 2682950 INFO  (TEST-TestReplicationHandler.testEmptyCommits-seed#[22B4683D20069F6E]) [    ] o.e.j.s.AbstractConnector Started ServerConnector@5c309978{HTTP/1.1,[http/1.1]}{127.0.0.1:35437}
   [junit4]   2> 2682950 INFO  (TEST-TestReplicationHandler.testEmptyCommits-seed#[22B4683D20069F6E]) [    ] o.e.j.s.Server Started @2683132ms
   [junit4]   2> 2682950 INFO  (TEST-TestReplicationHandler.testEmptyCommits-seed#[22B4683D20069F6E]) [    ] o.a.s.c.s.e.JettySolrRunner Jetty properties: {solr.data.dir=/x1/jenkins/jenkins-slave/workspace/Lucene-Solr-NightlyTests-7.x/checkout/solr/build/solr-core/test/J2/temp/solr.handler.TestReplicationHandler_22B4683D20069F6E-001/solr-instance-002/collection1/data, hostContext=/solr, hostPort=35437}
   [junit4]   2> 2682950 ERROR (TEST-TestReplicationHandler.testEmptyCommits-seed#[22B4683D20069F6E]) [    ] o.a.s.u.StartupLoggingUtils Missing Java Option solr.log.dir. Logging may be missing or incomplete.
   [junit4]   2> 2682950 INFO  (TEST-TestReplicationHandler.testEmptyCommits-seed#[22B4683D20069F6E]) [    ] o.a.s.s.SolrDispatchFilter Using logger factory org.apache.logging.slf4j.Log4jLoggerFactory
   [junit4]   2> 2682951 INFO  (TEST-TestReplicationHandler.testEmptyCommits-seed#[22B4683D20069F6E]) [    ] o.a.s.s.SolrDispatchFilter  ___      _       Welcome to Apache Solr? version 7.4.0
   [junit4]   2> 2682951 INFO  (TEST-TestReplicationHandler.testEmptyCommits-seed#[22B4683D20069F6E]) [    ] o.a.s.s.SolrDispatchFilter / __| ___| |_ _   Starting in standalone mode on port null
   [junit4]   2> 2682951 INFO  (TEST-TestReplicationHandler.testEmptyCommits-seed#[22B4683D20069F6E]) [    ] o.a.s.s.SolrDispatchFilter \__ \/ _ \ | '_|  Install dir: null
   [junit4]   2> 2682951 INFO  (TEST-TestReplicationHandler.testEmptyCommits-seed#[22B4683D20069F6E]) [    ] o.a.s.s.SolrDispatchFilter |___/\___/_|_|    Start time: 2018-05-17T06:53:06.810Z
   [junit4]   2> 2682951 INFO  (TEST-TestReplicationHandler.testEmptyCommits-seed#[22B4683D20069F6E]) [    ] o.a.s.c.SolrXmlConfig Loading container configuration from /x1/jenkins/jenkins-slave/workspace/Lucene-Solr-NightlyTests-7.x/checkout/solr/build/solr-core/test/J2/temp/solr.handler.TestReplicationHandler_22B4683D20069F6E-001/solr-instance-002/solr.xml
   [junit4]   2> 2682955 INFO  (TEST-TestReplicationHandler.testEmptyCommits-seed#[22B4683D20069F6E]) [    ] o.a.s.c.SolrXmlConfig Configuration parameter autoReplicaFailoverWorkLoopDelay is ignored
   [junit4]   2> 2682955 INFO  (TEST-TestReplicationHandler.testEmptyCommits-seed#[22B4683D20069F6E]) [    ] o.a.s.c.SolrXmlConfig Configuration parameter autoReplicaFailoverBadNodeExpiration is ignored
   [junit4]   2> 2682957 INFO  (TEST-TestReplicationHandler.testEmptyCommits-seed#[22B4683D20069F6E]) [    ] o.a.s.c.SolrXmlConfig MBean server found: com.sun.jmx.mbeanserver.JmxMBeanServer@6b966107, but no JMX reporters were configured - adding default JMX reporter.
   [junit4]   2> 2683055 INFO  (TEST-TestReplicationHandler.testEmptyCommits-seed#[22B4683D20069F6E]) [    ] o.a.s.m.r.SolrJmxReporter JMX monitoring for 'solr.node' (registry 'solr.node') enabled at server: com.sun.jmx.mbeanserver.JmxMBeanServer@6b966107
   [junit4]   2> 2683071 INFO  (TEST-TestReplicationHandler.testEmptyCommits-seed#[22B4683D20069F6E]) [    ] o.a.s.m.r.SolrJmxReporter JMX monitoring for 'solr.jvm' (registry 'solr.jvm') enabled at server: com.sun.jmx.mbeanserver.JmxMBeanServer@6b966107
   [junit4]   2> 2683071 INFO  (TEST-TestReplicationHandler.testEmptyCommits-seed#[22B4683D20069F6E]) [    ] o.a.s.m.r.SolrJmxReporter JMX monitoring for 'solr.jetty' (registry 'solr.jetty') enabled at server: com.sun.jmx.mbeanserver.JmxMBeanServer@6b966107
   [junit4]   2> 2683074 INFO  (TEST-TestReplicationHandler.testEmptyCommits-seed#[22B4683D20069F6E]) [    ] o.a.s.c.CorePropertiesLocator Found 1 core definitions underneath /x1/jenkins/jenkins-slave/workspace/Lucene-Solr-NightlyTests-7.x/checkout/solr/build/solr-core/test/J2/temp/solr.handler.TestReplicationHandler_22B4683D20069F6E-001/solr-instance-002/.
   [junit4]   2> 2683074 INFO  (TEST-TestReplicationHandler.testEmptyCommits-seed#[22B4683D20069F6E]) [    ] o.a.s.c.CorePropertiesLocator Cores are: [collection1]
   [junit4]   2> 2683074 INFO  (coreLoadExecutor-5303-thread-1) [    ] o.a.s.c.TransientSolrCoreCacheDefault Allocating transient cache for 4 transient cores
   [junit4]   2> 2683100 INFO  (coreLoadExecutor-5303-thread-1) [    x:collection1] o.a.s.c.SolrConfig Using Lucene MatchVersion: 7.4.0
   [junit4]   2> 2683109 INFO  (coreLoadExecutor-5303-thread-1) [    x:collection1] o.a.s.s.IndexSchema [collection1] Schema name=test
   [junit4]   2> 2683111 INFO  (coreLoadExecutor-5303-thread-1) [    x:collection1] o.a.s.s.IndexSchema Loaded schema test/1.2 with uniqueid field id
   [junit4]   2> 2683111 INFO  (coreLoadExecutor-5303-thread-1) [    x:collection1] o.a.s.c.CoreContainer Creating SolrCore 'collection1' using configuration from instancedir /x1/jenkins/jenkins-slave/workspace/Lucene-Solr-NightlyTests-7.x/checkout/solr/build/solr-core/test/J2/temp/solr.handler.TestReplicationHandler_22B4683D20069F6E-001/solr-instance-002/./collection1, trusted=true
   [junit4]   2> 2683111 INFO  (coreLoadExecutor-5303-thread-1) [    x:collection1] o.a.s.m.r.SolrJmxReporter JMX monitoring for 'solr.core.collection1' (registry 'solr.core.collection1') enabled at server: com.sun.jmx.mbeanserver.JmxMBeanServer@6b966107
   [junit4]   2> 2683111 INFO  (coreLoadExecutor-5303-thread-1) [    x:collection1] o.a.s.c.SolrCore solr.RecoveryStrategy.Builder
   [junit4]   2> 2683111 INFO  (coreLoadExecutor-5303-thread-1) [    x:collection1] o.a.s.c.SolrCore [[collection1] ] Opening new SolrCore at [/x1/jenkins/jenkins-slave/workspace/Lucene-Solr-NightlyTests-7.x/checkout/solr/build/solr-core/test/J2/temp/solr.handler.TestReplicationHandler_22B4683D20069F6E-001/solr-instance-002/collection1], dataDir=[/x1/jenkins/jenkins-slave/workspace/Lucene-Solr-NightlyTests-7.x/checkout/solr/build/solr-core/test/J2/temp/solr.handler.TestReplicationHandler_22B4683D20069F6E-001/solr-instance-002/./collection1/data/]
   [junit4]   2> 2683113 INFO  (coreLoadExecutor-5303-thread-1) [    x:collection1] o.a.s.u.RandomMergePolicy RandomMergePolicy wrapping class org.apache.lucene.index.LogByteSizeMergePolicy: [LogByteSizeMergePolicy: minMergeSize=1677721, mergeFactor=49, maxMergeSize=2147483648, maxMergeSizeForForcedMerge=9223372036854775807, calibrateSizeByDeletes=true, maxMergeDocs=2147483647, maxCFSSegmentSizeMB=8.796093022207999E12, noCFSRatio=0.0]
   [junit4]   2> 2683171 INFO  (coreLoadExecutor-5303-thread-1) [    x:collection1] o.a.s.u.CommitTracker Hard AutoCommit: disabled
   [junit4]   2> 2683171 INFO  (coreLoadExecutor-5303-thread-1) [    x:collection1] o.a.s.u.CommitTracker Soft AutoCommit: disabled
   [junit4]   2> 2683172 INFO  (coreLoadExecutor-5303-thread-1) [    x:collection1] o.a.s.u.RandomMergePolicy RandomMergePolicy wrapping class org.apache.lucene.index.TieredMergePolicy: [TieredMergePolicy: maxMergeAtOnce=8, maxMergeAtOnceExplicit=5, maxMergedSegmentMB=38.072265625, floorSegmentMB=1.626953125, forceMergeDeletesPctAllowed=21.305491120853432, segmentsPerTier=30.0, maxCFSSegmentSizeMB=8.796093022207999E12, noCFSRatio=0.34815928142357866
   [junit4]   2> 2683172 INFO  (coreLoadExecutor-5303-thread-1) [    x:collection1] o.a.s.s.SolrIndexSearcher Opening [Searcher@6cab61c3[collection1] main]
   [junit4]   2> 2683173 INFO  (coreLoadExecutor-5303-thread-1) [    x:collection1] o.a.s.r.ManagedResourceStorage File-based storage initialized to use dir: /x1/jenkins/jenkins-slave/workspace/Lucene-Solr-NightlyTests-7.x/checkout/solr/build/solr-core/test/J2/temp/solr.handler.TestReplicationHandler_22B4683D20069F6E-001/solr-instance-002/collection1/conf
   [junit4]   2> 2683175 INFO  (coreLoadExecutor-5303-thread-1) [    x:collection1] o.a.s.h.ReplicationHandler Poll scheduled at an interval of 1000ms
   [junit4]   2> 2683175 INFO  (coreLoadExecutor-5303-thread-1) [    x:collection1] o.a.s.h.ReplicationHandler Commits will be reserved for 10000ms.
   [junit4]   2> 2683176 INFO  (searcherExecutor-5304-thread-1-processing-x:collection1) [    x:collection1] o.a.s.c.SolrCore [collection1] Registered new searcher Searcher@6cab61c3[collection1] main{ExitableDirectoryReader(UninvertingDirectoryReader())}
   [junit4]   2> 2683179 INFO  (qtp339392314-19910) [    x:collection1] o.a.s.c.S.Request [collection1]  webapp=/solr path=/select params={q=*:*&sort=id+desc&wt=javabin&version=2} hits=0 status=0 QTime=0
   [junit4]   2> 2683183 INFO  (qtp339392314-19906) [    x:collection1] o.a.s.u.p.LogUpdateProcessorFactory [collection1]  webapp=/solr path=/update params={wt=javabin&version=2}{add=[1]} 0 3
   [junit4]   2> 2683184 INFO  (qtp339392314-19909) [    x:collection1] o.a.s.u.DirectUpdateHandler2 start commit{,optimize=false,openSearcher=true,waitSearcher=true,expungeDeletes=false,softCommit=false,prepareCommit=false}
   [junit4]   2> 2683184 INFO  (qtp339392314-19909) [    x:collection1] o.a.s.u.SolrIndexWriter Calling setCommitData with IW:org.apache.solr.update.SolrIndexWriter@1bed630e commitCommandVersion:0
   [junit4]   2> 2683200 INFO  (qtp339392314-19905) [    x:collection1] o.a.s.c.S.Request [collection1]  webapp=/solr path=/replication params={qt=/replication&wt=javabin&version=2&command=indexversion} status=0 QTime=0
   [junit4]   2> 2683201 INFO  (indexFetcher-5308-thread-1) [    ] o.a.s.h.IndexFetcher Master's generation: 2
   [junit4]   2> 2683201 INFO  (indexFetcher-5308-thread-1) [    ] o.a.s.h.IndexFetcher Master's version: 1526539987043
   [junit4]   2> 2683201 INFO  (indexFetcher-5308-thread-1) [    ] o.a.s.h.IndexFetcher Slave's generation: 1
   [junit4]   2> 2683201 INFO  (indexFetcher-5308-thread-1) [    ] o.a.s.h.IndexFetcher Slave's version: 0
   [junit4]   2> 2683201 INFO  (indexFetcher-5308-thread-1) [    ] o.a.s.h.IndexFetcher Starting replication process
   [junit4]   2> 2683202 INFO  (qtp339392314-19909) [    x:collection1] o.a.s.s.SolrIndexSearcher Opening [Searcher@13ae2043[collection1] main]
   [junit4]   2> 2683202 INFO  (qtp339392314-19909) [    x:collection1] o.a.s.u.DirectUpdateHandler2 end_commit_flush
   [junit4]   2> 2683203 INFO  (searcherExecutor-5294-thread-1-processing-x:collection1) [    x:collection1] o.a.s.c.SolrCore [collection1] Registered new searcher Searcher@13ae2043[collection1] main{ExitableDirectoryReader(UninvertingDirectoryReader(Uninverting(_0(7.4.0):C1)))}
   [junit4]   2> 2683204 INFO  (qtp339392314-19909) [    x:collection1] o.a.s.u.p.LogUpdateProcessorFactory [collection1]  webapp=/solr path=/update params={commit=true&wt=javabin&version=2}{commit=} 0 19
   [junit4]   2> 2683207 INFO  (qtp339392314-19905) [    x:collection1] o.a.s.c.S.Request [collection1]  webapp=/solr path=/replication params={generation=2&qt=/replication&tlogFiles=false&wt=javabin&version=2&command=filelist} status=0 QTime=6
   [junit4]   2> 2683207 INFO  (indexFetcher-5308-thread-1) [    ] o.a.s.h.IndexFetcher Number of files in latest index in master: 11
   [junit4]   2> 2683220 INFO  (indexFetcher-5308-thread-1) [    ] o.a.s.u.RandomMergePolicy RandomMergePolicy wrapping class org.apache.lucene.index.TieredMergePolicy: [TieredMergePolicy: maxMergeAtOnce=46, maxMergeAtOnceExplicit=25, maxMergedSegmentMB=79.8984375, floorSegmentMB=1.583984375, forceMergeDeletesPctAllowed=2.6430624561794334, segmentsPerTier=13.0, maxCFSSegmentSizeMB=8.796093022207999E12, noCFSRatio=1.0
   [junit4]   2> 2683239 INFO  (qtp250027762-19928) [    x:collection1] o.a.s.c.S.Request [collection1]  webapp=/solr path=/replication params={wait=true&masterUrl=http://127.0.0.1:37114/solr/collection1/replication&command=fetchindex} status=0 QTime=19
   [junit4]   2> 2683240 INFO  (indexFetcher-5308-thread-1) [    ] o.a.s.u.DefaultSolrCoreState New IndexWriter is ready to be used.
   [junit4]   2> 2683241 INFO  (indexFetcher-5308-thread-1) [    ] o.a.s.h.IndexFetcher Starting download (fullCopy=false) to MockDirectoryWrapper(NRTCachingDirectory(RAMDirectory@5ee81ba lockFactory=org.apache.lucene.store.SingleInstanceLockFactory@21e1761; maxCacheMB=0.216796875 maxMergeSizeMB=0.7685546875))
   [junit4]   2> 2683241 INFO  (qtp339392314-19905) [    x:collection1] o.a.s.c.S.Request [collection1]  webapp=/solr path=/replication params={generation=2&qt=/replication&file=_0.si&checksum=true&compression=true&wt=filestream&command=filecontent} status=0 QTime=0
   [junit4]   2> 2683256 INFO  (qtp339392314-19905) [    x:collection1] o.a.s.c.S.Request [collection1]  webapp=/solr path=/replication params={generation=2&qt=/replication&file=_0_MockRandom_0.doc&checksum=true&compression=true&wt=filestream&command=filecontent} status=0 QTime=0
   [junit4]   2> 2683256 INFO  (qtp250027762-19923) [    x:collection1] o.a.s.c.S.Request [collection1]  webapp=/solr path=/select params={q=name:empty1&sort=id+desc&wt=javabin&version=2} hits=0 status=0 QTime=0
   [junit4]   2> 2683256 INFO  (TEST-TestReplicationHandler.testEmptyCommits-seed#[22B4683D20069F6E]) [    ] o.a.s.h.TestReplicationHandler Waiting for 1 docs
   [junit4]   2> 2683260 INFO  (qtp339392314-19912) [    x:collection1] o.a.s.c.S.Request [collection1]  webapp=/solr path=/replication params={generation=2&qt=/replication&file=_0_MockRandom_0.tim&checksum=true&compression=true&wt=filestream&command=filecontent} status=0 QTime=0
   [junit4]   2> 2683264 INFO  (qtp339392314-19909) [    x:collection1] o.a.s.c.S.Request [collection1]  webapp=/solr path=/replication params={generation=2&qt=/replication&file=_0.nvd&checksum=true&compression=true&wt=filestream&command=filecontent} status=0 QTime=0
   [junit4]   2> 2683265 INFO  (qtp339392314-19912) [    x:collection1] o.a.s.c.S.Request [collection1]  webapp=/solr path=/replication params={generation=2&qt=/replication&file=_0_MockRandom_0.sd&checksum=true&compression=true&wt=filestream&command=filecontent} status=0 QTime=0
   [junit4]   2> 2683266 INFO  (qtp339392314-19909) [    x:collection1] o.a.s.c.S.Request [collection1]  webapp=/solr path=/replication params={generation=2&qt=/replication&file=_0.fdx&checksum=true&compression=true&wt=filestream&command=filecontent} status=0 QTime=0
   [junit4]   2> 2683267 INFO  (qtp339392314-19909) [    x:collection1] o.a.s.c.S.Request [collection1]  webapp=/solr path=/replication params={generation=2&qt=/replication&file=_0_MockRandom_0.tip&checksum=true&compression=true&wt=filestream&command=filecontent} status=0 QTime=0
   [junit4]   2> 2683267 INFO  (qtp339392314-19912) [    x:collection1] o.a.s.c.S.Request [collection1]  webapp=/solr path=/replication params={generation=2&qt=/replication&file=_0.fdt&checksum=true&compression=true&wt=filestream&command=filecontent} status=0 QTime=0
   [junit4]   2> 2683268 INFO  (qtp339392314-19909) [    x:collection1] o.a.s.c.S.Request [collection1]  webapp=/solr path=/replication params={generation=2&qt=/replication&file=_0.fnm&checksum=true&compression=true&wt=filestream&command=filecontent} status=0 QTime=0
   [junit4]   2> 2683269 INFO  (qtp339392314-19909) [    x:collection1] o.a.s.c.S.Request [collection1]  webapp=/solr path=/replication params={generation=2&qt=/replication&file=_0.nvm&checksum=true&compression=true&wt=filestream&command=filecontent} status=0 QTime=0
   [junit4]   2> 2683270 INFO  (qtp339392314-19912) [    x:collection1] o.a.s.c.S.Request [collection1]  webapp=/solr path=/replication params={generation=2&qt=/replication&file=segments_2&checksum=true&compression=true&wt=filestream&command=filecontent} status=0 QTime=0
   [junit4]   2> 2683270 INFO  (indexFetcher-5308-thread-1) [    ] o.a.s.h.IndexFetcher Bytes downloaded: 1794, Bytes skipped downloading: 0
   [junit4]   2> 2683270 INFO  (indexFetcher-5308-thread-1) [    ] o.a.s.h.IndexFetcher Total time taken for download (fullCopy=false,bytesDownloaded=1794) : 0 secs (null bytes/sec) to MockDirectoryWrapper(NRTCachingDirectory(RAMDirectory@5ee81ba lockFactory=org.apache.lucene.store.SingleInstanceLockFactory@21e1761; maxCacheMB=0.216796875 maxMergeSizeMB=0.7685546875))
   [junit4]   2> 2683273 INFO  (indexFetcher-5308-thread-1) [    ] o.a.s.u.RandomMergePolicy RandomMergePolicy wrapping class org.apache.lucene.index.LogDocMergePolicy: [LogDocMergePolicy: minMergeSize=1000, mergeFactor=8, maxMergeSize=9223372036854775807, maxMergeSizeForForcedMerge=9223372036854775807, calibrateSizeByDeletes=true, maxMergeDocs=2147483647, maxCFSSegmentSizeMB=8.796093022207999E12, noCFSRatio=0.0]
   [junit4]   2> 2683276 INFO  (indexFetcher-5308-thread-1) [    ] o.a.s.u.DefaultSolrCoreState New IndexWriter is ready to be used.
   [junit4]   2> 2683277 INFO  (indexFetcher-5308-thread-1) [    ] o.a.s.s.SolrIndexSearcher Opening [Searcher@76d420c0[collection1] main]
   [junit4]   2> 2683278 INFO  (searcherExecutor-5304-thread-1) [    ] o.a.s.c.SolrCore [collection1] Registered new searcher Searcher@76d420c0[collection1] main{ExitableDirectoryReader(UninvertingDirectoryReader(Uninverting(_0(7.4.0):C1)))}
   [junit4]   2> 2683357 INFO  (qtp250027762-19923) [    x:collection1] o.a.s.c.S.Request [collection1]  webapp=/solr path=/select params={q=name:empty1&sort=id+desc&wt=javabin&version=2} hits=1 status=0 QTime=0
   [junit4]   2> 2683358 INFO  (TEST-TestReplicationHandler.testEmptyCommits-seed#[22B4683D20069F6E]) [    ] o.a.s.h.TestReplicationHandler Waited for 100ms and found 1 docs
   [junit4]   2> 2683359 INFO  (qtp339392314-19911) [    x:collection1] o.a.s.c.S.Request [collection1]  webapp=/solr path=/replication params={_trace=getDetails&qt=/replication&wt=javabin&version=2&command=details} status=0 QTime=0
   [junit4]   2> 2683360 INFO  (qtp339392314-19909) [    x:collection1] o.a.s.c.S.Request [collection1]  webapp=/solr path=/replication params={_trace=getDetails&qt=/replication&wt=javabin&version=2&command=details} status=0 QTime=0
   [junit4]   2> 2683367 INFO  (qtp339392314-19912) [    x:collection1] o.a.s.c.S.Request [collection1]  webapp=/solr path=/replication params={slave=false&qt=/replication&wt=javabin&version=2&command=details} status=0 QTime=0
   [junit4]   2> 2683368 INFO  (qtp250027762-19923) [    x:collection1] o.a.s.c.S.Request [collection1]  webapp=/solr path=/replication params={_trace=getDetails&qt=/replication&wt=javabin&version=2&command=details} status=0 QTime=6
   [junit4]   2> 2683368 INFO  (qtp339392314-19911) [    x:collection1] o.a.s.c.S.Request [collection1]  webapp=/solr path=/replication params={_trace=assertVersions&qt=/replication&wt=javabin&version=2&command=indexversion} status=0 QTime=0
   [junit4]   2> 2683369 INFO  (qtp250027762-19927) [    x:collection1] o.a.s.c.S.Request [collection1]  webapp=/solr path=/replication params={_trace=assertVersions&qt=/replication&wt=javabin&version=2&command=indexversion} status=0 QTime=0
   [junit4]   2> 2683369 INFO  (qtp339392314-19912) [    x:collection1] o.a.s.u.DirectUpdateHandler2 start commit{,optimize=false,openSearcher=true,waitSearcher=true,expungeDeletes=false,softCommit=false,prepareCommit=false}
   [junit4]   2> 2683369 INFO  (qtp339392314-19912) [    x:collection1] o.a.s.u.DirectUpdateHandler2 No uncommitted changes. Skipping IW.commit.
   [junit4]   2> 2683369 INFO  (qtp339392314-19912) [    x:collection1] o.a.s.u.DirectUpdateHandler2 end_commit_flush
   [junit4]   2> 2683369 INFO  (qtp339392314-19912) [    x:collection1] o.a.s.u.p.LogUpdateProcessorFactory [collection1]  webapp=/solr path=/update params={commit=true&wt=javabin&version=2}{commit=} 0 0
   [junit4]   2> 2683385 WARN  (explicit-fetchindex-cmd) [    ] o.a.s.h.IndexFetcher 'masterUrl' must be specified without the /replication suffix
   [junit4]   2> 2683387 INFO  (qtp339392314-19909) [    x:collection1] o.a.s.c.S.Request [collection1]  webapp=/solr path=/replication params={qt=/replication&wt=javabin&version=2&command=indexversion} status=0 QTime=0
   [junit4]   2> 2683398 INFO  (explicit-fetchindex-cmd) [    ] o.a.s.h.IndexFetcher Master's generation: 2
   [junit4]   2> 2683398 INFO  (explicit-fetchindex-cmd) [    ] o.a.s.h.IndexFetcher Master's version: 1526539987043
   [junit4]   2> 2683398 INFO  (explicit-fetchindex-cmd) [    ] o.a.s.h.IndexFetcher Slave's generation: 2
   [junit4]   2> 2683398 INFO  (explicit-fetchindex-cmd) [    ] o.a.s.h.IndexFetcher Slave's version: 1526539987043
   [junit4]   2> 2683398 INFO  (explicit-fetchindex-cmd) [    ] o.a.s.h.IndexFetcher Slave in sync with master.
   [junit4]   2> 2683399 INFO  (qtp250027762-19924) [    x:collection1] o.a.s.c.S.Request [collection1]  webapp=/solr path=/replication params={wait=true&masterUrl=http://127.0.0.1:37114/solr/collection1/replication&command=fetchindex} status=0 QTime=14
   [junit4]   2> 2683400 INFO  (qtp339392314-19911) [    x:collection1] o.a.s.u.p.LogUpdateProcessorFactory [collection1]  webapp=/solr path=/update params={wt=javabin&version=2}{add=[2]} 0 0
   [junit4]   2> 2683400 INFO  (qtp339392314-19909) [    x:collection1] o.a.s.u.DirectUpdateHandler2 start commit{,optimize=false,openSearcher=true,waitSearcher=true,expungeDeletes=false,softCommit=false,prepareCommit=false}
   [junit4]   2> 2683400 INFO  (qtp339392314-19909) [    x:collection1] o.a.s.u.SolrIndexWriter Calling setCommitData with IW:org.apache.solr.update.SolrIndexWriter@1bed630e commitCommandVersion:0
   [junit4]   2> 2683402 INFO  (qtp339392314-19909) [    x:collection1] o.a.s.s.SolrIndexSearcher Opening [Searcher@54e551b[collection1] main]
   [junit4]   2> 2683402 INFO  (qtp339392314-19909) [    x:collection1] o.a.s.u.DirectUpdateHandler2 end_commit_flush
   [junit4]   2> 2683404 INFO  (searcherExecutor-5294-thread-1-processing-x:collection1) [    x:collection1] o.a.s.c.SolrCore [collection1] Registered new searcher Searcher@54e551b[collection1] main{ExitableDirectoryReader(UninvertingDirectoryReader(Uninverting(_0(7.4.0):C1) Uninverting(_1(7.4.0):C1)))}
   [junit4]   2> 2683404 INFO  (qtp339392314-19909) [    x:collection1] o.a.s.u.p.LogUpdateProcessorFactory [collection1]  webapp=/solr path=/update params={commit=true&wt=javabin&version=2}{commit=} 0 3
   [junit4]   2> 2683414 WARN  (explicit-fetchindex-cmd) [    ] o.a.s.h.IndexFetcher 'masterUrl' must be specified without the /replication suffix
   [junit4]   2> 2683420 INFO  (qtp339392314-19912) [    x:collection1] o.a.s.c.S.Request [collection1]  webapp=/solr path=/replication params={qt=/replication&wt=javabin&version=2&command=indexversion} status=0 QTime=0
   [junit4]   2> 2683421 INFO  (explicit-fetchindex-cmd) [    ] o.a.s.h.IndexFetcher Master's generation: 3
   [junit4]   2> 2683421 INFO  (explicit-fetchindex-cmd) [    ] o.a.s.h.IndexFetcher Master's version: 1526539987259
   [junit4]   2> 2683421 INFO  (explicit-fetchindex-cmd) [    ] o.a.s.h.IndexFetcher Slave's generation: 2
   [junit4]   2> 2683421 INFO  (explicit-fetchindex-cmd) [    ] o.a.s.h.IndexFetcher Slave's version: 1526539987043
   [junit4]   2> 2683421 INFO  (explicit-fetchindex-cmd) [    ] o.a.s.h.IndexFetcher Starting replication process
   [junit4]   2> 2683422 INFO  (qtp339392314-19912) [    x:collection1] o.a.s.c.S.Request [collection1]  webapp=/solr path=/replication params={generation=3&qt=/replication&tlogFiles=false&wt=javabin&version=2&command=filelist} status=0 QTime=0
   [junit4]   2> 2683422 INFO  (explicit-fetchindex-cmd) [    ] o.a.s.h.IndexFetcher Number of files in latest index in master: 20
   [junit4]   2> 2683423 INFO  (explicit-fetchindex-cmd) [    ] o.a.s.u.RandomMergePolicy RandomMergePolicy wrapping class org.apache.lucene.index.TieredMergePolicy: [TieredMergePolicy: maxMergeAtOnce=46, maxMergeAtOnceExplicit=25, maxMergedSegmentMB=79.8984375, floorSegmentMB=1.583984375, forceMergeDeletesPctAllowed=2.6430624561794334, segmentsPerTier=13.0, maxCFSSegmentSizeMB=8.796093022207999E12, noCFSRatio=1.0
   [junit4]   2> 2683423 INFO  (explicit-fetchindex-cmd) [    ] o.a.s.u.DefaultSolrCoreState New IndexWriter is ready to be used.
   [junit4]   2> 2683424 INFO  (explicit-fetchindex-cmd) [    ] o.a.s.h.IndexFetcher Starting download (fullCopy=false) to MockDirectoryWrapper(NRTCachingDirectory(RAMDirectory@52677abf lockFactory=org.apache.lucene.store.SingleInstanceLockFactory@648547c1; maxCacheMB=0.216796875 maxMergeSizeMB=0.7685546875))
   [junit4]   2> 2683424 INFO  (explicit-fetchindex-cmd) [    ] o.a.s.h.IndexFetcher Skipping download for _0.si because it already exists
   [junit4]   2> 2683424 INFO  (explicit-fetchindex-cmd) [    ] o.a.s.h.IndexFetcher Skipping download for _0_MockRandom_0.doc because it already exists
   [junit4]   2> 2683424 INFO  (explicit-fetchindex-cmd) [    ] o.a.s.h.IndexFetcher Skipping download for _0_MockRandom_0.tim because it already exists
   [junit4]   2> 2683424 INFO  (explicit-fetchindex-cmd) [    ] o.a.s.h.IndexFetcher Skipping download for _0.nvd because it already exists
   [junit4]   2> 2683424 INFO  (explicit-fetchindex-cmd) [    ] o.a.s.h.IndexFetcher Skipping download for _0_MockRandom_0.sd because it already exists
   [junit4]   2> 2683424 INFO  (explicit-fetchindex-cmd) [    ] o.a.s.h.IndexFetcher Skipping download for _0.fdx because it already exists
   [junit4]   2> 2683424 INFO  (explicit-fetchindex-cmd) [    ] o.a.s.h.IndexFetcher Skipping download for _0_MockRandom_0.tip because it already exists
   [junit4]   2> 2683424 INFO  (explicit-fetchindex-cmd) [    ] o.a.s.h.IndexFetcher Skipping download for _0.fdt because it already exists
   [junit4]   2> 2683424 INFO  (explicit-fetchindex-cmd) [    ] o.a.s.h.IndexFetcher Skipping download for _0.fnm because it already exists
   [junit4]   2> 2683424 INFO  (explicit-fetchindex-cmd) [    ] o.a.s.h.IndexFetcher Skipping download for _0.nvm because it already exists
   [junit4]   2> 2683425 INFO  (qtp339392314-19909) [    x:collection1] o.a.s.c.S.Request [collection1]  webapp=/solr path=/replication params={generation=3&qt=/replication&file=_1_MockRandom_0.doc&checksum=true&wt=filestream&command=filecontent} status=0 QTime=0
   [junit4]   2> 2683426 INFO  (qtp339392314-19909) [    x:collection1] o.a.s.c.S.Request [collection1]  webapp=/solr path=/replication params={generation=3&qt=/replication&file=_1_MockRandom_0.sd&checksum=true&wt=filestream&command=filecontent} status=0 QTime=0
   [junit4]   2> 2683426 INFO  (qtp339392314-19912) [    x:collection1] o.a.s.c.S.Request [collection1]  webapp=/solr path=/replication params={generation=3&qt=/replication&file=_1.si&checksum=true&wt=filestream&command=filecontent} status=0 QTime=0
   [junit4]   2> 2683427 INFO  (qtp339392314-19909) [    x:collection1] o.a.s.c.S.Request [collection1]  webapp=/solr path=/replication params={generation=3&qt=/replication&file=_1.nvd&checksum=true&wt=filestream&command=filecontent} status=0 QTime=0
   [junit4]   2> 2683428 INFO  (qtp339392314-19912) [    x:collection1] o.a.s.c.S.Request [collection1]  webapp=/solr path=/replication params={generation=3&qt=/replication&file=_1.fdx&checksum=true&wt=filestream&command=filecontent} status=0 QTime=0
   [junit4]   2> 2683429 INFO  (qtp339392314-19909) [    x:collection1] o.a.s.c.S.Request [collection1]  webapp=/solr path=/replication params={generation=3&qt=/replication&file=_1.fnm&checksum=true&wt=filestream&command=filecontent} status=0 QTime=0
   [junit4]   2> 2683429 INFO  (qtp339392314-19912) [    x:collection1] o.a.s.c.S.Request [collection1]  webapp=/solr path=/replication params={generation=3&qt=/replication&file=_1.nvm&checksum=true&wt=filestream&command=filecontent} status=0 QTime=0
   [junit4]   2> 2683430 INFO  (qtp339392314-19909) [    x:collection1] o.a.s.c.S.Request [collection1]  webapp=/solr path=/replication params={generation=3&qt=/replication&file=_1_MockRandom_0.tfp&checksum=true&wt=filestream&command=filecontent} status=0 QTime=0
   [junit4]   2> 2683431 INFO  (qtp339392314-19912) [    x:collection1] o.a.s.c.S.Request [collection1]  webapp=/solr path=/replication params={generation=3&qt=/replication&file=_1.fdt&checksum=true&wt=filestream&command=filecontent} status=0 QTime=0
   [junit4]   2> 2683432 INFO  (qtp339392314-19912) [    x:collection1] o.a.s.c.S.Request [collection1]  webapp=/solr path=/replication params={generation=3&qt=/replication&file=segments_3&checksum=true&wt=filestream&command=filecontent} status=0 QTime=0
   [junit4]   2> 2683432 INFO  (explicit-fetchindex-cmd) [    ] o.a.s.h.IndexFetcher Bytes downloaded: 1710, Bytes skipped downloading: 0
   [junit4]   2> 2683432 INFO  (explicit-fetchindex-cmd) [    ] o.a.s.h.IndexFetcher Total time taken for download (fullCopy=false,bytesDownloaded=1710) : 0 secs (null bytes/sec) to MockDirectoryWrapper(NRTCachingDirectory(RAMDirectory@52677abf lockFactory=org.apache.lucene.store.SingleInstanceLockFactory@648547c1; maxCacheMB=0.216796875 maxMergeSizeMB=0.7685546875))
   [junit4]   2> 2683434 INFO  (explicit-fetchindex-cmd) [    ] o.a.s.u.RandomMergePolicy RandomMergePolicy wrapping class org.apache.lucene.index.LogDocMergePolicy: [LogDocMergePolicy: minMergeSize=1000, mergeFactor=8, maxMergeSize=9223372036854775807, maxMergeSizeForForcedMerge=9223372036854775807, calibrateSizeByDeletes=true, maxMergeDocs=2147483647, maxCFSSegmentSizeMB=8.796093022207999E12, noCFSRatio=0.0]
   [junit4]   2> 2683434 INFO  (explicit-fetchindex-cmd) [    ] o.a.s.u.DefaultSolrCoreState New IndexWriter is ready to be used.
   [junit4]   2> 2683435 INFO  (explicit-fetchindex-cmd) [    ] o.a.s.s.SolrIndexSearcher Opening [Searcher@19e5b59a[collection1] main]
   [junit4]   2> 2683436 INFO  (searcherExecutor-5304-thread-1) [    ] o.a.s.c.SolrCore [collection1] Registered new searcher Searcher@19e5b59a[collection1] main{ExitableDirectoryReader(UninvertingDirectoryReader(Uninverting(_0(7.4.0):C1) Uninverting(_1(7.4.0):C1)))}
   [junit4]   2> 2683438 INFO  (qtp250027762-19930) [    x:collection1] o.a.s.c.S.Request [collection1]  webapp=/solr path=/replication params={wait=true&masterUrl=http://127.0.0.1:37114/solr/collection1/replication&command=fetchindex} status=0 QTime=33
   [junit4]   2> 2683440 INFO  (qtp250027762-19927) [    x:collection1] o.a.s.c.S.Request [collection1]  webapp=/solr path=/select params={q=name:empty2&sort=id+desc&wt=javabin&version=2} hits=1 status=0 QTime=0
   [junit4]   2> 2683440 INFO  (TEST-TestReplicationHandler.testEmptyCommits-seed#[22B4683D20069F6E]) [    ] o.a.s.h.TestReplicationHandler Waited for 0ms and found 1 docs
   [junit4]   2> 2683440 INFO  (qtp339392314-19911) [    x:collection1] o.a.s.c.S.Request [collection1]  webapp=/solr path=/replication params={_trace=getDetails&qt=/replication&wt=javabin&version=2&command=details} status=0 QTime=0
   [junit4]   2> 2683441 INFO  (qtp339392314-19912) [    x:collection1] o.a.s.c.S.Request [collection1]  webapp=/solr path=/replication params={_trace=getDetails&qt=/replication&wt=javabin&version=2&command=details} status=0 QTime=0
   [junit4]   2> 2683443 INFO  (qtp339392314-19909) [    x:collection1] o.a.s.c.S.Request [collection1]  webapp=/solr path=/replication params={slave=false&qt=/replication&wt=javabin&version=2&command=details} status=0 QTime=0
   [junit4]   2> 2683443 INFO  (qtp250027762-19930) [    x:collection1] o.a.s.c.S.Request [collection1]  webapp=/solr path=/replication params={_trace=getDetails&qt=/replication&wt=javabin&version=2&command=details} status=0 QTime=1
   [junit4]   2> 2683444 INFO  (qtp339392314-19911) [    x:collection1] o.a.s.c.S.Request [collection1]  webapp=/solr path=/replication params={_trace=assertVersions&qt=/replication&wt=javabin&version=2&command=indexversion} status=0 QTime=0
   [junit4]   2> 2683444 INFO  (qtp250027762-19927) [    x:collection1] o.a.s.c.S.Request [collection1]  webapp=/solr path=/replication params={_trace=assertVersions&qt=/replication&wt=javabin&version=2&command=indexversion} status=0 QTime=0
   [junit4]   2> 2683445 INFO  (qtp339392314-19909) [    x:collection1] o.a.s.u.p.LogUpdateProcessorFactory [collection1]  webapp=/solr path=/update params={wt=javabin&version=2}{add=[3]} 0 0
   [junit4]   2> 2683445 INFO  (qtp339392314-19909) [    x:collection1] o.a.s.u.DirectUpdateHandler2 start commit{,optimize=false,openSearcher=false,waitSearcher=true,expungeDeletes=false,softCommit=false,prepareCommit=false}
   [junit4]   2> 2683445 INFO  (qtp339392314-19909) [    x:collection1] o.a.s.u.SolrIndexWriter Calling setCommitData with IW:org.apache.solr.update.SolrIndexWriter@1bed630e commitCommandVersion:0
   [junit4]   2> 2683452 INFO  (qtp339392314-19909) [    x:collection1] o.a.s.s.SolrIndexSearcher Opening [Searcher@63ebe586[collection1] realtime]
   [junit4]   2> 2683453 INFO  (qtp339392314-19909) [    x:collection1] o.a.s.u.DirectUpdateHandler2 end_commit_flush
   [junit4]   2> 2683453 INFO  (qtp339392314-19909) [    x:collection1] o.a.s.u.p.LogUpdateProcessorFactory [collection1]  webapp=/solr path=/update params={openSearcher=false&commit=true&wt=javabin&version=2}{commit=} 0 7
   [junit4]   2> 2683460 WARN  (explicit-fetchindex-cmd) [    ] o.a.s.h.IndexFetcher 'masterUrl' must be specified without the /replication suffix
   [junit4]   2> 2683461 INFO  (qtp339392314-19912) [    x:collection1] o.a.s.c.S.Request [collection1]  webapp=/solr path=/replication params={qt=/replication&wt=javabin&version=2&command=indexversion} status=0 QTime=0
   [junit4]   2> 2683461 INFO  (explicit-fetchindex-cmd) [    ] o.a.s.h.IndexFetcher Master's generation: 4
   [junit4]   2> 2683461 INFO  (explicit-fetchindex-cmd) [    ] o.a.s.h.IndexFetcher Master's version: 1526539987305
   [junit4]   2> 2683461 INFO  (explicit-fetchindex-cmd) [    ] o.a.s.h.IndexFetcher Slave's generation: 3
   [junit4]   2> 2683461 INFO  (explicit-fetchindex-cmd) [    ] o.a.s.h.IndexFetcher Slave's version: 1526539987259
   [junit4]   2> 2683461 INFO  (explicit-fetchindex-cmd) [    ] o.a.s.h.IndexFetcher Starting replication process
   [junit4]   2> 2683462 INFO  (qtp339392314-19912) [    x:collection1] o.a.s.c.S.Request [collection1]  webapp=/solr path=/replication params={generation=4&qt=/replication&tlogFiles=false&wt=javabin&version=2&command=filelist} status=0 QTime=0
   [junit4]   2> 2683462 INFO  (explicit-fetchindex-cmd) [    ] o.a.s.h.IndexFetcher Number of files in latest index in master: 30
   [junit4]   2> 2683463 INFO  (explicit-fetchindex-cmd) [    ] o.a.s.u.RandomMergePolicy RandomMergePolicy wrapping class org.apache.lucene.index.TieredMergePolicy: [TieredMergePolicy: maxMergeAtOnce=46, maxMergeAtOnceExplicit=25, maxMergedSegmentMB=79.8984375, floorSegmentMB=1.583984375, forceMergeDeletesPctAllowed=2.6430624561794334, segmentsPerTier=13.0, maxCFSSegmentSizeMB=8.796093022207999E12, noCFSRatio=1.0
   [junit4]   2> 2683464 INFO  (explicit-fetchindex-cmd) [    ] o.a.s.u.DefaultSolrCoreState New IndexWriter is ready to be used.
   [junit4]   2> 2683464 INFO  (explicit-fetchindex-cmd) [    ] o.a.s.h.IndexFetcher Found unused file: segments_2
   [junit4]   2> 2683464 INFO  (explicit-fetchindex-cmd) [    ] o.a.s.h.IndexFetcher Sleeping for 1000ms to wait for unused lucene index files to be delete-able
   [junit4]   2> 2684464 INFO  (explicit-fetchindex-cmd) [    ] o.a.s.h.IndexFetcher Found unused file: segments_2
   [junit4]   2> 2684464 INFO  (explicit-fetchindex-cmd) [    ] o.a.s.h.IndexFetcher Sleeping for 1000ms to wait for unused lucene index files to be delete-able
   [junit4]   2> 2685466 INFO  (explicit-fetchindex-cmd) [    ] o.a.s.h.IndexFetcher Found unused file: segments_2
   [junit4]   2> 2685466 INFO  (explicit-fetchindex-cmd) [    ] o.a.s.h.IndexFetcher Sleeping for 1000ms to wait for unused lucene index files to be delete-able
   [junit4]   2> 2686466 INFO  (explicit-fetchindex-cmd) [    ] o.a.s.h.IndexFetcher Found unused file: segments_2
   [junit4]   2> 2686466 INFO  (explicit-fetchindex-cmd) [    ] o.a.s.h.IndexFetcher Sleeping for 1000ms to wait for unused lucene index files to be delete-able
   [junit4]   2> 2687466 INFO  (explicit-fetchindex-cmd) [    ] o.a.s.h.IndexFetcher Found unused file: segments_2
   [junit4]   2> 2687467 INFO  (explicit-fetchindex-cmd) [    ] o.a.s.h.IndexFetcher Sleeping for 1000ms to wait for unused lucene index files to be delete-able
   [junit4]   2> 2688467 INFO  (explicit-fetchindex-cmd) [    ] o.a.s.h.IndexFetcher Found unused file: segments_2
   [junit4]   2> 2688467 INFO  (explicit-fetchindex-cmd) [    ] o.a.s.h.IndexFetcher Sleeping for 1000ms to wait for unused lucene index files to be delete-able
   [junit4]   2> 2689467 INFO  (explicit-fetchindex-cmd) [    ] o.a.s.h.IndexFetcher Found unused file: segments_2
   [junit4]   2> 2689468 INFO  (explicit-fetchindex-cmd) [    ] o.a.s.h.IndexFetcher Sleeping for 1000ms to wait for unused lucene index files to be delete-able
   [junit4]   2> 2690468 INFO  (explicit-fetchindex-cmd) [    ] o.a.s.h.IndexFetcher Found unused file: segments_2
   [junit4]   2> 2690468 INFO  (explicit-fetchindex-cmd) [    ] o.a.s.h.IndexFetcher Sleeping for 1000ms to wait for unused lucene index files to be delete-able
   [junit4]   2> 2691468 INFO  (explicit-fetchindex-cmd) [    ] o.a.s.h.IndexFetcher Found unused file: segments_2
   [junit4]   2> 2691469 INFO  (explicit-fetchindex-cmd) [    ] o.a.s.h.IndexFetcher Sleeping for 1000ms to wait for unused lucene index files to be delete-able
   [junit4]   2> 2692469 INFO  (explicit-fetchindex-cmd) [    ] o.a.s.h.IndexFetcher Found unused file: segments_2
   [junit4]   2> 2692469 INFO  (explicit-fetchindex-cmd) [    ] o.a.s.h.IndexFetcher Sleeping for 1000ms to wait for unused lucene index files to be delete-able
   [junit4]   2> 2693469 INFO  (explicit-fetchindex-cmd) [    ] o.a.s.h.IndexFetcher Found unused file: segments_2
   [junit4]   2> 2693469 INFO  (explicit-fetchindex-cmd) [    ] o.a.s.h.IndexFetcher Sleeping for 1000ms to wait for unused lucene index files to be delete-able
   [junit4]   2> 2694470 INFO  (explicit-fetchindex-cmd) [    ] o.a.s.h.IndexFetcher IndexFetcher slept for 11000ms for unused lucene index files to be delete-able
   [junit4]   2> 2694470 INFO  (explicit-fetchindex-cmd) [    ] o.a.s.h.IndexFetcher Starting download (fullCopy=false) to MockDirectoryWrapper(NRTCachingDirectory(RAMDirectory@74ef9c7f lockFactory=org.apache.lucene.store.SingleInstanceLockFactory@2f4311a0; maxCacheMB=0.216796875 maxMergeSizeMB=0.7685546875))
   [junit4]   2> 2694470 INFO  (explicit-fetchindex-cmd) [    ] o.a.s.h.IndexFetcher Skipping download for _0.si because it already exists
   [junit4]   2> 2694470 INFO  (explicit-fetchindex-cmd) [    ] o.a.s.h.IndexFetcher Skipping download for _0_MockRandom_0.doc because it already exists
   [junit4]   2> 2694471 INFO  (explicit-fetchindex-cmd) [    ] o.a.s.h.IndexFetcher Skipping download for _0_MockRandom_0.tim because it already exists
   [junit4]   2> 2694471 INFO  (explicit-fetchindex-cmd) [    ] o.a.s.h.IndexFetcher Skipping download for _0.nvd because it already exists
   [junit4]   2> 2694471 INFO  (explicit-fetchindex-cmd) [    ] o.a.s.h.IndexFetcher Skipping download for _0_MockRandom_0.sd because it already exists
   [junit4]   2> 2694471 INFO  (explicit-fetchindex-cmd) [    ] o.a.s.h.IndexFetcher Skipping download for _0.fdx because it already exists
   [junit4]   2> 2694471 INFO  (explicit-fetchindex-cmd) [    ] o.a.s.h.IndexFetcher Skipping download for _0_MockRandom_0.tip because it already exists
   [junit4]   2> 2694471 INFO  (explicit-fetchindex-cmd) [    ] o.a.s.h.IndexFetcher Skipping download for _0.fdt because it already exists
   [junit4]   2> 2694471 INFO  (explicit-fetchindex-cmd) [    ] o.a.s.h.IndexFetcher Skipping download for _0.fnm because it already exists
   [junit4]   2> 2694471 INFO  (explicit-fetchindex-cmd) [    ] o.a.s.h.IndexFetcher Skipping download for _0.nvm because it already exists
   [junit4]   2> 2694472 INFO  (explicit-fetchindex-cmd) [    ] o.a.s.h.IndexFetcher Skipping download for _1_MockRandom_0.doc because it already exists
   [junit4]   2> 2694473 INFO  (explicit-fetchindex-cmd) [    ] o.a.s.h.IndexFetcher Skipping download for _1_MockRandom_0.sd because it already exists
   [junit4]   2> 2694473 INFO  (explicit-fetchindex-cmd) [    ] o.a.s.h.IndexFetcher Skipping download for _1.si because it already exists
   [junit4]   2> 2694474 INFO  (explicit-fetchindex-cmd) [    ] o.a.s.h.IndexFetcher Skipping download for _1.nvd because it already exists
   [junit4]   2> 2694474 INFO  (explicit-fetchindex-cmd) [    ] o.a.s.h.IndexFetcher Skipping download for _1.fdx because it already exists
   [junit4]   2> 2694476 INFO  (explicit-fetchindex-cmd) [    ] o.a.s.h.IndexFetcher Skipping download for _1.fnm because it already exists
   [junit4]   2> 2694478 INFO  (explicit-fetchindex-cmd) [    ] o.a.s.h.IndexFetcher Skipping download for _1.nvm because it already exists
   [junit4]   2> 2694478 INFO  (explicit-fetchindex-cmd) [    ] o.a.s.h.IndexFetcher Skipping download for _1_MockRandom_0.tfp because it already exists
   [junit4]   2> 2694478 INFO  (explicit-fetchindex-cmd) [    ] o.a.s.h.IndexFetcher Skipping download for _1.fdt because it already exists
   [junit4]   2> 2694484 INFO  (qtp339392314-19909) [    x:collection1] o.a.s.c.S.Request [collection1]  webapp=/solr path=/replication params={generation=4&qt=/replication&file=_2.nvd&checksum=true&wt=filestream&command=filecontent} status=0 QTime=0
   [junit4]   2> 2694616 INFO  (qtp339392314-19912) [    x:collection1] o.a.s.c.S.Request [collection1]  webapp=/solr path=/replication params={generation=4&qt=/replication&file=_2_MockRandom_0.doc&checksum=true&wt=filestream&command=filecontent} status=0 QTime=0
   [junit4]   2> 2694617 INFO  (qtp339392314-19909) [    x:collection1] o.a.s.c.S.Request [collection1]  webapp=/solr path=/replication params={generation=4&qt=/replication&file=_2.si&checksum=true&wt=filestream&command=filecontent} status=0 QTime=0
   [junit4]   2> 2694618 INFO  (qtp339392314-19912) [    x:collection1] o.a.s.c.S.Request [collection1]  webapp=/solr path=/replication params={generation=4&qt=/replication&file=_2.fdt&checksum=true&wt=filestream&command=filecontent} status=0 QTime=0
   [junit4]   2> 2694619 INFO  (qtp339392314-19912) [    x:collection1] o.a.s.c.S.Request [collection1]  webapp=/solr path=/replication params={generation=4&qt=/replication&file=_2_MockRandom_0.tix&checksum=true&wt=filestream&command=filecontent} status=0 QTime=0
   [junit4]   2> 2694620 INFO  (qtp339392314-19909) [    x:collection1] o.a.s.c.S.Request [collection1]  webapp=/solr path=/replication params={generation=4&qt=/replication&file=_2.fnm&checksum=true&wt=filestream&command=filecontent} status=0 QTime=0
   [junit4]   2> 2694621 INFO  (qtp339392314-19912) [    x:collection1] o.a.s.c.S.Request [collection1]  webapp=/solr path=/replication params={generation=4&qt=/replication&file=_2.nvm&checksum=true&wt=filestream&command=filecontent} status=0 QTime=0
   [junit4]   2> 2694621 INFO  (qtp339392314-19909) [    x:collection1] o.a.s.c.S.Request [collection1]  webapp=/solr path=/replication params={generation=4&qt=/replication&file=_2_MockRandom_0.sd&checksum=true&wt=filestream&command=filecontent} status=0 QTime=0
   [junit4]   2> 2694622 INFO  (qtp339392314-19909) [    x:collection1] o.a.s.c.S.Request [collection1]  webapp=/solr path=/replication params={generation=4&qt=/replication&file=_2.fdx&checksum=true&wt=filestream&command=filecontent} status=0 QTime=0
   [junit4]   2> 2694623 INFO  (qtp339392314-19912) [    x:collection1] o.a.s.c.S.Request [collection1]  webapp=/solr path=/replication params={generation=4&qt=/replication&file=_2_MockRandom_0.tbk&checksum=true&wt=filestream&command=filecontent} status=0 QTime=0
   [junit4]   2> 2694624 INFO  (qtp339392314-19912) [    x:collection1] o.a.s.c.S.Request [collection1]  webapp=/solr path=/replication params={generation=4&qt=/replication&file=segments_4&checksum=true&wt=filestream&command=filecontent} status=0 QTime=0
   [junit4]   2> 2694624 INFO  (explicit-fetchindex-cmd) [    ] o.a.s.h.IndexFetcher Bytes downloaded: 1866, Bytes skipped downloading: 0
   [junit4]   2> 2694624 INFO  (explicit-fetchindex-cmd) [    ] o.a.s.h.IndexFetcher Total time taken for download (fullCopy=false,bytesDownloaded=1866) : 11 secs (169 bytes/sec) to MockDirectoryWrapper(NRTCachingDirectory(RAMDirectory@74ef9c7f lockFactory=org.apache.lucene.store.SingleInstanceLockFactory@2f4311a0; maxCacheMB=0.216796875 maxMergeSizeMB=0.7685546875))
   [junit4]   2> 2694635 INFO  (explicit-fetchindex-cmd) [    ] o.a.s.u.RandomMergePolicy RandomMergePolicy wrapping class org.apache.lucene.index.LogDocMergePolicy: [LogDocMergePolicy: minMergeSize=1000, mergeFactor=8, maxMergeSize=9223372036854775807, maxMergeSizeForForcedMerge=9223372036854775807, calibrateSizeByDeletes=true, maxMergeDocs=2147483647, maxCFSSegmentSizeMB=8.796093022207999E12, noCFSRatio=0.0]
   [junit4]   2> 2694635 INFO  (explicit-fetchindex-cmd) [    ] o.a.s.u.DefaultSolrCoreState New IndexWriter is ready to be used.
   [junit4]   2> 2694639 INFO  (explicit-fetchindex-cmd) [    ] o.a.s.s.SolrIndexSearcher Opening [Searcher@538bc442[collection1] main]
   [junit4]   2> 2694640 INFO  (searcherExecutor-5304-thread-1) [    ] o.a.s.c.SolrCore [collection1] Registered new searcher Searcher@538bc442[collection1] main{ExitableDirectoryReader(UninvertingDirectoryReader(Uninverting(_0(7.4.0):C1) Uninverting(_1(7.4.0):C1) Uninverting(_2(7.4.0):C1)))}
   [junit4]   2> 2694640 INFO  (qtp250027762-19926) [    x:collection1] o.a.s.c.S.Request [collection1]  webapp=/solr path=/replication params={wait=true&masterUrl=http://127.0.0.1:37114/solr/collection1/replication&command=fetchindex} status=0 QTime=11187
   [junit4]   2> 2694658 INFO  (qtp339392314-19911) [    x:collection1] o.a.s.c.S.Request [collection1]  webapp=/solr path=/select params={q=name:empty3&sort=id+desc&wt=javabin&version=2} hits=0 status=0 QTime=0
   [junit4]   2> 2694658 INFO  (TEST-TestReplicationHandler.testEmptyCommits-seed#[22B4683D20069F6E]) [    ] o.a.s.h.TestReplicationHandler Waited for 0ms and found 0 docs
   [junit4]   2> 2694660 INFO  (qtp250027762-19927) [    x:collection1] o.a.s.c.S.Request [collection1]  webapp=/solr path=/select params={q=name:empty3&sort=id+desc&wt=javabin&version=2} hits=1 status=0 QTime=0
   [junit4]   2> 2694660 INFO  (TEST-TestReplicationHandler.testEmptyCommits-seed#[22B4683D20069F6E]) [    ] o.a.s.h.TestReplicationHandler Waited for 0ms and found 1 docs
   [junit4]   2> 2694661 INFO  (qtp339392314-19911) [    x:collection1] o.a.s.u.p.LogUpdateProcessorFactory [collection1]  webapp=/solr path=/update params={wt=javabin&version=2}{add=[4]} 0 0
   [junit4]   2> 2694661 INFO  (qtp339392314-19912) [    x:collection1] o.a.s.u.DirectUpdateHandler2 start commit{,optimize=false,openSearcher=true,waitSearcher=true,expungeDeletes=false,softCommit=false,prepareCommit=false}
   [junit4]   2> 2694661 INFO  (qtp339392314-19912) [    x:collection1] o.a.s.u.SolrIndexWriter Calling setCommitData with IW:org.apache.solr.update.SolrIndexWriter@1bed630e commitCommandVersion:0
   [junit4]   2> 2694670 INFO  (qtp339392314-19912) [    x:collection1] o.a.s.s.SolrIndexSearcher Opening [Searcher@55251620[collection1] main]
   [junit4]   2> 2694670 INFO  (qtp339392314-19912) [    x:collection1] o.a.s.u.DirectUpdateHandler2 end_commit_flush
   [junit4]   2> 2694673 INFO  (searcherExecutor-5294-thread-1-processing-x:collection1) [    x:collection1] o.a.s.c.SolrCore [collection1] Registered new searcher Searcher@55251620[collection1] main{ExitableDirectoryReader(UninvertingDirectoryReader(Uninverting(_0(7.4.0):C1) Uninverting(_1(7.4.0):C1) Uninverting(_2(7.4.0):C1) Uninverting(_3(7.4.0):C1)))}
   [junit4]   2> 2694673 INFO  (qtp339392314-19912) [    x:collection1] o.a.s.u.p.LogUpdateProcessorFactory [collection1]  webapp=/solr path=/update params={commit=true&wt=javabin&version=2}{commit=} 0 12
   [junit4]   2> 2694706 WARN  (explicit-fetchindex-cmd) [    ] o.a.s.h.IndexFetcher 'masterUrl' must be specified without the /replication suffix
   [junit4]   2> 2694733 INFO  (qtp339392314-19909) [    x:collection1] o.a.s.c.S.Request [collection1]  webapp=/solr path=/replication params={qt=/replication&wt=javabin&version=2&command=indexversion} status=0 QTime=0
   [junit4]   2> 2694734 INFO  (explicit-fetchindex-cmd) [    ] o.a.s.h.IndexFetcher Master's generation: 5
   [junit4]   2> 2694734 INFO  (explicit-fetchindex-cmd) [    ] o.a.s.h.IndexFetcher Master's version: 1526539998520
   [junit4]   2> 2694734 INFO  (explicit-fetchindex-cmd) [    ] o.a.s.h.IndexFetcher Slave's generation: 4
   [junit4]   2> 2694734 INFO  (explicit-fetchindex-cmd) [    ] o.a.s.h.IndexFetcher Slave's version: 1526539987305
   [junit4]   2> 2694734 INFO  (explicit-fetchindex-cmd) [    ] o.a.s.h.IndexFetcher Starting replication process
   [junit4]   2> 2694736 INFO  (qtp339392314-19909) [    x:collection1] o.a.s.c.S.Request [collection1]  webapp=/solr path=/replication params={generation=5&qt=/replication&tlogFiles=false&wt=javabin&version=2&command=filelist} status=0 QTime=1
   [junit4]   2> 2694736 INFO  (explicit-fetchindex-cmd) [    ] o.a.s.h.IndexFetcher Number of files in latest index in master: 40
   [junit4]   2> 2694758 INFO  (explicit-fetchindex-cmd) [    ] o.a.s.u.RandomMergePolicy RandomMergePolicy wrapping class org.apache.lucene.index.TieredMergePolicy: [TieredMergePolicy: maxMergeAtOnce=46, maxMergeAtOnceExplicit=25, maxMergedSegmentMB=79.8984375, floorSegmentMB=1.583984375, forceMergeDeletesPctAllowed=2.6430624561794334, segmentsPerTier=13.0, maxCFSSegmentSizeMB=8.796093022207999E12, noCFSRatio=1.0
   [junit4]   2> 2694769 INFO  (explicit-fetchindex-cmd) [    ] o.a.s.u.DefaultSolrCoreState New IndexWriter is ready to be used.
   [junit4]   2> 2694771 INFO  (explicit-fetchindex-cmd) [    ] o.a.s.h.IndexFetcher Starting download (fullCopy=false) to MockDirectoryWrapper(NRTCachingDirectory(RAMDirectory@30c1f66c lockFactory=org.apache.lucene.store.SingleInstanceLockFactory@5cd76ea2; maxCacheMB=0.216796875 maxMergeSizeMB=0.7685546875))
   [junit4]   2> 2694771 INFO  (explicit-fetchindex-cmd) [    ] o.a.s.h.IndexFetcher Skipping download for _0.si because it already exists
   [junit4]   2> 2694771 INFO  (explicit-fetchindex-cmd) [    ] o.a.s.h.IndexFetcher Skipping download for _0_MockRandom_0.doc because it already exists
   [junit4]   2> 2694771 INFO  (explicit-fetchindex-cmd) [    ] o.a.s.h.IndexFetcher Skipping download for _0_MockRandom_0.tim because it already exists
   [junit4]   2> 2694771 INFO  (explicit-fetchindex-cmd) [    ] o.a.s.h.IndexFetcher Skipping download for _0.nvd because it already exists
   [junit4]   2> 2694771 INFO  (explicit-fetchindex-cmd) [    ] o.a.s.h.IndexFetcher Skipping download for _0_MockRandom_0.sd because it already exists
   [junit4]   2> 2694771 INFO  (explicit-fetchindex-cmd) [    ] o.a.s.h.IndexFetcher Skipping download for _0.fdx because it already exists
   [junit4]   2> 2694771 INFO  (explicit-fetchindex-cmd) [    ] o.a.s.h.IndexFetcher Skipping download for _0_MockRandom_0.tip because it already exists
   [junit4]   2> 2694771 INFO  (explicit-fetchindex-cmd) [    ] o.a.s.h.IndexFetcher Skipping download for _0.fdt because it already exists
   [junit4]   2> 2694771 INFO  (explicit-fetchindex-cmd) [    ] o.a.s.h.IndexFetcher Skipping download for _0.fnm because it already exists
   [junit4]   2> 2694776 INFO  (explicit-fetchindex-cmd) [    ] o.a.s.h.IndexFetcher Skipping download for _0.nvm because it already exists
   [junit4]   2> 2694776 INFO  (explicit-fetchindex-cmd) [    ] o.a.s.h.IndexFetcher Skipping download for _1_MockRandom_0.doc because it already exists
   [junit4]   2> 2694776 INFO  (explicit-fetchindex-cmd) [    ] o.a.s.h.IndexFetcher Skipping download for _1_MockRandom_0.sd because it already exists
   [junit4]   2> 2694776 INFO  (explicit-fetchindex-cmd) [    ] o.a.s.h.IndexFetcher Skipping download for _1.si because it already exists
   [junit4]   2> 2694776 INFO  (explicit-fetchindex-cmd) [    ] o.a.s.h.IndexFetcher Skipping download for _1.nvd because it already exists
   [junit4]   2> 2694776 INFO  (explicit-fetchindex-cmd) [    ] o.a.s.h.IndexFetcher Skipping download for _1.fdx because it already exists
   [junit4]   2> 2694776 INFO  (explicit-fetchindex-cmd) [    ] o.a.s.h.IndexFetcher Skipping download for _1.fnm because it already exists
   [junit4]   2> 2694776 INFO  (explicit-fetchindex-cmd) [    ] o.a.s.h.IndexFetcher Skipping download for _1.nvm because it already exists
   [junit4]   2> 2694776 INFO  (explicit-fetchindex-cmd) [    ] o.a.s.h.IndexFetcher Skipping download for _1_MockRandom_0.tfp because it already exists
   [junit4]   2> 2694776 INFO  (explicit-fetchindex-cmd) [    ] o.a.s.h.IndexFetcher Skipping download for _1.fdt because it already exists
   [junit4]   2> 2694776 INFO  (explicit-fetchindex-cmd) [    ] o.a.s.h.IndexFetcher Skipping download for _2.nvd because it already exists
   [junit4]   2> 2694776 INFO  (explicit-fetchindex-cmd) [    ] o.a.s.h.IndexFetcher Skipping download for _2_MockRandom_0.doc because it already exists
   [junit4]   2> 2694776 INFO  (explicit-fetchindex-cmd) [    ] o.a.s.h.IndexFetcher Skipping download for _2.si because it already exists
   [junit4]   2> 2694776 INFO  (explicit-fetchindex-cmd) [    ] o.a.s.h.IndexFetcher Skipping download for _2.fdt because it already exists
   [junit4]   2> 2694776 INFO  (explicit-fetchindex-cmd) [    ] o.a.s.h.IndexFetcher Skipping download for _2_MockRandom_0.tix because it already exists
   [junit4]   2> 2694776 INFO  (explicit-fetchindex-cmd) [    ] o.a.s.h.IndexFetcher Skipping download for _2.fnm because it already exists
   [junit4]   2> 2694776 INFO  (explicit-fetchindex-cmd) [    ] o.a.s.h.IndexFetcher Skipping download for _2.nvm because it already exists
   [junit4]   2> 2694776 INFO  (explicit-fetchindex-cmd) [    ] o.a.s.h.IndexFetcher Skipping download for _2_MockRandom_0.sd because it already exists
   [junit4]   2> 2694776 INFO  (explicit-fetchindex-cmd) [    ] o.a.s.h.IndexFetcher Skipping download for _2.fdx because it already exists
   [junit4]   2> 2694776 INFO  (explicit-fetchindex-cmd) [    ] o.a.s.h.IndexFetcher Skipping download for _2_MockRandom_0.tbk because it already exists
   [junit4]   2> 2694777 INFO  (qtp339392314-19912) [    x:collection1] o.a.s.c.S.Request [collection1]  webapp=/solr path=/replication params={generation=5&qt=/replication&file=_3.fdx&checksum=true&wt=filestream&command=filecontent} status=0 QTime=0
   [junit4]   2> 2694779 INFO  (qtp339392314-19912) [    x:collection1] o.a.s.c.S.Request [collection1]  webapp=/solr path=/replication params={generation=5&qt=/replication&file=_3_MockRandom_0.tbk&checksum=true&wt=filestream&command=filecontent} status=0 QTime=0
   [junit4]   2> 2694789 INFO  (qtp339392314-19912) [    x:collection1] o.a.s.c.S.Request [collection1]  webapp=/solr path=/replication params={generation=5&qt=/replication&file=_3.si&checksum=true&wt=filestream&command=filecontent} status=0 QTime=0
   [junit4]   2> 2694793 INFO  (qtp339392314-19909) [    x:collection1] o.a.s.c.S.Request [collection1]  webapp=/solr path=/replication params={generation=5&qt=/replication&file=_3.nvd&checksum=true&wt=filestream&command=filecontent} status=0 QTime=0
   [junit4]   2> 2694795 INFO  (qtp339392314-19912) [    x:collection1] o.a.s.c.S.Request [collection1]  webapp=/solr path=/replication params={generation=5&qt=/replication&file=_3_MockRandom_0.tix&checksum=true&wt=filestream&command=filecontent} status=0 QTime=0
   [junit4]   2> 2694797 INFO  (qtp339392314-19909) [    x:collection1] o.a.s.c.S.Request [collection1]  webapp=/solr path=/replication params={generation=5&qt=/replication&file=_3.fnm&checksum=true&wt=filestream&command=filecontent} status=0 QTime=0
   [junit4]   2> 2694798 INFO  (qtp339392314-19912) [    x:collection1] o.a.s.c.S.Request [collection1]  webapp=/solr path=/replication params={generation=5&qt=/replication&file=_3.nvm&checksum=true&wt=filestream&command=filecontent} status=0 QTime=0
   [junit4]   2> 2694799 INFO  (qtp339392314-19912) [    x:collection1] o.a.s.c.S.Request [collection1]  webapp=/solr path=/replication params={generation=5&qt=/replication&file=_3_MockRandom_0.doc&checksum=true&wt=filestream&command=filecontent} status=0 QTime=0
   [junit4]   2> 2694800 INFO  (qtp339392314-19909) [    x:collection1] o.a.s.c.S.Request [collection1]  webapp=/solr path=/replication params={generation=5&qt=/replication&file=_3.fdt&checksum=true&wt=filestream&command=filecontent} status=0 QTime=0
   [junit4]   2> 2694801 INFO  (qtp339392314-19912) [    x:collection1] o.a.s.c.S.Request [collection1]  webapp=/solr path=/replication params={generation=5&qt=/replication&file=_3_MockRandom_0.sd&checksum=true&wt=filestream&command=filecontent} status=0 QTime=0
   [junit4]   2> 2694802 INFO  (qtp339392314-19909) [    x:collection1] o.a.s.c.S.Request [collection1]  webapp=/solr path=/replication params={generation=5&qt=/replication&file=segments_5&checksum=true&wt=filestream&command=filecontent} status=0 QTime=0
   [junit4]   2> 2694802 INFO  (explicit-fetchindex-cmd) [    ] o.a.s.h.IndexFetcher Bytes downloaded: 1928, Bytes skipped downloading: 0
   [junit4]   2> 2694802 INFO  (explicit-fetchindex-cmd) [    ] o.a.s.h.IndexFetcher Total time taken for download (fullCopy=false,bytesDownloaded=1928) : 0 secs (null bytes/sec) to MockDirectoryWrapper(NRTCachingDirectory(RAMDirectory@30c1f66c lockFactory=org.apache.lucene.store.SingleInstanceLockFactory@5cd76ea2; maxCacheMB=0.216796875 maxMergeSizeMB=0.7685546875))
   [junit4]   2> 2694804 INFO  (explicit-fetchindex-cmd) [    ] o.a.s.u.RandomMergePolicy RandomMergePolicy wrapping class org.apache.lucene.index.LogDocMergePolicy: [LogDocMergePolicy: minMergeSize=1000, mergeFactor=8, maxMergeSize=9223372036854775807, maxMergeSizeForForcedMerge=9223372036854775807, calibrateSizeByDeletes=true, maxMergeDocs=2147483647, maxCFSSegmentSizeMB=8.796093022207999E12, noCFSRatio=0.0]
   [junit4]   2> 2694805 INFO  (explicit-fetchindex-cmd) [    ] o.a.s.u.DefaultSolrCoreState New IndexWriter is ready to be used.
   [junit4]   2> 2694806 INFO  (explicit-fetchindex-cmd) [    ] o.a.s.s.SolrIndexSearcher Opening [Searcher@203ac10c[collection1] main]
   [junit4]   2> 2694807 INFO  (searcherExecutor-5304-thread-1) [    ] o.a.s.c.SolrCore [collection1] Registered new searcher Searcher@203ac10c[collection1] main{ExitableDirectoryReader(UninvertingDirectoryReader(Uninverting(_0(7.4.0):C1) Uninverting(_1(7.4.0):C1) Uninverting(_2(7.4.0):C1) Uninverting(_3(7.4.0):C1)))}
   [junit4]   2> 2694807 INFO  (qtp250027762-19930) [    x:collection1] o.a.s.c.S.Request [collection1]  webapp=/solr path=/replication params={wait=true&masterUrl=http://127.0.0.1:37114/solr/collection1/replication&command=fetchindex} status=0 QTime=133
   [junit4]   2> 2694809 INFO  (qtp339392314-19911) [    x:collection1] o.a.s.c.S.Request [collection1]  webapp=/solr path=/select params={q=name:(empty1+empty2+empty3+empty4)&sort=id+desc&wt=javabin&version=2} hits=4 status=0 QTime=0
   [junit4]   2> 2694812 INFO  (TEST-TestReplicationHandler.testEmptyCommits-seed#[22B4683D20069F6E]) [    ] o.a.s.h.TestReplicationHandler Waited for 0ms and found 4 docs
   [junit4]   2> 2694813 INFO  (qtp250027762-19927) [    x:collection1] o.a.s.c.S.Request [collection1]  webapp=/solr path=/select params={q=name:(empty1+empty2+empty3+empty4)&sort=id+desc&wt=javabin&version=2} hits=4 status=0 QTime=0
   [junit4]   2> 2694813 INFO  (TEST-TestReplicationHandler.testEmptyCommits-seed#[22B4683D20069F6E]) [    ] o.a.s.h.TestReplicationHandler Waited for 0ms and found 4 docs
   [junit4]   2> 2694817 INFO  (qtp339392314-19911) [    x:collection1] o.a.s.c.S.Request [collection1]  webapp=/solr path=/replication params={_trace=getDetails&qt=/replication&wt=javabin&version=2&command=details} status=0 QTime=2
   [junit4]   2> 2694820 INFO  (qtp339392314-19911) [    x:collection1] o.a.s.c.S.Request [collection1]  webapp=/solr path=/replication params={_trace=getDetails&qt=/replication&wt=javabin&version=2&command=details} status=0 QTime=2
   [junit4]   2> 2694821 INFO  (qtp339392314-19912) [    x:collection1] o.a.s.c.S.Request [collection1]  webapp=/solr path=/replication params={slave=false&qt=/replication&wt=javabin&version=2&command=details} status=0 QTime=0
   [junit4]   2> 2694822 INFO  (qtp250027762-19930) [    x:collection1] o.a.s.c.S.Request [collection1]  webapp=/solr path=/replication params={_trace=getDetails&qt=/replication&wt=javabin&version=2&command=details} status=0 QTime=1
   [junit4]   2> 2694822 INFO  (qtp339392314-19911) [    x:collection1] o.a.s.c.S.Request [collection1]  webapp=/solr path=/replication params={_trace=assertVersions&qt=/replication&wt=javabin&version=2&command=indexversion} status=0 QTime=0
   [junit4]   2> 2694822 INFO  (qtp250027762-19927) [    x:collection1] o.a.s.c.S.Request [collection1]  webapp=/solr path=/replication params={_trace=assertVersions&qt=/replication&wt=javabin&version=2&command=indexversion} status=0 QTime=0
   [junit4]   2> 2694823 INFO  (TEST-TestReplicationHandler.testEmptyCommits-seed#[22B4683D20069F6E]) [    ] o.a.s.SolrTestCaseJ4 ###Ending testEmptyCommits
   [junit4]   2> 2694958 INFO  (TEST-TestReplicationHandler.testEmptyCommits-seed#[22B4683D20069F6E]) [    ] o.e.j.s.AbstractConnector Stopped ServerConnector@5e7b20cd{HTTP/1.1,[http/1.1]}{127.0.0.1:0}
   [junit4]   2> 2694959 INFO  (TEST-TestReplicationHandler.testEmptyCommits-seed#[22B4683D20069F6E]) [    ] o.a.s.c.CoreContainer Shutting down CoreContainer instance=773046056
   [junit4]   2> 2694959 INFO  (TEST-TestReplicationHandler.testEmptyCommits-seed#[22B4683D20069F6E]) [    ] o.a.s.m.SolrMetricManager Closing metric reporters for registry=solr.node, tag=null
   [junit4]   2> 2694959 INFO  (TEST-TestReplicationHandler.testEmptyCommits-seed#[22B4683D20069F6E]) [    ] o.a.s.m.r.SolrJmxReporter Closing reporter [org.apache.solr.metrics.reporters.SolrJmxReporter@7b99f1ea: rootName = null, domain = solr.node, service url = null, agent id = null] for registry solr.node / com.codahale.metrics.MetricRegistry@47da168d
   [junit4]   2> 2694964 INFO  (TEST-TestReplicationHandler.testEmptyCommits-seed#[22B4683D20069F6E]) [    ] o.a.s.m.SolrMetricManager Closing metric reporters for registry=solr.jvm, tag=null
   [junit4]   2> 2694964 INFO  (TEST-TestReplicationHandler.testEmptyCommits-seed#[22B4683D20069F6E]) [    ] o.a.s.m.r.SolrJmxReporter Closing reporter [org.apache.solr.metrics.reporters.SolrJmxReporter@991a415: rootName = null, domain = solr.jvm, service url = null, agent id = null] for registry solr.jvm / com.codahale.metrics.MetricRegistry@5e521503
   [junit4]   2> 2694968 INFO  (TEST-TestReplicationHandler.testEmptyCommits-seed#[22B4683D20069F6E]) [    ] o.a.s.m.SolrMetricManager Closing metric reporters for registry=solr.jetty, tag=null
   [junit4]   2> 2694969 INFO  (TEST-TestReplicationHandler.testEmptyCommits-seed#[22B4683D20069F6E]) [    ] o.a.s.m.r.SolrJmxReporter Closing reporter [org.apache.solr.metrics.reporters.SolrJmxReporter@567c068d: rootName = null, domain = solr.jetty, service url = null, agent id = null] for registry solr.jetty / com.codahale.metrics.MetricRegistry@718d3072
   [junit4]   2> 2694999 INFO  (coreCloseExecutor-5313-thread-1) [    x:collection1] o.a.s.c.SolrCore [collection1]  CLOSING SolrCore org.apache.solr.core.SolrCore@59fa811e
   [junit4]   2> 2694999 INFO  (coreCloseExecutor-5313-thread-1) [    x:collection1] o.a.s.m.SolrMetricManager Closing 

[...truncated too long message...]

ne/top-level-ivy-settings.xml

resolve:

ivy-availability-check:
[loadresource] Do not set property disallowed.ivy.jars.list as its length is 0.

-ivy-fail-disallowed-ivy-version:

ivy-fail:

ivy-configure:
[ivy:configure] :: loading settings :: file = /x1/jenkins/jenkins-slave/workspace/Lucene-Solr-NightlyTests-7.x/checkout/lucene/top-level-ivy-settings.xml

resolve:

ivy-availability-check:
[loadresource] Do not set property disallowed.ivy.jars.list as its length is 0.

-ivy-fail-disallowed-ivy-version:

ivy-fail:

ivy-configure:
[ivy:configure] :: loading settings :: file = /x1/jenkins/jenkins-slave/workspace/Lucene-Solr-NightlyTests-7.x/checkout/lucene/top-level-ivy-settings.xml

resolve:

ivy-availability-check:
[loadresource] Do not set property disallowed.ivy.jars.list as its length is 0.

-ivy-fail-disallowed-ivy-version:

ivy-fail:

ivy-configure:
[ivy:configure] :: loading settings :: file = /x1/jenkins/jenkins-slave/workspace/Lucene-Solr-NightlyTests-7.x/checkout/lucene/top-level-ivy-settings.xml

resolve:

jar-checksums:
    [mkdir] Created dir: /x1/jenkins/jenkins-slave/workspace/Lucene-Solr-NightlyTests-7.x/checkout/lucene/null1141842782
     [copy] Copying 39 files to /x1/jenkins/jenkins-slave/workspace/Lucene-Solr-NightlyTests-7.x/checkout/lucene/null1141842782
   [delete] Deleting directory /x1/jenkins/jenkins-slave/workspace/Lucene-Solr-NightlyTests-7.x/checkout/lucene/null1141842782

resolve-example:

ivy-availability-check:
[loadresource] Do not set property disallowed.ivy.jars.list as its length is 0.

-ivy-fail-disallowed-ivy-version:

ivy-fail:

ivy-configure:
[ivy:configure] :: loading settings :: file = /x1/jenkins/jenkins-slave/workspace/Lucene-Solr-NightlyTests-7.x/checkout/lucene/top-level-ivy-settings.xml

resolve:

resolve-server:

ivy-availability-check:
[loadresource] Do not set property disallowed.ivy.jars.list as its length is 0.

-ivy-fail-disallowed-ivy-version:

ivy-fail:

ivy-fail:

ivy-configure:
[ivy:configure] :: loading settings :: file = /x1/jenkins/jenkins-slave/workspace/Lucene-Solr-NightlyTests-7.x/checkout/lucene/top-level-ivy-settings.xml

resolve:

resolve:

ivy-availability-check:
[loadresource] Do not set property disallowed.ivy.jars.list as its length is 0.

-ivy-fail-disallowed-ivy-version:

ivy-fail:

ivy-fail:

ivy-configure:
[ivy:configure] :: loading settings :: file = /x1/jenkins/jenkins-slave/workspace/Lucene-Solr-NightlyTests-7.x/checkout/lucene/top-level-ivy-settings.xml

resolve:

ivy-availability-check:
[loadresource] Do not set property disallowed.ivy.jars.list as its length is 0.

-ivy-fail-disallowed-ivy-version:

ivy-fail:

ivy-fail:

ivy-configure:
[ivy:configure] :: loading settings :: file = /x1/jenkins/jenkins-slave/workspace/Lucene-Solr-NightlyTests-7.x/checkout/lucene/top-level-ivy-settings.xml

resolve:

ivy-availability-check:
[loadresource] Do not set property disallowed.ivy.jars.list as its length is 0.

-ivy-fail-disallowed-ivy-version:

ivy-fail:

ivy-configure:
[ivy:configure] :: loading settings :: file = /x1/jenkins/jenkins-slave/workspace/Lucene-Solr-NightlyTests-7.x/checkout/lucene/top-level-ivy-settings.xml

resolve:

ivy-availability-check:
[loadresource] Do not set property disallowed.ivy.jars.list as its length is 0.

-ivy-fail-disallowed-ivy-version:

ivy-fail:

ivy-fail:

ivy-configure:
[ivy:configure] :: loading settings :: file = /x1/jenkins/jenkins-slave/workspace/Lucene-Solr-NightlyTests-7.x/checkout/lucene/top-level-ivy-settings.xml

resolve:

ivy-availability-check:
[loadresource] Do not set property disallowed.ivy.jars.list as its length is 0.

-ivy-fail-disallowed-ivy-version:

ivy-fail:

ivy-configure:
[ivy:configure] :: loading settings :: file = /x1/jenkins/jenkins-slave/workspace/Lucene-Solr-NightlyTests-7.x/checkout/lucene/top-level-ivy-settings.xml

resolve:

ivy-availability-check:
[loadresource] Do not set property disallowed.ivy.jars.list as its length is 0.

-ivy-fail-disallowed-ivy-version:

ivy-fail:

ivy-fail:

ivy-configure:
[ivy:configure] :: loading settings :: file = /x1/jenkins/jenkins-slave/workspace/Lucene-Solr-NightlyTests-7.x/checkout/lucene/top-level-ivy-settings.xml

resolve:

ivy-availability-check:
[loadresource] Do not set property disallowed.ivy.jars.list as its length is 0.

-ivy-fail-disallowed-ivy-version:

ivy-fail:

ivy-fail:

ivy-configure:
[ivy:configure] :: loading settings :: file = /x1/jenkins/jenkins-slave/workspace/Lucene-Solr-NightlyTests-7.x/checkout/lucene/top-level-ivy-settings.xml

resolve:

ivy-availability-check:
[loadresource] Do not set property disallowed.ivy.jars.list as its length is 0.

-ivy-fail-disallowed-ivy-version:

ivy-fail:

ivy-fail:

ivy-configure:
[ivy:configure] :: loading settings :: file = /x1/jenkins/jenkins-slave/workspace/Lucene-Solr-NightlyTests-7.x/checkout/lucene/top-level-ivy-settings.xml

resolve:

ivy-availability-check:
[loadresource] Do not set property disallowed.ivy.jars.list as its length is 0.

-ivy-fail-disallowed-ivy-version:

ivy-fail:

ivy-fail:

ivy-configure:
[ivy:configure] :: loading settings :: file = /x1/jenkins/jenkins-slave/workspace/Lucene-Solr-NightlyTests-7.x/checkout/lucene/top-level-ivy-settings.xml

resolve:

ivy-availability-check:
[loadresource] Do not set property disallowed.ivy.jars.list as its length is 0.

-ivy-fail-disallowed-ivy-version:

ivy-fail:

ivy-fail:

ivy-configure:
[ivy:configure] :: loading settings :: file = /x1/jenkins/jenkins-slave/workspace/Lucene-Solr-NightlyTests-7.x/checkout/lucene/top-level-ivy-settings.xml

resolve:

ivy-availability-check:
[loadresource] Do not set property disallowed.ivy.jars.list as its length is 0.

-ivy-fail-disallowed-ivy-version:

ivy-fail:

ivy-fail:

ivy-configure:
[ivy:configure] :: loading settings :: file = /x1/jenkins/jenkins-slave/workspace/Lucene-Solr-NightlyTests-7.x/checkout/lucene/top-level-ivy-settings.xml

resolve:

ivy-availability-check:
[loadresource] Do not set property disallowed.ivy.jars.list as its length is 0.

-ivy-fail-disallowed-ivy-version:

ivy-fail:

ivy-fail:

ivy-configure:
[ivy:configure] :: loading settings :: file = /x1/jenkins/jenkins-slave/workspace/Lucene-Solr-NightlyTests-7.x/checkout/lucene/top-level-ivy-settings.xml

resolve:

ivy-availability-check:
[loadresource] Do not set property disallowed.ivy.jars.list as its length is 0.

-ivy-fail-disallowed-ivy-version:

ivy-fail:

ivy-fail:

ivy-configure:
[ivy:configure] :: loading settings :: file = /x1/jenkins/jenkins-slave/workspace/Lucene-Solr-NightlyTests-7.x/checkout/lucene/top-level-ivy-settings.xml

resolve:

ivy-availability-check:
[loadresource] Do not set property disallowed.ivy.jars.list as its length is 0.

-ivy-fail-disallowed-ivy-version:

ivy-fail:

ivy-fail:

ivy-configure:
[ivy:configure] :: loading settings :: file = /x1/jenkins/jenkins-slave/workspace/Lucene-Solr-NightlyTests-7.x/checkout/lucene/top-level-ivy-settings.xml

resolve:

ivy-availability-check:
[loadresource] Do not set property disallowed.ivy.jars.list as its length is 0.

-ivy-fail-disallowed-ivy-version:

ivy-fail:

ivy-fail:

ivy-configure:
[ivy:configure] :: loading settings :: file = /x1/jenkins/jenkins-slave/workspace/Lucene-Solr-NightlyTests-7.x/checkout/lucene/top-level-ivy-settings.xml

resolve:

ivy-availability-check:
[loadresource] Do not set property disallowed.ivy.jars.list as its length is 0.

-ivy-fail-disallowed-ivy-version:

ivy-fail:

ivy-fail:

ivy-configure:
[ivy:configure] :: loading settings :: file = /x1/jenkins/jenkins-slave/workspace/Lucene-Solr-NightlyTests-7.x/checkout/lucene/top-level-ivy-settings.xml

resolve:

jar-checksums:
    [mkdir] Created dir: /x1/jenkins/jenkins-slave/workspace/Lucene-Solr-NightlyTests-7.x/checkout/solr/null108267829
     [copy] Copying 246 files to /x1/jenkins/jenkins-slave/workspace/Lucene-Solr-NightlyTests-7.x/checkout/solr/null108267829
   [delete] Deleting directory /x1/jenkins/jenkins-slave/workspace/Lucene-Solr-NightlyTests-7.x/checkout/solr/null108267829

check-working-copy:
[ivy:cachepath] :: resolving dependencies :: org.eclipse.jgit#org.eclipse.jgit-caller;working
[ivy:cachepath] 	confs: [default]
[ivy:cachepath] 	found org.eclipse.jgit#org.eclipse.jgit;4.6.0.201612231935-r in public
[ivy:cachepath] 	found com.jcraft#jsch;0.1.53 in public
[ivy:cachepath] 	found com.googlecode.javaewah#JavaEWAH;1.1.6 in public
[ivy:cachepath] 	found org.apache.httpcomponents#httpclient;4.3.6 in public
[ivy:cachepath] 	found org.apache.httpcomponents#httpcore;4.3.3 in public
[ivy:cachepath] 	found commons-logging#commons-logging;1.1.3 in public
[ivy:cachepath] 	found commons-codec#commons-codec;1.6 in public
[ivy:cachepath] 	found org.slf4j#slf4j-api;1.7.2 in public
[ivy:cachepath] :: resolution report :: resolve 81ms :: artifacts dl 22ms
	---------------------------------------------------------------------
	|                  |            modules            ||   artifacts   |
	|       conf       | number| search|dwnlded|evicted|| number|dwnlded|
	---------------------------------------------------------------------
	|      default     |   8   |   0   |   0   |   0   ||   8   |   0   |
	---------------------------------------------------------------------
[wc-checker] Initializing working copy...
[wc-checker] SLF4J: Failed to load class "org.slf4j.impl.StaticLoggerBinder".
[wc-checker] SLF4J: Defaulting to no-operation (NOP) logger implementation
[wc-checker] SLF4J: See http://www.slf4j.org/codes.html#StaticLoggerBinder for further details.
[wc-checker] Checking working copy status...

-jenkins-base:

BUILD SUCCESSFUL
Total time: 401 minutes 52 seconds
Archiving artifacts
WARN: No artifacts found that match the file pattern "**/*.events,heapdumps/**,**/hs_err_pid*". Configuration error?
WARN: java.lang.InterruptedException: no matches found within 10000
Recording test results
Build step 'Publish JUnit test result report' changed build result to UNSTABLE
Email was triggered for: Unstable (Test Failures)
Sending email for trigger: Unstable (Test Failures)

Mime
View raw message