lucene-dev mailing list archives

Site index · List index
Message view « Date » · « Thread »
Top « Date » · « Thread »
From Policeman Jenkins Server <jenk...@thetaphi.de>
Subject [JENKINS-EA] Lucene-Solr-master-Linux (64bit/jdk-11-ea+21) - Build # 22441 - Unstable!
Date Thu, 12 Jul 2018 14:16:39 GMT
Build: https://jenkins.thetaphi.de/job/Lucene-Solr-master-Linux/22441/
Java: 64bit/jdk-11-ea+21 -XX:+UseCompressedOops -XX:+UseParallelGC

191 tests failed.
FAILED:  junit.framework.TestSuite.org.apache.solr.cloud.TestCloudRecovery

Error Message:
Could not find collection:collection1

Stack Trace:
java.lang.AssertionError: Could not find collection:collection1
	at __randomizedtesting.SeedInfo.seed([733256A0DDCE845B]:0)
	at org.junit.Assert.fail(Assert.java:93)
	at org.junit.Assert.assertTrue(Assert.java:43)
	at org.junit.Assert.assertNotNull(Assert.java:526)
	at org.apache.solr.cloud.AbstractDistribZkTestBase.waitForRecoveriesToFinish(AbstractDistribZkTestBase.java:155)
	at org.apache.solr.cloud.TestCloudRecovery.setupCluster(TestCloudRecovery.java:70)
	at java.base/jdk.internal.reflect.NativeMethodAccessorImpl.invoke0(Native Method)
	at java.base/jdk.internal.reflect.NativeMethodAccessorImpl.invoke(NativeMethodAccessorImpl.java:62)
	at java.base/jdk.internal.reflect.DelegatingMethodAccessorImpl.invoke(DelegatingMethodAccessorImpl.java:43)
	at java.base/java.lang.reflect.Method.invoke(Method.java:566)
	at com.carrotsearch.randomizedtesting.RandomizedRunner.invoke(RandomizedRunner.java:1737)
	at com.carrotsearch.randomizedtesting.RandomizedRunner$6.evaluate(RandomizedRunner.java:874)
	at com.carrotsearch.randomizedtesting.RandomizedRunner$7.evaluate(RandomizedRunner.java:890)
	at com.carrotsearch.randomizedtesting.rules.StatementAdapter.evaluate(StatementAdapter.java:36)
	at com.carrotsearch.randomizedtesting.rules.SystemPropertiesRestoreRule$1.evaluate(SystemPropertiesRestoreRule.java:57)
	at org.apache.lucene.util.AbstractBeforeAfterRule$1.evaluate(AbstractBeforeAfterRule.java:45)
	at com.carrotsearch.randomizedtesting.rules.StatementAdapter.evaluate(StatementAdapter.java:36)
	at org.apache.lucene.util.TestRuleStoreClassName$1.evaluate(TestRuleStoreClassName.java:41)
	at com.carrotsearch.randomizedtesting.rules.NoShadowingOrOverridesOnMethodsRule$1.evaluate(NoShadowingOrOverridesOnMethodsRule.java:40)
	at com.carrotsearch.randomizedtesting.rules.NoShadowingOrOverridesOnMethodsRule$1.evaluate(NoShadowingOrOverridesOnMethodsRule.java:40)
	at com.carrotsearch.randomizedtesting.rules.StatementAdapter.evaluate(StatementAdapter.java:36)
	at com.carrotsearch.randomizedtesting.rules.StatementAdapter.evaluate(StatementAdapter.java:36)
	at org.apache.lucene.util.TestRuleAssertionsRequired$1.evaluate(TestRuleAssertionsRequired.java:53)
	at org.apache.lucene.util.TestRuleMarkFailure$1.evaluate(TestRuleMarkFailure.java:47)
	at org.apache.lucene.util.TestRuleIgnoreAfterMaxFailures$1.evaluate(TestRuleIgnoreAfterMaxFailures.java:64)
	at org.apache.lucene.util.TestRuleIgnoreTestSuites$1.evaluate(TestRuleIgnoreTestSuites.java:54)
	at com.carrotsearch.randomizedtesting.rules.StatementAdapter.evaluate(StatementAdapter.java:36)
	at com.carrotsearch.randomizedtesting.ThreadLeakControl$StatementRunner.run(ThreadLeakControl.java:368)
	at java.base/java.lang.Thread.run(Thread.java:834)


FAILED:  junit.framework.TestSuite.org.apache.solr.cloud.TestCloudRecovery

Error Message:
Could not find collection:collection1

Stack Trace:
java.lang.AssertionError: Could not find collection:collection1
	at __randomizedtesting.SeedInfo.seed([733256A0DDCE845B]:0)
	at org.junit.Assert.fail(Assert.java:93)
	at org.junit.Assert.assertTrue(Assert.java:43)
	at org.junit.Assert.assertNotNull(Assert.java:526)
	at org.apache.solr.cloud.AbstractDistribZkTestBase.waitForRecoveriesToFinish(AbstractDistribZkTestBase.java:155)
	at org.apache.solr.cloud.TestCloudRecovery.setupCluster(TestCloudRecovery.java:70)
	at java.base/jdk.internal.reflect.NativeMethodAccessorImpl.invoke0(Native Method)
	at java.base/jdk.internal.reflect.NativeMethodAccessorImpl.invoke(NativeMethodAccessorImpl.java:62)
	at java.base/jdk.internal.reflect.DelegatingMethodAccessorImpl.invoke(DelegatingMethodAccessorImpl.java:43)
	at java.base/java.lang.reflect.Method.invoke(Method.java:566)
	at com.carrotsearch.randomizedtesting.RandomizedRunner.invoke(RandomizedRunner.java:1737)
	at com.carrotsearch.randomizedtesting.RandomizedRunner$6.evaluate(RandomizedRunner.java:874)
	at com.carrotsearch.randomizedtesting.RandomizedRunner$7.evaluate(RandomizedRunner.java:890)
	at com.carrotsearch.randomizedtesting.rules.StatementAdapter.evaluate(StatementAdapter.java:36)
	at com.carrotsearch.randomizedtesting.rules.SystemPropertiesRestoreRule$1.evaluate(SystemPropertiesRestoreRule.java:57)
	at org.apache.lucene.util.AbstractBeforeAfterRule$1.evaluate(AbstractBeforeAfterRule.java:45)
	at com.carrotsearch.randomizedtesting.rules.StatementAdapter.evaluate(StatementAdapter.java:36)
	at org.apache.lucene.util.TestRuleStoreClassName$1.evaluate(TestRuleStoreClassName.java:41)
	at com.carrotsearch.randomizedtesting.rules.NoShadowingOrOverridesOnMethodsRule$1.evaluate(NoShadowingOrOverridesOnMethodsRule.java:40)
	at com.carrotsearch.randomizedtesting.rules.NoShadowingOrOverridesOnMethodsRule$1.evaluate(NoShadowingOrOverridesOnMethodsRule.java:40)
	at com.carrotsearch.randomizedtesting.rules.StatementAdapter.evaluate(StatementAdapter.java:36)
	at com.carrotsearch.randomizedtesting.rules.StatementAdapter.evaluate(StatementAdapter.java:36)
	at org.apache.lucene.util.TestRuleAssertionsRequired$1.evaluate(TestRuleAssertionsRequired.java:53)
	at org.apache.lucene.util.TestRuleMarkFailure$1.evaluate(TestRuleMarkFailure.java:47)
	at org.apache.lucene.util.TestRuleIgnoreAfterMaxFailures$1.evaluate(TestRuleIgnoreAfterMaxFailures.java:64)
	at org.apache.lucene.util.TestRuleIgnoreTestSuites$1.evaluate(TestRuleIgnoreTestSuites.java:54)
	at com.carrotsearch.randomizedtesting.rules.StatementAdapter.evaluate(StatementAdapter.java:36)
	at com.carrotsearch.randomizedtesting.ThreadLeakControl$StatementRunner.run(ThreadLeakControl.java:368)
	at java.base/java.lang.Thread.run(Thread.java:834)


FAILED:  junit.framework.TestSuite.org.apache.solr.cloud.TestCloudRecovery

Error Message:
Could not find collection:collection1

Stack Trace:
java.lang.AssertionError: Could not find collection:collection1
	at __randomizedtesting.SeedInfo.seed([733256A0DDCE845B]:0)
	at org.junit.Assert.fail(Assert.java:93)
	at org.junit.Assert.assertTrue(Assert.java:43)
	at org.junit.Assert.assertNotNull(Assert.java:526)
	at org.apache.solr.cloud.AbstractDistribZkTestBase.waitForRecoveriesToFinish(AbstractDistribZkTestBase.java:155)
	at org.apache.solr.cloud.TestCloudRecovery.setupCluster(TestCloudRecovery.java:70)
	at java.base/jdk.internal.reflect.NativeMethodAccessorImpl.invoke0(Native Method)
	at java.base/jdk.internal.reflect.NativeMethodAccessorImpl.invoke(NativeMethodAccessorImpl.java:62)
	at java.base/jdk.internal.reflect.DelegatingMethodAccessorImpl.invoke(DelegatingMethodAccessorImpl.java:43)
	at java.base/java.lang.reflect.Method.invoke(Method.java:566)
	at com.carrotsearch.randomizedtesting.RandomizedRunner.invoke(RandomizedRunner.java:1737)
	at com.carrotsearch.randomizedtesting.RandomizedRunner$6.evaluate(RandomizedRunner.java:874)
	at com.carrotsearch.randomizedtesting.RandomizedRunner$7.evaluate(RandomizedRunner.java:890)
	at com.carrotsearch.randomizedtesting.rules.StatementAdapter.evaluate(StatementAdapter.java:36)
	at com.carrotsearch.randomizedtesting.rules.SystemPropertiesRestoreRule$1.evaluate(SystemPropertiesRestoreRule.java:57)
	at org.apache.lucene.util.AbstractBeforeAfterRule$1.evaluate(AbstractBeforeAfterRule.java:45)
	at com.carrotsearch.randomizedtesting.rules.StatementAdapter.evaluate(StatementAdapter.java:36)
	at org.apache.lucene.util.TestRuleStoreClassName$1.evaluate(TestRuleStoreClassName.java:41)
	at com.carrotsearch.randomizedtesting.rules.NoShadowingOrOverridesOnMethodsRule$1.evaluate(NoShadowingOrOverridesOnMethodsRule.java:40)
	at com.carrotsearch.randomizedtesting.rules.NoShadowingOrOverridesOnMethodsRule$1.evaluate(NoShadowingOrOverridesOnMethodsRule.java:40)
	at com.carrotsearch.randomizedtesting.rules.StatementAdapter.evaluate(StatementAdapter.java:36)
	at com.carrotsearch.randomizedtesting.rules.StatementAdapter.evaluate(StatementAdapter.java:36)
	at org.apache.lucene.util.TestRuleAssertionsRequired$1.evaluate(TestRuleAssertionsRequired.java:53)
	at org.apache.lucene.util.TestRuleMarkFailure$1.evaluate(TestRuleMarkFailure.java:47)
	at org.apache.lucene.util.TestRuleIgnoreAfterMaxFailures$1.evaluate(TestRuleIgnoreAfterMaxFailures.java:64)
	at org.apache.lucene.util.TestRuleIgnoreTestSuites$1.evaluate(TestRuleIgnoreTestSuites.java:54)
	at com.carrotsearch.randomizedtesting.rules.StatementAdapter.evaluate(StatementAdapter.java:36)
	at com.carrotsearch.randomizedtesting.ThreadLeakControl$StatementRunner.run(ThreadLeakControl.java:368)
	at java.base/java.lang.Thread.run(Thread.java:834)


FAILED:  junit.framework.TestSuite.org.apache.solr.cloud.TestConfigSetsAPI

Error Message:
1 thread leaked from SUITE scope at org.apache.solr.cloud.TestConfigSetsAPI:     1) Thread[id=2235, name=Connection evictor, state=TIMED_WAITING, group=TGRP-TestConfigSetsAPI]         at java.base@11-ea/java.lang.Thread.sleep(Native Method)         at app//org.apache.http.impl.client.IdleConnectionEvictor$1.run(IdleConnectionEvictor.java:66)         at java.base@11-ea/java.lang.Thread.run(Thread.java:834)

Stack Trace:
com.carrotsearch.randomizedtesting.ThreadLeakError: 1 thread leaked from SUITE scope at org.apache.solr.cloud.TestConfigSetsAPI: 
   1) Thread[id=2235, name=Connection evictor, state=TIMED_WAITING, group=TGRP-TestConfigSetsAPI]
        at java.base@11-ea/java.lang.Thread.sleep(Native Method)
        at app//org.apache.http.impl.client.IdleConnectionEvictor$1.run(IdleConnectionEvictor.java:66)
        at java.base@11-ea/java.lang.Thread.run(Thread.java:834)
	at __randomizedtesting.SeedInfo.seed([733256A0DDCE845B]:0)


FAILED:  junit.framework.TestSuite.org.apache.solr.cloud.TestConfigSetsAPI

Error Message:
1 thread leaked from SUITE scope at org.apache.solr.cloud.TestConfigSetsAPI:     1) Thread[id=3615, name=Connection evictor, state=TIMED_WAITING, group=TGRP-TestConfigSetsAPI]         at java.base@11-ea/java.lang.Thread.sleep(Native Method)         at app//org.apache.http.impl.client.IdleConnectionEvictor$1.run(IdleConnectionEvictor.java:66)         at java.base@11-ea/java.lang.Thread.run(Thread.java:834)

Stack Trace:
com.carrotsearch.randomizedtesting.ThreadLeakError: 1 thread leaked from SUITE scope at org.apache.solr.cloud.TestConfigSetsAPI: 
   1) Thread[id=3615, name=Connection evictor, state=TIMED_WAITING, group=TGRP-TestConfigSetsAPI]
        at java.base@11-ea/java.lang.Thread.sleep(Native Method)
        at app//org.apache.http.impl.client.IdleConnectionEvictor$1.run(IdleConnectionEvictor.java:66)
        at java.base@11-ea/java.lang.Thread.run(Thread.java:834)
	at __randomizedtesting.SeedInfo.seed([733256A0DDCE845B]:0)


FAILED:  junit.framework.TestSuite.org.apache.solr.cloud.TestConfigSetsAPI

Error Message:
1 thread leaked from SUITE scope at org.apache.solr.cloud.TestConfigSetsAPI:     1) Thread[id=5940, name=Connection evictor, state=TIMED_WAITING, group=TGRP-TestConfigSetsAPI]         at java.base@11-ea/java.lang.Thread.sleep(Native Method)         at app//org.apache.http.impl.client.IdleConnectionEvictor$1.run(IdleConnectionEvictor.java:66)         at java.base@11-ea/java.lang.Thread.run(Thread.java:834)

Stack Trace:
com.carrotsearch.randomizedtesting.ThreadLeakError: 1 thread leaked from SUITE scope at org.apache.solr.cloud.TestConfigSetsAPI: 
   1) Thread[id=5940, name=Connection evictor, state=TIMED_WAITING, group=TGRP-TestConfigSetsAPI]
        at java.base@11-ea/java.lang.Thread.sleep(Native Method)
        at app//org.apache.http.impl.client.IdleConnectionEvictor$1.run(IdleConnectionEvictor.java:66)
        at java.base@11-ea/java.lang.Thread.run(Thread.java:834)
	at __randomizedtesting.SeedInfo.seed([733256A0DDCE845B]:0)


FAILED:  junit.framework.TestSuite.org.apache.solr.cloud.TestConfigSetsAPI

Error Message:
1 thread leaked from SUITE scope at org.apache.solr.cloud.TestConfigSetsAPI:     1) Thread[id=7558, name=Connection evictor, state=TIMED_WAITING, group=TGRP-TestConfigSetsAPI]         at java.base@11-ea/java.lang.Thread.sleep(Native Method)         at app//org.apache.http.impl.client.IdleConnectionEvictor$1.run(IdleConnectionEvictor.java:66)         at java.base@11-ea/java.lang.Thread.run(Thread.java:834)

Stack Trace:
com.carrotsearch.randomizedtesting.ThreadLeakError: 1 thread leaked from SUITE scope at org.apache.solr.cloud.TestConfigSetsAPI: 
   1) Thread[id=7558, name=Connection evictor, state=TIMED_WAITING, group=TGRP-TestConfigSetsAPI]
        at java.base@11-ea/java.lang.Thread.sleep(Native Method)
        at app//org.apache.http.impl.client.IdleConnectionEvictor$1.run(IdleConnectionEvictor.java:66)
        at java.base@11-ea/java.lang.Thread.run(Thread.java:834)
	at __randomizedtesting.SeedInfo.seed([733256A0DDCE845B]:0)


FAILED:  junit.framework.TestSuite.org.apache.solr.cloud.TestConfigSetsAPI

Error Message:
1 thread leaked from SUITE scope at org.apache.solr.cloud.TestConfigSetsAPI:     1) Thread[id=2310, name=Connection evictor, state=TIMED_WAITING, group=TGRP-TestConfigSetsAPI]         at java.base@11-ea/java.lang.Thread.sleep(Native Method)         at app//org.apache.http.impl.client.IdleConnectionEvictor$1.run(IdleConnectionEvictor.java:66)         at java.base@11-ea/java.lang.Thread.run(Thread.java:834)

Stack Trace:
com.carrotsearch.randomizedtesting.ThreadLeakError: 1 thread leaked from SUITE scope at org.apache.solr.cloud.TestConfigSetsAPI: 
   1) Thread[id=2310, name=Connection evictor, state=TIMED_WAITING, group=TGRP-TestConfigSetsAPI]
        at java.base@11-ea/java.lang.Thread.sleep(Native Method)
        at app//org.apache.http.impl.client.IdleConnectionEvictor$1.run(IdleConnectionEvictor.java:66)
        at java.base@11-ea/java.lang.Thread.run(Thread.java:834)
	at __randomizedtesting.SeedInfo.seed([733256A0DDCE845B]:0)


FAILED:  junit.framework.TestSuite.org.apache.solr.cloud.TestConfigSetsAPI

Error Message:
1 thread leaked from SUITE scope at org.apache.solr.cloud.TestConfigSetsAPI:     1) Thread[id=6906, name=Connection evictor, state=TIMED_WAITING, group=TGRP-TestConfigSetsAPI]         at java.base@11-ea/java.lang.Thread.sleep(Native Method)         at app//org.apache.http.impl.client.IdleConnectionEvictor$1.run(IdleConnectionEvictor.java:66)         at java.base@11-ea/java.lang.Thread.run(Thread.java:834)

Stack Trace:
com.carrotsearch.randomizedtesting.ThreadLeakError: 1 thread leaked from SUITE scope at org.apache.solr.cloud.TestConfigSetsAPI: 
   1) Thread[id=6906, name=Connection evictor, state=TIMED_WAITING, group=TGRP-TestConfigSetsAPI]
        at java.base@11-ea/java.lang.Thread.sleep(Native Method)
        at app//org.apache.http.impl.client.IdleConnectionEvictor$1.run(IdleConnectionEvictor.java:66)
        at java.base@11-ea/java.lang.Thread.run(Thread.java:834)
	at __randomizedtesting.SeedInfo.seed([733256A0DDCE845B]:0)


FAILED:  junit.framework.TestSuite.org.apache.solr.handler.admin.AutoscalingHistoryHandlerTest

Error Message:
Could not find collection : AutoscalingHistoryHandlerTest_collection

Stack Trace:
org.apache.solr.common.SolrException: Could not find collection : AutoscalingHistoryHandlerTest_collection
	at __randomizedtesting.SeedInfo.seed([733256A0DDCE845B]:0)
	at org.apache.solr.common.cloud.ClusterState.getCollection(ClusterState.java:118)
	at org.apache.solr.cloud.SolrCloudTestCase.getCollectionState(SolrCloudTestCase.java:256)
	at org.apache.solr.handler.admin.AutoscalingHistoryHandlerTest.waitForRecovery(AutoscalingHistoryHandlerTest.java:403)
	at org.apache.solr.handler.admin.AutoscalingHistoryHandlerTest.setupCluster(AutoscalingHistoryHandlerTest.java:97)
	at java.base/jdk.internal.reflect.NativeMethodAccessorImpl.invoke0(Native Method)
	at java.base/jdk.internal.reflect.NativeMethodAccessorImpl.invoke(NativeMethodAccessorImpl.java:62)
	at java.base/jdk.internal.reflect.DelegatingMethodAccessorImpl.invoke(DelegatingMethodAccessorImpl.java:43)
	at java.base/java.lang.reflect.Method.invoke(Method.java:566)
	at com.carrotsearch.randomizedtesting.RandomizedRunner.invoke(RandomizedRunner.java:1737)
	at com.carrotsearch.randomizedtesting.RandomizedRunner$6.evaluate(RandomizedRunner.java:874)
	at com.carrotsearch.randomizedtesting.RandomizedRunner$7.evaluate(RandomizedRunner.java:890)
	at com.carrotsearch.randomizedtesting.rules.StatementAdapter.evaluate(StatementAdapter.java:36)
	at com.carrotsearch.randomizedtesting.rules.SystemPropertiesRestoreRule$1.evaluate(SystemPropertiesRestoreRule.java:57)
	at org.apache.lucene.util.AbstractBeforeAfterRule$1.evaluate(AbstractBeforeAfterRule.java:45)
	at com.carrotsearch.randomizedtesting.rules.StatementAdapter.evaluate(StatementAdapter.java:36)
	at org.apache.lucene.util.TestRuleStoreClassName$1.evaluate(TestRuleStoreClassName.java:41)
	at com.carrotsearch.randomizedtesting.rules.NoShadowingOrOverridesOnMethodsRule$1.evaluate(NoShadowingOrOverridesOnMethodsRule.java:40)
	at com.carrotsearch.randomizedtesting.rules.NoShadowingOrOverridesOnMethodsRule$1.evaluate(NoShadowingOrOverridesOnMethodsRule.java:40)
	at com.carrotsearch.randomizedtesting.rules.StatementAdapter.evaluate(StatementAdapter.java:36)
	at com.carrotsearch.randomizedtesting.rules.StatementAdapter.evaluate(StatementAdapter.java:36)
	at org.apache.lucene.util.TestRuleAssertionsRequired$1.evaluate(TestRuleAssertionsRequired.java:53)
	at org.apache.lucene.util.TestRuleMarkFailure$1.evaluate(TestRuleMarkFailure.java:47)
	at org.apache.lucene.util.TestRuleIgnoreAfterMaxFailures$1.evaluate(TestRuleIgnoreAfterMaxFailures.java:64)
	at org.apache.lucene.util.TestRuleIgnoreTestSuites$1.evaluate(TestRuleIgnoreTestSuites.java:54)
	at com.carrotsearch.randomizedtesting.rules.StatementAdapter.evaluate(StatementAdapter.java:36)
	at com.carrotsearch.randomizedtesting.ThreadLeakControl$StatementRunner.run(ThreadLeakControl.java:368)
	at java.base/java.lang.Thread.run(Thread.java:834)


FAILED:  junit.framework.TestSuite.org.apache.solr.handler.admin.AutoscalingHistoryHandlerTest

Error Message:
Could not find collection : AutoscalingHistoryHandlerTest_collection

Stack Trace:
org.apache.solr.common.SolrException: Could not find collection : AutoscalingHistoryHandlerTest_collection
	at __randomizedtesting.SeedInfo.seed([733256A0DDCE845B]:0)
	at org.apache.solr.common.cloud.ClusterState.getCollection(ClusterState.java:118)
	at org.apache.solr.cloud.SolrCloudTestCase.getCollectionState(SolrCloudTestCase.java:256)
	at org.apache.solr.handler.admin.AutoscalingHistoryHandlerTest.waitForRecovery(AutoscalingHistoryHandlerTest.java:403)
	at org.apache.solr.handler.admin.AutoscalingHistoryHandlerTest.setupCluster(AutoscalingHistoryHandlerTest.java:97)
	at java.base/jdk.internal.reflect.NativeMethodAccessorImpl.invoke0(Native Method)
	at java.base/jdk.internal.reflect.NativeMethodAccessorImpl.invoke(NativeMethodAccessorImpl.java:62)
	at java.base/jdk.internal.reflect.DelegatingMethodAccessorImpl.invoke(DelegatingMethodAccessorImpl.java:43)
	at java.base/java.lang.reflect.Method.invoke(Method.java:566)
	at com.carrotsearch.randomizedtesting.RandomizedRunner.invoke(RandomizedRunner.java:1737)
	at com.carrotsearch.randomizedtesting.RandomizedRunner$6.evaluate(RandomizedRunner.java:874)
	at com.carrotsearch.randomizedtesting.RandomizedRunner$7.evaluate(RandomizedRunner.java:890)
	at com.carrotsearch.randomizedtesting.rules.StatementAdapter.evaluate(StatementAdapter.java:36)
	at com.carrotsearch.randomizedtesting.rules.SystemPropertiesRestoreRule$1.evaluate(SystemPropertiesRestoreRule.java:57)
	at org.apache.lucene.util.AbstractBeforeAfterRule$1.evaluate(AbstractBeforeAfterRule.java:45)
	at com.carrotsearch.randomizedtesting.rules.StatementAdapter.evaluate(StatementAdapter.java:36)
	at org.apache.lucene.util.TestRuleStoreClassName$1.evaluate(TestRuleStoreClassName.java:41)
	at com.carrotsearch.randomizedtesting.rules.NoShadowingOrOverridesOnMethodsRule$1.evaluate(NoShadowingOrOverridesOnMethodsRule.java:40)
	at com.carrotsearch.randomizedtesting.rules.NoShadowingOrOverridesOnMethodsRule$1.evaluate(NoShadowingOrOverridesOnMethodsRule.java:40)
	at com.carrotsearch.randomizedtesting.rules.StatementAdapter.evaluate(StatementAdapter.java:36)
	at com.carrotsearch.randomizedtesting.rules.StatementAdapter.evaluate(StatementAdapter.java:36)
	at org.apache.lucene.util.TestRuleAssertionsRequired$1.evaluate(TestRuleAssertionsRequired.java:53)
	at org.apache.lucene.util.TestRuleMarkFailure$1.evaluate(TestRuleMarkFailure.java:47)
	at org.apache.lucene.util.TestRuleIgnoreAfterMaxFailures$1.evaluate(TestRuleIgnoreAfterMaxFailures.java:64)
	at org.apache.lucene.util.TestRuleIgnoreTestSuites$1.evaluate(TestRuleIgnoreTestSuites.java:54)
	at com.carrotsearch.randomizedtesting.rules.StatementAdapter.evaluate(StatementAdapter.java:36)
	at com.carrotsearch.randomizedtesting.ThreadLeakControl$StatementRunner.run(ThreadLeakControl.java:368)
	at java.base/java.lang.Thread.run(Thread.java:834)


FAILED:  junit.framework.TestSuite.org.apache.solr.handler.admin.AutoscalingHistoryHandlerTest

Error Message:
Could not find collection : AutoscalingHistoryHandlerTest_collection

Stack Trace:
org.apache.solr.common.SolrException: Could not find collection : AutoscalingHistoryHandlerTest_collection
	at __randomizedtesting.SeedInfo.seed([733256A0DDCE845B]:0)
	at org.apache.solr.common.cloud.ClusterState.getCollection(ClusterState.java:118)
	at org.apache.solr.cloud.SolrCloudTestCase.getCollectionState(SolrCloudTestCase.java:256)
	at org.apache.solr.handler.admin.AutoscalingHistoryHandlerTest.waitForRecovery(AutoscalingHistoryHandlerTest.java:403)
	at org.apache.solr.handler.admin.AutoscalingHistoryHandlerTest.setupCluster(AutoscalingHistoryHandlerTest.java:97)
	at java.base/jdk.internal.reflect.NativeMethodAccessorImpl.invoke0(Native Method)
	at java.base/jdk.internal.reflect.NativeMethodAccessorImpl.invoke(NativeMethodAccessorImpl.java:62)
	at java.base/jdk.internal.reflect.DelegatingMethodAccessorImpl.invoke(DelegatingMethodAccessorImpl.java:43)
	at java.base/java.lang.reflect.Method.invoke(Method.java:566)
	at com.carrotsearch.randomizedtesting.RandomizedRunner.invoke(RandomizedRunner.java:1737)
	at com.carrotsearch.randomizedtesting.RandomizedRunner$6.evaluate(RandomizedRunner.java:874)
	at com.carrotsearch.randomizedtesting.RandomizedRunner$7.evaluate(RandomizedRunner.java:890)
	at com.carrotsearch.randomizedtesting.rules.StatementAdapter.evaluate(StatementAdapter.java:36)
	at com.carrotsearch.randomizedtesting.rules.SystemPropertiesRestoreRule$1.evaluate(SystemPropertiesRestoreRule.java:57)
	at org.apache.lucene.util.AbstractBeforeAfterRule$1.evaluate(AbstractBeforeAfterRule.java:45)
	at com.carrotsearch.randomizedtesting.rules.StatementAdapter.evaluate(StatementAdapter.java:36)
	at org.apache.lucene.util.TestRuleStoreClassName$1.evaluate(TestRuleStoreClassName.java:41)
	at com.carrotsearch.randomizedtesting.rules.NoShadowingOrOverridesOnMethodsRule$1.evaluate(NoShadowingOrOverridesOnMethodsRule.java:40)
	at com.carrotsearch.randomizedtesting.rules.NoShadowingOrOverridesOnMethodsRule$1.evaluate(NoShadowingOrOverridesOnMethodsRule.java:40)
	at com.carrotsearch.randomizedtesting.rules.StatementAdapter.evaluate(StatementAdapter.java:36)
	at com.carrotsearch.randomizedtesting.rules.StatementAdapter.evaluate(StatementAdapter.java:36)
	at org.apache.lucene.util.TestRuleAssertionsRequired$1.evaluate(TestRuleAssertionsRequired.java:53)
	at org.apache.lucene.util.TestRuleMarkFailure$1.evaluate(TestRuleMarkFailure.java:47)
	at org.apache.lucene.util.TestRuleIgnoreAfterMaxFailures$1.evaluate(TestRuleIgnoreAfterMaxFailures.java:64)
	at org.apache.lucene.util.TestRuleIgnoreTestSuites$1.evaluate(TestRuleIgnoreTestSuites.java:54)
	at com.carrotsearch.randomizedtesting.rules.StatementAdapter.evaluate(StatementAdapter.java:36)
	at com.carrotsearch.randomizedtesting.ThreadLeakControl$StatementRunner.run(ThreadLeakControl.java:368)
	at java.base/java.lang.Thread.run(Thread.java:834)


FAILED:  junit.framework.TestSuite.org.apache.solr.handler.admin.AutoscalingHistoryHandlerTest

Error Message:
Could not find collection : AutoscalingHistoryHandlerTest_collection

Stack Trace:
org.apache.solr.common.SolrException: Could not find collection : AutoscalingHistoryHandlerTest_collection
	at __randomizedtesting.SeedInfo.seed([733256A0DDCE845B]:0)
	at org.apache.solr.common.cloud.ClusterState.getCollection(ClusterState.java:118)
	at org.apache.solr.cloud.SolrCloudTestCase.getCollectionState(SolrCloudTestCase.java:256)
	at org.apache.solr.handler.admin.AutoscalingHistoryHandlerTest.waitForRecovery(AutoscalingHistoryHandlerTest.java:403)
	at org.apache.solr.handler.admin.AutoscalingHistoryHandlerTest.setupCluster(AutoscalingHistoryHandlerTest.java:97)
	at java.base/jdk.internal.reflect.NativeMethodAccessorImpl.invoke0(Native Method)
	at java.base/jdk.internal.reflect.NativeMethodAccessorImpl.invoke(NativeMethodAccessorImpl.java:62)
	at java.base/jdk.internal.reflect.DelegatingMethodAccessorImpl.invoke(DelegatingMethodAccessorImpl.java:43)
	at java.base/java.lang.reflect.Method.invoke(Method.java:566)
	at com.carrotsearch.randomizedtesting.RandomizedRunner.invoke(RandomizedRunner.java:1737)
	at com.carrotsearch.randomizedtesting.RandomizedRunner$6.evaluate(RandomizedRunner.java:874)
	at com.carrotsearch.randomizedtesting.RandomizedRunner$7.evaluate(RandomizedRunner.java:890)
	at com.carrotsearch.randomizedtesting.rules.StatementAdapter.evaluate(StatementAdapter.java:36)
	at com.carrotsearch.randomizedtesting.rules.SystemPropertiesRestoreRule$1.evaluate(SystemPropertiesRestoreRule.java:57)
	at org.apache.lucene.util.AbstractBeforeAfterRule$1.evaluate(AbstractBeforeAfterRule.java:45)
	at com.carrotsearch.randomizedtesting.rules.StatementAdapter.evaluate(StatementAdapter.java:36)
	at org.apache.lucene.util.TestRuleStoreClassName$1.evaluate(TestRuleStoreClassName.java:41)
	at com.carrotsearch.randomizedtesting.rules.NoShadowingOrOverridesOnMethodsRule$1.evaluate(NoShadowingOrOverridesOnMethodsRule.java:40)
	at com.carrotsearch.randomizedtesting.rules.NoShadowingOrOverridesOnMethodsRule$1.evaluate(NoShadowingOrOverridesOnMethodsRule.java:40)
	at com.carrotsearch.randomizedtesting.rules.StatementAdapter.evaluate(StatementAdapter.java:36)
	at com.carrotsearch.randomizedtesting.rules.StatementAdapter.evaluate(StatementAdapter.java:36)
	at org.apache.lucene.util.TestRuleAssertionsRequired$1.evaluate(TestRuleAssertionsRequired.java:53)
	at org.apache.lucene.util.TestRuleMarkFailure$1.evaluate(TestRuleMarkFailure.java:47)
	at org.apache.lucene.util.TestRuleIgnoreAfterMaxFailures$1.evaluate(TestRuleIgnoreAfterMaxFailures.java:64)
	at org.apache.lucene.util.TestRuleIgnoreTestSuites$1.evaluate(TestRuleIgnoreTestSuites.java:54)
	at com.carrotsearch.randomizedtesting.rules.StatementAdapter.evaluate(StatementAdapter.java:36)
	at com.carrotsearch.randomizedtesting.ThreadLeakControl$StatementRunner.run(ThreadLeakControl.java:368)
	at java.base/java.lang.Thread.run(Thread.java:834)


FAILED:  junit.framework.TestSuite.org.apache.solr.handler.component.CustomHighlightComponentTest

Error Message:
Could not find collection:collection27

Stack Trace:
java.lang.AssertionError: Could not find collection:collection27
	at __randomizedtesting.SeedInfo.seed([733256A0DDCE845B]:0)
	at org.junit.Assert.fail(Assert.java:93)
	at org.junit.Assert.assertTrue(Assert.java:43)
	at org.junit.Assert.assertNotNull(Assert.java:526)
	at org.apache.solr.cloud.AbstractDistribZkTestBase.waitForRecoveriesToFinish(AbstractDistribZkTestBase.java:155)
	at org.apache.solr.handler.component.CustomHighlightComponentTest.setupCluster(CustomHighlightComponentTest.java:125)
	at java.base/jdk.internal.reflect.NativeMethodAccessorImpl.invoke0(Native Method)
	at java.base/jdk.internal.reflect.NativeMethodAccessorImpl.invoke(NativeMethodAccessorImpl.java:62)
	at java.base/jdk.internal.reflect.DelegatingMethodAccessorImpl.invoke(DelegatingMethodAccessorImpl.java:43)
	at java.base/java.lang.reflect.Method.invoke(Method.java:566)
	at com.carrotsearch.randomizedtesting.RandomizedRunner.invoke(RandomizedRunner.java:1737)
	at com.carrotsearch.randomizedtesting.RandomizedRunner$6.evaluate(RandomizedRunner.java:874)
	at com.carrotsearch.randomizedtesting.RandomizedRunner$7.evaluate(RandomizedRunner.java:890)
	at com.carrotsearch.randomizedtesting.rules.StatementAdapter.evaluate(StatementAdapter.java:36)
	at com.carrotsearch.randomizedtesting.rules.SystemPropertiesRestoreRule$1.evaluate(SystemPropertiesRestoreRule.java:57)
	at org.apache.lucene.util.AbstractBeforeAfterRule$1.evaluate(AbstractBeforeAfterRule.java:45)
	at com.carrotsearch.randomizedtesting.rules.StatementAdapter.evaluate(StatementAdapter.java:36)
	at org.apache.lucene.util.TestRuleStoreClassName$1.evaluate(TestRuleStoreClassName.java:41)
	at com.carrotsearch.randomizedtesting.rules.NoShadowingOrOverridesOnMethodsRule$1.evaluate(NoShadowingOrOverridesOnMethodsRule.java:40)
	at com.carrotsearch.randomizedtesting.rules.NoShadowingOrOverridesOnMethodsRule$1.evaluate(NoShadowingOrOverridesOnMethodsRule.java:40)
	at com.carrotsearch.randomizedtesting.rules.StatementAdapter.evaluate(StatementAdapter.java:36)
	at com.carrotsearch.randomizedtesting.rules.StatementAdapter.evaluate(StatementAdapter.java:36)
	at org.apache.lucene.util.TestRuleAssertionsRequired$1.evaluate(TestRuleAssertionsRequired.java:53)
	at org.apache.lucene.util.TestRuleMarkFailure$1.evaluate(TestRuleMarkFailure.java:47)
	at org.apache.lucene.util.TestRuleIgnoreAfterMaxFailures$1.evaluate(TestRuleIgnoreAfterMaxFailures.java:64)
	at org.apache.lucene.util.TestRuleIgnoreTestSuites$1.evaluate(TestRuleIgnoreTestSuites.java:54)
	at com.carrotsearch.randomizedtesting.rules.StatementAdapter.evaluate(StatementAdapter.java:36)
	at com.carrotsearch.randomizedtesting.ThreadLeakControl$StatementRunner.run(ThreadLeakControl.java:368)
	at java.base/java.lang.Thread.run(Thread.java:834)


FAILED:  junit.framework.TestSuite.org.apache.solr.handler.component.CustomHighlightComponentTest

Error Message:
Could not find collection:collection27

Stack Trace:
java.lang.AssertionError: Could not find collection:collection27
	at __randomizedtesting.SeedInfo.seed([733256A0DDCE845B]:0)
	at org.junit.Assert.fail(Assert.java:93)
	at org.junit.Assert.assertTrue(Assert.java:43)
	at org.junit.Assert.assertNotNull(Assert.java:526)
	at org.apache.solr.cloud.AbstractDistribZkTestBase.waitForRecoveriesToFinish(AbstractDistribZkTestBase.java:155)
	at org.apache.solr.handler.component.CustomHighlightComponentTest.setupCluster(CustomHighlightComponentTest.java:125)
	at java.base/jdk.internal.reflect.NativeMethodAccessorImpl.invoke0(Native Method)
	at java.base/jdk.internal.reflect.NativeMethodAccessorImpl.invoke(NativeMethodAccessorImpl.java:62)
	at java.base/jdk.internal.reflect.DelegatingMethodAccessorImpl.invoke(DelegatingMethodAccessorImpl.java:43)
	at java.base/java.lang.reflect.Method.invoke(Method.java:566)
	at com.carrotsearch.randomizedtesting.RandomizedRunner.invoke(RandomizedRunner.java:1737)
	at com.carrotsearch.randomizedtesting.RandomizedRunner$6.evaluate(RandomizedRunner.java:874)
	at com.carrotsearch.randomizedtesting.RandomizedRunner$7.evaluate(RandomizedRunner.java:890)
	at com.carrotsearch.randomizedtesting.rules.StatementAdapter.evaluate(StatementAdapter.java:36)
	at com.carrotsearch.randomizedtesting.rules.SystemPropertiesRestoreRule$1.evaluate(SystemPropertiesRestoreRule.java:57)
	at org.apache.lucene.util.AbstractBeforeAfterRule$1.evaluate(AbstractBeforeAfterRule.java:45)
	at com.carrotsearch.randomizedtesting.rules.StatementAdapter.evaluate(StatementAdapter.java:36)
	at org.apache.lucene.util.TestRuleStoreClassName$1.evaluate(TestRuleStoreClassName.java:41)
	at com.carrotsearch.randomizedtesting.rules.NoShadowingOrOverridesOnMethodsRule$1.evaluate(NoShadowingOrOverridesOnMethodsRule.java:40)
	at com.carrotsearch.randomizedtesting.rules.NoShadowingOrOverridesOnMethodsRule$1.evaluate(NoShadowingOrOverridesOnMethodsRule.java:40)
	at com.carrotsearch.randomizedtesting.rules.StatementAdapter.evaluate(StatementAdapter.java:36)
	at com.carrotsearch.randomizedtesting.rules.StatementAdapter.evaluate(StatementAdapter.java:36)
	at org.apache.lucene.util.TestRuleAssertionsRequired$1.evaluate(TestRuleAssertionsRequired.java:53)
	at org.apache.lucene.util.TestRuleMarkFailure$1.evaluate(TestRuleMarkFailure.java:47)
	at org.apache.lucene.util.TestRuleIgnoreAfterMaxFailures$1.evaluate(TestRuleIgnoreAfterMaxFailures.java:64)
	at org.apache.lucene.util.TestRuleIgnoreTestSuites$1.evaluate(TestRuleIgnoreTestSuites.java:54)
	at com.carrotsearch.randomizedtesting.rules.StatementAdapter.evaluate(StatementAdapter.java:36)
	at com.carrotsearch.randomizedtesting.ThreadLeakControl$StatementRunner.run(ThreadLeakControl.java:368)
	at java.base/java.lang.Thread.run(Thread.java:834)


FAILED:  junit.framework.TestSuite.org.apache.solr.client.solrj.io.graph.GraphExpressionTest

Error Message:
6 threads leaked from SUITE scope at org.apache.solr.client.solrj.io.graph.GraphExpressionTest:     1) Thread[id=579, name=ShortestPathStream-281-thread-1-SendThread(127.0.0.1:34481), state=TIMED_WAITING, group=TGRP-GraphExpressionTest]         at java.base@11-ea/java.lang.Thread.sleep(Native Method)         at app//org.apache.zookeeper.ClientCnxn$SendThread.run(ClientCnxn.java:1054)    2) Thread[id=581, name=zkConnectionManagerCallback-286-thread-1, state=WAITING, group=TGRP-GraphExpressionTest]         at java.base@11-ea/jdk.internal.misc.Unsafe.park(Native Method)         at java.base@11-ea/java.util.concurrent.locks.LockSupport.park(LockSupport.java:194)         at java.base@11-ea/java.util.concurrent.locks.AbstractQueuedSynchronizer$ConditionObject.await(AbstractQueuedSynchronizer.java:2081)         at java.base@11-ea/java.util.concurrent.LinkedBlockingQueue.take(LinkedBlockingQueue.java:433)         at java.base@11-ea/java.util.concurrent.ThreadPoolExecutor.getTask(ThreadPoolExecutor.java:1054)         at java.base@11-ea/java.util.concurrent.ThreadPoolExecutor.runWorker(ThreadPoolExecutor.java:1114)         at java.base@11-ea/java.util.concurrent.ThreadPoolExecutor$Worker.run(ThreadPoolExecutor.java:628)         at java.base@11-ea/java.lang.Thread.run(Thread.java:834)    3) Thread[id=580, name=ShortestPathStream-281-thread-1-EventThread, state=WAITING, group=TGRP-GraphExpressionTest]         at java.base@11-ea/jdk.internal.misc.Unsafe.park(Native Method)         at java.base@11-ea/java.util.concurrent.locks.LockSupport.park(LockSupport.java:194)         at java.base@11-ea/java.util.concurrent.locks.AbstractQueuedSynchronizer$ConditionObject.await(AbstractQueuedSynchronizer.java:2081)         at java.base@11-ea/java.util.concurrent.LinkedBlockingQueue.take(LinkedBlockingQueue.java:433)         at app//org.apache.zookeeper.ClientCnxn$EventThread.run(ClientCnxn.java:502)    4) Thread[id=578, name=Connection evictor, state=TIMED_WAITING, group=TGRP-GraphExpressionTest]         at java.base@11-ea/java.lang.Thread.sleep(Native Method)         at app//org.apache.http.impl.client.IdleConnectionEvictor$1.run(IdleConnectionEvictor.java:66)         at java.base@11-ea/java.lang.Thread.run(Thread.java:834)    5) Thread[id=584, name=Connection evictor, state=TIMED_WAITING, group=TGRP-GraphExpressionTest]         at java.base@11-ea/java.lang.Thread.sleep(Native Method)         at app//org.apache.http.impl.client.IdleConnectionEvictor$1.run(IdleConnectionEvictor.java:66)         at java.base@11-ea/java.lang.Thread.run(Thread.java:834)    6) Thread[id=585, name=Connection evictor, state=TIMED_WAITING, group=TGRP-GraphExpressionTest]         at java.base@11-ea/java.lang.Thread.sleep(Native Method)         at app//org.apache.http.impl.client.IdleConnectionEvictor$1.run(IdleConnectionEvictor.java:66)         at java.base@11-ea/java.lang.Thread.run(Thread.java:834)

Stack Trace:
com.carrotsearch.randomizedtesting.ThreadLeakError: 6 threads leaked from SUITE scope at org.apache.solr.client.solrj.io.graph.GraphExpressionTest: 
   1) Thread[id=579, name=ShortestPathStream-281-thread-1-SendThread(127.0.0.1:34481), state=TIMED_WAITING, group=TGRP-GraphExpressionTest]
        at java.base@11-ea/java.lang.Thread.sleep(Native Method)
        at app//org.apache.zookeeper.ClientCnxn$SendThread.run(ClientCnxn.java:1054)
   2) Thread[id=581, name=zkConnectionManagerCallback-286-thread-1, state=WAITING, group=TGRP-GraphExpressionTest]
        at java.base@11-ea/jdk.internal.misc.Unsafe.park(Native Method)
        at java.base@11-ea/java.util.concurrent.locks.LockSupport.park(LockSupport.java:194)
        at java.base@11-ea/java.util.concurrent.locks.AbstractQueuedSynchronizer$ConditionObject.await(AbstractQueuedSynchronizer.java:2081)
        at java.base@11-ea/java.util.concurrent.LinkedBlockingQueue.take(LinkedBlockingQueue.java:433)
        at java.base@11-ea/java.util.concurrent.ThreadPoolExecutor.getTask(ThreadPoolExecutor.java:1054)
        at java.base@11-ea/java.util.concurrent.ThreadPoolExecutor.runWorker(ThreadPoolExecutor.java:1114)
        at java.base@11-ea/java.util.concurrent.ThreadPoolExecutor$Worker.run(ThreadPoolExecutor.java:628)
        at java.base@11-ea/java.lang.Thread.run(Thread.java:834)
   3) Thread[id=580, name=ShortestPathStream-281-thread-1-EventThread, state=WAITING, group=TGRP-GraphExpressionTest]
        at java.base@11-ea/jdk.internal.misc.Unsafe.park(Native Method)
        at java.base@11-ea/java.util.concurrent.locks.LockSupport.park(LockSupport.java:194)
        at java.base@11-ea/java.util.concurrent.locks.AbstractQueuedSynchronizer$ConditionObject.await(AbstractQueuedSynchronizer.java:2081)
        at java.base@11-ea/java.util.concurrent.LinkedBlockingQueue.take(LinkedBlockingQueue.java:433)
        at app//org.apache.zookeeper.ClientCnxn$EventThread.run(ClientCnxn.java:502)
   4) Thread[id=578, name=Connection evictor, state=TIMED_WAITING, group=TGRP-GraphExpressionTest]
        at java.base@11-ea/java.lang.Thread.sleep(Native Method)
        at app//org.apache.http.impl.client.IdleConnectionEvictor$1.run(IdleConnectionEvictor.java:66)
        at java.base@11-ea/java.lang.Thread.run(Thread.java:834)
   5) Thread[id=584, name=Connection evictor, state=TIMED_WAITING, group=TGRP-GraphExpressionTest]
        at java.base@11-ea/java.lang.Thread.sleep(Native Method)
        at app//org.apache.http.impl.client.IdleConnectionEvictor$1.run(IdleConnectionEvictor.java:66)
        at java.base@11-ea/java.lang.Thread.run(Thread.java:834)
   6) Thread[id=585, name=Connection evictor, state=TIMED_WAITING, group=TGRP-GraphExpressionTest]
        at java.base@11-ea/java.lang.Thread.sleep(Native Method)
        at app//org.apache.http.impl.client.IdleConnectionEvictor$1.run(IdleConnectionEvictor.java:66)
        at java.base@11-ea/java.lang.Thread.run(Thread.java:834)
	at __randomizedtesting.SeedInfo.seed([491AD2CEBF836003]:0)


FAILED:  junit.framework.TestSuite.org.apache.solr.client.solrj.io.graph.GraphExpressionTest

Error Message:
There are still zombie threads that couldn't be terminated:    1) Thread[id=579, name=ShortestPathStream-281-thread-1-SendThread(127.0.0.1:34481), state=TIMED_WAITING, group=TGRP-GraphExpressionTest]         at java.base@11-ea/java.lang.Thread.sleep(Native Method)         at app//org.apache.zookeeper.client.StaticHostProvider.next(StaticHostProvider.java:105)         at app//org.apache.zookeeper.ClientCnxn$SendThread.startConnect(ClientCnxn.java:1000)         at app//org.apache.zookeeper.ClientCnxn$SendThread.run(ClientCnxn.java:1063)    2) Thread[id=581, name=zkConnectionManagerCallback-286-thread-1, state=WAITING, group=TGRP-GraphExpressionTest]         at java.base@11-ea/jdk.internal.misc.Unsafe.park(Native Method)         at java.base@11-ea/java.util.concurrent.locks.LockSupport.park(LockSupport.java:194)         at java.base@11-ea/java.util.concurrent.locks.AbstractQueuedSynchronizer$ConditionObject.await(AbstractQueuedSynchronizer.java:2081)         at java.base@11-ea/java.util.concurrent.LinkedBlockingQueue.take(LinkedBlockingQueue.java:433)         at java.base@11-ea/java.util.concurrent.ThreadPoolExecutor.getTask(ThreadPoolExecutor.java:1054)         at java.base@11-ea/java.util.concurrent.ThreadPoolExecutor.runWorker(ThreadPoolExecutor.java:1114)         at java.base@11-ea/java.util.concurrent.ThreadPoolExecutor$Worker.run(ThreadPoolExecutor.java:628)         at java.base@11-ea/java.lang.Thread.run(Thread.java:834)

Stack Trace:
com.carrotsearch.randomizedtesting.ThreadLeakError: There are still zombie threads that couldn't be terminated:
   1) Thread[id=579, name=ShortestPathStream-281-thread-1-SendThread(127.0.0.1:34481), state=TIMED_WAITING, group=TGRP-GraphExpressionTest]
        at java.base@11-ea/java.lang.Thread.sleep(Native Method)
        at app//org.apache.zookeeper.client.StaticHostProvider.next(StaticHostProvider.java:105)
        at app//org.apache.zookeeper.ClientCnxn$SendThread.startConnect(ClientCnxn.java:1000)
        at app//org.apache.zookeeper.ClientCnxn$SendThread.run(ClientCnxn.java:1063)
   2) Thread[id=581, name=zkConnectionManagerCallback-286-thread-1, state=WAITING, group=TGRP-GraphExpressionTest]
        at java.base@11-ea/jdk.internal.misc.Unsafe.park(Native Method)
        at java.base@11-ea/java.util.concurrent.locks.LockSupport.park(LockSupport.java:194)
        at java.base@11-ea/java.util.concurrent.locks.AbstractQueuedSynchronizer$ConditionObject.await(AbstractQueuedSynchronizer.java:2081)
        at java.base@11-ea/java.util.concurrent.LinkedBlockingQueue.take(LinkedBlockingQueue.java:433)
        at java.base@11-ea/java.util.concurrent.ThreadPoolExecutor.getTask(ThreadPoolExecutor.java:1054)
        at java.base@11-ea/java.util.concurrent.ThreadPoolExecutor.runWorker(ThreadPoolExecutor.java:1114)
        at java.base@11-ea/java.util.concurrent.ThreadPoolExecutor$Worker.run(ThreadPoolExecutor.java:628)
        at java.base@11-ea/java.lang.Thread.run(Thread.java:834)
	at __randomizedtesting.SeedInfo.seed([491AD2CEBF836003]:0)


FAILED:  junit.framework.TestSuite.org.apache.solr.client.solrj.io.graph.GraphExpressionTest

Error Message:
6 threads leaked from SUITE scope at org.apache.solr.client.solrj.io.graph.GraphExpressionTest:     1) Thread[id=2681, name=Connection evictor, state=TIMED_WAITING, group=TGRP-GraphExpressionTest]         at java.base@11-ea/java.lang.Thread.sleep(Native Method)         at app//org.apache.http.impl.client.IdleConnectionEvictor$1.run(IdleConnectionEvictor.java:66)         at java.base@11-ea/java.lang.Thread.run(Thread.java:834)    2) Thread[id=2677, name=zkConnectionManagerCallback-1271-thread-1, state=WAITING, group=TGRP-GraphExpressionTest]         at java.base@11-ea/jdk.internal.misc.Unsafe.park(Native Method)         at java.base@11-ea/java.util.concurrent.locks.LockSupport.park(LockSupport.java:194)         at java.base@11-ea/java.util.concurrent.locks.AbstractQueuedSynchronizer$ConditionObject.await(AbstractQueuedSynchronizer.java:2081)         at java.base@11-ea/java.util.concurrent.LinkedBlockingQueue.take(LinkedBlockingQueue.java:433)         at java.base@11-ea/java.util.concurrent.ThreadPoolExecutor.getTask(ThreadPoolExecutor.java:1054)         at java.base@11-ea/java.util.concurrent.ThreadPoolExecutor.runWorker(ThreadPoolExecutor.java:1114)         at java.base@11-ea/java.util.concurrent.ThreadPoolExecutor$Worker.run(ThreadPoolExecutor.java:628)         at java.base@11-ea/java.lang.Thread.run(Thread.java:834)    3) Thread[id=2676, name=ShortestPathStream-1266-thread-1-EventThread, state=WAITING, group=TGRP-GraphExpressionTest]         at java.base@11-ea/jdk.internal.misc.Unsafe.park(Native Method)         at java.base@11-ea/java.util.concurrent.locks.LockSupport.park(LockSupport.java:194)         at java.base@11-ea/java.util.concurrent.locks.AbstractQueuedSynchronizer$ConditionObject.await(AbstractQueuedSynchronizer.java:2081)         at java.base@11-ea/java.util.concurrent.LinkedBlockingQueue.take(LinkedBlockingQueue.java:433)         at app//org.apache.zookeeper.ClientCnxn$EventThread.run(ClientCnxn.java:502)    4) Thread[id=2674, name=Connection evictor, state=TIMED_WAITING, group=TGRP-GraphExpressionTest]         at java.base@11-ea/java.lang.Thread.sleep(Native Method)         at app//org.apache.http.impl.client.IdleConnectionEvictor$1.run(IdleConnectionEvictor.java:66)         at java.base@11-ea/java.lang.Thread.run(Thread.java:834)    5) Thread[id=2680, name=Connection evictor, state=TIMED_WAITING, group=TGRP-GraphExpressionTest]         at java.base@11-ea/java.lang.Thread.sleep(Native Method)         at app//org.apache.http.impl.client.IdleConnectionEvictor$1.run(IdleConnectionEvictor.java:66)         at java.base@11-ea/java.lang.Thread.run(Thread.java:834)    6) Thread[id=2675, name=ShortestPathStream-1266-thread-1-SendThread(127.0.0.1:40253), state=TIMED_WAITING, group=TGRP-GraphExpressionTest]         at java.base@11-ea/java.lang.Thread.sleep(Native Method)         at app//org.apache.zookeeper.ClientCnxn$SendThread.run(ClientCnxn.java:1054)

Stack Trace:
com.carrotsearch.randomizedtesting.ThreadLeakError: 6 threads leaked from SUITE scope at org.apache.solr.client.solrj.io.graph.GraphExpressionTest: 
   1) Thread[id=2681, name=Connection evictor, state=TIMED_WAITING, group=TGRP-GraphExpressionTest]
        at java.base@11-ea/java.lang.Thread.sleep(Native Method)
        at app//org.apache.http.impl.client.IdleConnectionEvictor$1.run(IdleConnectionEvictor.java:66)
        at java.base@11-ea/java.lang.Thread.run(Thread.java:834)
   2) Thread[id=2677, name=zkConnectionManagerCallback-1271-thread-1, state=WAITING, group=TGRP-GraphExpressionTest]
        at java.base@11-ea/jdk.internal.misc.Unsafe.park(Native Method)
        at java.base@11-ea/java.util.concurrent.locks.LockSupport.park(LockSupport.java:194)
        at java.base@11-ea/java.util.concurrent.locks.AbstractQueuedSynchronizer$ConditionObject.await(AbstractQueuedSynchronizer.java:2081)
        at java.base@11-ea/java.util.concurrent.LinkedBlockingQueue.take(LinkedBlockingQueue.java:433)
        at java.base@11-ea/java.util.concurrent.ThreadPoolExecutor.getTask(ThreadPoolExecutor.java:1054)
        at java.base@11-ea/java.util.concurrent.ThreadPoolExecutor.runWorker(ThreadPoolExecutor.java:1114)
        at java.base@11-ea/java.util.concurrent.ThreadPoolExecutor$Worker.run(ThreadPoolExecutor.java:628)
        at java.base@11-ea/java.lang.Thread.run(Thread.java:834)
   3) Thread[id=2676, name=ShortestPathStream-1266-thread-1-EventThread, state=WAITING, group=TGRP-GraphExpressionTest]
        at java.base@11-ea/jdk.internal.misc.Unsafe.park(Native Method)
        at java.base@11-ea/java.util.concurrent.locks.LockSupport.park(LockSupport.java:194)
        at java.base@11-ea/java.util.concurrent.locks.AbstractQueuedSynchronizer$ConditionObject.await(AbstractQueuedSynchronizer.java:2081)
        at java.base@11-ea/java.util.concurrent.LinkedBlockingQueue.take(LinkedBlockingQueue.java:433)
        at app//org.apache.zookeeper.ClientCnxn$EventThread.run(ClientCnxn.java:502)
   4) Thread[id=2674, name=Connection evictor, state=TIMED_WAITING, group=TGRP-GraphExpressionTest]
        at java.base@11-ea/java.lang.Thread.sleep(Native Method)
        at app//org.apache.http.impl.client.IdleConnectionEvictor$1.run(IdleConnectionEvictor.java:66)
        at java.base@11-ea/java.lang.Thread.run(Thread.java:834)
   5) Thread[id=2680, name=Connection evictor, state=TIMED_WAITING, group=TGRP-GraphExpressionTest]
        at java.base@11-ea/java.lang.Thread.sleep(Native Method)
        at app//org.apache.http.impl.client.IdleConnectionEvictor$1.run(IdleConnectionEvictor.java:66)
        at java.base@11-ea/java.lang.Thread.run(Thread.java:834)
   6) Thread[id=2675, name=ShortestPathStream-1266-thread-1-SendThread(127.0.0.1:40253), state=TIMED_WAITING, group=TGRP-GraphExpressionTest]
        at java.base@11-ea/java.lang.Thread.sleep(Native Method)
        at app//org.apache.zookeeper.ClientCnxn$SendThread.run(ClientCnxn.java:1054)
	at __randomizedtesting.SeedInfo.seed([491AD2CEBF836003]:0)


FAILED:  junit.framework.TestSuite.org.apache.solr.client.solrj.io.graph.GraphExpressionTest

Error Message:
There are still zombie threads that couldn't be terminated:    1) Thread[id=2677, name=zkConnectionManagerCallback-1271-thread-1, state=WAITING, group=TGRP-GraphExpressionTest]         at java.base@11-ea/jdk.internal.misc.Unsafe.park(Native Method)         at java.base@11-ea/java.util.concurrent.locks.LockSupport.park(LockSupport.java:194)         at java.base@11-ea/java.util.concurrent.locks.AbstractQueuedSynchronizer$ConditionObject.await(AbstractQueuedSynchronizer.java:2081)         at java.base@11-ea/java.util.concurrent.LinkedBlockingQueue.take(LinkedBlockingQueue.java:433)         at java.base@11-ea/java.util.concurrent.ThreadPoolExecutor.getTask(ThreadPoolExecutor.java:1054)         at java.base@11-ea/java.util.concurrent.ThreadPoolExecutor.runWorker(ThreadPoolExecutor.java:1114)         at java.base@11-ea/java.util.concurrent.ThreadPoolExecutor$Worker.run(ThreadPoolExecutor.java:628)         at java.base@11-ea/java.lang.Thread.run(Thread.java:834)    2) Thread[id=2675, name=ShortestPathStream-1266-thread-1-SendThread(127.0.0.1:40253), state=TIMED_WAITING, group=TGRP-GraphExpressionTest]         at java.base@11-ea/java.lang.Thread.sleep(Native Method)         at app//org.apache.zookeeper.client.StaticHostProvider.next(StaticHostProvider.java:105)         at app//org.apache.zookeeper.ClientCnxn$SendThread.startConnect(ClientCnxn.java:1000)         at app//org.apache.zookeeper.ClientCnxn$SendThread.run(ClientCnxn.java:1063)

Stack Trace:
com.carrotsearch.randomizedtesting.ThreadLeakError: There are still zombie threads that couldn't be terminated:
   1) Thread[id=2677, name=zkConnectionManagerCallback-1271-thread-1, state=WAITING, group=TGRP-GraphExpressionTest]
        at java.base@11-ea/jdk.internal.misc.Unsafe.park(Native Method)
        at java.base@11-ea/java.util.concurrent.locks.LockSupport.park(LockSupport.java:194)
        at java.base@11-ea/java.util.concurrent.locks.AbstractQueuedSynchronizer$ConditionObject.await(AbstractQueuedSynchronizer.java:2081)
        at java.base@11-ea/java.util.concurrent.LinkedBlockingQueue.take(LinkedBlockingQueue.java:433)
        at java.base@11-ea/java.util.concurrent.ThreadPoolExecutor.getTask(ThreadPoolExecutor.java:1054)
        at java.base@11-ea/java.util.concurrent.ThreadPoolExecutor.runWorker(ThreadPoolExecutor.java:1114)
        at java.base@11-ea/java.util.concurrent.ThreadPoolExecutor$Worker.run(ThreadPoolExecutor.java:628)
        at java.base@11-ea/java.lang.Thread.run(Thread.java:834)
   2) Thread[id=2675, name=ShortestPathStream-1266-thread-1-SendThread(127.0.0.1:40253), state=TIMED_WAITING, group=TGRP-GraphExpressionTest]
        at java.base@11-ea/java.lang.Thread.sleep(Native Method)
        at app//org.apache.zookeeper.client.StaticHostProvider.next(StaticHostProvider.java:105)
        at app//org.apache.zookeeper.ClientCnxn$SendThread.startConnect(ClientCnxn.java:1000)
        at app//org.apache.zookeeper.ClientCnxn$SendThread.run(ClientCnxn.java:1063)
	at __randomizedtesting.SeedInfo.seed([491AD2CEBF836003]:0)


FAILED:  junit.framework.TestSuite.org.apache.solr.client.solrj.io.stream.StreamDecoratorTest

Error Message:
24 threads leaked from SUITE scope at org.apache.solr.client.solrj.io.stream.StreamDecoratorTest:     1) Thread[id=449, name=zkConnectionManagerCallback-193-thread-1, state=WAITING, group=TGRP-StreamDecoratorTest]         at java.base@11-ea/jdk.internal.misc.Unsafe.park(Native Method)         at java.base@11-ea/java.util.concurrent.locks.LockSupport.park(LockSupport.java:194)         at java.base@11-ea/java.util.concurrent.locks.AbstractQueuedSynchronizer$ConditionObject.await(AbstractQueuedSynchronizer.java:2081)         at java.base@11-ea/java.util.concurrent.LinkedBlockingQueue.take(LinkedBlockingQueue.java:433)         at java.base@11-ea/java.util.concurrent.ThreadPoolExecutor.getTask(ThreadPoolExecutor.java:1054)         at java.base@11-ea/java.util.concurrent.ThreadPoolExecutor.runWorker(ThreadPoolExecutor.java:1114)         at java.base@11-ea/java.util.concurrent.ThreadPoolExecutor$Worker.run(ThreadPoolExecutor.java:628)         at java.base@11-ea/java.lang.Thread.run(Thread.java:834)    2) Thread[id=2258, name=TEST-StreamDecoratorTest.testParallelExecutorStream-seed#[491AD2CEBF836003]-SendThread(127.0.0.1:45247), state=TIMED_WAITING, group=TGRP-StreamDecoratorTest]         at java.base@11-ea/java.lang.Thread.sleep(Native Method)         at app//org.apache.zookeeper.client.StaticHostProvider.next(StaticHostProvider.java:105)         at app//org.apache.zookeeper.ClientCnxn$SendThread.startConnect(ClientCnxn.java:1000)         at app//org.apache.zookeeper.ClientCnxn$SendThread.run(ClientCnxn.java:1063)    3) Thread[id=1589, name=Thread-65-EventThread, state=WAITING, group=TGRP-StreamDecoratorTest]         at java.base@11-ea/jdk.internal.misc.Unsafe.park(Native Method)         at java.base@11-ea/java.util.concurrent.locks.LockSupport.park(LockSupport.java:194)         at java.base@11-ea/java.util.concurrent.locks.AbstractQueuedSynchronizer$ConditionObject.await(AbstractQueuedSynchronizer.java:2081)         at java.base@11-ea/java.util.concurrent.LinkedBlockingQueue.take(LinkedBlockingQueue.java:433)         at app//org.apache.zookeeper.ClientCnxn$EventThread.run(ClientCnxn.java:502)    4) Thread[id=453, name=Connection evictor, state=TIMED_WAITING, group=TGRP-StreamDecoratorTest]         at java.base@11-ea/java.lang.Thread.sleep(Native Method)         at app//org.apache.http.impl.client.IdleConnectionEvictor$1.run(IdleConnectionEvictor.java:66)         at java.base@11-ea/java.lang.Thread.run(Thread.java:834)    5) Thread[id=1546, name=Connection evictor, state=TIMED_WAITING, group=TGRP-StreamDecoratorTest]         at java.base@11-ea/java.lang.Thread.sleep(Native Method)         at app//org.apache.http.impl.client.IdleConnectionEvictor$1.run(IdleConnectionEvictor.java:66)         at java.base@11-ea/java.lang.Thread.run(Thread.java:834)    6) Thread[id=448, name=TEST-StreamDecoratorTest.testExecutorStream-seed#[491AD2CEBF836003]-EventThread, state=WAITING, group=TGRP-StreamDecoratorTest]         at java.base@11-ea/jdk.internal.misc.Unsafe.park(Native Method)         at java.base@11-ea/java.util.concurrent.locks.LockSupport.park(LockSupport.java:194)         at java.base@11-ea/java.util.concurrent.locks.AbstractQueuedSynchronizer$ConditionObject.await(AbstractQueuedSynchronizer.java:2081)         at java.base@11-ea/java.util.concurrent.LinkedBlockingQueue.take(LinkedBlockingQueue.java:433)         at app//org.apache.zookeeper.ClientCnxn$EventThread.run(ClientCnxn.java:502)    7) Thread[id=446, name=Connection evictor, state=TIMED_WAITING, group=TGRP-StreamDecoratorTest]         at java.base@11-ea/java.lang.Thread.sleep(Native Method)         at app//org.apache.http.impl.client.IdleConnectionEvictor$1.run(IdleConnectionEvictor.java:66)         at java.base@11-ea/java.lang.Thread.run(Thread.java:834)    8) Thread[id=2260, name=zkConnectionManagerCallback-1106-thread-1, state=WAITING, group=TGRP-StreamDecoratorTest]         at java.base@11-ea/jdk.internal.misc.Unsafe.park(Native Method)         at java.base@11-ea/java.util.concurrent.locks.LockSupport.park(LockSupport.java:194)         at java.base@11-ea/java.util.concurrent.locks.AbstractQueuedSynchronizer$ConditionObject.await(AbstractQueuedSynchronizer.java:2081)         at java.base@11-ea/java.util.concurrent.LinkedBlockingQueue.take(LinkedBlockingQueue.java:433)         at java.base@11-ea/java.util.concurrent.ThreadPoolExecutor.getTask(ThreadPoolExecutor.java:1054)         at java.base@11-ea/java.util.concurrent.ThreadPoolExecutor.runWorker(ThreadPoolExecutor.java:1114)         at java.base@11-ea/java.util.concurrent.ThreadPoolExecutor$Worker.run(ThreadPoolExecutor.java:628)         at java.base@11-ea/java.lang.Thread.run(Thread.java:834)    9) Thread[id=1549, name=zkConnectionManagerCallback-732-thread-1, state=WAITING, group=TGRP-StreamDecoratorTest]         at java.base@11-ea/jdk.internal.misc.Unsafe.park(Native Method)         at java.base@11-ea/java.util.concurrent.locks.LockSupport.park(LockSupport.java:194)         at java.base@11-ea/java.util.concurrent.locks.AbstractQueuedSynchronizer$ConditionObject.await(AbstractQueuedSynchronizer.java:2081)         at java.base@11-ea/java.util.concurrent.LinkedBlockingQueue.take(LinkedBlockingQueue.java:433)         at java.base@11-ea/java.util.concurrent.ThreadPoolExecutor.getTask(ThreadPoolExecutor.java:1054)         at java.base@11-ea/java.util.concurrent.ThreadPoolExecutor.runWorker(ThreadPoolExecutor.java:1114)         at java.base@11-ea/java.util.concurrent.ThreadPoolExecutor$Worker.run(ThreadPoolExecutor.java:628)         at java.base@11-ea/java.lang.Thread.run(Thread.java:834)   10) Thread[id=1547, name=TEST-StreamDecoratorTest.testParallelHavingStream-seed#[491AD2CEBF836003]-SendThread(127.0.0.1:45247), state=TIMED_WAITING, group=TGRP-StreamDecoratorTest]         at java.base@11-ea/java.lang.Thread.sleep(Native Method)         at app//org.apache.zookeeper.ClientCnxnSocketNIO.cleanup(ClientCnxnSocketNIO.java:230)         at app//org.apache.zookeeper.ClientCnxn$SendThread.cleanup(ClientCnxn.java:1249)         at app//org.apache.zookeeper.ClientCnxn$SendThread.run(ClientCnxn.java:1173)   11) Thread[id=2257, name=Connection evictor, state=TIMED_WAITING, group=TGRP-StreamDecoratorTest]         at java.base@11-ea/java.lang.Thread.sleep(Native Method)         at app//org.apache.http.impl.client.IdleConnectionEvictor$1.run(IdleConnectionEvictor.java:66)         at java.base@11-ea/java.lang.Thread.run(Thread.java:834)   12) Thread[id=2263, name=Connection evictor, state=TIMED_WAITING, group=TGRP-StreamDecoratorTest]         at java.base@11-ea/java.lang.Thread.sleep(Native Method)         at app//org.apache.http.impl.client.IdleConnectionEvictor$1.run(IdleConnectionEvictor.java:66)         at java.base@11-ea/java.lang.Thread.run(Thread.java:834)   13) Thread[id=460, name=Connection evictor, state=TIMED_WAITING, group=TGRP-StreamDecoratorTest]         at java.base@11-ea/java.lang.Thread.sleep(Native Method)         at app//org.apache.http.impl.client.IdleConnectionEvictor$1.run(IdleConnectionEvictor.java:66)         at java.base@11-ea/java.lang.Thread.run(Thread.java:834)   14) Thread[id=1590, name=zkConnectionManagerCallback-752-thread-1, state=WAITING, group=TGRP-StreamDecoratorTest]         at java.base@11-ea/jdk.internal.misc.Unsafe.park(Native Method)         at java.base@11-ea/java.util.concurrent.locks.LockSupport.park(LockSupport.java:194)         at java.base@11-ea/java.util.concurrent.locks.AbstractQueuedSynchronizer$ConditionObject.await(AbstractQueuedSynchronizer.java:2081)         at java.base@11-ea/java.util.concurrent.LinkedBlockingQueue.take(LinkedBlockingQueue.java:433)         at java.base@11-ea/java.util.concurrent.ThreadPoolExecutor.getTask(ThreadPoolExecutor.java:1054)         at java.base@11-ea/java.util.concurrent.ThreadPoolExecutor.runWorker(ThreadPoolExecutor.java:1114)         at java.base@11-ea/java.util.concurrent.ThreadPoolExecutor$Worker.run(ThreadPoolExecutor.java:628)         at java.base@11-ea/java.lang.Thread.run(Thread.java:834)   15) Thread[id=1552, name=Connection evictor, state=TIMED_WAITING, group=TGRP-StreamDecoratorTest]         at java.base@11-ea/java.lang.Thread.sleep(Native Method)         at app//org.apache.http.impl.client.IdleConnectionEvictor$1.run(IdleConnectionEvictor.java:66)         at java.base@11-ea/java.lang.Thread.run(Thread.java:834)   16) Thread[id=447, name=TEST-StreamDecoratorTest.testExecutorStream-seed#[491AD2CEBF836003]-SendThread(127.0.0.1:45247), state=TIMED_WAITING, group=TGRP-StreamDecoratorTest]         at java.base@11-ea/java.lang.Thread.sleep(Native Method)         at app//org.apache.zookeeper.ClientCnxn$SendThread.run(ClientCnxn.java:1054)   17) Thread[id=461, name=Connection evictor, state=TIMED_WAITING, group=TGRP-StreamDecoratorTest]         at java.base@11-ea/java.lang.Thread.sleep(Native Method)         at app//org.apache.http.impl.client.IdleConnectionEvictor$1.run(IdleConnectionEvictor.java:66)         at java.base@11-ea/java.lang.Thread.run(Thread.java:834)   18) Thread[id=2259, name=TEST-StreamDecoratorTest.testParallelExecutorStream-seed#[491AD2CEBF836003]-EventThread, state=WAITING, group=TGRP-StreamDecoratorTest]         at java.base@11-ea/jdk.internal.misc.Unsafe.park(Native Method)         at java.base@11-ea/java.util.concurrent.locks.LockSupport.park(LockSupport.java:194)         at java.base@11-ea/java.util.concurrent.locks.AbstractQueuedSynchronizer$ConditionObject.await(AbstractQueuedSynchronizer.java:2081)         at java.base@11-ea/java.util.concurrent.LinkedBlockingQueue.take(LinkedBlockingQueue.java:433)         at app//org.apache.zookeeper.ClientCnxn$EventThread.run(ClientCnxn.java:502)   19) Thread[id=1553, name=Connection evictor, state=TIMED_WAITING, group=TGRP-StreamDecoratorTest]         at java.base@11-ea/java.lang.Thread.sleep(Native Method)         at app//org.apache.http.impl.client.IdleConnectionEvictor$1.run(IdleConnectionEvictor.java:66)         at java.base@11-ea/java.lang.Thread.run(Thread.java:834)   20) Thread[id=2264, name=Connection evictor, state=TIMED_WAITING, group=TGRP-StreamDecoratorTest]         at java.base@11-ea/java.lang.Thread.sleep(Native Method)         at app//org.apache.http.impl.client.IdleConnectionEvictor$1.run(IdleConnectionEvictor.java:66)         at java.base@11-ea/java.lang.Thread.run(Thread.java:834)   21) Thread[id=3418, name=Connection evictor, state=TIMED_WAITING, group=TGRP-StreamDecoratorTest]         at java.base@11-ea/java.lang.Thread.sleep(Native Method)         at app//org.apache.http.impl.client.IdleConnectionEvictor$1.run(IdleConnectionEvictor.java:66)         at java.base@11-ea/java.lang.Thread.run(Thread.java:834)   22) Thread[id=1588, name=Thread-65-SendThread(127.0.0.1:45247), state=TIMED_WAITING, group=TGRP-StreamDecoratorTest]         at java.base@11-ea/java.lang.Thread.sleep(Native Method)         at app//org.apache.zookeeper.client.StaticHostProvider.next(StaticHostProvider.java:105)         at app//org.apache.zookeeper.ClientCnxn$SendThread.startConnect(ClientCnxn.java:1000)         at app//org.apache.zookeeper.ClientCnxn$SendThread.run(ClientCnxn.java:1063)   23) Thread[id=1548, name=TEST-StreamDecoratorTest.testParallelHavingStream-seed#[491AD2CEBF836003]-EventThread, state=WAITING, group=TGRP-StreamDecoratorTest]         at java.base@11-ea/jdk.internal.misc.Unsafe.park(Native Method)         at java.base@11-ea/java.util.concurrent.locks.LockSupport.park(LockSupport.java:194)         at java.base@11-ea/java.util.concurrent.locks.AbstractQueuedSynchronizer$ConditionObject.await(AbstractQueuedSynchronizer.java:2081)         at java.base@11-ea/java.util.concurrent.LinkedBlockingQueue.take(LinkedBlockingQueue.java:433)         at app//org.apache.zookeeper.ClientCnxn$EventThread.run(ClientCnxn.java:502)   24) Thread[id=452, name=Connection evictor, state=TIMED_WAITING, group=TGRP-StreamDecoratorTest]         at java.base@11-ea/java.lang.Thread.sleep(Native Method)         at app//org.apache.http.impl.client.IdleConnectionEvictor$1.run(IdleConnectionEvictor.java:66)         at java.base@11-ea/java.lang.Thread.run(Thread.java:834)

Stack Trace:
com.carrotsearch.randomizedtesting.ThreadLeakError: 24 threads leaked from SUITE scope at org.apache.solr.client.solrj.io.stream.StreamDecoratorTest: 
   1) Thread[id=449, name=zkConnectionManagerCallback-193-thread-1, state=WAITING, group=TGRP-StreamDecoratorTest]
        at java.base@11-ea/jdk.internal.misc.Unsafe.park(Native Method)
        at java.base@11-ea/java.util.concurrent.locks.LockSupport.park(LockSupport.java:194)
        at java.base@11-ea/java.util.concurrent.locks.AbstractQueuedSynchronizer$ConditionObject.await(AbstractQueuedSynchronizer.java:2081)
        at java.base@11-ea/java.util.concurrent.LinkedBlockingQueue.take(LinkedBlockingQueue.java:433)
        at java.base@11-ea/java.util.concurrent.ThreadPoolExecutor.getTask(ThreadPoolExecutor.java:1054)
        at java.base@11-ea/java.util.concurrent.ThreadPoolExecutor.runWorker(ThreadPoolExecutor.java:1114)
        at java.base@11-ea/java.util.concurrent.ThreadPoolExecutor$Worker.run(ThreadPoolExecutor.java:628)
        at java.base@11-ea/java.lang.Thread.run(Thread.java:834)
   2) Thread[id=2258, name=TEST-StreamDecoratorTest.testParallelExecutorStream-seed#[491AD2CEBF836003]-SendThread(127.0.0.1:45247), state=TIMED_WAITING, group=TGRP-StreamDecoratorTest]
        at java.base@11-ea/java.lang.Thread.sleep(Native Method)
        at app//org.apache.zookeeper.client.StaticHostProvider.next(StaticHostProvider.java:105)
        at app//org.apache.zookeeper.ClientCnxn$SendThread.startConnect(ClientCnxn.java:1000)
        at app//org.apache.zookeeper.ClientCnxn$SendThread.run(ClientCnxn.java:1063)
   3) Thread[id=1589, name=Thread-65-EventThread, state=WAITING, group=TGRP-StreamDecoratorTest]
        at java.base@11-ea/jdk.internal.misc.Unsafe.park(Native Method)
        at java.base@11-ea/java.util.concurrent.locks.LockSupport.park(LockSupport.java:194)
        at java.base@11-ea/java.util.concurrent.locks.AbstractQueuedSynchronizer$ConditionObject.await(AbstractQueuedSynchronizer.java:2081)
        at java.base@11-ea/java.util.concurrent.LinkedBlockingQueue.take(LinkedBlockingQueue.java:433)
        at app//org.apache.zookeeper.ClientCnxn$EventThread.run(ClientCnxn.java:502)
   4) Thread[id=453, name=Connection evictor, state=TIMED_WAITING, group=TGRP-StreamDecoratorTest]
        at java.base@11-ea/java.lang.Thread.sleep(Native Method)
        at app//org.apache.http.impl.client.IdleConnectionEvictor$1.run(IdleConnectionEvictor.java:66)
        at java.base@11-ea/java.lang.Thread.run(Thread.java:834)
   5) Thread[id=1546, name=Connection evictor, state=TIMED_WAITING, group=TGRP-StreamDecoratorTest]
        at java.base@11-ea/java.lang.Thread.sleep(Native Method)
        at app//org.apache.http.impl.client.IdleConnectionEvictor$1.run(IdleConnectionEvictor.java:66)
        at java.base@11-ea/java.lang.Thread.run(Thread.java:834)
   6) Thread[id=448, name=TEST-StreamDecoratorTest.testExecutorStream-seed#[491AD2CEBF836003]-EventThread, state=WAITING, group=TGRP-StreamDecoratorTest]
        at java.base@11-ea/jdk.internal.misc.Unsafe.park(Native Method)
        at java.base@11-ea/java.util.concurrent.locks.LockSupport.park(LockSupport.java:194)
        at java.base@11-ea/java.util.concurrent.locks.AbstractQueuedSynchronizer$ConditionObject.await(AbstractQueuedSynchronizer.java:2081)
        at java.base@11-ea/java.util.concurrent.LinkedBlockingQueue.take(LinkedBlockingQueue.java:433)
        at app//org.apache.zookeeper.ClientCnxn$EventThread.run(ClientCnxn.java:502)
   7) Thread[id=446, name=Connection evictor, state=TIMED_WAITING, group=TGRP-StreamDecoratorTest]
        at java.base@11-ea/java.lang.Thread.sleep(Native Method)
        at app//org.apache.http.impl.client.IdleConnectionEvictor$1.run(IdleConnectionEvictor.java:66)
        at java.base@11-ea/java.lang.Thread.run(Thread.java:834)
   8) Thread[id=2260, name=zkConnectionManagerCallback-1106-thread-1, state=WAITING, group=TGRP-StreamDecoratorTest]
        at java.base@11-ea/jdk.internal.misc.Unsafe.park(Native Method)
        at java.base@11-ea/java.util.concurrent.locks.LockSupport.park(LockSupport.java:194)
        at java.base@11-ea/java.util.concurrent.locks.AbstractQueuedSynchronizer$ConditionObject.await(AbstractQueuedSynchronizer.java:2081)
        at java.base@11-ea/java.util.concurrent.LinkedBlockingQueue.take(LinkedBlockingQueue.java:433)
        at java.base@11-ea/java.util.concurrent.ThreadPoolExecutor.getTask(ThreadPoolExecutor.java:1054)
        at java.base@11-ea/java.util.concurrent.ThreadPoolExecutor.runWorker(ThreadPoolExecutor.java:1114)
        at java.base@11-ea/java.util.concurrent.ThreadPoolExecutor$Worker.run(ThreadPoolExecutor.java:628)
        at java.base@11-ea/java.lang.Thread.run(Thread.java:834)
   9) Thread[id=1549, name=zkConnectionManagerCallback-732-thread-1, state=WAITING, group=TGRP-StreamDecoratorTest]
        at java.base@11-ea/jdk.internal.misc.Unsafe.park(Native Method)
        at java.base@11-ea/java.util.concurrent.locks.LockSupport.park(LockSupport.java:194)
        at java.base@11-ea/java.util.concurrent.locks.AbstractQueuedSynchronizer$ConditionObject.await(AbstractQueuedSynchronizer.java:2081)
        at java.base@11-ea/java.util.concurrent.LinkedBlockingQueue.take(LinkedBlockingQueue.java:433)
        at java.base@11-ea/java.util.concurrent.ThreadPoolExecutor.getTask(ThreadPoolExecutor.java:1054)
        at java.base@11-ea/java.util.concurrent.ThreadPoolExecutor.runWorker(ThreadPoolExecutor.java:1114)
        at java.base@11-ea/java.util.concurrent.ThreadPoolExecutor$Worker.run(ThreadPoolExecutor.java:628)
        at java.base@11-ea/java.lang.Thread.run(Thread.java:834)
  10) Thread[id=1547, name=TEST-StreamDecoratorTest.testParallelHavingStream-seed#[491AD2CEBF836003]-SendThread(127.0.0.1:45247), state=TIMED_WAITING, group=TGRP-StreamDecoratorTest]
        at java.base@11-ea/java.lang.Thread.sleep(Native Method)
        at app//org.apache.zookeeper.ClientCnxnSocketNIO.cleanup(ClientCnxnSocketNIO.java:230)
        at app//org.apache.zookeeper.ClientCnxn$SendThread.cleanup(ClientCnxn.java:1249)
        at app//org.apache.zookeeper.ClientCnxn$SendThread.run(ClientCnxn.java:1173)
  11) Thread[id=2257, name=Connection evictor, state=TIMED_WAITING, group=TGRP-StreamDecoratorTest]
        at java.base@11-ea/java.lang.Thread.sleep(Native Method)
        at app//org.apache.http.impl.client.IdleConnectionEvictor$1.run(IdleConnectionEvictor.java:66)
        at java.base@11-ea/java.lang.Thread.run(Thread.java:834)
  12) Thread[id=2263, name=Connection evictor, state=TIMED_WAITING, group=TGRP-StreamDecoratorTest]
        at java.base@11-ea/java.lang.Thread.sleep(Native Method)
        at app//org.apache.http.impl.client.IdleConnectionEvictor$1.run(IdleConnectionEvictor.java:66)
        at java.base@11-ea/java.lang.Thread.run(Thread.java:834)
  13) Thread[id=460, name=Connection evictor, state=TIMED_WAITING, group=TGRP-StreamDecoratorTest]
        at java.base@11-ea/java.lang.Thread.sleep(Native Method)
        at app//org.apache.http.impl.client.IdleConnectionEvictor$1.run(IdleConnectionEvictor.java:66)
        at java.base@11-ea/java.lang.Thread.run(Thread.java:834)
  14) Thread[id=1590, name=zkConnectionManagerCallback-752-thread-1, state=WAITING, group=TGRP-StreamDecoratorTest]
        at java.base@11-ea/jdk.internal.misc.Unsafe.park(Native Method)
        at java.base@11-ea/java.util.concurrent.locks.LockSupport.park(LockSupport.java:194)
        at java.base@11-ea/java.util.concurrent.locks.AbstractQueuedSynchronizer$ConditionObject.await(AbstractQueuedSynchronizer.java:2081)
        at java.base@11-ea/java.util.concurrent.LinkedBlockingQueue.take(LinkedBlockingQueue.java:433)
        at java.base@11-ea/java.util.concurrent.ThreadPoolExecutor.getTask(ThreadPoolExecutor.java:1054)
        at java.base@11-ea/java.util.concurrent.ThreadPoolExecutor.runWorker(ThreadPoolExecutor.java:1114)
        at java.base@11-ea/java.util.concurrent.ThreadPoolExecutor$Worker.run(ThreadPoolExecutor.java:628)
        at java.base@11-ea/java.lang.Thread.run(Thread.java:834)
  15) Thread[id=1552, name=Connection evictor, state=TIMED_WAITING, group=TGRP-StreamDecoratorTest]
        at java.base@11-ea/java.lang.Thread.sleep(Native Method)
        at app//org.apache.http.impl.client.IdleConnectionEvictor$1.run(IdleConnectionEvictor.java:66)
        at java.base@11-ea/java.lang.Thread.run(Thread.java:834)
  16) Thread[id=447, name=TEST-StreamDecoratorTest.testExecutorStream-seed#[491AD2CEBF836003]-SendThread(127.0.0.1:45247), state=TIMED_WAITING, group=TGRP-StreamDecoratorTest]
        at java.base@11-ea/java.lang.Thread.sleep(Native Method)
        at app//org.apache.zookeeper.ClientCnxn$SendThread.run(ClientCnxn.java:1054)
  17) Thread[id=461, name=Connection evictor, state=TIMED_WAITING, group=TGRP-StreamDecoratorTest]
        at java.base@11-ea/java.lang.Thread.sleep(Native Method)
        at app//org.apache.http.impl.client.IdleConnectionEvictor$1.run(IdleConnectionEvictor.java:66)
        at java.base@11-ea/java.lang.Thread.run(Thread.java:834)
  18) Thread[id=2259, name=TEST-StreamDecoratorTest.testParallelExecutorStream-seed#[491AD2CEBF836003]-EventThread, state=WAITING, group=TGRP-StreamDecoratorTest]
        at java.base@11-ea/jdk.internal.misc.Unsafe.park(Native Method)
        at java.base@11-ea/java.util.concurrent.locks.LockSupport.park(LockSupport.java:194)
        at java.base@11-ea/java.util.concurrent.locks.AbstractQueuedSynchronizer$ConditionObject.await(AbstractQueuedSynchronizer.java:2081)
        at java.base@11-ea/java.util.concurrent.LinkedBlockingQueue.take(LinkedBlockingQueue.java:433)
        at app//org.apache.zookeeper.ClientCnxn$EventThread.run(ClientCnxn.java:502)
  19) Thread[id=1553, name=Connection evictor, state=TIMED_WAITING, group=TGRP-StreamDecoratorTest]
        at java.base@11-ea/java.lang.Thread.sleep(Native Method)
        at app//org.apache.http.impl.client.IdleConnectionEvictor$1.run(IdleConnectionEvictor.java:66)
        at java.base@11-ea/java.lang.Thread.run(Thread.java:834)
  20) Thread[id=2264, name=Connection evictor, state=TIMED_WAITING, group=TGRP-StreamDecoratorTest]
        at java.base@11-ea/java.lang.Thread.sleep(Native Method)
        at app//org.apache.http.impl.client.IdleConnectionEvictor$1.run(IdleConnectionEvictor.java:66)
        at java.base@11-ea/java.lang.Thread.run(Thread.java:834)
  21) Thread[id=3418, name=Connection evictor, state=TIMED_WAITING, group=TGRP-StreamDecoratorTest]
        at java.base@11-ea/java.lang.Thread.sleep(Native Method)
        at app//org.apache.http.impl.client.IdleConnectionEvictor$1.run(IdleConnectionEvictor.java:66)
        at java.base@11-ea/java.lang.Thread.run(Thread.java:834)
  22) Thread[id=1588, name=Thread-65-SendThread(127.0.0.1:45247), state=TIMED_WAITING, group=TGRP-StreamDecoratorTest]
        at java.base@11-ea/java.lang.Thread.sleep(Native Method)
        at app//org.apache.zookeeper.client.StaticHostProvider.next(StaticHostProvider.java:105)
        at app//org.apache.zookeeper.ClientCnxn$SendThread.startConnect(ClientCnxn.java:1000)
        at app//org.apache.zookeeper.ClientCnxn$SendThread.run(ClientCnxn.java:1063)
  23) Thread[id=1548, name=TEST-StreamDecoratorTest.testParallelHavingStream-seed#[491AD2CEBF836003]-EventThread, state=WAITING, group=TGRP-StreamDecoratorTest]
        at java.base@11-ea/jdk.internal.misc.Unsafe.park(Native Method)
        at java.base@11-ea/java.util.concurrent.locks.LockSupport.park(LockSupport.java:194)
        at java.base@11-ea/java.util.concurrent.locks.AbstractQueuedSynchronizer$ConditionObject.await(AbstractQueuedSynchronizer.java:2081)
        at java.base@11-ea/java.util.concurrent.LinkedBlockingQueue.take(LinkedBlockingQueue.java:433)
        at app//org.apache.zookeeper.ClientCnxn$EventThread.run(ClientCnxn.java:502)
  24) Thread[id=452, name=Connection evictor, state=TIMED_WAITING, group=TGRP-StreamDecoratorTest]
        at java.base@11-ea/java.lang.Thread.sleep(Native Method)
        at app//org.apache.http.impl.client.IdleConnectionEvictor$1.run(IdleConnectionEvictor.java:66)
        at java.base@11-ea/java.lang.Thread.run(Thread.java:834)
	at __randomizedtesting.SeedInfo.seed([491AD2CEBF836003]:0)


FAILED:  junit.framework.TestSuite.org.apache.solr.client.solrj.io.stream.StreamDecoratorTest

Error Message:
There are still zombie threads that couldn't be terminated:    1) Thread[id=449, name=zkConnectionManagerCallback-193-thread-1, state=WAITING, group=TGRP-StreamDecoratorTest]         at java.base@11-ea/jdk.internal.misc.Unsafe.park(Native Method)         at java.base@11-ea/java.util.concurrent.locks.LockSupport.park(LockSupport.java:194)         at java.base@11-ea/java.util.concurrent.locks.AbstractQueuedSynchronizer$ConditionObject.await(AbstractQueuedSynchronizer.java:2081)         at java.base@11-ea/java.util.concurrent.LinkedBlockingQueue.take(LinkedBlockingQueue.java:433)         at java.base@11-ea/java.util.concurrent.ThreadPoolExecutor.getTask(ThreadPoolExecutor.java:1054)         at java.base@11-ea/java.util.concurrent.ThreadPoolExecutor.runWorker(ThreadPoolExecutor.java:1114)         at java.base@11-ea/java.util.concurrent.ThreadPoolExecutor$Worker.run(ThreadPoolExecutor.java:628)         at java.base@11-ea/java.lang.Thread.run(Thread.java:834)    2) Thread[id=2260, name=zkConnectionManagerCallback-1106-thread-1, state=WAITING, group=TGRP-StreamDecoratorTest]         at java.base@11-ea/jdk.internal.misc.Unsafe.park(Native Method)         at java.base@11-ea/java.util.concurrent.locks.LockSupport.park(LockSupport.java:194)         at java.base@11-ea/java.util.concurrent.locks.AbstractQueuedSynchronizer$ConditionObject.await(AbstractQueuedSynchronizer.java:2081)         at java.base@11-ea/java.util.concurrent.LinkedBlockingQueue.take(LinkedBlockingQueue.java:433)         at java.base@11-ea/java.util.concurrent.ThreadPoolExecutor.getTask(ThreadPoolExecutor.java:1054)         at java.base@11-ea/java.util.concurrent.ThreadPoolExecutor.runWorker(ThreadPoolExecutor.java:1114)         at java.base@11-ea/java.util.concurrent.ThreadPoolExecutor$Worker.run(ThreadPoolExecutor.java:628)         at java.base@11-ea/java.lang.Thread.run(Thread.java:834)    3) Thread[id=1590, name=zkConnectionManagerCallback-752-thread-1, state=WAITING, group=TGRP-StreamDecoratorTest]         at java.base@11-ea/jdk.internal.misc.Unsafe.park(Native Method)         at java.base@11-ea/java.util.concurrent.locks.LockSupport.park(LockSupport.java:194)         at java.base@11-ea/java.util.concurrent.locks.AbstractQueuedSynchronizer$ConditionObject.await(AbstractQueuedSynchronizer.java:2081)         at java.base@11-ea/java.util.concurrent.LinkedBlockingQueue.take(LinkedBlockingQueue.java:433)         at java.base@11-ea/java.util.concurrent.ThreadPoolExecutor.getTask(ThreadPoolExecutor.java:1054)         at java.base@11-ea/java.util.concurrent.ThreadPoolExecutor.runWorker(ThreadPoolExecutor.java:1114)         at java.base@11-ea/java.util.concurrent.ThreadPoolExecutor$Worker.run(ThreadPoolExecutor.java:628)         at java.base@11-ea/java.lang.Thread.run(Thread.java:834)    4) Thread[id=1549, name=zkConnectionManagerCallback-732-thread-1, state=WAITING, group=TGRP-StreamDecoratorTest]         at java.base@11-ea/jdk.internal.misc.Unsafe.park(Native Method)         at java.base@11-ea/java.util.concurrent.locks.LockSupport.park(LockSupport.java:194)         at java.base@11-ea/java.util.concurrent.locks.AbstractQueuedSynchronizer$ConditionObject.await(AbstractQueuedSynchronizer.java:2081)         at java.base@11-ea/java.util.concurrent.LinkedBlockingQueue.take(LinkedBlockingQueue.java:433)         at java.base@11-ea/java.util.concurrent.ThreadPoolExecutor.getTask(ThreadPoolExecutor.java:1054)         at java.base@11-ea/java.util.concurrent.ThreadPoolExecutor.runWorker(ThreadPoolExecutor.java:1114)         at java.base@11-ea/java.util.concurrent.ThreadPoolExecutor$Worker.run(ThreadPoolExecutor.java:628)         at java.base@11-ea/java.lang.Thread.run(Thread.java:834)    5) Thread[id=1547, name=TEST-StreamDecoratorTest.testParallelHavingStream-seed#[491AD2CEBF836003]-SendThread(127.0.0.1:45247), state=TIMED_WAITING, group=TGRP-StreamDecoratorTest]         at java.base@11-ea/java.lang.Thread.sleep(Native Method)         at app//org.apache.zookeeper.client.StaticHostProvider.next(StaticHostProvider.java:105)         at app//org.apache.zookeeper.ClientCnxn$SendThread.startConnect(ClientCnxn.java:1000)         at app//org.apache.zookeeper.ClientCnxn$SendThread.run(ClientCnxn.java:1063)    6) Thread[id=2258, name=TEST-StreamDecoratorTest.testParallelExecutorStream-seed#[491AD2CEBF836003]-SendThread(127.0.0.1:45247), state=TIMED_WAITING, group=TGRP-StreamDecoratorTest]         at java.base@11-ea/java.lang.Thread.sleep(Native Method)         at app//org.apache.zookeeper.ClientCnxn$SendThread.run(ClientCnxn.java:1054)    7) Thread[id=1588, name=Thread-65-SendThread(127.0.0.1:45247), state=TIMED_WAITING, group=TGRP-StreamDecoratorTest]         at java.base@11-ea/java.lang.Thread.sleep(Native Method)         at app//org.apache.zookeeper.client.StaticHostProvider.next(StaticHostProvider.java:105)         at app//org.apache.zookeeper.ClientCnxn$SendThread.startConnect(ClientCnxn.java:1000)         at app//org.apache.zookeeper.ClientCnxn$SendThread.run(ClientCnxn.java:1063)    8) Thread[id=447, name=TEST-StreamDecoratorTest.testExecutorStream-seed#[491AD2CEBF836003]-SendThread(127.0.0.1:45247), state=TIMED_WAITING, group=TGRP-StreamDecoratorTest]         at java.base@11-ea/java.lang.Thread.sleep(Native Method)         at app//org.apache.zookeeper.ClientCnxn$SendThread.run(ClientCnxn.java:1054)

Stack Trace:
com.carrotsearch.randomizedtesting.ThreadLeakError: There are still zombie threads that couldn't be terminated:
   1) Thread[id=449, name=zkConnectionManagerCallback-193-thread-1, state=WAITING, group=TGRP-StreamDecoratorTest]
        at java.base@11-ea/jdk.internal.misc.Unsafe.park(Native Method)
        at java.base@11-ea/java.util.concurrent.locks.LockSupport.park(LockSupport.java:194)
        at java.base@11-ea/java.util.concurrent.locks.AbstractQueuedSynchronizer$ConditionObject.await(AbstractQueuedSynchronizer.java:2081)
        at java.base@11-ea/java.util.concurrent.LinkedBlockingQueue.take(LinkedBlockingQueue.java:433)
        at java.base@11-ea/java.util.concurrent.ThreadPoolExecutor.getTask(ThreadPoolExecutor.java:1054)
        at java.base@11-ea/java.util.concurrent.ThreadPoolExecutor.runWorker(ThreadPoolExecutor.java:1114)
        at java.base@11-ea/java.util.concurrent.ThreadPoolExecutor$Worker.run(ThreadPoolExecutor.java:628)
        at java.base@11-ea/java.lang.Thread.run(Thread.java:834)
   2) Thread[id=2260, name=zkConnectionManagerCallback-1106-thread-1, state=WAITING, group=TGRP-StreamDecoratorTest]
        at java.base@11-ea/jdk.internal.misc.Unsafe.park(Native Method)
        at java.base@11-ea/java.util.concurrent.locks.LockSupport.park(LockSupport.java:194)
        at java.base@11-ea/java.util.concurrent.locks.AbstractQueuedSynchronizer$ConditionObject.await(AbstractQueuedSynchronizer.java:2081)
        at java.base@11-ea/java.util.concurrent.LinkedBlockingQueue.take(LinkedBlockingQueue.java:433)
        at java.base@11-ea/java.util.concurrent.ThreadPoolExecutor.getTask(ThreadPoolExecutor.java:1054)
        at java.base@11-ea/java.util.concurrent.ThreadPoolExecutor.runWorker(ThreadPoolExecutor.java:1114)
        at java.base@11-ea/java.util.concurrent.ThreadPoolExecutor$Worker.run(ThreadPoolExecutor.java:628)
        at java.base@11-ea/java.lang.Thread.run(Thread.java:834)
   3) Thread[id=1590, name=zkConnectionManagerCallback-752-thread-1, state=WAITING, group=TGRP-StreamDecoratorTest]
        at java.base@11-ea/jdk.internal.misc.Unsafe.park(Native Method)
        at java.base@11-ea/java.util.concurrent.locks.LockSupport.park(LockSupport.java:194)
        at java.base@11-ea/java.util.concurrent.locks.AbstractQueuedSynchronizer$ConditionObject.await(AbstractQueuedSynchronizer.java:2081)
        at java.base@11-ea/java.util.concurrent.LinkedBlockingQueue.take(LinkedBlockingQueue.java:433)
        at java.base@11-ea/java.util.concurrent.ThreadPoolExecutor.getTask(ThreadPoolExecutor.java:1054)
        at java.base@11-ea/java.util.concurrent.ThreadPoolExecutor.runWorker(ThreadPoolExecutor.java:1114)
        at java.base@11-ea/java.util.concurrent.ThreadPoolExecutor$Worker.run(ThreadPoolExecutor.java:628)
        at java.base@11-ea/java.lang.Thread.run(Thread.java:834)
   4) Thread[id=1549, name=zkConnectionManagerCallback-732-thread-1, state=WAITING, group=TGRP-StreamDecoratorTest]
        at java.base@11-ea/jdk.internal.misc.Unsafe.park(Native Method)
        at java.base@11-ea/java.util.concurrent.locks.LockSupport.park(LockSupport.java:194)
        at java.base@11-ea/java.util.concurrent.locks.AbstractQueuedSynchronizer$ConditionObject.await(AbstractQueuedSynchronizer.java:2081)
        at java.base@11-ea/java.util.concurrent.LinkedBlockingQueue.take(LinkedBlockingQueue.java:433)
        at java.base@11-ea/java.util.concurrent.ThreadPoolExecutor.getTask(ThreadPoolExecutor.java:1054)
        at java.base@11-ea/java.util.concurrent.ThreadPoolExecutor.runWorker(ThreadPoolExecutor.java:1114)
        at java.base@11-ea/java.util.concurrent.ThreadPoolExecutor$Worker.run(ThreadPoolExecutor.java:628)
        at java.base@11-ea/java.lang.Thread.run(Thread.java:834)
   5) Thread[id=1547, name=TEST-StreamDecoratorTest.testParallelHavingStream-seed#[491AD2CEBF836003]-SendThread(127.0.0.1:45247), state=TIMED_WAITING, group=TGRP-StreamDecoratorTest]
        at java.base@11-ea/java.lang.Thread.sleep(Native Method)
        at app//org.apache.zookeeper.client.StaticHostProvider.next(StaticHostProvider.java:105)
        at app//org.apache.zookeeper.ClientCnxn$SendThread.startConnect(ClientCnxn.java:1000)
        at app//org.apache.zookeeper.ClientCnxn$SendThread.run(ClientCnxn.java:1063)
   6) Thread[id=2258, name=TEST-StreamDecoratorTest.testParallelExecutorStream-seed#[491AD2CEBF836003]-SendThread(127.0.0.1:45247), state=TIMED_WAITING, group=TGRP-StreamDecoratorTest]
        at java.base@11-ea/java.lang.Thread.sleep(Native Method)
        at app//org.apache.zookeeper.ClientCnxn$SendThread.run(ClientCnxn.java:1054)
   7) Thread[id=1588, name=Thread-65-SendThread(127.0.0.1:45247), state=TIMED_WAITING, group=TGRP-StreamDecoratorTest]
        at java.base@11-ea/java.lang.Thread.sleep(Native Method)
        at app//org.apache.zookeeper.client.StaticHostProvider.next(StaticHostProvider.java:105)
        at app//org.apache.zookeeper.ClientCnxn$SendThread.startConnect(ClientCnxn.java:1000)
        at app//org.apache.zookeeper.ClientCnxn$SendThread.run(ClientCnxn.java:1063)
   8) Thread[id=447, name=TEST-StreamDecoratorTest.testExecutorStream-seed#[491AD2CEBF836003]-SendThread(127.0.0.1:45247), state=TIMED_WAITING, group=TGRP-StreamDecoratorTest]
        at java.base@11-ea/java.lang.Thread.sleep(Native Method)
        at app//org.apache.zookeeper.ClientCnxn$SendThread.run(ClientCnxn.java:1054)
	at __randomizedtesting.SeedInfo.seed([491AD2CEBF836003]:0)


FAILED:  junit.framework.TestSuite.org.apache.solr.client.solrj.io.stream.StreamDecoratorTest

Error Message:
20 threads leaked from SUITE scope at org.apache.solr.client.solrj.io.stream.StreamDecoratorTest:     1) Thread[id=449, name=TEST-StreamDecoratorTest.testExecutorStream-seed#[491AD2CEBF836003]-SendThread(127.0.0.1:44313), state=TIMED_WAITING, group=TGRP-StreamDecoratorTest]         at java.base@11-ea/java.lang.Thread.sleep(Native Method)         at app//org.apache.zookeeper.client.StaticHostProvider.next(StaticHostProvider.java:105)         at app//org.apache.zookeeper.ClientCnxn$SendThread.startConnect(ClientCnxn.java:1000)         at app//org.apache.zookeeper.ClientCnxn$SendThread.run(ClientCnxn.java:1063)    2) Thread[id=1546, name=Connection evictor, state=TIMED_WAITING, group=TGRP-StreamDecoratorTest]         at java.base@11-ea/java.lang.Thread.sleep(Native Method)         at app//org.apache.http.impl.client.IdleConnectionEvictor$1.run(IdleConnectionEvictor.java:66)         at java.base@11-ea/java.lang.Thread.run(Thread.java:834)    3) Thread[id=454, name=Connection evictor, state=TIMED_WAITING, group=TGRP-StreamDecoratorTest]         at java.base@11-ea/java.lang.Thread.sleep(Native Method)         at app//org.apache.http.impl.client.IdleConnectionEvictor$1.run(IdleConnectionEvictor.java:66)         at java.base@11-ea/java.lang.Thread.run(Thread.java:834)    4) Thread[id=1541, name=TEST-StreamDecoratorTest.testParallelHavingStream-seed#[491AD2CEBF836003]-SendThread(127.0.0.1:44313), state=TIMED_WAITING, group=TGRP-StreamDecoratorTest]         at java.base@11-ea/java.lang.Thread.sleep(Native Method)         at app//org.apache.zookeeper.client.StaticHostProvider.next(StaticHostProvider.java:105)         at app//org.apache.zookeeper.ClientCnxn$SendThread.startConnect(ClientCnxn.java:1000)         at app//org.apache.zookeeper.ClientCnxn$SendThread.run(ClientCnxn.java:1063)    5) Thread[id=2177, name=TEST-StreamDecoratorTest.testParallelExecutorStream-seed#[491AD2CEBF836003]-SendThread(127.0.0.1:44313), state=TIMED_WAITING, group=TGRP-StreamDecoratorTest]         at java.base@11-ea/java.lang.Thread.sleep(Native Method)         at app//org.apache.zookeeper.ClientCnxn$SendThread.run(ClientCnxn.java:1054)    6) Thread[id=2176, name=Connection evictor, state=TIMED_WAITING, group=TGRP-StreamDecoratorTest]         at java.base@11-ea/java.lang.Thread.sleep(Native Method)         at app//org.apache.http.impl.client.IdleConnectionEvictor$1.run(IdleConnectionEvictor.java:66)         at java.base@11-ea/java.lang.Thread.run(Thread.java:834)    7) Thread[id=461, name=Connection evictor, state=TIMED_WAITING, group=TGRP-StreamDecoratorTest]         at java.base@11-ea/java.lang.Thread.sleep(Native Method)         at app//org.apache.http.impl.client.IdleConnectionEvictor$1.run(IdleConnectionEvictor.java:66)         at java.base@11-ea/java.lang.Thread.run(Thread.java:834)    8) Thread[id=455, name=Connection evictor, state=TIMED_WAITING, group=TGRP-StreamDecoratorTest]         at java.base@11-ea/java.lang.Thread.sleep(Native Method)         at app//org.apache.http.impl.client.IdleConnectionEvictor$1.run(IdleConnectionEvictor.java:66)         at java.base@11-ea/java.lang.Thread.run(Thread.java:834)    9) Thread[id=2183, name=Connection evictor, state=TIMED_WAITING, group=TG

[...truncated too long message...]

icManager Closing metric reporters for registry=solr.cluster, tag=null
   [junit4]   2> 1425760 INFO  (zkCallback-3053-thread-2) [    ] o.a.s.c.c.ZkStateReader Updated live nodes from ZooKeeper... (1) -> (0)
   [junit4]   2> 1425760 INFO  (zkCallback-3076-thread-1) [    ] o.a.s.c.c.ZkStateReader Updated live nodes from ZooKeeper... (1) -> (0)
   [junit4]   2> 1425760 INFO  (jetty-closer-3034-thread-2) [    ] o.e.j.s.h.ContextHandler Stopped o.e.j.s.ServletContextHandler@23e5758e{/solr,null,UNAVAILABLE}
   [junit4]   2> 1425760 INFO  (jetty-closer-3034-thread-2) [    ] o.e.j.s.session node0 Stopped scavenging
   [junit4]   2> 1425760 ERROR (SUITE-CustomHighlightComponentTest-seed#[733256A0DDCE845B]-worker) [    ] o.a.z.s.ZooKeeperServer ZKShutdownHandler is not registered, so ZooKeeper server won't take any action on ERROR or SHUTDOWN server state changes
   [junit4]   2> 1425761 INFO  (SUITE-CustomHighlightComponentTest-seed#[733256A0DDCE845B]-worker) [    ] o.a.s.c.ZkTestServer connecting to 127.0.0.1:43421 43421
   [junit4]   2> 1425883 INFO  (Thread-1674) [    ] o.a.s.c.ZkTestServer connecting to 127.0.0.1:43421 43421
   [junit4]   2> 1425883 WARN  (Thread-1674) [    ] o.a.s.c.ZkTestServer Watch limit violations: 
   [junit4]   2> Maximum concurrent create/delete watches above limit:
   [junit4]   2> 
   [junit4]   2> 	9	/solr/collections/collection27/terms/shard2
   [junit4]   2> 	7	/solr/aliases.json
   [junit4]   2> 	7	/solr/collections/collection27/terms/shard3
   [junit4]   2> 	3	/solr/security.json
   [junit4]   2> 	3	/solr/configs/conf
   [junit4]   2> 	2	/solr/collections/collection27/terms/shard1
   [junit4]   2> 
   [junit4]   2> Maximum concurrent data watches above limit:
   [junit4]   2> 
   [junit4]   2> 	7	/solr/collections/collection27/state.json
   [junit4]   2> 	7	/solr/clusterstate.json
   [junit4]   2> 	7	/solr/clusterprops.json
   [junit4]   2> 
   [junit4]   2> Maximum concurrent children watches above limit:
   [junit4]   2> 
   [junit4]   2> 	7	/solr/live_nodes
   [junit4]   2> 	7	/solr/collections
   [junit4]   2> 
   [junit4]   2> 1425883 INFO  (SUITE-CustomHighlightComponentTest-seed#[733256A0DDCE845B]-worker) [    ] o.a.s.SolrTestCaseJ4 ------------------------------------------------------- Done waiting for tracked resources to be released
   [junit4]   2> Jul 12, 2018 2:12:39 PM com.carrotsearch.randomizedtesting.ThreadLeakControl checkThreadLeaks
   [junit4]   2> WARNING: Will linger awaiting termination of 1 leaked thread(s).
   [junit4]   2> NOTE: test params are: codec=Asserting(Lucene70): {}, docValues:{}, maxPointsInLeafNode=1867, maxMBSortInHeap=6.360649646976705, sim=Asserting(org.apache.lucene.search.similarities.AssertingSimilarity@3172f29e), locale=se-SE, timezone=America/Coral_Harbour
   [junit4]   2> NOTE: Linux 4.15.0-24-generic amd64/Oracle Corporation 11-ea (64-bit)/cpus=8,threads=1,free=198296520,total=455606272
   [junit4]   2> NOTE: All tests run in this JVM: [TestDynamicLoading, AutoAddReplicasIntegrationTest, SolrCloudExampleTest, ZkShardTermsTest, TestPullReplica, TestMiniSolrCloudClusterSSL, SolrJmxReporterCloudTest, TestReqParamsAPI, AutoAddReplicasIntegrationTest, TestLocalFSCloudBackupRestore, TestInPlaceUpdatesDistrib, SolrJmxReporterCloudTest, CdcrBidirectionalTest, TestReqParamsAPI, SolrCloudReportersTest, TestInPlaceUpdatesDistrib, SolrCloudReportersTest, TestPullReplica, ZkShardTermsTest, TestMiniSolrCloudClusterSSL, AutoscalingHistoryHandlerTest, AutoscalingHistoryHandlerTest, AutoscalingHistoryHandlerTest, TestCloudRecovery, TestLocalFSCloudBackupRestore, CdcrBidirectionalTest, TestInPlaceUpdatesDistrib, TestDynamicLoading, SolrCloudExampleTest, TestNamedUpdateProcessors, TestConfigReload, CustomHighlightComponentTest]
   [junit4]   2> NOTE: reproduce with: ant test  -Dtestcase=CustomHighlightComponentTest -Dtests.seed=733256A0DDCE845B -Dtests.multiplier=3 -Dtests.slow=true -Dtests.badapples=true -Dtests.locale=se-SE -Dtests.timezone=America/Coral_Harbour -Dtests.asserts=true -Dtests.file.encoding=ISO-8859-1
   [junit4] ERROR   0.00s J1 | CustomHighlightComponentTest (suite) <<<
   [junit4]    > Throwable #1: java.lang.AssertionError: Could not find collection:collection27
   [junit4]    > 	at __randomizedtesting.SeedInfo.seed([733256A0DDCE845B]:0)
   [junit4]    > 	at org.apache.solr.cloud.AbstractDistribZkTestBase.waitForRecoveriesToFinish(AbstractDistribZkTestBase.java:155)
   [junit4]    > 	at org.apache.solr.handler.component.CustomHighlightComponentTest.setupCluster(CustomHighlightComponentTest.java:125)
   [junit4]    > 	at java.base/jdk.internal.reflect.NativeMethodAccessorImpl.invoke0(Native Method)
   [junit4]    > 	at java.base/jdk.internal.reflect.NativeMethodAccessorImpl.invoke(NativeMethodAccessorImpl.java:62)
   [junit4]    > 	at java.base/jdk.internal.reflect.DelegatingMethodAccessorImpl.invoke(DelegatingMethodAccessorImpl.java:43)
   [junit4]    > 	at java.base/java.lang.reflect.Method.invoke(Method.java:566)
   [junit4]    > 	at java.base/java.lang.Thread.run(Thread.java:834)
   [junit4] Completed [105/105 (75!)] on J1 in 5.72s, 0 tests, 1 failure <<< FAILURES!
   [junit4] 
   [junit4] 
   [junit4] Tests with failures [seed: 733256A0DDCE845B] (first 10 out of 125):
   [junit4]   - org.apache.solr.update.processor.TestNamedUpdateProcessors.test
   [junit4]   - org.apache.solr.core.TestDynamicLoading.testDynamicLoading
   [junit4]   - org.apache.solr.cloud.SolrCloudExampleTest.testLoadDocsIntoGettingStartedCollection
   [junit4]   - org.apache.solr.handler.TestSolrConfigHandlerCloud.test
   [junit4]   - org.apache.solr.handler.TestConfigReload.test
   [junit4]   - org.apache.solr.cloud.cdcr.CdcrBidirectionalTest.testBiDir
   [junit4]   - org.apache.solr.handler.TestSolrConfigHandlerCloud.test
   [junit4]   - org.apache.solr.handler.TestReqParamsAPI.test
   [junit4]   - org.apache.solr.cloud.TestConfigSetsAPI.testUploadDisabled
   [junit4]   - org.apache.solr.cloud.TestConfigSetsAPI.testUpload
   [junit4] 
   [junit4] 
   [junit4] JVM J0:     0.72 ..  1425.10 =  1424.37s
   [junit4] JVM J1:     0.72 ..  1426.66 =  1425.93s
   [junit4] JVM J2:     0.73 ..  1425.30 =  1424.57s
   [junit4] Execution time total: 23 minutes 46 seconds
   [junit4] Tests summary: 105 suites, 272 tests, 11 suite-level errors, 88 errors, 26 failures, 5 ignored

BUILD FAILED
/home/jenkins/workspace/Lucene-Solr-master-Linux/lucene/common-build.xml:1568: The following error occurred while executing this line:
/home/jenkins/workspace/Lucene-Solr-master-Linux/lucene/common-build.xml:1092: There were test failures: 105 suites, 272 tests, 11 suite-level errors, 88 errors, 26 failures, 5 ignored [seed: 733256A0DDCE845B]

Total time: 23 minutes 48 seconds

[repro] Setting last failure code to 256

[repro] Failures:
[repro]   0/5 failed: org.apache.solr.update.TestInPlaceUpdatesDistrib
[repro]   1/5 failed: org.apache.solr.client.solrj.io.graph.GraphExpressionTest
[repro]   1/5 failed: org.apache.solr.cloud.autoscaling.AutoAddReplicasIntegrationTest
[repro]   1/5 failed: org.apache.solr.handler.component.CustomHighlightComponentTest
[repro]   1/5 failed: org.apache.solr.metrics.reporters.SolrJmxReporterCloudTest
[repro]   2/5 failed: org.apache.solr.client.solrj.io.stream.StreamDecoratorTest
[repro]   2/5 failed: org.apache.solr.cloud.TestCloudRecovery
[repro]   2/5 failed: org.apache.solr.cloud.ZkShardTermsTest
[repro]   2/5 failed: org.apache.solr.metrics.reporters.solr.SolrCloudReportersTest
[repro]   3/5 failed: org.apache.solr.client.solrj.SolrSchemalessExampleTest
[repro]   3/5 failed: org.apache.solr.cloud.api.collections.TestLocalFSCloudBackupRestore
[repro]   3/5 failed: org.apache.solr.handler.admin.AutoscalingHistoryHandlerTest
[repro]   5/5 failed: org.apache.solr.cloud.SolrCloudExampleTest
[repro]   5/5 failed: org.apache.solr.cloud.TestConfigSetsAPI
[repro]   5/5 failed: org.apache.solr.cloud.TestMiniSolrCloudClusterSSL
[repro]   5/5 failed: org.apache.solr.cloud.TestPullReplica
[repro]   5/5 failed: org.apache.solr.cloud.cdcr.CdcrBidirectionalTest
[repro]   5/5 failed: org.apache.solr.core.TestDynamicLoading
[repro]   5/5 failed: org.apache.solr.handler.TestConfigReload
[repro]   5/5 failed: org.apache.solr.handler.TestReqParamsAPI
[repro]   5/5 failed: org.apache.solr.handler.TestSolrConfigHandlerCloud
[repro]   5/5 failed: org.apache.solr.security.BasicAuthStandaloneTest
[repro]   5/5 failed: org.apache.solr.servlet.NoCacheHeaderTest
[repro]   5/5 failed: org.apache.solr.update.processor.TestNamedUpdateProcessors
[repro] Exiting with code 256
+ mv lucene/build lucene/build.repro
+ mv solr/build solr/build.repro
+ mv lucene/build.orig lucene/build
+ mv solr/build.orig solr/build
Archiving artifacts
Setting ANT_1_8_2_HOME=/var/lib/jenkins/tools/hudson.tasks.Ant_AntInstallation/ANT_1.8.2
[WARNINGS] Parsing warnings in console log with parser Java Compiler (javac)
Setting ANT_1_8_2_HOME=/var/lib/jenkins/tools/hudson.tasks.Ant_AntInstallation/ANT_1.8.2
Setting ANT_1_8_2_HOME=/var/lib/jenkins/tools/hudson.tasks.Ant_AntInstallation/ANT_1.8.2
<Git Blamer> Using GitBlamer to create author and commit information for all warnings.
<Git Blamer> GIT_COMMIT=8997d41357ab95eaa88702b93c75de4b1813457b, workspace=/var/lib/jenkins/workspace/Lucene-Solr-master-Linux
[WARNINGS] Computing warning deltas based on reference build #22440
Recording test results
Setting ANT_1_8_2_HOME=/var/lib/jenkins/tools/hudson.tasks.Ant_AntInstallation/ANT_1.8.2
Build step 'Publish JUnit test result report' changed build result to UNSTABLE
Email was triggered for: Unstable (Test Failures)
Sending email for trigger: Unstable (Test Failures)
Setting ANT_1_8_2_HOME=/var/lib/jenkins/tools/hudson.tasks.Ant_AntInstallation/ANT_1.8.2
Setting ANT_1_8_2_HOME=/var/lib/jenkins/tools/hudson.tasks.Ant_AntInstallation/ANT_1.8.2
Setting ANT_1_8_2_HOME=/var/lib/jenkins/tools/hudson.tasks.Ant_AntInstallation/ANT_1.8.2
Setting ANT_1_8_2_HOME=/var/lib/jenkins/tools/hudson.tasks.Ant_AntInstallation/ANT_1.8.2

Mime
View raw message