lucene-dev mailing list archives

Site index · List index
Message view « Date » · « Thread »
Top « Date » · « Thread »
From Apache Jenkins Server <jenk...@builds.apache.org>
Subject [JENKINS] Lucene-Solr-NightlyTests-7.x - Build # 253 - Still unstable
Date Mon, 02 Jul 2018 06:12:22 GMT
Build: https://builds.apache.org/job/Lucene-Solr-NightlyTests-7.x/253/

6 tests failed.
FAILED:  org.apache.lucene.analysis.core.TestRandomChains.testRandomChains

Error Message:
last stage: inconsistent startOffset at pos=2: 12 vs 15; token=<ALPHANUM>word

Stack Trace:
java.lang.IllegalStateException: last stage: inconsistent startOffset at pos=2: 12 vs 15; token=<ALPHANUM>word
	at __randomizedtesting.SeedInfo.seed([E5D6D73E34CFBE1F:D837FE5F73DDA3DF]:0)
	at org.apache.lucene.analysis.ValidatingTokenFilter.incrementToken(ValidatingTokenFilter.java:109)
	at org.apache.lucene.analysis.BaseTokenStreamTestCase.checkAnalysisConsistency(BaseTokenStreamTestCase.java:748)
	at org.apache.lucene.analysis.BaseTokenStreamTestCase.checkRandomData(BaseTokenStreamTestCase.java:659)
	at org.apache.lucene.analysis.BaseTokenStreamTestCase.checkRandomData(BaseTokenStreamTestCase.java:561)
	at org.apache.lucene.analysis.core.TestRandomChains.testRandomChains(TestRandomChains.java:866)
	at sun.reflect.NativeMethodAccessorImpl.invoke0(Native Method)
	at sun.reflect.NativeMethodAccessorImpl.invoke(NativeMethodAccessorImpl.java:62)
	at sun.reflect.DelegatingMethodAccessorImpl.invoke(DelegatingMethodAccessorImpl.java:43)
	at java.lang.reflect.Method.invoke(Method.java:498)
	at com.carrotsearch.randomizedtesting.RandomizedRunner.invoke(RandomizedRunner.java:1737)
	at com.carrotsearch.randomizedtesting.RandomizedRunner$8.evaluate(RandomizedRunner.java:934)
	at com.carrotsearch.randomizedtesting.RandomizedRunner$9.evaluate(RandomizedRunner.java:970)
	at com.carrotsearch.randomizedtesting.RandomizedRunner$10.evaluate(RandomizedRunner.java:984)
	at org.apache.lucene.util.TestRuleSetupTeardownChained$1.evaluate(TestRuleSetupTeardownChained.java:49)
	at org.apache.lucene.util.AbstractBeforeAfterRule$1.evaluate(AbstractBeforeAfterRule.java:45)
	at org.apache.lucene.util.TestRuleThreadAndTestName$1.evaluate(TestRuleThreadAndTestName.java:48)
	at org.apache.lucene.util.TestRuleIgnoreAfterMaxFailures$1.evaluate(TestRuleIgnoreAfterMaxFailures.java:64)
	at org.apache.lucene.util.TestRuleMarkFailure$1.evaluate(TestRuleMarkFailure.java:47)
	at com.carrotsearch.randomizedtesting.rules.StatementAdapter.evaluate(StatementAdapter.java:36)
	at com.carrotsearch.randomizedtesting.ThreadLeakControl$StatementRunner.run(ThreadLeakControl.java:368)
	at com.carrotsearch.randomizedtesting.ThreadLeakControl.forkTimeoutingTask(ThreadLeakControl.java:817)
	at com.carrotsearch.randomizedtesting.ThreadLeakControl$3.evaluate(ThreadLeakControl.java:468)
	at com.carrotsearch.randomizedtesting.RandomizedRunner.runSingleTest(RandomizedRunner.java:943)
	at com.carrotsearch.randomizedtesting.RandomizedRunner$5.evaluate(RandomizedRunner.java:829)
	at com.carrotsearch.randomizedtesting.RandomizedRunner$6.evaluate(RandomizedRunner.java:879)
	at com.carrotsearch.randomizedtesting.RandomizedRunner$7.evaluate(RandomizedRunner.java:890)
	at org.apache.lucene.util.AbstractBeforeAfterRule$1.evaluate(AbstractBeforeAfterRule.java:45)
	at com.carrotsearch.randomizedtesting.rules.StatementAdapter.evaluate(StatementAdapter.java:36)
	at org.apache.lucene.util.TestRuleStoreClassName$1.evaluate(TestRuleStoreClassName.java:41)
	at com.carrotsearch.randomizedtesting.rules.NoShadowingOrOverridesOnMethodsRule$1.evaluate(NoShadowingOrOverridesOnMethodsRule.java:40)
	at com.carrotsearch.randomizedtesting.rules.NoShadowingOrOverridesOnMethodsRule$1.evaluate(NoShadowingOrOverridesOnMethodsRule.java:40)
	at com.carrotsearch.randomizedtesting.rules.StatementAdapter.evaluate(StatementAdapter.java:36)
	at com.carrotsearch.randomizedtesting.rules.StatementAdapter.evaluate(StatementAdapter.java:36)
	at com.carrotsearch.randomizedtesting.rules.StatementAdapter.evaluate(StatementAdapter.java:36)
	at org.apache.lucene.util.TestRuleAssertionsRequired$1.evaluate(TestRuleAssertionsRequired.java:53)
	at org.apache.lucene.util.TestRuleMarkFailure$1.evaluate(TestRuleMarkFailure.java:47)
	at org.apache.lucene.util.TestRuleIgnoreAfterMaxFailures$1.evaluate(TestRuleIgnoreAfterMaxFailures.java:64)
	at org.apache.lucene.util.TestRuleIgnoreTestSuites$1.evaluate(TestRuleIgnoreTestSuites.java:54)
	at com.carrotsearch.randomizedtesting.rules.StatementAdapter.evaluate(StatementAdapter.java:36)
	at com.carrotsearch.randomizedtesting.ThreadLeakControl$StatementRunner.run(ThreadLeakControl.java:368)
	at java.lang.Thread.run(Thread.java:748)


FAILED:  junit.framework.TestSuite.org.apache.solr.handler.admin.AutoscalingHistoryHandlerTest

Error Message:
Could not find collection : AutoscalingHistoryHandlerTest_collection

Stack Trace:
org.apache.solr.common.SolrException: Could not find collection : AutoscalingHistoryHandlerTest_collection
	at __randomizedtesting.SeedInfo.seed([35343B2071AF1737]:0)
	at org.apache.solr.common.cloud.ClusterState.getCollection(ClusterState.java:118)
	at org.apache.solr.cloud.SolrCloudTestCase.getCollectionState(SolrCloudTestCase.java:256)
	at org.apache.solr.handler.admin.AutoscalingHistoryHandlerTest.waitForRecovery(AutoscalingHistoryHandlerTest.java:403)
	at org.apache.solr.handler.admin.AutoscalingHistoryHandlerTest.setupCluster(AutoscalingHistoryHandlerTest.java:97)
	at sun.reflect.NativeMethodAccessorImpl.invoke0(Native Method)
	at sun.reflect.NativeMethodAccessorImpl.invoke(NativeMethodAccessorImpl.java:62)
	at sun.reflect.DelegatingMethodAccessorImpl.invoke(DelegatingMethodAccessorImpl.java:43)
	at java.lang.reflect.Method.invoke(Method.java:498)
	at com.carrotsearch.randomizedtesting.RandomizedRunner.invoke(RandomizedRunner.java:1737)
	at com.carrotsearch.randomizedtesting.RandomizedRunner$6.evaluate(RandomizedRunner.java:874)
	at com.carrotsearch.randomizedtesting.RandomizedRunner$7.evaluate(RandomizedRunner.java:890)
	at com.carrotsearch.randomizedtesting.rules.StatementAdapter.evaluate(StatementAdapter.java:36)
	at com.carrotsearch.randomizedtesting.rules.SystemPropertiesRestoreRule$1.evaluate(SystemPropertiesRestoreRule.java:57)
	at org.apache.lucene.util.AbstractBeforeAfterRule$1.evaluate(AbstractBeforeAfterRule.java:45)
	at com.carrotsearch.randomizedtesting.rules.StatementAdapter.evaluate(StatementAdapter.java:36)
	at org.apache.lucene.util.TestRuleStoreClassName$1.evaluate(TestRuleStoreClassName.java:41)
	at com.carrotsearch.randomizedtesting.rules.NoShadowingOrOverridesOnMethodsRule$1.evaluate(NoShadowingOrOverridesOnMethodsRule.java:40)
	at com.carrotsearch.randomizedtesting.rules.NoShadowingOrOverridesOnMethodsRule$1.evaluate(NoShadowingOrOverridesOnMethodsRule.java:40)
	at com.carrotsearch.randomizedtesting.rules.StatementAdapter.evaluate(StatementAdapter.java:36)
	at com.carrotsearch.randomizedtesting.rules.StatementAdapter.evaluate(StatementAdapter.java:36)
	at com.carrotsearch.randomizedtesting.rules.StatementAdapter.evaluate(StatementAdapter.java:36)
	at org.apache.lucene.util.TestRuleAssertionsRequired$1.evaluate(TestRuleAssertionsRequired.java:53)
	at org.apache.lucene.util.TestRuleMarkFailure$1.evaluate(TestRuleMarkFailure.java:47)
	at org.apache.lucene.util.TestRuleIgnoreAfterMaxFailures$1.evaluate(TestRuleIgnoreAfterMaxFailures.java:64)
	at org.apache.lucene.util.TestRuleIgnoreTestSuites$1.evaluate(TestRuleIgnoreTestSuites.java:54)
	at com.carrotsearch.randomizedtesting.rules.StatementAdapter.evaluate(StatementAdapter.java:36)
	at com.carrotsearch.randomizedtesting.ThreadLeakControl$StatementRunner.run(ThreadLeakControl.java:368)
	at java.lang.Thread.run(Thread.java:748)


FAILED:  org.apache.solr.client.solrj.impl.CloudSolrClientTest.preferLocalShardsTest

Error Message:
Could not load collection from ZK: localShardsTestColl

Stack Trace:
org.apache.solr.common.SolrException: Could not load collection from ZK: localShardsTestColl
	at __randomizedtesting.SeedInfo.seed([542AC76723C69E7E:A8E75FDEDD110984]:0)
	at org.apache.solr.common.cloud.ZkStateReader.getCollectionLive(ZkStateReader.java:1316)
	at org.apache.solr.common.cloud.ZkStateReader$LazyCollectionRef.get(ZkStateReader.java:732)
	at org.apache.solr.common.cloud.ClusterState.getCollectionOrNull(ClusterState.java:148)
	at org.apache.solr.common.cloud.ClusterState.getCollectionOrNull(ClusterState.java:131)
	at org.apache.solr.cloud.AbstractDistribZkTestBase.waitForRecoveriesToFinish(AbstractDistribZkTestBase.java:154)
	at org.apache.solr.client.solrj.impl.CloudSolrClientTest.preferLocalShardsTest(CloudSolrClientTest.java:409)
	at sun.reflect.NativeMethodAccessorImpl.invoke0(Native Method)
	at sun.reflect.NativeMethodAccessorImpl.invoke(NativeMethodAccessorImpl.java:62)
	at sun.reflect.DelegatingMethodAccessorImpl.invoke(DelegatingMethodAccessorImpl.java:43)
	at java.lang.reflect.Method.invoke(Method.java:498)
	at com.carrotsearch.randomizedtesting.RandomizedRunner.invoke(RandomizedRunner.java:1737)
	at com.carrotsearch.randomizedtesting.RandomizedRunner$8.evaluate(RandomizedRunner.java:934)
	at com.carrotsearch.randomizedtesting.RandomizedRunner$9.evaluate(RandomizedRunner.java:970)
	at com.carrotsearch.randomizedtesting.RandomizedRunner$10.evaluate(RandomizedRunner.java:984)
	at org.junit.rules.ExpectedException$ExpectedExceptionStatement.evaluate(ExpectedException.java:110)
	at com.carrotsearch.randomizedtesting.rules.SystemPropertiesRestoreRule$1.evaluate(SystemPropertiesRestoreRule.java:57)
	at org.apache.lucene.util.TestRuleSetupTeardownChained$1.evaluate(TestRuleSetupTeardownChained.java:49)
	at org.apache.lucene.util.AbstractBeforeAfterRule$1.evaluate(AbstractBeforeAfterRule.java:45)
	at org.apache.lucene.util.TestRuleThreadAndTestName$1.evaluate(TestRuleThreadAndTestName.java:48)
	at org.apache.lucene.util.TestRuleIgnoreAfterMaxFailures$1.evaluate(TestRuleIgnoreAfterMaxFailures.java:64)
	at org.apache.lucene.util.TestRuleMarkFailure$1.evaluate(TestRuleMarkFailure.java:47)
	at com.carrotsearch.randomizedtesting.rules.StatementAdapter.evaluate(StatementAdapter.java:36)
	at com.carrotsearch.randomizedtesting.ThreadLeakControl$StatementRunner.run(ThreadLeakControl.java:368)
	at com.carrotsearch.randomizedtesting.ThreadLeakControl.forkTimeoutingTask(ThreadLeakControl.java:817)
	at com.carrotsearch.randomizedtesting.ThreadLeakControl$3.evaluate(ThreadLeakControl.java:468)
	at com.carrotsearch.randomizedtesting.RandomizedRunner.runSingleTest(RandomizedRunner.java:943)
	at com.carrotsearch.randomizedtesting.RandomizedRunner$5.evaluate(RandomizedRunner.java:829)
	at com.carrotsearch.randomizedtesting.RandomizedRunner$6.evaluate(RandomizedRunner.java:879)
	at com.carrotsearch.randomizedtesting.RandomizedRunner$7.evaluate(RandomizedRunner.java:890)
	at com.carrotsearch.randomizedtesting.rules.StatementAdapter.evaluate(StatementAdapter.java:36)
	at com.carrotsearch.randomizedtesting.rules.SystemPropertiesRestoreRule$1.evaluate(SystemPropertiesRestoreRule.java:57)
	at org.apache.lucene.util.AbstractBeforeAfterRule$1.evaluate(AbstractBeforeAfterRule.java:45)
	at com.carrotsearch.randomizedtesting.rules.StatementAdapter.evaluate(StatementAdapter.java:36)
	at org.apache.lucene.util.TestRuleStoreClassName$1.evaluate(TestRuleStoreClassName.java:41)
	at com.carrotsearch.randomizedtesting.rules.NoShadowingOrOverridesOnMethodsRule$1.evaluate(NoShadowingOrOverridesOnMethodsRule.java:40)
	at com.carrotsearch.randomizedtesting.rules.NoShadowingOrOverridesOnMethodsRule$1.evaluate(NoShadowingOrOverridesOnMethodsRule.java:40)
	at com.carrotsearch.randomizedtesting.rules.StatementAdapter.evaluate(StatementAdapter.java:36)
	at com.carrotsearch.randomizedtesting.rules.StatementAdapter.evaluate(StatementAdapter.java:36)
	at com.carrotsearch.randomizedtesting.rules.StatementAdapter.evaluate(StatementAdapter.java:36)
	at org.apache.lucene.util.TestRuleAssertionsRequired$1.evaluate(TestRuleAssertionsRequired.java:53)
	at org.apache.lucene.util.TestRuleMarkFailure$1.evaluate(TestRuleMarkFailure.java:47)
	at org.apache.lucene.util.TestRuleIgnoreAfterMaxFailures$1.evaluate(TestRuleIgnoreAfterMaxFailures.java:64)
	at org.apache.lucene.util.TestRuleIgnoreTestSuites$1.evaluate(TestRuleIgnoreTestSuites.java:54)
	at com.carrotsearch.randomizedtesting.rules.StatementAdapter.evaluate(StatementAdapter.java:36)
	at com.carrotsearch.randomizedtesting.ThreadLeakControl$StatementRunner.run(ThreadLeakControl.java:368)
	at java.lang.Thread.run(Thread.java:748)
Caused by: org.apache.zookeeper.KeeperException$SessionExpiredException: KeeperErrorCode = Session expired for /collections/localShardsTestColl/state.json
	at org.apache.zookeeper.KeeperException.create(KeeperException.java:130)
	at org.apache.zookeeper.KeeperException.create(KeeperException.java:54)
	at org.apache.zookeeper.ZooKeeper.getData(ZooKeeper.java:1215)
	at org.apache.solr.common.cloud.SolrZkClient.lambda$getData$5(SolrZkClient.java:341)
	at org.apache.solr.common.cloud.ZkCmdExecutor.retryOperation(ZkCmdExecutor.java:60)
	at org.apache.solr.common.cloud.SolrZkClient.getData(SolrZkClient.java:341)
	at org.apache.solr.common.cloud.ZkStateReader.fetchCollectionState(ZkStateReader.java:1328)
	at org.apache.solr.common.cloud.ZkStateReader.getCollectionLive(ZkStateReader.java:1314)
	... 45 more


FAILED:  org.apache.solr.client.solrj.io.stream.StreamDecoratorTest.testExecutorStream

Error Message:


Stack Trace:
java.lang.AssertionError
	at __randomizedtesting.SeedInfo.seed([542AC76723C69E7E:76EA469C00ACB46E]:0)
	at org.junit.Assert.fail(Assert.java:92)
	at org.junit.Assert.assertTrue(Assert.java:43)
	at org.junit.Assert.assertTrue(Assert.java:54)
	at org.apache.solr.client.solrj.io.stream.StreamDecoratorTest.testExecutorStream(StreamDecoratorTest.java:3535)
	at sun.reflect.NativeMethodAccessorImpl.invoke0(Native Method)
	at sun.reflect.NativeMethodAccessorImpl.invoke(NativeMethodAccessorImpl.java:62)
	at sun.reflect.DelegatingMethodAccessorImpl.invoke(DelegatingMethodAccessorImpl.java:43)
	at java.lang.reflect.Method.invoke(Method.java:498)
	at com.carrotsearch.randomizedtesting.RandomizedRunner.invoke(RandomizedRunner.java:1737)
	at com.carrotsearch.randomizedtesting.RandomizedRunner$8.evaluate(RandomizedRunner.java:934)
	at com.carrotsearch.randomizedtesting.RandomizedRunner$9.evaluate(RandomizedRunner.java:970)
	at com.carrotsearch.randomizedtesting.RandomizedRunner$10.evaluate(RandomizedRunner.java:984)
	at com.carrotsearch.randomizedtesting.rules.SystemPropertiesRestoreRule$1.evaluate(SystemPropertiesRestoreRule.java:57)
	at org.apache.lucene.util.TestRuleSetupTeardownChained$1.evaluate(TestRuleSetupTeardownChained.java:49)
	at org.apache.lucene.util.AbstractBeforeAfterRule$1.evaluate(AbstractBeforeAfterRule.java:45)
	at org.apache.lucene.util.TestRuleThreadAndTestName$1.evaluate(TestRuleThreadAndTestName.java:48)
	at org.apache.lucene.util.TestRuleIgnoreAfterMaxFailures$1.evaluate(TestRuleIgnoreAfterMaxFailures.java:64)
	at org.apache.lucene.util.TestRuleMarkFailure$1.evaluate(TestRuleMarkFailure.java:47)
	at com.carrotsearch.randomizedtesting.rules.StatementAdapter.evaluate(StatementAdapter.java:36)
	at com.carrotsearch.randomizedtesting.ThreadLeakControl$StatementRunner.run(ThreadLeakControl.java:368)
	at com.carrotsearch.randomizedtesting.ThreadLeakControl.forkTimeoutingTask(ThreadLeakControl.java:817)
	at com.carrotsearch.randomizedtesting.ThreadLeakControl$3.evaluate(ThreadLeakControl.java:468)
	at com.carrotsearch.randomizedtesting.RandomizedRunner.runSingleTest(RandomizedRunner.java:943)
	at com.carrotsearch.randomizedtesting.RandomizedRunner$5.evaluate(RandomizedRunner.java:829)
	at com.carrotsearch.randomizedtesting.RandomizedRunner$6.evaluate(RandomizedRunner.java:879)
	at com.carrotsearch.randomizedtesting.RandomizedRunner$7.evaluate(RandomizedRunner.java:890)
	at com.carrotsearch.randomizedtesting.rules.StatementAdapter.evaluate(StatementAdapter.java:36)
	at com.carrotsearch.randomizedtesting.rules.SystemPropertiesRestoreRule$1.evaluate(SystemPropertiesRestoreRule.java:57)
	at org.apache.lucene.util.AbstractBeforeAfterRule$1.evaluate(AbstractBeforeAfterRule.java:45)
	at com.carrotsearch.randomizedtesting.rules.StatementAdapter.evaluate(StatementAdapter.java:36)
	at org.apache.lucene.util.TestRuleStoreClassName$1.evaluate(TestRuleStoreClassName.java:41)
	at com.carrotsearch.randomizedtesting.rules.NoShadowingOrOverridesOnMethodsRule$1.evaluate(NoShadowingOrOverridesOnMethodsRule.java:40)
	at com.carrotsearch.randomizedtesting.rules.NoShadowingOrOverridesOnMethodsRule$1.evaluate(NoShadowingOrOverridesOnMethodsRule.java:40)
	at com.carrotsearch.randomizedtesting.rules.StatementAdapter.evaluate(StatementAdapter.java:36)
	at com.carrotsearch.randomizedtesting.rules.StatementAdapter.evaluate(StatementAdapter.java:36)
	at com.carrotsearch.randomizedtesting.rules.StatementAdapter.evaluate(StatementAdapter.java:36)
	at org.apache.lucene.util.TestRuleAssertionsRequired$1.evaluate(TestRuleAssertionsRequired.java:53)
	at org.apache.lucene.util.TestRuleMarkFailure$1.evaluate(TestRuleMarkFailure.java:47)
	at org.apache.lucene.util.TestRuleIgnoreAfterMaxFailures$1.evaluate(TestRuleIgnoreAfterMaxFailures.java:64)
	at org.apache.lucene.util.TestRuleIgnoreTestSuites$1.evaluate(TestRuleIgnoreTestSuites.java:54)
	at com.carrotsearch.randomizedtesting.rules.StatementAdapter.evaluate(StatementAdapter.java:36)
	at com.carrotsearch.randomizedtesting.ThreadLeakControl$StatementRunner.run(ThreadLeakControl.java:368)
	at java.lang.Thread.run(Thread.java:748)


FAILED:  junit.framework.TestSuite.org.apache.solr.client.solrj.io.stream.StreamDecoratorTest

Error Message:
8 threads leaked from SUITE scope at org.apache.solr.client.solrj.io.stream.StreamDecoratorTest:     1) Thread[id=394, name=Connection evictor, state=TIMED_WAITING, group=TGRP-StreamDecoratorTest]         at java.lang.Thread.sleep(Native Method)         at org.apache.http.impl.client.IdleConnectionEvictor$1.run(IdleConnectionEvictor.java:66)         at java.lang.Thread.run(Thread.java:748)    2) Thread[id=405, name=Connection evictor, state=TIMED_WAITING, group=TGRP-StreamDecoratorTest]         at java.lang.Thread.sleep(Native Method)         at org.apache.http.impl.client.IdleConnectionEvictor$1.run(IdleConnectionEvictor.java:66)         at java.lang.Thread.run(Thread.java:748)    3) Thread[id=786, name=zkConnectionManagerCallback-151-thread-1-SendThread(127.0.0.1:39479), state=TIMED_WAITING, group=TGRP-StreamDecoratorTest]         at java.lang.Thread.sleep(Native Method)         at org.apache.zookeeper.client.StaticHostProvider.next(StaticHostProvider.java:105)         at org.apache.zookeeper.ClientCnxn$SendThread.startConnect(ClientCnxn.java:1000)         at org.apache.zookeeper.ClientCnxn$SendThread.run(ClientCnxn.java:1063)    4) Thread[id=387, name=Connection evictor, state=TIMED_WAITING, group=TGRP-StreamDecoratorTest]         at java.lang.Thread.sleep(Native Method)         at org.apache.http.impl.client.IdleConnectionEvictor$1.run(IdleConnectionEvictor.java:66)         at java.lang.Thread.run(Thread.java:748)    5) Thread[id=404, name=Connection evictor, state=TIMED_WAITING, group=TGRP-StreamDecoratorTest]         at java.lang.Thread.sleep(Native Method)         at org.apache.http.impl.client.IdleConnectionEvictor$1.run(IdleConnectionEvictor.java:66)         at java.lang.Thread.run(Thread.java:748)    6) Thread[id=393, name=Connection evictor, state=TIMED_WAITING, group=TGRP-StreamDecoratorTest]         at java.lang.Thread.sleep(Native Method)         at org.apache.http.impl.client.IdleConnectionEvictor$1.run(IdleConnectionEvictor.java:66)         at java.lang.Thread.run(Thread.java:748)    7) Thread[id=390, name=zkConnectionManagerCallback-151-thread-1, state=WAITING, group=TGRP-StreamDecoratorTest]         at sun.misc.Unsafe.park(Native Method)         at java.util.concurrent.locks.LockSupport.park(LockSupport.java:175)         at java.util.concurrent.locks.AbstractQueuedSynchronizer$ConditionObject.await(AbstractQueuedSynchronizer.java:2039)         at java.util.concurrent.LinkedBlockingQueue.take(LinkedBlockingQueue.java:442)         at java.util.concurrent.ThreadPoolExecutor.getTask(ThreadPoolExecutor.java:1074)         at java.util.concurrent.ThreadPoolExecutor.runWorker(ThreadPoolExecutor.java:1134)         at java.util.concurrent.ThreadPoolExecutor$Worker.run(ThreadPoolExecutor.java:624)         at java.lang.Thread.run(Thread.java:748)    8) Thread[id=787, name=zkConnectionManagerCallback-151-thread-1-EventThread, state=WAITING, group=TGRP-StreamDecoratorTest]         at sun.misc.Unsafe.park(Native Method)         at java.util.concurrent.locks.LockSupport.park(LockSupport.java:175)         at java.util.concurrent.locks.AbstractQueuedSynchronizer$ConditionObject.await(AbstractQueuedSynchronizer.java:2039)         at java.util.concurrent.LinkedBlockingQueue.take(LinkedBlockingQueue.java:442)         at org.apache.zookeeper.ClientCnxn$EventThread.run(ClientCnxn.java:502)

Stack Trace:
com.carrotsearch.randomizedtesting.ThreadLeakError: 8 threads leaked from SUITE scope at org.apache.solr.client.solrj.io.stream.StreamDecoratorTest: 
   1) Thread[id=394, name=Connection evictor, state=TIMED_WAITING, group=TGRP-StreamDecoratorTest]
        at java.lang.Thread.sleep(Native Method)
        at org.apache.http.impl.client.IdleConnectionEvictor$1.run(IdleConnectionEvictor.java:66)
        at java.lang.Thread.run(Thread.java:748)
   2) Thread[id=405, name=Connection evictor, state=TIMED_WAITING, group=TGRP-StreamDecoratorTest]
        at java.lang.Thread.sleep(Native Method)
        at org.apache.http.impl.client.IdleConnectionEvictor$1.run(IdleConnectionEvictor.java:66)
        at java.lang.Thread.run(Thread.java:748)
   3) Thread[id=786, name=zkConnectionManagerCallback-151-thread-1-SendThread(127.0.0.1:39479), state=TIMED_WAITING, group=TGRP-StreamDecoratorTest]
        at java.lang.Thread.sleep(Native Method)
        at org.apache.zookeeper.client.StaticHostProvider.next(StaticHostProvider.java:105)
        at org.apache.zookeeper.ClientCnxn$SendThread.startConnect(ClientCnxn.java:1000)
        at org.apache.zookeeper.ClientCnxn$SendThread.run(ClientCnxn.java:1063)
   4) Thread[id=387, name=Connection evictor, state=TIMED_WAITING, group=TGRP-StreamDecoratorTest]
        at java.lang.Thread.sleep(Native Method)
        at org.apache.http.impl.client.IdleConnectionEvictor$1.run(IdleConnectionEvictor.java:66)
        at java.lang.Thread.run(Thread.java:748)
   5) Thread[id=404, name=Connection evictor, state=TIMED_WAITING, group=TGRP-StreamDecoratorTest]
        at java.lang.Thread.sleep(Native Method)
        at org.apache.http.impl.client.IdleConnectionEvictor$1.run(IdleConnectionEvictor.java:66)
        at java.lang.Thread.run(Thread.java:748)
   6) Thread[id=393, name=Connection evictor, state=TIMED_WAITING, group=TGRP-StreamDecoratorTest]
        at java.lang.Thread.sleep(Native Method)
        at org.apache.http.impl.client.IdleConnectionEvictor$1.run(IdleConnectionEvictor.java:66)
        at java.lang.Thread.run(Thread.java:748)
   7) Thread[id=390, name=zkConnectionManagerCallback-151-thread-1, state=WAITING, group=TGRP-StreamDecoratorTest]
        at sun.misc.Unsafe.park(Native Method)
        at java.util.concurrent.locks.LockSupport.park(LockSupport.java:175)
        at java.util.concurrent.locks.AbstractQueuedSynchronizer$ConditionObject.await(AbstractQueuedSynchronizer.java:2039)
        at java.util.concurrent.LinkedBlockingQueue.take(LinkedBlockingQueue.java:442)
        at java.util.concurrent.ThreadPoolExecutor.getTask(ThreadPoolExecutor.java:1074)
        at java.util.concurrent.ThreadPoolExecutor.runWorker(ThreadPoolExecutor.java:1134)
        at java.util.concurrent.ThreadPoolExecutor$Worker.run(ThreadPoolExecutor.java:624)
        at java.lang.Thread.run(Thread.java:748)
   8) Thread[id=787, name=zkConnectionManagerCallback-151-thread-1-EventThread, state=WAITING, group=TGRP-StreamDecoratorTest]
        at sun.misc.Unsafe.park(Native Method)
        at java.util.concurrent.locks.LockSupport.park(LockSupport.java:175)
        at java.util.concurrent.locks.AbstractQueuedSynchronizer$ConditionObject.await(AbstractQueuedSynchronizer.java:2039)
        at java.util.concurrent.LinkedBlockingQueue.take(LinkedBlockingQueue.java:442)
        at org.apache.zookeeper.ClientCnxn$EventThread.run(ClientCnxn.java:502)
	at __randomizedtesting.SeedInfo.seed([542AC76723C69E7E]:0)


FAILED:  junit.framework.TestSuite.org.apache.solr.client.solrj.io.stream.StreamDecoratorTest

Error Message:
There are still zombie threads that couldn't be terminated:    1) Thread[id=786, name=zkConnectionManagerCallback-151-thread-1-SendThread(127.0.0.1:39479), state=TIMED_WAITING, group=TGRP-StreamDecoratorTest]         at java.lang.Thread.sleep(Native Method)         at org.apache.zookeeper.ClientCnxn$SendThread.run(ClientCnxn.java:1054)    2) Thread[id=390, name=zkConnectionManagerCallback-151-thread-1, state=WAITING, group=TGRP-StreamDecoratorTest]         at sun.misc.Unsafe.park(Native Method)         at java.util.concurrent.locks.LockSupport.park(LockSupport.java:175)         at java.util.concurrent.locks.AbstractQueuedSynchronizer$ConditionObject.await(AbstractQueuedSynchronizer.java:2039)         at java.util.concurrent.LinkedBlockingQueue.take(LinkedBlockingQueue.java:442)         at java.util.concurrent.ThreadPoolExecutor.getTask(ThreadPoolExecutor.java:1074)         at java.util.concurrent.ThreadPoolExecutor.runWorker(ThreadPoolExecutor.java:1134)         at java.util.concurrent.ThreadPoolExecutor$Worker.run(ThreadPoolExecutor.java:624)         at java.lang.Thread.run(Thread.java:748)

Stack Trace:
com.carrotsearch.randomizedtesting.ThreadLeakError: There are still zombie threads that couldn't be terminated:
   1) Thread[id=786, name=zkConnectionManagerCallback-151-thread-1-SendThread(127.0.0.1:39479), state=TIMED_WAITING, group=TGRP-StreamDecoratorTest]
        at java.lang.Thread.sleep(Native Method)
        at org.apache.zookeeper.ClientCnxn$SendThread.run(ClientCnxn.java:1054)
   2) Thread[id=390, name=zkConnectionManagerCallback-151-thread-1, state=WAITING, group=TGRP-StreamDecoratorTest]
        at sun.misc.Unsafe.park(Native Method)
        at java.util.concurrent.locks.LockSupport.park(LockSupport.java:175)
        at java.util.concurrent.locks.AbstractQueuedSynchronizer$ConditionObject.await(AbstractQueuedSynchronizer.java:2039)
        at java.util.concurrent.LinkedBlockingQueue.take(LinkedBlockingQueue.java:442)
        at java.util.concurrent.ThreadPoolExecutor.getTask(ThreadPoolExecutor.java:1074)
        at java.util.concurrent.ThreadPoolExecutor.runWorker(ThreadPoolExecutor.java:1134)
        at java.util.concurrent.ThreadPoolExecutor$Worker.run(ThreadPoolExecutor.java:624)
        at java.lang.Thread.run(Thread.java:748)
	at __randomizedtesting.SeedInfo.seed([542AC76723C69E7E]:0)




Build Log:
[...truncated 3373 lines...]
   [junit4] Suite: org.apache.lucene.analysis.core.TestRandomChains
   [junit4]   2> TEST FAIL: useCharFilter=false text='Protein_Data_Bank|PD'
   [junit4]   2> Exception from random analyzer: 
   [junit4]   2> charfilters=
   [junit4]   2> tokenizer=
   [junit4]   2>   org.apache.lucene.analysis.pattern.PatternTokenizer(org.apache.lucene.util.AttributeFactory$DefaultAttributeFactory@2efbbefd, a, -14)
   [junit4]   2> filters=
   [junit4]   2>   org.apache.lucene.analysis.miscellaneous.TypeAsSynonymFilter(ValidatingTokenFilter@519cd943 term=,bytes=[],startOffset=0,endOffset=0,type=word,positionIncrement=1, <ALPHANUM>)
   [junit4]   2>   org.apache.lucene.analysis.ru.RussianLightStemFilter(ValidatingTokenFilter@12e97d93 term=,bytes=[],startOffset=0,endOffset=0,type=word,positionIncrement=1,keyword=false)
   [junit4]   2>   Conditional:org.apache.lucene.analysis.synonym.SynonymGraphFilter(OneTimeWrapper@4264e89 term=,bytes=[],startOffset=0,endOffset=0,type=word,positionIncrement=1,keyword=false,positionLength=1, org.apache.lucene.analysis.synonym.SynonymMap@3469385d, true)
   [junit4]   2>   org.apache.lucene.analysis.miscellaneous.TypeAsSynonymFilter(ValidatingTokenFilter@6084b824 term=,bytes=[],startOffset=0,endOffset=0,type=word,positionIncrement=1,keyword=false,positionLength=1)
   [junit4]   2> NOTE: download the large Jenkins line-docs file by running 'ant get-jenkins-line-docs' in the lucene directory.
   [junit4]   2> NOTE: reproduce with: ant test  -Dtestcase=TestRandomChains -Dtests.method=testRandomChains -Dtests.seed=E5D6D73E34CFBE1F -Dtests.multiplier=2 -Dtests.nightly=true -Dtests.slow=true -Dtests.linedocsfile=/home/jenkins/jenkins-slave/workspace/Lucene-Solr-NightlyTests-7.x/test-data/enwiki.random.lines.txt -Dtests.locale=sl -Dtests.timezone=America/Boise -Dtests.asserts=true -Dtests.file.encoding=US-ASCII
   [junit4] ERROR   93.8s J2 | TestRandomChains.testRandomChains <<<
   [junit4]    > Throwable #1: java.lang.IllegalStateException: last stage: inconsistent startOffset at pos=2: 12 vs 15; token=<ALPHANUM>word
   [junit4]    > 	at __randomizedtesting.SeedInfo.seed([E5D6D73E34CFBE1F:D837FE5F73DDA3DF]:0)
   [junit4]    > 	at org.apache.lucene.analysis.ValidatingTokenFilter.incrementToken(ValidatingTokenFilter.java:109)
   [junit4]    > 	at org.apache.lucene.analysis.BaseTokenStreamTestCase.checkAnalysisConsistency(BaseTokenStreamTestCase.java:748)
   [junit4]    > 	at org.apache.lucene.analysis.BaseTokenStreamTestCase.checkRandomData(BaseTokenStreamTestCase.java:659)
   [junit4]    > 	at org.apache.lucene.analysis.BaseTokenStreamTestCase.checkRandomData(BaseTokenStreamTestCase.java:561)
   [junit4]    > 	at org.apache.lucene.analysis.core.TestRandomChains.testRandomChains(TestRandomChains.java:866)
   [junit4]    > 	at java.lang.Thread.run(Thread.java:748)
   [junit4]   2> NOTE: leaving temporary files on disk at: /home/jenkins/jenkins-slave/workspace/Lucene-Solr-NightlyTests-7.x/checkout/lucene/build/analysis/common/test/J2/temp/lucene.analysis.core.TestRandomChains_E5D6D73E34CFBE1F-001
   [junit4]   2> NOTE: test params are: codec=Asserting(Lucene70): {dummy=TestBloomFilteredLucenePostings(BloomFilteringPostingsFormat(Lucene50(blocksize=128)))}, docValues:{}, maxPointsInLeafNode=864, maxMBSortInHeap=5.854194972498171, sim=RandomSimilarity(queryNorm=true): {dummy=IB LL-LZ(0.3)}, locale=sl, timezone=America/Boise
   [junit4]   2> NOTE: Linux 4.4.0-112-generic amd64/Oracle Corporation 1.8.0_172 (64-bit)/cpus=4,threads=1,free=132673784,total=233832448
   [junit4]   2> NOTE: All tests run in this JVM: [TestMultiWordSynonyms, TestIndonesianAnalyzer, TestMorphData, TestLimitTokenCountFilter, TestWikipediaTokenizerFactory, TestFlagNum, TestPortugueseAnalyzer, TestGalicianStemFilterFactory, TestCollationKeyAnalyzer, TestStrangeOvergeneration, EdgeNGramTokenFilterTest, TestFrenchMinimalStemFilter, TestCapitalizationFilter, TestTypeTokenFilter, TestReversePathHierarchyTokenizer, TestCharTokenizers, TestUAX29URLEmailAnalyzer, TestIndicNormalizer, TestTrimFilterFactory, TestAnalyzers, TestRandomChains]
   [junit4] Completed [109/291 (1!)] on J2 in 129.94s, 2 tests, 1 error <<< FAILURES!

[...truncated 10038 lines...]
   [junit4] Suite: org.apache.solr.handler.admin.AutoscalingHistoryHandlerTest
   [junit4]   2> 848251 INFO  (SUITE-AutoscalingHistoryHandlerTest-seed#[35343B2071AF1737]-worker) [    ] o.a.s.SolrTestCaseJ4 SecureRandom sanity checks: test.solr.allowed.securerandom=null & java.security.egd=file:/dev/./urandom
   [junit4]   2> Creating dataDir: /home/jenkins/jenkins-slave/workspace/Lucene-Solr-NightlyTests-7.x/checkout/solr/build/solr-core/test/J0/temp/solr.handler.admin.AutoscalingHistoryHandlerTest_35343B2071AF1737-001/init-core-data-001
   [junit4]   2> 848252 WARN  (SUITE-AutoscalingHistoryHandlerTest-seed#[35343B2071AF1737]-worker) [    ] o.a.s.SolrTestCaseJ4 startTrackingSearchers: numOpens=5 numCloses=5
   [junit4]   2> 848252 INFO  (SUITE-AutoscalingHistoryHandlerTest-seed#[35343B2071AF1737]-worker) [    ] o.a.s.SolrTestCaseJ4 Using PointFields (NUMERIC_POINTS_SYSPROP=true) w/NUMERIC_DOCVALUES_SYSPROP=false
   [junit4]   2> 848265 INFO  (SUITE-AutoscalingHistoryHandlerTest-seed#[35343B2071AF1737]-worker) [    ] o.a.s.SolrTestCaseJ4 Randomized ssl (true) and clientAuth (true) via: @org.apache.solr.util.RandomizeSSL(reason=, ssl=NaN, value=NaN, clientAuth=NaN)
   [junit4]   2> 848267 INFO  (SUITE-AutoscalingHistoryHandlerTest-seed#[35343B2071AF1737]-worker) [    ] o.a.s.c.MiniSolrCloudCluster Starting cluster of 2 servers in /home/jenkins/jenkins-slave/workspace/Lucene-Solr-NightlyTests-7.x/checkout/solr/build/solr-core/test/J0/temp/solr.handler.admin.AutoscalingHistoryHandlerTest_35343B2071AF1737-001/tempDir-001
   [junit4]   2> 848267 INFO  (SUITE-AutoscalingHistoryHandlerTest-seed#[35343B2071AF1737]-worker) [    ] o.a.s.c.ZkTestServer STARTING ZK TEST SERVER
   [junit4]   2> 848267 INFO  (Thread-1508) [    ] o.a.s.c.ZkTestServer client port:0.0.0.0/0.0.0.0:0
   [junit4]   2> 848267 INFO  (Thread-1508) [    ] o.a.s.c.ZkTestServer Starting server
   [junit4]   2> 848359 ERROR (Thread-1508) [    ] o.a.z.s.ZooKeeperServer ZKShutdownHandler is not registered, so ZooKeeper server won't take any action on ERROR or SHUTDOWN server state changes
   [junit4]   2> 848367 INFO  (SUITE-AutoscalingHistoryHandlerTest-seed#[35343B2071AF1737]-worker) [    ] o.a.s.c.ZkTestServer start zk server on port:42727
   [junit4]   2> 848400 INFO  (zkConnectionManagerCallback-1641-thread-1) [    ] o.a.s.c.c.ConnectionManager zkClient has connected
   [junit4]   2> 848404 INFO  (jetty-launcher-1638-thread-1) [    ] o.e.j.s.Server jetty-9.4.11.v20180605; built: 2018-06-05T18:24:03.829Z; git: d5fc0523cfa96bfebfbda19606cad384d772f04c; jvm 1.8.0_172-b11
   [junit4]   2> 848405 INFO  (jetty-launcher-1638-thread-2) [    ] o.e.j.s.Server jetty-9.4.11.v20180605; built: 2018-06-05T18:24:03.829Z; git: d5fc0523cfa96bfebfbda19606cad384d772f04c; jvm 1.8.0_172-b11
   [junit4]   2> 848406 INFO  (jetty-launcher-1638-thread-2) [    ] o.e.j.s.session DefaultSessionIdManager workerName=node0
   [junit4]   2> 848406 INFO  (jetty-launcher-1638-thread-2) [    ] o.e.j.s.session No SessionScavenger set, using defaults
   [junit4]   2> 848406 INFO  (jetty-launcher-1638-thread-1) [    ] o.e.j.s.session DefaultSessionIdManager workerName=node0
   [junit4]   2> 848406 INFO  (jetty-launcher-1638-thread-1) [    ] o.e.j.s.session No SessionScavenger set, using defaults
   [junit4]   2> 848406 INFO  (jetty-launcher-1638-thread-2) [    ] o.e.j.s.session node0 Scavenging every 600000ms
   [junit4]   2> 848406 INFO  (jetty-launcher-1638-thread-1) [    ] o.e.j.s.session node0 Scavenging every 600000ms
   [junit4]   2> 848406 INFO  (jetty-launcher-1638-thread-2) [    ] o.e.j.s.h.ContextHandler Started o.e.j.s.ServletContextHandler@1c2b4786{/solr,null,AVAILABLE}
   [junit4]   2> 848406 INFO  (jetty-launcher-1638-thread-1) [    ] o.e.j.s.h.ContextHandler Started o.e.j.s.ServletContextHandler@21c125a3{/solr,null,AVAILABLE}
   [junit4]   2> 848427 INFO  (jetty-launcher-1638-thread-1) [    ] o.e.j.s.AbstractConnector Started ServerConnector@cb8a2ff{SSL,[ssl, http/1.1]}{127.0.0.1:39407}
   [junit4]   2> 848427 INFO  (jetty-launcher-1638-thread-2) [    ] o.e.j.s.AbstractConnector Started ServerConnector@74e3959f{SSL,[ssl, http/1.1]}{127.0.0.1:41574}
   [junit4]   2> 848427 INFO  (jetty-launcher-1638-thread-1) [    ] o.e.j.s.Server Started @848603ms
   [junit4]   2> 848427 INFO  (jetty-launcher-1638-thread-2) [    ] o.e.j.s.Server Started @848603ms
   [junit4]   2> 848427 INFO  (jetty-launcher-1638-thread-1) [    ] o.a.s.c.s.e.JettySolrRunner Jetty properties: {hostContext=/solr, hostPort=39407}
   [junit4]   2> 848427 INFO  (jetty-launcher-1638-thread-2) [    ] o.a.s.c.s.e.JettySolrRunner Jetty properties: {hostContext=/solr, hostPort=41574}
   [junit4]   2> 848428 ERROR (jetty-launcher-1638-thread-2) [    ] o.a.s.u.StartupLoggingUtils Missing Java Option solr.log.dir. Logging may be missing or incomplete.
   [junit4]   2> 848428 ERROR (jetty-launcher-1638-thread-1) [    ] o.a.s.u.StartupLoggingUtils Missing Java Option solr.log.dir. Logging may be missing or incomplete.
   [junit4]   2> 848428 INFO  (jetty-launcher-1638-thread-2) [    ] o.a.s.s.SolrDispatchFilter Using logger factory org.apache.logging.slf4j.Log4jLoggerFactory
   [junit4]   2> 848428 INFO  (jetty-launcher-1638-thread-1) [    ] o.a.s.s.SolrDispatchFilter Using logger factory org.apache.logging.slf4j.Log4jLoggerFactory
   [junit4]   2> 848428 INFO  (jetty-launcher-1638-thread-2) [    ] o.a.s.s.SolrDispatchFilter  ___      _       Welcome to Apache Solr? version 7.5.0
   [junit4]   2> 848428 INFO  (jetty-launcher-1638-thread-1) [    ] o.a.s.s.SolrDispatchFilter  ___      _       Welcome to Apache Solr? version 7.5.0
   [junit4]   2> 848428 INFO  (jetty-launcher-1638-thread-2) [    ] o.a.s.s.SolrDispatchFilter / __| ___| |_ _   Starting in cloud mode on port null
   [junit4]   2> 848428 INFO  (jetty-launcher-1638-thread-1) [    ] o.a.s.s.SolrDispatchFilter / __| ___| |_ _   Starting in cloud mode on port null
   [junit4]   2> 848428 INFO  (jetty-launcher-1638-thread-2) [    ] o.a.s.s.SolrDispatchFilter \__ \/ _ \ | '_|  Install dir: null
   [junit4]   2> 848428 INFO  (jetty-launcher-1638-thread-1) [    ] o.a.s.s.SolrDispatchFilter \__ \/ _ \ | '_|  Install dir: null
   [junit4]   2> 848428 INFO  (jetty-launcher-1638-thread-2) [    ] o.a.s.s.SolrDispatchFilter |___/\___/_|_|    Start time: 2018-07-02T03:57:51.465Z
   [junit4]   2> 848428 INFO  (jetty-launcher-1638-thread-1) [    ] o.a.s.s.SolrDispatchFilter |___/\___/_|_|    Start time: 2018-07-02T03:57:51.465Z
   [junit4]   2> 848449 INFO  (zkConnectionManagerCallback-1643-thread-1) [    ] o.a.s.c.c.ConnectionManager zkClient has connected
   [junit4]   2> 848450 INFO  (zkConnectionManagerCallback-1645-thread-1) [    ] o.a.s.c.c.ConnectionManager zkClient has connected
   [junit4]   2> 848450 INFO  (jetty-launcher-1638-thread-2) [    ] o.a.s.s.SolrDispatchFilter solr.xml found in ZooKeeper. Loading...
   [junit4]   2> 848450 INFO  (jetty-launcher-1638-thread-1) [    ] o.a.s.s.SolrDispatchFilter solr.xml found in ZooKeeper. Loading...
   [junit4]   2> 848774 INFO  (jetty-launcher-1638-thread-1) [    ] o.a.s.c.ZkContainer Zookeeper client=127.0.0.1:42727/solr
   [junit4]   2> 848777 INFO  (zkConnectionManagerCallback-1649-thread-1) [    ] o.a.s.c.c.ConnectionManager zkClient has connected
   [junit4]   2> 848827 INFO  (zkConnectionManagerCallback-1651-thread-1) [    ] o.a.s.c.c.ConnectionManager zkClient has connected
   [junit4]   2> 848858 INFO  (jetty-launcher-1638-thread-2) [    ] o.a.s.c.ZkContainer Zookeeper client=127.0.0.1:42727/solr
   [junit4]   2> 848879 INFO  (zkConnectionManagerCallback-1657-thread-1) [    ] o.a.s.c.c.ConnectionManager zkClient has connected
   [junit4]   2> 848882 INFO  (zkConnectionManagerCallback-1659-thread-1) [    ] o.a.s.c.c.ConnectionManager zkClient has connected
   [junit4]   2> 849473 INFO  (jetty-launcher-1638-thread-2) [n:127.0.0.1:41574_solr    ] o.a.s.c.Overseer Overseer (id=null) closing
   [junit4]   2> 849474 INFO  (jetty-launcher-1638-thread-2) [n:127.0.0.1:41574_solr    ] o.a.s.c.OverseerElectionContext I am going to be the leader 127.0.0.1:41574_solr
   [junit4]   2> 849475 INFO  (jetty-launcher-1638-thread-2) [n:127.0.0.1:41574_solr    ] o.a.s.c.Overseer Overseer (id=72899159658594310-127.0.0.1:41574_solr-n_0000000000) starting
   [junit4]   2> 849514 INFO  (zkConnectionManagerCallback-1666-thread-1) [    ] o.a.s.c.c.ConnectionManager zkClient has connected
   [junit4]   2> 849516 INFO  (jetty-launcher-1638-thread-2) [n:127.0.0.1:41574_solr    ] o.a.s.c.s.i.ZkClientClusterStateProvider Cluster at 127.0.0.1:42727/solr ready
   [junit4]   2> 849541 INFO  (jetty-launcher-1638-thread-2) [n:127.0.0.1:41574_solr    ] o.a.s.c.ZkController Register node as live in ZooKeeper:/live_nodes/127.0.0.1:41574_solr
   [junit4]   2> 849542 DEBUG (OverseerStateUpdate-72899159658594310-127.0.0.1:41574_solr-n_0000000000) [    ] o.a.s.c.Overseer Starting to work on the main queue
   [junit4]   2> 849562 DEBUG (OverseerAutoScalingTriggerThread-72899159658594310-127.0.0.1:41574_solr-n_0000000000) [    ] o.a.s.c.a.OverseerTriggerThread Adding .auto_add_replicas and .scheduled_maintenance triggers
   [junit4]   2> 849582 INFO  (OverseerStateUpdate-72899159658594310-127.0.0.1:41574_solr-n_0000000000) [    ] o.a.s.c.c.ZkStateReader Updated live nodes from ZooKeeper... (0) -> (1)
   [junit4]   2> 849583 DEBUG (OverseerAutoScalingTriggerThread-72899159658594310-127.0.0.1:41574_solr-n_0000000000) [    ] o.a.s.c.a.OverseerTriggerThread Refreshing /autoscaling.json with znode version 1
   [junit4]   2> 849583 DEBUG (OverseerAutoScalingTriggerThread-72899159658594310-127.0.0.1:41574_solr-n_0000000000) [    ] o.a.s.c.a.OverseerTriggerThread Current znodeVersion 1, lastZnodeVersion -1
   [junit4]   2> 849583 DEBUG (OverseerAutoScalingTriggerThread-72899159658594310-127.0.0.1:41574_solr-n_0000000000) [    ] o.a.s.c.a.OverseerTriggerThread Processed trigger updates upto znodeVersion 1
   [junit4]   2> 849585 INFO  (zkCallback-1665-thread-1) [    ] o.a.s.c.c.ZkStateReader Updated live nodes from ZooKeeper... (0) -> (1)
   [junit4]   2> 849600 DEBUG (OverseerAutoScalingTriggerThread-72899159658594310-127.0.0.1:41574_solr-n_0000000000) [    ] o.a.s.c.a.NodeLostTrigger NodeLostTrigger .auto_add_replicas - Initial livenodes: [127.0.0.1:41574_solr]
   [junit4]   2> 849601 DEBUG (OverseerAutoScalingTriggerThread-72899159658594310-127.0.0.1:41574_solr-n_0000000000) [    ] o.a.s.c.a.OverseerTriggerThread -- clean old nodeAdded markers
   [junit4]   2> 849601 DEBUG (OverseerAutoScalingTriggerThread-72899159658594310-127.0.0.1:41574_solr-n_0000000000) [    ] o.a.s.c.a.OverseerTriggerThread Current znodeVersion 1, lastZnodeVersion 1
   [junit4]   2> 849601 DEBUG (ScheduledTrigger-1756-thread-1) [    ] o.a.s.c.a.NodeLostTrigger Running NodeLostTrigger: .auto_add_replicas with currently live nodes: 1
   [junit4]   2> 849619 INFO  (jetty-launcher-1638-thread-1) [n:127.0.0.1:39407_solr    ] o.a.s.c.c.ZkStateReader Updated live nodes from ZooKeeper... (0) -> (1)
   [junit4]   2> 849622 INFO  (jetty-launcher-1638-thread-1) [n:127.0.0.1:39407_solr    ] o.a.s.c.Overseer Overseer (id=null) closing
   [junit4]   2> 849636 INFO  (jetty-launcher-1638-thread-1) [n:127.0.0.1:39407_solr    ] o.a.s.c.TransientSolrCoreCacheDefault Allocating transient cache for 2147483647 transient cores
   [junit4]   2> 849636 INFO  (jetty-launcher-1638-thread-1) [n:127.0.0.1:39407_solr    ] o.a.s.c.ZkController Register node as live in ZooKeeper:/live_nodes/127.0.0.1:39407_solr
   [junit4]   2> 849637 DEBUG (OverseerStateUpdate-72899159658594310-127.0.0.1:41574_solr-n_0000000000) [    ] o.a.s.c.Overseer processMessage: queueSize: 1, message = {
   [junit4]   2>   "operation":"downnode",
   [junit4]   2>   "node_name":"127.0.0.1:39407_solr"} current state version: 0
   [junit4]   2> 849637 DEBUG (OverseerStateUpdate-72899159658594310-127.0.0.1:41574_solr-n_0000000000) [    ] o.a.s.c.o.NodeMutator DownNode state invoked for node: 127.0.0.1:39407_solr
   [junit4]   2> 849637 INFO  (zkCallback-1665-thread-1) [    ] o.a.s.c.c.ZkStateReader Updated live nodes from ZooKeeper... (1) -> (2)
   [junit4]   2> 849652 INFO  (zkCallback-1658-thread-1) [    ] o.a.s.c.c.ZkStateReader Updated live nodes from ZooKeeper... (1) -> (2)
   [junit4]   2> 849675 INFO  (jetty-launcher-1638-thread-2) [n:127.0.0.1:41574_solr    ] o.a.s.h.a.MetricsHistoryHandler No .system collection, keeping metrics history in memory.
   [junit4]   2> 849696 INFO  (zkCallback-1650-thread-1) [    ] o.a.s.c.c.ZkStateReader Updated live nodes from ZooKeeper... (1) -> (2)
   [junit4]   2> 849718 INFO  (zkConnectionManagerCallback-1672-thread-1) [    ] o.a.s.c.c.ConnectionManager zkClient has connected
   [junit4]   2> 849719 INFO  (jetty-launcher-1638-thread-1) [n:127.0.0.1:39407_solr    ] o.a.s.c.c.ZkStateReader Updated live nodes from ZooKeeper... (0) -> (2)
   [junit4]   2> 849720 INFO  (jetty-launcher-1638-thread-1) [n:127.0.0.1:39407_solr    ] o.a.s.c.s.i.ZkClientClusterStateProvider Cluster at 127.0.0.1:42727/solr ready
   [junit4]   2> 849720 INFO  (jetty-launcher-1638-thread-1) [n:127.0.0.1:39407_solr    ] o.a.s.h.a.MetricsHistoryHandler No .system collection, keeping metrics history in memory.
   [junit4]   2> 849790 INFO  (jetty-launcher-1638-thread-2) [n:127.0.0.1:41574_solr    ] o.a.s.m.r.SolrJmxReporter JMX monitoring for 'solr_41574.solr.node' (registry 'solr.node') enabled at server: com.sun.jmx.mbeanserver.JmxMBeanServer@7d9850fe
   [junit4]   2> 849814 INFO  (jetty-launcher-1638-thread-1) [n:127.0.0.1:39407_solr    ] o.a.s.m.r.SolrJmxReporter JMX monitoring for 'solr_39407.solr.node' (registry 'solr.node') enabled at server: com.sun.jmx.mbeanserver.JmxMBeanServer@7d9850fe
   [junit4]   2> 849830 INFO  (jetty-launcher-1638-thread-1) [n:127.0.0.1:39407_solr    ] o.a.s.m.r.SolrJmxReporter JMX monitoring for 'solr_39407.solr.jvm' (registry 'solr.jvm') enabled at server: com.sun.jmx.mbeanserver.JmxMBeanServer@7d9850fe
   [junit4]   2> 849832 INFO  (jetty-launcher-1638-thread-1) [n:127.0.0.1:39407_solr    ] o.a.s.m.r.SolrJmxReporter JMX monitoring for 'solr_39407.solr.jetty' (registry 'solr.jetty') enabled at server: com.sun.jmx.mbeanserver.JmxMBeanServer@7d9850fe
   [junit4]   2> 849833 INFO  (jetty-launcher-1638-thread-2) [n:127.0.0.1:41574_solr    ] o.a.s.m.r.SolrJmxReporter JMX monitoring for 'solr_41574.solr.jvm' (registry 'solr.jvm') enabled at server: com.sun.jmx.mbeanserver.JmxMBeanServer@7d9850fe
   [junit4]   2> 849834 INFO  (jetty-launcher-1638-thread-2) [n:127.0.0.1:41574_solr    ] o.a.s.m.r.SolrJmxReporter JMX monitoring for 'solr_41574.solr.jetty' (registry 'solr.jetty') enabled at server: com.sun.jmx.mbeanserver.JmxMBeanServer@7d9850fe
   [junit4]   2> 849834 INFO  (jetty-launcher-1638-thread-2) [n:127.0.0.1:41574_solr    ] o.a.s.c.CorePropertiesLocator Found 0 core definitions underneath /home/jenkins/jenkins-slave/workspace/Lucene-Solr-NightlyTests-7.x/checkout/solr/build/solr-core/test/J0/temp/solr.handler.admin.AutoscalingHistoryHandlerTest_35343B2071AF1737-001/tempDir-001/node2/.
   [junit4]   2> 849849 INFO  (jetty-launcher-1638-thread-1) [n:127.0.0.1:39407_solr    ] o.a.s.c.CorePropertiesLocator Found 0 core definitions underneath /home/jenkins/jenkins-slave/workspace/Lucene-Solr-NightlyTests-7.x/checkout/solr/build/solr-core/test/J0/temp/solr.handler.admin.AutoscalingHistoryHandlerTest_35343B2071AF1737-001/tempDir-001/node1/.
   [junit4]   2> 849942 INFO  (zkConnectionManagerCallback-1675-thread-1) [    ] o.a.s.c.c.ConnectionManager zkClient has connected
   [junit4]   2> 849957 INFO  (zkConnectionManagerCallback-1680-thread-1) [    ] o.a.s.c.c.ConnectionManager zkClient has connected
   [junit4]   2> 849958 INFO  (SUITE-AutoscalingHistoryHandlerTest-seed#[35343B2071AF1737]-worker) [    ] o.a.s.c.c.ZkStateReader Updated live nodes from ZooKeeper... (0) -> (2)
   [junit4]   2> 849959 INFO  (SUITE-AutoscalingHistoryHandlerTest-seed#[35343B2071AF1737]-worker) [    ] o.a.s.c.s.i.ZkClientClusterStateProvider Cluster at 127.0.0.1:42727/solr ready
   [junit4]   2> 850099 INFO  (qtp1818263918-5481) [n:127.0.0.1:39407_solr    ] o.a.s.h.a.CollectionsHandler Invoked Collection Action :create with params name=.system&nrtReplicas=1&action=CREATE&numShards=1&createNodeSet=127.0.0.1:41574_solr&wt=javabin&version=2 and sendToOCPQueue=true
   [junit4]   2> 850187 INFO  (OverseerThreadFactory-1758-thread-1) [    ] o.a.s.c.a.c.CreateCollectionCmd Create collection .system
   [junit4]   2> 850201 DEBUG (OverseerStateUpdate-72899159658594310-127.0.0.1:41574_solr-n_0000000000) [    ] o.a.s.c.Overseer processMessage: queueSize: 1, message = {
   [junit4]   2>   "name":".system",
   [junit4]   2>   "fromApi":"true",
   [junit4]   2>   "numShards":1,
   [junit4]   2>   "createNodeSet":"127.0.0.1:41574_solr",
   [junit4]   2>   "nrtReplicas":"1",
   [junit4]   2>   "stateFormat":"2",
   [junit4]   2>   "replicationFactor":"1",
   [junit4]   2>   "operation":"create"} current state version: 0
   [junit4]   2> 850201 DEBUG (OverseerStateUpdate-72899159658594310-127.0.0.1:41574_solr-n_0000000000) [    ] o.a.s.c.o.ClusterStateMutator building a new cName: .system
   [junit4]   2> 850201 DEBUG (OverseerStateUpdate-72899159658594310-127.0.0.1:41574_solr-n_0000000000) [    ] o.a.s.c.o.ZkStateWriter going to create_collection /collections/.system/state.json
   [junit4]   2> 850315 DEBUG (OverseerStateUpdate-72899159658594310-127.0.0.1:41574_solr-n_0000000000) [    ] o.a.s.c.Overseer processMessage: queueSize: 1, message = {
   [junit4]   2>   "operation":"ADDREPLICA",
   [junit4]   2>   "collection":".system",
   [junit4]   2>   "shard":"shard1",
   [junit4]   2>   "core":".system_shard1_replica_n1",
   [junit4]   2>   "state":"down",
   [junit4]   2>   "base_url":"https://127.0.0.1:41574/solr",
   [junit4]   2>   "type":"NRT",
   [junit4]   2>   "waitForFinalState":"false"} current state version: 0
   [junit4]   2> 850315 INFO  (OverseerStateUpdate-72899159658594310-127.0.0.1:41574_solr-n_0000000000) [    ] o.a.s.c.o.SliceMutator createReplica() {
   [junit4]   2>   "operation":"ADDREPLICA",
   [junit4]   2>   "collection":".system",
   [junit4]   2>   "shard":"shard1",
   [junit4]   2>   "core":".system_shard1_replica_n1",
   [junit4]   2>   "state":"down",
   [junit4]   2>   "base_url":"https://127.0.0.1:41574/solr",
   [junit4]   2>   "type":"NRT",
   [junit4]   2>   "waitForFinalState":"false"} 
   [junit4]   2> 850316 DEBUG (OverseerStateUpdate-72899159658594310-127.0.0.1:41574_solr-n_0000000000) [    ] o.a.s.c.o.SliceMutator Old Slice: shard1:{
   [junit4]   2>   "range":"80000000-7fffffff",
   [junit4]   2>   "state":"active",
   [junit4]   2>   "replicas":{}}
   [junit4]   2> 850316 DEBUG (OverseerStateUpdate-72899159658594310-127.0.0.1:41574_solr-n_0000000000) [    ] o.a.s.c.o.SliceMutator New Slice: shard1:{
   [junit4]   2>   "range":"80000000-7fffffff",
   [junit4]   2>   "state":"active",
   [junit4]   2>   "replicas":{"core_node2":{
   [junit4]   2>       "core":".system_shard1_replica_n1",
   [junit4]   2>       "base_url":"https://127.0.0.1:41574/solr",
   [junit4]   2>       "state":"down",
   [junit4]   2>       "node_name":null,
   [junit4]   2>       "type":"NRT"}}}
   [junit4]   2> 850417 DEBUG (OverseerStateUpdate-72899159658594310-127.0.0.1:41574_solr-n_0000000000) [    ] o.a.s.c.o.ZkStateWriter going to update_collection /collections/.system/state.json version: 0
   [junit4]   2> 850619 DEBUG (ScheduledTrigger-1756-thread-2) [    ] o.a.s.c.a.NodeLostTrigger Running NodeLostTrigger: .auto_add_replicas with currently live nodes: 2
   [junit4]   2> 850656 INFO  (qtp1928478273-5484) [n:127.0.0.1:41574_solr    x:.system_shard1_replica_n1] o.a.s.h.a.CoreAdminOperation core create command qt=/admin/cores&coreNodeName=core_node2&collection.configName=.system&newCollection=true&name=.system_shard1_replica_n1&action=CREATE&numShards=1&collection=.system&shard=shard1&wt=javabin&version=2&replicaType=NRT
   [junit4]   2> 850656 INFO  (qtp1928478273-5484) [n:127.0.0.1:41574_solr    x:.system_shard1_replica_n1] o.a.s.c.TransientSolrCoreCacheDefault Allocating transient cache for 2147483647 transient cores
   [junit4]   2> 850659 DEBUG (OverseerStateUpdate-72899159658594310-127.0.0.1:41574_solr-n_0000000000) [    ] o.a.s.c.Overseer processMessage: queueSize: 1, message = {
   [junit4]   2>   "core":".system_shard1_replica_n1",
   [junit4]   2>   "core_node_name":"core_node2",
   [junit4]   2>   "roles":null,
   [junit4]   2>   "base_url":"https://127.0.0.1:41574/solr",
   [junit4]   2>   "node_name":"127.0.0.1:41574_solr",
   [junit4]   2>   "numShards":"1",
   [junit4]   2>   "state":"down",
   [junit4]   2>   "shard":"shard1",
   [junit4]   2>   "collection":".system",
   [junit4]   2>   "type":"NRT",
   [junit4]   2>   "force_set_state":"false",
   [junit4]   2>   "operation":"state"} current state version: 0
   [junit4]   2> 850659 DEBUG (OverseerStateUpdate-72899159658594310-127.0.0.1:41574_solr-n_0000000000) [    ] o.a.s.c.o.ReplicaMutator Update state numShards=1 message={
   [junit4]   2>   "core":".system_shard1_replica_n1",
   [junit4]   2>   "core_node_name":"core_node2",
   [junit4]   2>   "roles":null,
   [junit4]   2>   "base_url":"https://127.0.0.1:41574/solr",
   [junit4]   2>   "node_name":"127.0.0.1:41574_solr",
   [junit4]   2>   "numShards":"1",
   [junit4]   2>   "state":"down",
   [junit4]   2>   "shard":"shard1",
   [junit4]   2>   "collection":".system",
   [junit4]   2>   "type":"NRT",
   [junit4]   2>   "force_set_state":"false",
   [junit4]   2>   "operation":"state"}
   [junit4]   2> 850659 DEBUG (OverseerStateUpdate-72899159658594310-127.0.0.1:41574_solr-n_0000000000) [    ] o.a.s.c.o.ReplicaMutator Will update state for replica: core_node2:{"core":".system_shard1_replica_n1","base_url":"https://127.0.0.1:41574/solr","node_name":"127.0.0.1:41574_solr","state":"down","type":"NRT","force_set_state":"false"}
   [junit4]   2> 850659 DEBUG (OverseerStateUpdate-72899159658594310-127.0.0.1:41574_solr-n_0000000000) [    ] o.a.s.c.o.ReplicaMutator Collection is now: DocCollection(.system//collections/.system/state.json/1)={
   [junit4]   2>   "pullReplicas":"0",
   [junit4]   2>   "replicationFactor":"1",
   [junit4]   2>   "router":{"name":"compositeId"},
   [junit4]   2>   "maxShardsPerNode":"1",
   [junit4]   2>   "autoAddReplicas":"false",
   [junit4]   2>   "nrtReplicas":"1",
   [junit4]   2>   "tlogReplicas":"0",
   [junit4]   2>   "shards":{"shard1":{
   [junit4]   2>       "range":"80000000-7fffffff",
   [junit4]   2>       "state":"active",
   [junit4]   2>       "replicas":{"core_node2":{
   [junit4]   2>           "core":".system_shard1_replica_n1",
   [junit4]   2>           "base_url":"https://127.0.0.1:41574/solr",
   [junit4]   2>           "node_name":"127.0.0.1:41574_solr",
   [junit4]   2>           "state":"down",
   [junit4]   2>           "type":"NRT",
   [junit4]   2>           "force_set_state":"false"}}}}}
   [junit4]   2> 850760 DEBUG (OverseerStateUpdate-72899159658594310-127.0.0.1:41574_solr-n_0000000000) [    ] o.a.s.c.o.ZkStateWriter going to update_collection /collections/.system/state.json version: 1
   [junit4]   2> 851655 DEBUG (ScheduledTrigger-1756-thread-1) [    ] o.a.s.c.a.NodeLostTrigger Running NodeLostTrigger: .auto_add_replicas with currently live nodes: 2
   [junit4]   2> 851667 WARN  (qtp1928478273-5484) [n:127.0.0.1:41574_solr c:.system s:shard1 r:core_node2 x:.system_shard1_replica_n1] o.a.s.c.Config You should not use LATEST as luceneMatchVersion property: if you use this setting, and then Solr upgrades to a newer release of Lucene, sizable changes may happen. If precise back compatibility is important then you should instead explicitly specify an actual Lucene version.
   [junit4]   2> 851668 INFO  (qtp1928478273-5484) [n:127.0.0.1:41574_solr c:.system s:shard1 r:core_node2 x:.system_shard1_replica_n1] o.a.s.c.SolrConfig Using Lucene MatchVersion: 7.5.0
   [junit4]   2> 851741 INFO  (qtp1928478273-5484) [n:127.0.0.1:41574_solr c:.system s:shard1 r:core_node2 x:.system_shard1_replica_n1] o.a.s.s.ManagedIndexSchemaFactory The schema is configured as managed, but managed schema resource managed-schema not found - loading non-managed schema schema.xml instead
   [junit4]   2> 851752 INFO  (qtp1928478273-5484) [n:127.0.0.1:41574_solr c:.system s:shard1 r:core_node2 x:.system_shard1_replica_n1] o.a.s.s.IndexSchema [.system_shard1_replica_n1] Schema name=_system collection or core
   [junit4]   2> 851765 INFO  (qtp1928478273-5484) [n:127.0.0.1:41574_solr c:.system s:shard1 r:core_node2 x:.system_shard1_replica_n1] o.a.s.s.IndexSchema Loaded schema _system collection or core/1.1 with uniqueid field id
   [junit4]   2> 851766 INFO  (qtp1928478273-5484) [n:127.0.0.1:41574_solr c:.system s:shard1 r:core_node2 x:.system_shard1_replica_n1] o.a.s.s.ManagedIndexSchema Created and persisted managed schema znode at /configs/.system/managed-schema
   [junit4]   2> 851768 INFO  (qtp1928478273-5484) [n:127.0.0.1:41574_solr c:.system s:shard1 r:core_node2 x:.system_shard1_replica_n1] o.a.s.s.ManagedIndexSchemaFactory After upgrading to managed schema in ZooKeeper, renamed the non-managed schema /configs/.system/schema.xml to /configs/.system/schema.xml.bak
   [junit4]   2> 851768 INFO  (qtp1928478273-5484) [n:127.0.0.1:41574_solr c:.system s:shard1 r:core_node2 x:.system_shard1_replica_n1] o.a.s.c.CoreContainer Creating SolrCore '.system_shard1_replica_n1' using configuration from collection .system, trusted=true
   [junit4]   2> 851768 INFO  (qtp1928478273-5484) [n:127.0.0.1:41574_solr c:.system s:shard1 r:core_node2 x:.system_shard1_replica_n1] o.a.s.m.r.SolrJmxReporter JMX monitoring for 'solr_41574.solr.core..system.shard1.replica_n1' (registry 'solr.core..system.shard1.replica_n1') enabled at server: com.sun.jmx.mbeanserver.JmxMBeanServer@7d9850fe
   [junit4]   2> 851769 INFO  (qtp1928478273-5484) [n:127.0.0.1:41574_solr c:.system s:shard1 r:core_node2 x:.system_shard1_replica_n1] o.a.s.c.SolrCore solr.RecoveryStrategy.Builder
   [junit4]   2> 851769 INFO  (qtp1928478273-5484) [n:127.0.0.1:41574_solr c:.system s:shard1 r:core_node2 x:.system_shard1_replica_n1] o.a.s.c.SolrCore [[.system_shard1_replica_n1] ] Opening new SolrCore at [/home/jenkins/jenkins-slave/workspace/Lucene-Solr-NightlyTests-7.x/checkout/solr/build/solr-core/test/J0/temp/solr.handler.admin.AutoscalingHistoryHandlerTest_35343B2071AF1737-001/tempDir-001/node2/.system_shard1_replica_n1], dataDir=[/home/jenkins/jenkins-slave/workspace/Lucene-Solr-NightlyTests-7.x/checkout/solr/build/solr-core/test/J0/temp/solr.handler.admin.AutoscalingHistoryHandlerTest_35343B2071AF1737-001/tempDir-001/node2/./.system_shard1_replica_n1/data/]
   [junit4]   2> 851994 INFO  (qtp1928478273-5484) [n:127.0.0.1:41574_solr c:.system s:shard1 r:core_node2 x:.system_shard1_replica_n1] o.a.s.u.UpdateHandler Using UpdateLog implementation: org.apache.solr.update.UpdateLog
   [junit4]   2> 851994 INFO  (qtp1928478273-5484) [n:127.0.0.1:41574_solr c:.system s:shard1 r:core_node2 x:.system_shard1_replica_n1] o.a.s.u.UpdateLog Initializing UpdateLog: dataDir= defaultSyncLevel=FLUSH numRecordsToKeep=100 maxNumLogsToKeep=10 numVersionBuckets=65536
   [junit4]   2> 851995 INFO  (qtp1928478273-5484) [n:127.0.0.1:41574_solr c:.system s:shard1 r:core_node2 x:.system_shard1_replica_n1] o.a.s.u.CommitTracker Hard AutoCommit: if 1 uncommited docs 
   [junit4]   2> 851995 INFO  (qtp1928478273-5484) [n:127.0.0.1:41574_solr c:.system s:shard1 r:core_node2 x:.system_shard1_replica_n1] o.a.s.u.CommitTracker Soft AutoCommit: disabled
   [junit4]   2> 851997 INFO  (qtp1928478273-5484) [n:127.0.0.1:41574_solr c:.system s:shard1 r:core_node2 x:.system_shard1_replica_n1] o.a.s.s.SolrIndexSearcher Opening [Searcher@1537e059[.system_shard1_replica_n1] main]
   [junit4]   2> 852014 INFO  (qtp1928478273-5484) [n:127.0.0.1:41574_solr c:.system s:shard1 r:core_node2 x:.system_shard1_replica_n1] o.a.s.r.ManagedResourceStorage Configured ZooKeeperStorageIO with znodeBase: /configs/.system
   [junit4]   2> 852015 INFO  (qtp1928478273-5484) [n:127.0.0.1:41574_solr c:.system s:shard1 r:core_node2 x:.system_shard1_replica_n1] o.a.s.r.ManagedResourceStorage Loaded null at path _rest_managed.json using ZooKeeperStorageIO:path=/configs/.system
   [junit4]   2> 852017 INFO  (qtp1928478273-5484) [n:127.0.0.1:41574_solr c:.system s:shard1 r:core_node2 x:.system_shard1_replica_n1] o.a.s.s.ZkIndexSchemaReader Creating ZooKeeper watch for the managed schema at /configs/.system/managed-schema
   [junit4]   2> 852030 INFO  (qtp1928478273-5484) [n:127.0.0.1:41574_solr c:.system s:shard1 r:core_node2 x:.system_shard1_replica_n1] o.a.s.s.ZkIndexSchemaReader Current schema version 0 is already the latest
   [junit4]   2> 852031 INFO  (qtp1928478273-5484) [n:127.0.0.1:41574_solr c:.system s:shard1 r:core_node2 x:.system_shard1_replica_n1] o.a.s.h.ReplicationHandler Commits will be reserved for 10000ms.
   [junit4]   2> 852047 INFO  (searcherExecutor-1767-thread-1-processing-n:127.0.0.1:41574_solr x:.system_shard1_replica_n1 c:.system s:shard1 r:core_node2) [n:127.0.0.1:41574_solr c:.system s:shard1 r:core_node2 x:.system_shard1_replica_n1] o.a.s.c.SolrCore [.system_shard1_replica_n1] Registered new searcher Searcher@1537e059[.system_shard1_replica_n1] main{ExitableDirectoryReader(UninvertingDirectoryReader())}
   [junit4]   2> 852047 INFO  (qtp1928478273-5484) [n:127.0.0.1:41574_solr c:.system s:shard1 r:core_node2 x:.system_shard1_replica_n1] o.a.s.u.UpdateLog Could not find max version in index or recent updates, using new clock 1604849631320080384
   [junit4]   2> 852065 INFO  (qtp1928478273-5484) [n:127.0.0.1:41574_solr c:.system s:shard1 r:core_node2 x:.system_shard1_replica_n1] o.a.s.c.ZkShardTerms Successful update of terms at /collections/.system/terms/shard1 to Terms{values={core_node2=0}, version=0}
   [junit4]   2> 852076 INFO  (qtp1928478273-5484) [n:127.0.0.1:41574_solr c:.system s:shard1 r:core_node2 x:.system_shard1_replica_n1] o.a.s.c.ShardLeaderElectionContext Enough replicas found to continue.
   [junit4]   2> 852076 INFO  (qtp1928478273-5484) [n:127.0.0.1:41574_solr c:.system s:shard1 r:core_node2 x:.system_shard1_replica_n1] o.a.s.c.ShardLeaderElectionContext I may be the new leader - try and sync
   [junit4]   2> 852076 INFO  (qtp1928478273-5484) [n:127.0.0.1:41574_solr c:.system s:shard1 r:core_node2 x:.system_shard1_replica_n1] o.a.s.c.SyncStrategy Sync replicas to https://127.0.0.1:41574/solr/.system_shard1_replica_n1/
   [junit4]   2> 852076 INFO  (qtp1928478273-5484) [n:127.0.0.1:41574_solr c:.system s:shard1 r:core_node2 x:.system_shard1_replica_n1] o.a.s.c.SyncStrategy Sync Success - now sync replicas to me
   [junit4]   2> 852076 INFO  (qtp1928478273-5484) [n:127.0.0.1:41574_solr c:.system s:shard1 r:core_node2 x:.system_shard1_replica_n1] o.a.s.c.SyncStrategy https://127.0.0.1:41574/solr/.system_shard1_replica_n1/ has no replicas
   [junit4]   2> 852076 INFO  (qtp1928478273-5484) [n:127.0.0.1:41574_solr c:.system s:shard1 r:core_node2 x:.system_shard1_replica_n1] o.a.s.c.ShardLeaderElectionContext Found all replicas participating in election, clear LIR
   [junit4]   2> 852088 INFO  (qtp1928478273-5484) [n:127.0.0.1:41574_solr c:.system s:shard1 r:core_node2 x:.system_shard1_replica_n1] o.a.s.c.ShardLeaderElectionContext I am the new leader: https://127.0.0.1:41574/solr/.system_shard1_replica_n1/ shard1
   [junit4]   2> 852100 DEBUG (OverseerStateUpdate-72899159658594310-127.0.0.1:41574_solr-n_0000000000) [    ] o.a.s.c.Overseer processMessage: queueSize: 1, message = {
   [junit4]   2>   "operation":"leader",
   [junit4]   2>   "shard":"shard1",
   [junit4]   2>   "collection":".system",
   [junit4]   2>   "base_url":"https://127.0.0.1:41574/solr",
   [junit4]   2>   "core":".system_shard1_replica_n1",
   [junit4]   2>   "state":"active"} current state version: 0
   [junit4]   2> 852200 DEBUG (OverseerStateUpdate-72899159658594310-127.0.0.1:41574_solr-n_0000000000) [    ] o.a.s.c.o.ZkStateWriter going to update_collection /collections/.system/state.json version: 2
   [junit4]   2> 852241 INFO  (qtp1928478273-5484) [n:127.0.0.1:41574_solr c:.system s:shard1 r:core_node2 x:.system_shard1_replica_n1] o.a.s.c.ZkController I am the leader, no recovery necessary
   [junit4]   2> 852279 INFO  (qtp1928478273-5484) [n:127.0.0.1:41574_solr c:.system s:shard1 r:core_node2 x:.system_shard1_replica_n1] o.a.s.s.HttpSolrCall [admin] webapp=null path=/admin/cores params={qt=/admin/cores&coreNodeName=core_node2&collection.configName=.system&newCollection=true&name=.system_shard1_replica_n1&action=CREATE&numShards=1&collection=.system&shard=shard1&wt=javabin&version=2&replicaType=NRT} status=0 QTime=1623
   [junit4]   2> 852282 DEBUG (OverseerStateUpdate-72899159658594310-127.0.0.1:41574_solr-n_0000000000) [    ] o.a.s.c.Overseer processMessage: queueSize: 1, message = {
   [junit4]   2>   "core":".system_shard1_replica_n1",
   [junit4]   2>   "core_node_name":"core_node2",
   [junit4]   2>   "roles":null,
   [junit4]   2>   "base_url":"https://127.0.0.1:41574/solr",
   [junit4]   2>   "node_name":"127.0.0.1:41574_solr",
   [junit4]   2>   "numShards":"1",
   [junit4]   2>   "state":"active",
   [junit4]   2>   "shard":"shard1",
   [junit4]   2>   "collection":".system",
   [junit4]   2>   "type":"NRT",
   [junit4]   2>   "force_set_state":"false",
   [junit4]   2>   "operation":"state"} current state version: 0
   [junit4]   2> 852282 DEBUG (OverseerStateUpdate-72899159658594310-127.0.0.1:41574_solr-n_0000000000) [    ] o.a.s.c.o.ReplicaMutator Update state numShards=1 message={
   [junit4]   2>   "core":".system_shard1_replica_n1",
   [junit4]   2>   "core_node_name":"core_node2",
   [junit4]   2>   "roles":null,
   [junit4]   2>   "base_url":"https://127.0.0.1:41574/solr",
   [junit4]   2>   "node_name":"127.0.0.1:41574_solr",
   [junit4]   2>   "numShards":"1",
   [junit4]   2>   "state":"active",
   [junit4]   2>   "shard":"shard1",
   [junit4]   2>   "collection":".system",
   [junit4]   2>   "type":"NRT",
   [junit4]   2>   "force_set_state":"false",
   [junit4]   2>   "operation":"state"}
   [junit4]   2> 852295 DEBUG (OverseerStateUpdate-72899159658594310-127.0.0.1:41574_solr-n_0000000000) [    ] o.a.s.c.o.ReplicaMutator Will update state for replica: core_node2:{"core":".system_shard1_replica_n1","base_url":"https://127.0.0.1:41574/solr","node_name":"127.0.0.1:41574_solr","state":"active","type":"NRT","force_set_state":"false","leader":"true"}
   [junit4]   2> 852295 DEBUG (OverseerStateUpdate-72899159658594310-127.0.0.1:41574_solr-n_0000000000) [    ] o.a.s.c.o.ReplicaMutator Collection is now: DocCollection(.system//collections/.system/state.json/3)={
   [junit4]   2>   "pullReplicas":"0",
   [junit4]   2>   "replicationFactor":"1",
   [junit4]   2>   "router":{"name":"compositeId"},
   [junit4]   2>   "maxShardsPerNode":"1",
   [junit4]   2>   "autoAddReplicas":"false",
   [junit4]   2>   "nrtReplicas":"1",
   [junit4]   2>   "tlogReplicas":"0",
   [junit4]   2>   "shards":{"shard1":{
   [junit4]   2>       "range":"80000000-7fffffff",
   [junit4]   2>       "state":"active",
   [junit4]   2>       "replicas":{"core_node2":{
   [junit4]   2>           "core":".system_shard1_replica_n1",
   [junit4]   2>           "base_url":"https://127.0.0.1:41574/solr",
   [junit4]   2>           "node_name":"127.0.0.1:41574_solr",
   [junit4]   2>           "state":"active",
   [junit4]   2>           "type":"NRT",
   [junit4]   2>           "force_set_state":"false",
   [junit4]   2>           "leader":"true"}}}}}
   [junit4]   2> 852300 INFO  (qtp1818263918-5481) [n:127.0.0.1:39407_solr    ] o.a.s.h.a.CollectionsHandler Wait for new collection to be active for at most 30 seconds. Check all shard replicas
   [junit4]   2> 852395 DEBUG (OverseerStateUpdate-72899159658594310-127.0.0.1:41574_solr-n_0000000000) [    ] o.a.s.c.o.ZkStateWriter going to update_collection /collections/.system/state.json version: 3
   [junit4]   2> 852396 INFO  (zkCallback-1658-thread-1) [    ] o.a.s.c.c.ZkStateReader A cluster state change: [WatchedEvent state:SyncConnected type:NodeDataChanged path:/collections/.system/state.json] for collection [.system] has occurred - updating... (live nodes size: [2])
   [junit4]   2> 852656 DEBUG (ScheduledTrigger-1756-thread-2) [    ] o.a.s.c.a.NodeLostTrigger Running NodeLostTrigger: .auto_add_replicas with currently live nodes: 2
   [junit4]   2> 853301 INFO  (qtp1818263918-5481) [n:127.0.0.1:39407_solr    ] o.a.s.s.HttpSolrCall [admin] webapp=null path=/admin/collections params={name=.system&nrtReplicas=1&action=CREATE&numShards=1&createNodeSet=127.0.0.1:41574_solr&wt=javabin&version=2} status=0 QTime=3202
   [junit4]   2> 853304 INFO  (qtp1818263918-5479) [n:127.0.0.1:39407_solr    ] o.a.s.h.a.CollectionsHandler Invoked Collection Action :create with params maxShardsPerNode=3&name=AutoscalingHistoryHandlerTest_collection&nrtReplicas=3&action=CREATE&numShards=1&createNodeSet=127.0.0.1:39407_solr&wt=javabin&version=2 and sendToOCPQueue=true
   [junit4]   2> 853328 INFO  (OverseerThreadFactory-1758-thread-2) [    ] o.a.s.c.a.c.CreateCollectionCmd Create collection AutoscalingHistoryHandlerTest_collection
   [junit4]   2> 853328 INFO  (OverseerCollectionConfigSetProcessor-72899159658594310-127.0.0.1:41574_solr-n_0000000000) [    ] o.a.s.c.OverseerTaskQueue Response ZK path: /overseer/collection-queue-work/qnr-0000000000 doesn't exist.  Requestor may have disconnected from ZooKeeper
   [junit4]   2> 853329 INFO  (OverseerThreadFactory-1758-thread-2) [    ] o.a.s.c.c.ZkConfigManager Copying zk node /configs/_default/protwords.txt to /configs/AutoscalingHistoryHandlerTest_collection.AUTOCREATED/protwords.txt
   [junit4]   2> 853343 INFO  (OverseerThreadFactory-1758-thread-2) [    ] o.a.s.c.c.ZkConfigManager Copying zk node /configs/_default/managed-schema to /configs/AutoscalingHistoryHandlerTest_collection.AUTOCREATED/managed-schema
   [junit4]   2> 853345 INFO  (OverseerThreadFactory-1758-thread-2) [    ] o.a.s.c.c.ZkConfigManager Copying zk node /configs/_default/params.json to /configs/AutoscalingHistoryHandlerTest_collection.AUTOCREATED/params.json
   [junit4]   2> 853346 INFO  (OverseerThreadFactory-1758-thread-2) [    ] o.a.s.c.c.ZkConfigManager Copying zk node /configs/_default/solrconfig.xml to /configs/AutoscalingHistoryHandlerTest_collection.AUTOCREATED/solrconfig.xml
   [junit4]   2> 853348 INFO  (OverseerThreadFactory-1758-thread-2) [    ] o.a.s.c.c.ZkConfigManager Copying zk node /configs/_default/lang/contractions_it.txt to /configs/AutoscalingHistoryHandlerTest_collection.AUTOCREATED/lang/contractions_it.txt
   [junit4]   2> 853349 INFO  (OverseerThreadFactory-1758-thread-2) [    ] o.a.s.c.c.ZkConfigManager Copying zk node /configs/_default/lang/stopwords_no.txt to /configs/AutoscalingHistoryHandlerTest_collection.AUTOCREATED/lang/stopwords_no.txt
   [junit4]   2> 853363 INFO  (OverseerThreadFactory-1758-thread-2) [    ] o.a.s.c.c.ZkConfigManager Copying zk node /configs/_default/lang/stopwords_hy.txt to /configs/AutoscalingHistoryHandlerTest_collection.AUTOCREATED/lang/stopwords_hy.txt
   [junit4]   2> 853365 INFO  (OverseerThreadFactory-1758-thread-2) [    ] o.a.s.c.c.ZkConfigManager Copying zk node /configs/_default/lang/stemdict_nl.txt to /configs/AutoscalingHistoryHandlerTest_collection.AUTOCREATED/lang/stemdict_nl.txt
   [junit4]   2> 853366 INFO  (OverseerThreadFactory-1758-thread-2) [    ] o.a.s.c.c.ZkConfigManager Copying zk node /configs/_default/lang/contractions_ca.txt to /configs/AutoscalingHistoryHandlerTest_collection.AUTOCREATED/lang/contractions_ca.txt
   [junit4]   2> 853376 INFO  (OverseerThreadFactory-1758-thread-2) [    ] o.a.s.c.c.ZkConfigManager Copying zk node /configs/_default/lang/stopwords_id.txt to /configs/AutoscalingHistoryHandlerTest_collection.AUTOCREATED/lang/stopwords_id.txt
   [junit4]   2> 853377 INFO  (OverseerThreadFactory-1758-thread-2) [    ] o.a.s.c.c.ZkConfigManager Copying zk node /configs/_default/lang/stopwords_ga.txt to /configs/AutoscalingHistoryHandlerTest_collection.AUTOCREATED/lang/stopwords_ga.txt
   [junit4]   2> 853379 INFO  (OverseerThreadFactory-1758-thread-2) [    ] o.a.s.c.c.ZkConfigManager Copying zk node /configs/_default/lang/stopwords_da.txt to /configs/AutoscalingHistoryHandlerTest_collection.AUTOCREATED/lang/stopwords_da.txt
   [junit4]   2> 853388 INFO  (OverseerThreadFactory-1758-thread-2) [    ] o.a.s.c.c.ZkConfigManager Copying zk node /configs/_default/lang/stopwords_hi.txt to /configs/AutoscalingHistoryHandlerTest_collection.AUTOCREATED/lang/stopwords_hi.txt
   [junit4]   2> 853389 INFO  (OverseerThreadFactory-1758-thread-2) [    ] o.a.s.c.c.ZkConfigManager Copying zk node /configs/_default/lang/stopwords_ja.txt to /configs/AutoscalingHistoryHandlerTest_collection.AUTOCREATED/lang/stopwords_ja.txt
   [junit4]   2> 853391 INFO  (OverseerThreadFactory-1758-thread-2) [    ] o.a.s.c.c.ZkConfigManager Copying zk node /configs/_default/lang/stopwords_pt.txt to /configs/AutoscalingHistoryHandlerTest_collection.AUTOCREATED/lang/stopwords_pt.txt
   [junit4]   2> 853392 INFO  (OverseerThreadFactory-1758-thread-2) [    ] o.a.s.c.c.ZkConfigManager Copying zk node /configs/_default/lang/stopwords_hu.txt to /configs/AutoscalingHistoryHandlerTest_collection.AUTOCREATED/lang/stopwords_hu.txt
   [junit4]   2> 853394 INFO  (OverseerThreadFactory-1758-thread-2) [    ] o.a.s.c.c.ZkConfigManager Copying zk node /configs/_default/lang/stopwords_el.txt to /configs/AutoscalingHistoryHandlerTest_collection.AUTOCREATED/lang/stopwords_el.txt
   [junit4]   2> 853395 INFO  (OverseerThreadFactory-1758-thread-2) [    ] o.a.s.c.c.ZkConfigManager Copying zk node /configs/_default/lang/stopwords_ru.txt to /configs/AutoscalingHistoryHandlerTest_collection.AUTOCREATED/lang/stopwords_ru.txt
   [junit4]   2> 853409 INFO  (OverseerThreadFactory-1758-thread-2) [    ] o.a.s.c.c.ZkConfigManager Copying zk node /configs/_default/lang/stopwords_tr.txt to /configs/AutoscalingHistoryHandlerTest_collection.AUTOCREATED/lang/stopwords_tr.txt
   [junit4]   2> 853433 INFO  (OverseerThreadFactory-1758-thread-2) [    ] o.a.s.c.c.ZkConfigManager Copying zk node /configs/_default/lang/stopwords_ar.txt to /configs/AutoscalingHistoryHandlerTest_collection.AUTOCREATED/lang/stopwords_ar.txt
   [junit4]   2> 853434 INFO  (OverseerThreadFactory-1758-thread-2) [    ] o.a.s.c.c.ZkConfigManager Copying zk node /configs/_default/lang/userdict_ja.txt to /configs/AutoscalingHistoryHandlerTest_collection.AUTOCREATED/lang/userdict_ja.txt
   [junit4]   2> 853436 INFO  (OverseerThreadFactory-1758-thread-2) [    ] o.a.s.c.c.ZkConfigManager Copying zk node /configs/_default/lang/stopwords_it.txt to /configs/AutoscalingHistoryHandlerTest_collection.AUTOCREATED/lang/stopwords_it.txt
   [junit4]   2> 853438 INFO  (OverseerThreadFactory-1758-thread-2) [    ] o.a.s.c.c.ZkConfigManager Copying zk node /configs/_default/lang/stopwords_eu.txt to /configs/AutoscalingHistoryHandlerTest_collection.AUTOCREATED/lang/stopwords_eu.txt
   [junit4]   2> 853439 INFO  (OverseerThreadFactory-1758-thread-2) [    ] o.a.s.c.c.ZkConfigManager Copying zk node /configs/_default/lang/stopwords_cz.txt to /configs/AutoscalingHistoryHandlerTest_collection.AUTOCREATED/lang/stopwords_cz.txt
   [junit4]   2> 853441 INFO  (OverseerThreadFactory-1758-thread-2) [    ] o.a.s.c.c.ZkConfigManager Copying zk node /configs/_default/lang/stoptags_ja.txt to /configs/AutoscalingHistoryHandlerTest_collection.AUTOCREATED/lang/stoptags_ja.txt
   [junit4]   2> 853442 INFO  (OverseerThreadFactory-1758-thread-2) [    ] o.a.s.c.c.ZkConfigManager Copying zk node /configs/_default/lang/contractions_fr.txt to /configs/AutoscalingHistoryHandlerTest_collection.AUTOCREATED/lang/contractions_fr.txt
   [junit4]   2> 853461 INFO  (OverseerThreadFactory-1758-thread-2) [    ] o.a.s.c.c.ZkConfigManager Copying zk node /configs/_default/lang/stopwords_fa.txt to /configs/AutoscalingHistoryHandlerTest_collection.AUTOCREATED/lang/stopwords_fa.txt
   [junit4]   2> 853463 INFO  (OverseerThreadFactory-1758-thread-2) [    ] o.a.s.c.c.ZkConfigManager Copying zk node /configs/_default/lang/stopwords_de.txt to /configs/AutoscalingHistoryHandlerTest_collection.AUTOCREATED/lang/stopwords_de.txt
   [junit4]   2> 853498 INFO  (OverseerThreadFactory-1758-thread-2) [    ] o.a.s.c.c.ZkConfigManager Copying zk node /configs/_default/lang/contractions_ga.txt to /configs/AutoscalingHistoryHandlerTest_collection.AUTOCREATED/lang/contractions_ga.txt
   [junit4]   2> 853500 INFO  (OverseerThreadFactory-1758-thread-2) [    ] o.a.s.c.c.ZkConfigManager Copying zk node /configs/_default/lang/stopwords_ca.txt to /configs/AutoscalingHistoryHandlerTest_collection.AUTOCREATED/lang/stopwords_ca.txt
   [junit4]   2> 853509 INFO  (OverseerThreadFactory-1758-thread-2) [    ] o.a.s.c.c.ZkConfigManager Copying zk node /configs/_default/lang/stopwords_nl.txt to /configs/AutoscalingHistoryHandlerTest_collection.AUTOCREATED/lang/stopwords_nl.txt
   [junit4]   2> 853511 INFO  (OverseerThreadFactory-1758-thread-2) [    ] o.a.s.c.c.ZkConfigManager Copying zk node /configs/_default/lang/stopwords_bg.txt to /configs/AutoscalingHistoryHandlerTest_collection.AUTOCREATED/lang/stopwords_bg.txt
   [junit4]   2> 853512 INFO  (OverseerThreadFactory-1758-thread-2) [    ] o.a.s.c.c.ZkConfigManager Copying zk node /configs/_default/lang/stopwords_es.txt to /configs/AutoscalingHistoryHandlerTest_collection.AUTOCREATED/lang/stopwords_es.txt
   [junit4]   2> 853523 INFO  (OverseerThreadFactory-1758-thread-2) [    ] o.a.s.c.c.ZkConfigManager Copying zk node /configs/_default/lang/stopwords_en.txt to /configs/AutoscalingHistoryHandlerTest_collection.AUTOCREATED/lang/stopwords_en.txt
   [junit4]   2> 853524 INFO  (OverseerThreadFactory-1758-thread-2) [    ] o.a.s.c.c.ZkConfigManager Copying zk node /configs/_default/lang/stopwords_lv.txt to /configs/AutoscalingHistoryHandlerTest_collection.AUTOCREATED/lang/stopwords_lv.txt
   [junit4]   2> 853541 INFO  (OverseerThreadFactory-1758-thread-2) [    ] o.a.s.c.c.ZkConfigManager Copying zk node /configs/_default/lang/stopwords_th.txt to /configs/AutoscalingHistoryHandlerTest_collection.AUTOCREATED/lang/stopwords_th.txt
   [junit4]   2> 853555 INFO  (OverseerThreadFactory-1758-thread-2) [    ] o.a.s.c.c.ZkConfigManager Copying zk node /configs/_default/lang/stopwords_ro.txt to /configs/AutoscalingHistoryHandlerTest_collection.AUTOCREATED/lang/stopwords_ro.txt
   [junit4]   2> 853556 INFO  (OverseerThreadFactory-1758-thread-2) [    ] o.a.s.c.c.ZkConfigManager Copying zk node /configs/_default/lang/stopwords_fr.txt to /configs/AutoscalingHistoryHandlerTest_collection.AUTOCREATED/lang/stopwords_fr.txt
   [junit4]   2> 853557 INFO  (OverseerThreadFactory-1758-thread-2) [    ] o.a.s.c.c.ZkConfigManager Copying zk node /configs/_default/lang/stopwords_sv.txt to /configs/AutoscalingHistoryHandlerTest_collection.AUTOCREATED/lang/stopwords_sv.txt
   [junit4]   2> 853572 INFO  (OverseerThreadFactory-1758-thread-2) [    ] o.a.s.c.c.ZkConfigManager Copying zk node /configs/_default/lang/stopwords_fi.txt to /configs/AutoscalingHistoryHandlerTest_collection.AUTOCREATED/lang/stopwords_fi.txt
   [junit4]   2> 853573 INFO  (OverseerThreadFactory-1758-thread-2) [    ] o.a.s.c.c.ZkConfigManager Copying zk node /configs/_default/lang/hyphenations_ga.txt to /configs/AutoscalingHistoryHandlerTest_collection.AUTOCREATED/lang/hyphenations_ga.txt
   [junit4]   2> 853583 INFO  (OverseerThreadFactory-1758-thread-2) [    ] o.a.s.c.c.ZkConfigManager Copying zk node /configs/_default/lang/stopwords_gl.txt to /configs/AutoscalingHistoryHandlerTest_collection.AUTOCREATED/lang/stopwords_gl.txt
   [junit4]   2> 853608 INFO  (OverseerThreadFactory-1758-thread-2) [    ] o.a.s.c.c.ZkConfigManager Copying zk node /configs/_default/stopwords.txt to /configs/AutoscalingHistoryHandlerTest_collection.AUTOCREATED/stopwords.txt
   [junit4]   2> 853609 WARN  (OverseerThreadFactory-1758-thread-2) [    ] o.a.s.c.a.c.CreateCollectionCmd Specified number of replicas of 3 on collection AutoscalingHistoryHandlerTest_collection is higher than the number of Solr instances currently live or live and part of your createNodeSet(1). It's unusual to run two replica of the same slice on the same Solr-instance.
   [junit4]   2> 853646 DEBUG (OverseerStateUpdate-72899159658594310-127.0.0.1:41574_solr-n_0000000000) [    ] o.a.s.c.Overseer processMessage: queueSize: 1, message = {
   [junit4]   2>   "name":"AutoscalingHistoryHandlerTest_collection",
   [junit4]   2>   "fromApi":"true",
   [junit4]   2>   "numShards":"1",
   [junit4]   2>   "maxShardsPerNode":"3",
   [junit4]   2>   "createNodeSet":"127.0.0.1:39407_solr",
   [junit4]   2>   "nrtReplicas":"3",
   [junit4]   2>   "stateFormat":"2",
   [junit4]   2>   "replicationFactor":"3",
   [junit4]   2>   "operation":"create"} current state version: 0
   [junit4]   2> 853647 DEBUG (OverseerStateUpdate-72899159658594310-127.0.0.1:41574_solr-n_0000000000) [    ] o.a.s.c.o.ClusterStateMutator building a new cName: AutoscalingHistoryHandlerTest_collection
   [junit4]   2> 853656 DEBUG (ScheduledTrigger-1756-thread-1) [    ] o.a.s.c.a.NodeLostTrigger Running NodeLostTrigger: .auto_add_replicas with currently live nodes: 2
   [junit4]   2> 853757 DEBUG (OverseerStateUpdate-72899159658594310-127.0.0.1:41574_solr-n_0000000000) [    ] o.a.s.c.o.ZkStateWriter going to create_collection /collections/AutoscalingHistoryHandlerTest_collection/state.json
   [junit4]   2> 853860 DEBUG (OverseerStateUpdate-72899159658594310-127.0.0.1:41574_solr-n_0000000000) [    ] o.a.s.c.Overseer processMessage: queueSize: 1, message = {
   [junit4]   2>   "operation":"ADDREPLICA",
   [junit4]   2>   "collection":"AutoscalingHistoryHandlerTest_collection",
   [junit4]   2>   "shard":"shard1",
   [junit4]   2>   "core":"AutoscalingHistoryHandlerTest_collection_shard1_replica_n1",
   [junit4]   2>   "state":"down",
   [junit4]   2>   "base_url":"https://127.0.0.1:39407/solr",
   [junit4]   2>   "type":"NRT",
   [junit4]   2>   "waitForFinalState":"false"} current state version: 0
   [junit4]   2> 853860 INFO  (OverseerStateUpdate-72899159658594310-127.0.0.1:41574_solr-n_0000000000) [    ] o.a.s.c.o.SliceMutator createReplica() {
   [junit4]   2>   "operation":"ADDREPLICA",
   [junit4]   2>   "collection":"AutoscalingHistoryHandlerTest_collection",
   [junit4]   2>   "shard":"shard1",
   [junit4]   2>   "core":"AutoscalingHistoryHandlerTest_collection_shard1_replica_n1",
   [junit4]   2>   "state":"down",
   [junit4]   2>   "base_url":"https://127.0.0.1:39407/solr",
   [junit4]   2>   "type":"NRT",
   [junit4]   2>   "waitForFinalState":"false"} 
   [junit4]   2> 853862 DEBUG (OverseerStateUpdate-72899159658594310-127.0.0.1:41574_solr-n_0000000000) [    ] o.a.s.c.o.SliceMutator Old Slice: shard1:{
   [junit4]   2>   "range":"80000000-7fffffff",
   [junit4]   2>   "state":"active",
   [junit4]   2>   "replicas":{}}
   [junit4]   2> 853862 DEBUG (OverseerStateUpdate-72899159658594310-127.0.0.1:41574_solr-n_0000000000) [    ] o.a.s.c.o.SliceMutator New Slice: shard1:{
   [junit4]   2>   "range":"80000000-7fffffff",
   [junit4]   2>   "state":"active",
   [junit4]   2>   "replicas":{"core_node3":{
   [junit4]   2>       "core":"AutoscalingHistoryHandlerTest_collection_shard1_replica_n1",
   [junit4]   2>       "base_url":"https://127.0.0.1:39407/solr",
   [junit4]   2>       "state":"down",
   [junit4]   2>       "node_name":null,
   [junit4]   2>       "type":"NRT"}}}
   [junit4]   2> 853891 DEBUG (OverseerStateUpdate-72899159658594310-127.0.0.1:41574_solr-n_0000000000) [    ] o.a.s.c.Overseer processMessage: queueSize: 2, message = {
   [junit4]   2>   "operation":"ADDREPLICA",
   [junit4]   2>   "collection":"AutoscalingHistoryHandlerTest_collection",
   [junit4]   2>   "shard":"shard1",
   [junit4]   2>   "core":"AutoscalingHistoryHandlerTest_collection_shard1_replica_n2",
   [junit4]   2>   "state":"down",
   [junit4]   2>   "base_url":"https://127.0.0.1:39407/solr",
   [junit4]   2>   "type":"NRT",
   [junit4]   2>   "waitForFinalState":"false"} current state version: 0
   [junit4]   2> 853892 INFO  (OverseerStateUpdate-72899159658594310-127.0.0.1:41574_solr-n_0000000000) [    ] o.a.s.c.o.SliceMutator createReplica() {
   [junit4]   2>   "operation":"ADDREPLICA",
   [junit4]   2>   "collection":"AutoscalingHistoryHandlerTest_collection",
   [junit4]   2>   "shard":"shard1",
   [junit4]   2>   "core":"AutoscalingHistoryHandlerTest_collection_shard1_replica_n2",
   [junit4]   2>   "state":"down",
   [junit4]   2>   "base_url":"https://127.0.0.1:39407/solr",
   [junit4]   2>   "type":"NRT",
   [junit4]   2>   "waitForFinalState":"false"} 
   [junit4]   2> 853907 DEBUG (OverseerStateUpdate-72899159658594310-127.0.0.1:41574_solr-n_0000000000) [    ] o.a.s.c.o.SliceMutator Old Slice: shard1:{
   [junit4]   2>   "range":"80000000-7fffffff",
   [junit4]   2>   "state":"active",
   [junit4]   2>   "replicas":{"core_node3":{
   [junit4]   2>       "core":"AutoscalingHistoryHandlerTest_collection_shard1_replica_n1",
   [junit4]   2>       "base_url":"https://127.0.0.1:39407/solr",
   [junit4]   2>       "state":"down",
   [junit4]   2>       "node_name":null,
   [junit4]   2>       "type":"NRT"}}}
   [junit4]   2> 853908 DEBUG (OverseerStateUpdate-72899159658594310-127.0.0.1:41574_solr-n_0000000000) [    ] o.a.s.c.o.SliceMutator New Slice: shard1:{
   [junit4]   2>   "range":"80000000-7fffffff",
   [junit4]   2>   "state":"active",
   [junit4]   2>   "replicas":{
   [junit4]   2>     "core_node3":{
   [junit4]   2>       "core":"AutoscalingHistoryHandlerTest_collection_shard1_replica_n1",
   [junit4]   2>       "base_url":"https://127.0.0.1:39407/solr",
   [junit4]   2>       "state":"down",
   [junit4]   2>       "node_name":null,
   [junit4]   2>       "type":"NRT"},
   [junit4]   2>     "core_node5":{
   [junit4]   2>       "core":"AutoscalingHistoryHandlerTest_collection_shard1_replica_n2",
   [junit4]   2>       "base_url":"https://127.0.0.1:39407/solr",
   [junit4]   2>       "state":"down",
   [junit4]   2>       "node_name":null,
   [junit4]   2>       "type":"NRT"}}}
   [junit4]   2> 853924 DEBUG (OverseerStateUpdate-72899159658594310-127.0.0.1:41574_solr-n_0000000000) [    ] o.a.s.c.Overseer processMessage: queueSize: 3, message = {
   [junit4]   2>   "operation":"ADDREPLICA",
   [junit4]   2>   "collection":"AutoscalingHistoryHandlerTest_collection",
   [junit4]   2>   "shard":"shard1",
   [junit4]   2>   "core":"AutoscalingHistoryHandlerTest_collection_shard1_replica_n4",
   [junit4]   2>   "state":"down",
   [junit4]   2>   "base_url":"https://127.0.0.1:39407/solr",
   [junit4]   2>   "type":"NRT",
   [junit4]   2>   "waitForFinalState":"false"} current state version: 0
   [junit4]   2> 853924 INFO  (OverseerStateUpdate-72899159658594310-127.0.0.1:41574_solr-n_0000000000) [    ] o.a.s.c.o.SliceMutator createReplica() {
   [junit4]   2>   "operation":"ADDREPLICA",
   [junit4]   2>   "collection":"AutoscalingHistoryHandlerTest_collection",
   [junit4]   2>   "shard":"shard1",
   [junit4]   2>   "core":"AutoscalingHistoryHandlerTest_collection_shard1_replica_n4",
   [junit4]   2>   "state":"down",
   [junit4]   2>   "base_url":"https://127.0.0.1:39407/solr",
   [junit4]   2>   "type":"NRT",
   [junit4]   2>   "waitForFinalState":"false"} 
   [junit4]   2> 853925 DEBUG (OverseerStateUpdate-72899159658594310-127.0.0.1:41574_solr-n_0000000000) [    ] o.a.s.c.o.SliceMutator Old Slice: shard1:{
   [junit4]   2>   "range":"80000000-7fffffff",
   [junit4]   2>   "state":"active",
   [junit4]   2>   "replicas":{
   [junit4]   2>     "core_node3":{
   [junit4]   2>       "core":"AutoscalingHistoryHandlerTest_collection_shard1_replica_n1",
   [junit4]   2>       "base_url":"https://127.0.0.1:39407/solr",
   [junit4]   2>       "state":"down",
   [junit4]   2>       "node_name":null,
   [junit4]   2>       "type":"NRT"},
   [junit4]   2>     "core_node5":{
   [junit4]   2>       "core":"AutoscalingHistoryHandlerTest_collection_shard1_replica_n2",
   [junit4]   2>       "base_url":"https://127.0.0.1:39407/solr",
   [junit4]   2>       "state":"down",
   [junit4]   2>       "node_name":null,
   [junit4]   2>       "type":"NRT"}}}
   [junit4]   2> 853925 DEBUG (OverseerStateUpdate-72899159658594310-127.0.0.1:41574_solr-n_0000000000) [    ] o.a.s.c.o.SliceMutator New Slice: shard1:{
   [junit4]   2>   "range":"80000000-7fffffff",
   [junit4]   2>   "state":"active",
   [junit4]   2>   "replicas":{
   [junit4]   2>     "core_node3":{
   [junit4]   2>       "core":"AutoscalingHistoryHandlerTest_collection_shard1_replica_n1",
   [junit4]   2>       "base_url":"https://127.0.0.1:39407/solr",
   [junit4]   2>       "state":"down",
   [junit4]   2>       "node_name":null,
   [junit4]   2>       "type":"NRT"},
   [junit4]   2>     "core_node5":{
   [junit4]   2>       "core":"AutoscalingHistoryHandlerTest_collection_shard1_replica_n2",
   [junit4]   2>       "base_url":"https://127.0.0.1:39407/solr",
   [junit4]   2>       "state":"down",
   [junit4]   2>       "node_name":null,
   [junit4]   2>       "type":"NRT"},
   [junit4]   2>     "core_node6":{
   [junit4]   2>       "core":"AutoscalingHistoryHandlerTest_collection_shard1_replica_n4",
   [junit4]   2>       "base_url":"https://127.0.0.1:39407/solr",
   [junit4]   2>       "state":"down",
   [junit4]   2>       "node_name":null,
   [junit4]   2>       "type":"NRT"}}}
   [junit4]   2> 854030 DEBUG (OverseerStateUpdate-72899159658594310-127.0.0.1:41574_solr-n_0000000000) [    ] o.a.s.c.o.ZkStateWriter going to update_collection /collections/AutoscalingHistoryHandlerTest_collection/state.json version: 0
   [junit4]   2> 854153 INFO  (qtp1818263918-5472) [n:127.0.0.1:39407_solr    x:AutoscalingHistoryHandlerTest_collection_shard1_replica_n4] o.a.s.h.a.CoreAdminOperation core create command qt=/admin/cores&coreNodeName=core_node6&collection.configName=AutoscalingHistoryHandlerTest_collection.AUTOCREATED&newCollection=true&name=AutoscalingHistoryHandlerTest_collection_shard1_replica_n4&action=CREATE&numShards=1&collection=AutoscalingHistoryHandlerTest_collection&shard=shard1&wt=javabin&version=2&replicaType=NRT
   [junit4]   2> 854158 INFO  (qtp1818263918-5485) [n:127.0.0.1:39407_solr    x:AutoscalingHistoryHandlerTest_collection_shard1_replica_n2] o.a.s.h.a.CoreAdminOperation core create command qt=/admin/cores&coreNodeName=core_node5&collection.configName=AutoscalingHistoryHandlerTest_collection.AUTOCREATED&newCollection=true&name=AutoscalingHistoryHandlerTest_collection_shard1_replica_n2&action=CREATE&numShards=1&collection=AutoscalingHistoryHandlerTest_collection&shard=shard1&wt=javabin&version=2&replicaType=NRT
   [junit4]   2> 854174 DEBUG (OverseerStateUpdate-72899159658594310-127.0.0.1:41574_solr-n_0000000000) [    ] o.a.s.c.Overseer processMessage: queueSize: 1, message = {
   [junit4]   2>   "core":"AutoscalingHistoryHandlerTest_collection_shard1_repli

[...truncated too long message...]

ve:

ivy-availability-check:
[loadresource] Do not set property disallowed.ivy.jars.list as its length is 0.

-ivy-fail-disallowed-ivy-version:

ivy-fail:

ivy-fail:

ivy-configure:
[ivy:configure] :: loading settings :: file = /home/jenkins/jenkins-slave/workspace/Lucene-Solr-NightlyTests-7.x/checkout/lucene/top-level-ivy-settings.xml

resolve:

ivy-availability-check:
[loadresource] Do not set property disallowed.ivy.jars.list as its length is 0.

-ivy-fail-disallowed-ivy-version:

ivy-fail:

ivy-configure:
[ivy:configure] :: loading settings :: file = /home/jenkins/jenkins-slave/workspace/Lucene-Solr-NightlyTests-7.x/checkout/lucene/top-level-ivy-settings.xml

resolve:

ivy-availability-check:
[loadresource] Do not set property disallowed.ivy.jars.list as its length is 0.

-ivy-fail-disallowed-ivy-version:

ivy-fail:

ivy-fail:

ivy-configure:
[ivy:configure] :: loading settings :: file = /home/jenkins/jenkins-slave/workspace/Lucene-Solr-NightlyTests-7.x/checkout/lucene/top-level-ivy-settings.xml

resolve:

ivy-availability-check:
[loadresource] Do not set property disallowed.ivy.jars.list as its length is 0.

-ivy-fail-disallowed-ivy-version:

ivy-fail:

ivy-fail:

ivy-configure:
[ivy:configure] :: loading settings :: file = /home/jenkins/jenkins-slave/workspace/Lucene-Solr-NightlyTests-7.x/checkout/lucene/top-level-ivy-settings.xml

resolve:

ivy-availability-check:
[loadresource] Do not set property disallowed.ivy.jars.list as its length is 0.

-ivy-fail-disallowed-ivy-version:

ivy-fail:

ivy-fail:

ivy-configure:
[ivy:configure] :: loading settings :: file = /home/jenkins/jenkins-slave/workspace/Lucene-Solr-NightlyTests-7.x/checkout/lucene/top-level-ivy-settings.xml

resolve:

ivy-availability-check:
[loadresource] Do not set property disallowed.ivy.jars.list as its length is 0.

-ivy-fail-disallowed-ivy-version:

ivy-fail:

ivy-fail:

ivy-configure:
[ivy:configure] :: loading settings :: file = /home/jenkins/jenkins-slave/workspace/Lucene-Solr-NightlyTests-7.x/checkout/lucene/top-level-ivy-settings.xml

resolve:

ivy-availability-check:
[loadresource] Do not set property disallowed.ivy.jars.list as its length is 0.

-ivy-fail-disallowed-ivy-version:

ivy-fail:

ivy-fail:

ivy-configure:
[ivy:configure] :: loading settings :: file = /home/jenkins/jenkins-slave/workspace/Lucene-Solr-NightlyTests-7.x/checkout/lucene/top-level-ivy-settings.xml

resolve:

ivy-availability-check:
[loadresource] Do not set property disallowed.ivy.jars.list as its length is 0.

-ivy-fail-disallowed-ivy-version:

ivy-fail:

ivy-fail:

ivy-configure:
[ivy:configure] :: loading settings :: file = /home/jenkins/jenkins-slave/workspace/Lucene-Solr-NightlyTests-7.x/checkout/lucene/top-level-ivy-settings.xml

resolve:

ivy-availability-check:
[loadresource] Do not set property disallowed.ivy.jars.list as its length is 0.

-ivy-fail-disallowed-ivy-version:

ivy-fail:

ivy-fail:

ivy-configure:
[ivy:configure] :: loading settings :: file = /home/jenkins/jenkins-slave/workspace/Lucene-Solr-NightlyTests-7.x/checkout/lucene/top-level-ivy-settings.xml

resolve:

ivy-availability-check:
[loadresource] Do not set property disallowed.ivy.jars.list as its length is 0.

-ivy-fail-disallowed-ivy-version:

ivy-fail:

ivy-fail:

ivy-configure:
[ivy:configure] :: loading settings :: file = /home/jenkins/jenkins-slave/workspace/Lucene-Solr-NightlyTests-7.x/checkout/lucene/top-level-ivy-settings.xml

resolve:

ivy-availability-check:
[loadresource] Do not set property disallowed.ivy.jars.list as its length is 0.

-ivy-fail-disallowed-ivy-version:

ivy-fail:

ivy-fail:

ivy-configure:
[ivy:configure] :: loading settings :: file = /home/jenkins/jenkins-slave/workspace/Lucene-Solr-NightlyTests-7.x/checkout/lucene/top-level-ivy-settings.xml

resolve:

ivy-availability-check:
[loadresource] Do not set property disallowed.ivy.jars.list as its length is 0.

-ivy-fail-disallowed-ivy-version:

ivy-fail:

ivy-fail:

ivy-configure:
[ivy:configure] :: loading settings :: file = /home/jenkins/jenkins-slave/workspace/Lucene-Solr-NightlyTests-7.x/checkout/lucene/top-level-ivy-settings.xml

resolve:

ivy-availability-check:
[loadresource] Do not set property disallowed.ivy.jars.list as its length is 0.

-ivy-fail-disallowed-ivy-version:

ivy-fail:

ivy-fail:

ivy-configure:
[ivy:configure] :: loading settings :: file = /home/jenkins/jenkins-slave/workspace/Lucene-Solr-NightlyTests-7.x/checkout/lucene/top-level-ivy-settings.xml

resolve:

jar-checksums:
    [mkdir] Created dir: /home/jenkins/jenkins-slave/workspace/Lucene-Solr-NightlyTests-7.x/checkout/solr/null1149340891
     [copy] Copying 247 files to /home/jenkins/jenkins-slave/workspace/Lucene-Solr-NightlyTests-7.x/checkout/solr/null1149340891
   [delete] Deleting directory /home/jenkins/jenkins-slave/workspace/Lucene-Solr-NightlyTests-7.x/checkout/solr/null1149340891

check-working-copy:
[ivy:cachepath] :: resolving dependencies :: org.eclipse.jgit#org.eclipse.jgit-caller;working
[ivy:cachepath] 	confs: [default]
[ivy:cachepath] 	found org.eclipse.jgit#org.eclipse.jgit;4.6.0.201612231935-r in public
[ivy:cachepath] 	found com.jcraft#jsch;0.1.53 in public
[ivy:cachepath] 	found com.googlecode.javaewah#JavaEWAH;1.1.6 in public
[ivy:cachepath] 	found org.apache.httpcomponents#httpclient;4.3.6 in public
[ivy:cachepath] 	found org.apache.httpcomponents#httpcore;4.3.3 in public
[ivy:cachepath] 	found commons-logging#commons-logging;1.1.3 in public
[ivy:cachepath] 	found commons-codec#commons-codec;1.6 in public
[ivy:cachepath] 	found org.slf4j#slf4j-api;1.7.2 in public
[ivy:cachepath] :: resolution report :: resolve 84ms :: artifacts dl 16ms
	---------------------------------------------------------------------
	|                  |            modules            ||   artifacts   |
	|       conf       | number| search|dwnlded|evicted|| number|dwnlded|
	---------------------------------------------------------------------
	|      default     |   8   |   0   |   0   |   0   ||   8   |   0   |
	---------------------------------------------------------------------
[wc-checker] Initializing working copy...
[wc-checker] SLF4J: Failed to load class "org.slf4j.impl.StaticLoggerBinder".
[wc-checker] SLF4J: Defaulting to no-operation (NOP) logger implementation
[wc-checker] SLF4J: See http://www.slf4j.org/codes.html#StaticLoggerBinder for further details.
[wc-checker] Checking working copy status...

-jenkins-base:

BUILD SUCCESSFUL
Total time: 448 minutes 24 seconds
Archiving artifacts
java.lang.InterruptedException: no matches found within 10000
	at hudson.FilePath$34.hasMatch(FilePath.java:2678)
	at hudson.FilePath$34.invoke(FilePath.java:2557)
	at hudson.FilePath$34.invoke(FilePath.java:2547)
	at hudson.FilePath$FileCallableWrapper.call(FilePath.java:2918)
Also:   hudson.remoting.Channel$CallSiteStackTrace: Remote call to lucene2
		at hudson.remoting.Channel.attachCallSiteStackTrace(Channel.java:1741)
		at hudson.remoting.UserRequest$ExceptionResponse.retrieve(UserRequest.java:357)
		at hudson.remoting.Channel.call(Channel.java:955)
		at hudson.FilePath.act(FilePath.java:1036)
		at hudson.FilePath.act(FilePath.java:1025)
		at hudson.FilePath.validateAntFileMask(FilePath.java:2547)
		at hudson.tasks.ArtifactArchiver.perform(ArtifactArchiver.java:243)
		at hudson.tasks.BuildStepCompatibilityLayer.perform(BuildStepCompatibilityLayer.java:81)
		at hudson.tasks.BuildStepMonitor$1.perform(BuildStepMonitor.java:20)
		at hudson.model.AbstractBuild$AbstractBuildExecution.perform(AbstractBuild.java:744)
		at hudson.model.AbstractBuild$AbstractBuildExecution.performAllBuildSteps(AbstractBuild.java:690)
		at hudson.model.Build$BuildExecution.post2(Build.java:186)
		at hudson.model.AbstractBuild$AbstractBuildExecution.post(AbstractBuild.java:635)
		at hudson.model.Run.execute(Run.java:1819)
		at hudson.model.FreeStyleBuild.run(FreeStyleBuild.java:43)
		at hudson.model.ResourceController.execute(ResourceController.java:97)
		at hudson.model.Executor.run(Executor.java:429)
Caused: hudson.FilePath$TunneledInterruptedException
	at hudson.FilePath$FileCallableWrapper.call(FilePath.java:2920)
	at hudson.remoting.UserRequest.perform(UserRequest.java:212)
	at hudson.remoting.UserRequest.perform(UserRequest.java:54)
	at hudson.remoting.Request$2.run(Request.java:369)
	at hudson.remoting.InterceptingExecutorService$1.call(InterceptingExecutorService.java:72)
	at java.util.concurrent.FutureTask.run(FutureTask.java:266)
	at java.util.concurrent.ThreadPoolExecutor.runWorker(ThreadPoolExecutor.java:1142)
	at java.util.concurrent.ThreadPoolExecutor$Worker.run(ThreadPoolExecutor.java:617)
	at java.lang.Thread.run(Thread.java:748)
Caused: java.lang.InterruptedException: java.lang.InterruptedException: no matches found within 10000
	at hudson.FilePath.act(FilePath.java:1038)
	at hudson.FilePath.act(FilePath.java:1025)
	at hudson.FilePath.validateAntFileMask(FilePath.java:2547)
	at hudson.tasks.ArtifactArchiver.perform(ArtifactArchiver.java:243)
	at hudson.tasks.BuildStepCompatibilityLayer.perform(BuildStepCompatibilityLayer.java:81)
	at hudson.tasks.BuildStepMonitor$1.perform(BuildStepMonitor.java:20)
	at hudson.model.AbstractBuild$AbstractBuildExecution.perform(AbstractBuild.java:744)
	at hudson.model.AbstractBuild$AbstractBuildExecution.performAllBuildSteps(AbstractBuild.java:690)
	at hudson.model.Build$BuildExecution.post2(Build.java:186)
	at hudson.model.AbstractBuild$AbstractBuildExecution.post(AbstractBuild.java:635)
	at hudson.model.Run.execute(Run.java:1819)
	at hudson.model.FreeStyleBuild.run(FreeStyleBuild.java:43)
	at hudson.model.ResourceController.execute(ResourceController.java:97)
	at hudson.model.Executor.run(Executor.java:429)
No artifacts found that match the file pattern "**/*.events,heapdumps/**,**/hs_err_pid*". Configuration error?
Recording test results
Build step 'Publish JUnit test result report' changed build result to UNSTABLE
Email was triggered for: Unstable (Test Failures)
Sending email for trigger: Unstable (Test Failures)

Mime
View raw message