lucene-dev mailing list archives

Site index · List index
Message view « Date » · « Thread »
Top « Date » · « Thread »
From Policeman Jenkins Server <jenk...@thetaphi.de>
Subject [JENKINS] Lucene-Solr-master-Linux (64bit/jdk1.8.0_172) - Build # 22427 - Unstable!
Date Mon, 09 Jul 2018 23:31:14 GMT
Build: https://jenkins.thetaphi.de/job/Lucene-Solr-master-Linux/22427/
Java: 64bit/jdk1.8.0_172 -XX:+UseCompressedOops -XX:+UseSerialGC

18 tests failed.
FAILED:  junit.framework.TestSuite.org.apache.solr.client.solrj.embedded.TestSolrProperties

Error Message:
Suite timeout exceeded (>= 7200000 msec).

Stack Trace:
java.lang.Exception: Suite timeout exceeded (>= 7200000 msec).
	at __randomizedtesting.SeedInfo.seed([F16ADC998060EDDE]:0)


FAILED:  junit.framework.TestSuite.org.apache.solr.client.solrj.embedded.TestSolrProperties

Error Message:
Suite timeout exceeded (>= 7200000 msec).

Stack Trace:
java.lang.Exception: Suite timeout exceeded (>= 7200000 msec).
	at __randomizedtesting.SeedInfo.seed([F16ADC998060EDDE]:0)


FAILED:  org.apache.solr.client.solrj.embedded.TestSolrProperties.testProperties

Error Message:
Test abandoned because suite timeout was reached.

Stack Trace:
java.lang.Exception: Test abandoned because suite timeout was reached.
	at __randomizedtesting.SeedInfo.seed([F16ADC998060EDDE]:0)


FAILED:  org.apache.solr.client.solrj.embedded.TestSolrProperties.testProperties

Error Message:
Test abandoned because suite timeout was reached.

Stack Trace:
java.lang.Exception: Test abandoned because suite timeout was reached.
	at __randomizedtesting.SeedInfo.seed([F16ADC998060EDDE]:0)


FAILED:  org.apache.solr.handler.component.InfixSuggestersTest.testAnalyzingInfixSuggesterBuildThenReload

Error Message:
Test abandoned because suite timeout was reached.

Stack Trace:
java.lang.Exception: Test abandoned because suite timeout was reached.
	at __randomizedtesting.SeedInfo.seed([F5F55A0D6C698C6B]:0)


FAILED:  org.apache.solr.handler.component.InfixSuggestersTest.testAnalyzingInfixSuggesterBuildThenReload

Error Message:
Test abandoned because suite timeout was reached.

Stack Trace:
java.lang.Exception: Test abandoned because suite timeout was reached.
	at __randomizedtesting.SeedInfo.seed([F5F55A0D6C698C6B]:0)


FAILED:  org.apache.solr.handler.component.InfixSuggestersTest.testAnalyzingInfixSuggesterBuildThenReload

Error Message:
Test abandoned because suite timeout was reached.

Stack Trace:
java.lang.Exception: Test abandoned because suite timeout was reached.
	at __randomizedtesting.SeedInfo.seed([F5F55A0D6C698C6B]:0)


FAILED:  junit.framework.TestSuite.org.apache.solr.handler.component.InfixSuggestersTest

Error Message:
Suite timeout exceeded (>= 7200000 msec).

Stack Trace:
java.lang.Exception: Suite timeout exceeded (>= 7200000 msec).
	at __randomizedtesting.SeedInfo.seed([F5F55A0D6C698C6B]:0)


FAILED:  junit.framework.TestSuite.org.apache.solr.handler.component.InfixSuggestersTest

Error Message:
Suite timeout exceeded (>= 7200000 msec).

Stack Trace:
java.lang.Exception: Suite timeout exceeded (>= 7200000 msec).
	at __randomizedtesting.SeedInfo.seed([F5F55A0D6C698C6B]:0)


FAILED:  junit.framework.TestSuite.org.apache.solr.handler.component.InfixSuggestersTest

Error Message:
Suite timeout exceeded (>= 7200000 msec).

Stack Trace:
java.lang.Exception: Suite timeout exceeded (>= 7200000 msec).
	at __randomizedtesting.SeedInfo.seed([F5F55A0D6C698C6B]:0)


FAILED:  org.apache.solr.cloud.TestPullReplica.testKillLeader

Error Message:
Replica core_node4 not up to date after 10 seconds expected:<1> but was:<0>

Stack Trace:
java.lang.AssertionError: Replica core_node4 not up to date after 10 seconds expected:<1> but was:<0>
	at __randomizedtesting.SeedInfo.seed([F5F55A0D6C698C6B:BCE3AEB90ED2183D]:0)
	at org.junit.Assert.fail(Assert.java:93)
	at org.junit.Assert.failNotEquals(Assert.java:647)
	at org.junit.Assert.assertEquals(Assert.java:128)
	at org.junit.Assert.assertEquals(Assert.java:472)
	at org.apache.solr.cloud.TestPullReplica.waitForNumDocsInAllReplicas(TestPullReplica.java:542)
	at org.apache.solr.cloud.TestPullReplica.doTestNoLeader(TestPullReplica.java:490)
	at org.apache.solr.cloud.TestPullReplica.testKillLeader(TestPullReplica.java:309)
	at sun.reflect.NativeMethodAccessorImpl.invoke0(Native Method)
	at sun.reflect.NativeMethodAccessorImpl.invoke(NativeMethodAccessorImpl.java:62)
	at sun.reflect.DelegatingMethodAccessorImpl.invoke(DelegatingMethodAccessorImpl.java:43)
	at java.lang.reflect.Method.invoke(Method.java:498)
	at com.carrotsearch.randomizedtesting.RandomizedRunner.invoke(RandomizedRunner.java:1737)
	at com.carrotsearch.randomizedtesting.RandomizedRunner$8.evaluate(RandomizedRunner.java:934)
	at com.carrotsearch.randomizedtesting.RandomizedRunner$9.evaluate(RandomizedRunner.java:970)
	at com.carrotsearch.randomizedtesting.RandomizedRunner$10.evaluate(RandomizedRunner.java:984)
	at com.carrotsearch.randomizedtesting.rules.SystemPropertiesRestoreRule$1.evaluate(SystemPropertiesRestoreRule.java:57)
	at org.apache.lucene.util.TestRuleSetupTeardownChained$1.evaluate(TestRuleSetupTeardownChained.java:49)
	at org.apache.lucene.util.AbstractBeforeAfterRule$1.evaluate(AbstractBeforeAfterRule.java:45)
	at org.apache.lucene.util.TestRuleThreadAndTestName$1.evaluate(TestRuleThreadAndTestName.java:48)
	at org.apache.lucene.util.TestRuleIgnoreAfterMaxFailures$1.evaluate(TestRuleIgnoreAfterMaxFailures.java:64)
	at org.apache.lucene.util.TestRuleMarkFailure$1.evaluate(TestRuleMarkFailure.java:47)
	at com.carrotsearch.randomizedtesting.rules.StatementAdapter.evaluate(StatementAdapter.java:36)
	at com.carrotsearch.randomizedtesting.ThreadLeakControl$StatementRunner.run(ThreadLeakControl.java:368)
	at com.carrotsearch.randomizedtesting.ThreadLeakControl.forkTimeoutingTask(ThreadLeakControl.java:817)
	at com.carrotsearch.randomizedtesting.ThreadLeakControl$3.evaluate(ThreadLeakControl.java:468)
	at com.carrotsearch.randomizedtesting.RandomizedRunner.runSingleTest(RandomizedRunner.java:943)
	at com.carrotsearch.randomizedtesting.RandomizedRunner$5.evaluate(RandomizedRunner.java:829)
	at com.carrotsearch.randomizedtesting.RandomizedRunner$6.evaluate(RandomizedRunner.java:879)
	at com.carrotsearch.randomizedtesting.RandomizedRunner$7.evaluate(RandomizedRunner.java:890)
	at com.carrotsearch.randomizedtesting.rules.StatementAdapter.evaluate(StatementAdapter.java:36)
	at com.carrotsearch.randomizedtesting.rules.SystemPropertiesRestoreRule$1.evaluate(SystemPropertiesRestoreRule.java:57)
	at org.apache.lucene.util.AbstractBeforeAfterRule$1.evaluate(AbstractBeforeAfterRule.java:45)
	at com.carrotsearch.randomizedtesting.rules.StatementAdapter.evaluate(StatementAdapter.java:36)
	at org.apache.lucene.util.TestRuleStoreClassName$1.evaluate(TestRuleStoreClassName.java:41)
	at com.carrotsearch.randomizedtesting.rules.NoShadowingOrOverridesOnMethodsRule$1.evaluate(NoShadowingOrOverridesOnMethodsRule.java:40)
	at com.carrotsearch.randomizedtesting.rules.NoShadowingOrOverridesOnMethodsRule$1.evaluate(NoShadowingOrOverridesOnMethodsRule.java:40)
	at com.carrotsearch.randomizedtesting.rules.StatementAdapter.evaluate(StatementAdapter.java:36)
	at com.carrotsearch.randomizedtesting.rules.StatementAdapter.evaluate(StatementAdapter.java:36)
	at com.carrotsearch.randomizedtesting.rules.StatementAdapter.evaluate(StatementAdapter.java:36)
	at org.apache.lucene.util.TestRuleAssertionsRequired$1.evaluate(TestRuleAssertionsRequired.java:53)
	at org.apache.lucene.util.TestRuleMarkFailure$1.evaluate(TestRuleMarkFailure.java:47)
	at org.apache.lucene.util.TestRuleIgnoreAfterMaxFailures$1.evaluate(TestRuleIgnoreAfterMaxFailures.java:64)
	at org.apache.lucene.util.TestRuleIgnoreTestSuites$1.evaluate(TestRuleIgnoreTestSuites.java:54)
	at com.carrotsearch.randomizedtesting.rules.StatementAdapter.evaluate(StatementAdapter.java:36)
	at com.carrotsearch.randomizedtesting.ThreadLeakControl$StatementRunner.run(ThreadLeakControl.java:368)
	at java.lang.Thread.run(Thread.java:748)


FAILED:  org.apache.solr.cloud.TestPullReplica.testRemoveAllWriterReplicas

Error Message:
Replica core_node4 not up to date after 10 seconds expected:<1> but was:<0>

Stack Trace:
java.lang.AssertionError: Replica core_node4 not up to date after 10 seconds expected:<1> but was:<0>
	at __randomizedtesting.SeedInfo.seed([F5F55A0D6C698C6B:66FBC636789765C2]:0)
	at org.junit.Assert.fail(Assert.java:93)
	at org.junit.Assert.failNotEquals(Assert.java:647)
	at org.junit.Assert.assertEquals(Assert.java:128)
	at org.junit.Assert.assertEquals(Assert.java:472)
	at org.apache.solr.cloud.TestPullReplica.waitForNumDocsInAllReplicas(TestPullReplica.java:542)
	at org.apache.solr.cloud.TestPullReplica.doTestNoLeader(TestPullReplica.java:490)
	at org.apache.solr.cloud.TestPullReplica.testRemoveAllWriterReplicas(TestPullReplica.java:303)
	at sun.reflect.NativeMethodAccessorImpl.invoke0(Native Method)
	at sun.reflect.NativeMethodAccessorImpl.invoke(NativeMethodAccessorImpl.java:62)
	at sun.reflect.DelegatingMethodAccessorImpl.invoke(DelegatingMethodAccessorImpl.java:43)
	at java.lang.reflect.Method.invoke(Method.java:498)
	at com.carrotsearch.randomizedtesting.RandomizedRunner.invoke(RandomizedRunner.java:1737)
	at com.carrotsearch.randomizedtesting.RandomizedRunner$8.evaluate(RandomizedRunner.java:934)
	at com.carrotsearch.randomizedtesting.RandomizedRunner$9.evaluate(RandomizedRunner.java:970)
	at com.carrotsearch.randomizedtesting.RandomizedRunner$10.evaluate(RandomizedRunner.java:984)
	at com.carrotsearch.randomizedtesting.rules.SystemPropertiesRestoreRule$1.evaluate(SystemPropertiesRestoreRule.java:57)
	at org.apache.lucene.util.TestRuleSetupTeardownChained$1.evaluate(TestRuleSetupTeardownChained.java:49)
	at org.apache.lucene.util.AbstractBeforeAfterRule$1.evaluate(AbstractBeforeAfterRule.java:45)
	at org.apache.lucene.util.TestRuleThreadAndTestName$1.evaluate(TestRuleThreadAndTestName.java:48)
	at org.apache.lucene.util.TestRuleIgnoreAfterMaxFailures$1.evaluate(TestRuleIgnoreAfterMaxFailures.java:64)
	at org.apache.lucene.util.TestRuleMarkFailure$1.evaluate(TestRuleMarkFailure.java:47)
	at com.carrotsearch.randomizedtesting.rules.StatementAdapter.evaluate(StatementAdapter.java:36)
	at com.carrotsearch.randomizedtesting.ThreadLeakControl$StatementRunner.run(ThreadLeakControl.java:368)
	at com.carrotsearch.randomizedtesting.ThreadLeakControl.forkTimeoutingTask(ThreadLeakControl.java:817)
	at com.carrotsearch.randomizedtesting.ThreadLeakControl$3.evaluate(ThreadLeakControl.java:468)
	at com.carrotsearch.randomizedtesting.RandomizedRunner.runSingleTest(RandomizedRunner.java:943)
	at com.carrotsearch.randomizedtesting.RandomizedRunner$5.evaluate(RandomizedRunner.java:829)
	at com.carrotsearch.randomizedtesting.RandomizedRunner$6.evaluate(RandomizedRunner.java:879)
	at com.carrotsearch.randomizedtesting.RandomizedRunner$7.evaluate(RandomizedRunner.java:890)
	at com.carrotsearch.randomizedtesting.rules.StatementAdapter.evaluate(StatementAdapter.java:36)
	at com.carrotsearch.randomizedtesting.rules.SystemPropertiesRestoreRule$1.evaluate(SystemPropertiesRestoreRule.java:57)
	at org.apache.lucene.util.AbstractBeforeAfterRule$1.evaluate(AbstractBeforeAfterRule.java:45)
	at com.carrotsearch.randomizedtesting.rules.StatementAdapter.evaluate(StatementAdapter.java:36)
	at org.apache.lucene.util.TestRuleStoreClassName$1.evaluate(TestRuleStoreClassName.java:41)
	at com.carrotsearch.randomizedtesting.rules.NoShadowingOrOverridesOnMethodsRule$1.evaluate(NoShadowingOrOverridesOnMethodsRule.java:40)
	at com.carrotsearch.randomizedtesting.rules.NoShadowingOrOverridesOnMethodsRule$1.evaluate(NoShadowingOrOverridesOnMethodsRule.java:40)
	at com.carrotsearch.randomizedtesting.rules.StatementAdapter.evaluate(StatementAdapter.java:36)
	at com.carrotsearch.randomizedtesting.rules.StatementAdapter.evaluate(StatementAdapter.java:36)
	at com.carrotsearch.randomizedtesting.rules.StatementAdapter.evaluate(StatementAdapter.java:36)
	at org.apache.lucene.util.TestRuleAssertionsRequired$1.evaluate(TestRuleAssertionsRequired.java:53)
	at org.apache.lucene.util.TestRuleMarkFailure$1.evaluate(TestRuleMarkFailure.java:47)
	at org.apache.lucene.util.TestRuleIgnoreAfterMaxFailures$1.evaluate(TestRuleIgnoreAfterMaxFailures.java:64)
	at org.apache.lucene.util.TestRuleIgnoreTestSuites$1.evaluate(TestRuleIgnoreTestSuites.java:54)
	at com.carrotsearch.randomizedtesting.rules.StatementAdapter.evaluate(StatementAdapter.java:36)
	at com.carrotsearch.randomizedtesting.ThreadLeakControl$StatementRunner.run(ThreadLeakControl.java:368)
	at java.lang.Thread.run(Thread.java:748)


FAILED:  org.apache.solr.cloud.TestPullReplica.testKillLeader

Error Message:
Replica core_node4 not up to date after 10 seconds expected:<1> but was:<0>

Stack Trace:
java.lang.AssertionError: Replica core_node4 not up to date after 10 seconds expected:<1> but was:<0>
	at __randomizedtesting.SeedInfo.seed([F5F55A0D6C698C6B:BCE3AEB90ED2183D]:0)
	at org.junit.Assert.fail(Assert.java:93)
	at org.junit.Assert.failNotEquals(Assert.java:647)
	at org.junit.Assert.assertEquals(Assert.java:128)
	at org.junit.Assert.assertEquals(Assert.java:472)
	at org.apache.solr.cloud.TestPullReplica.waitForNumDocsInAllReplicas(TestPullReplica.java:542)
	at org.apache.solr.cloud.TestPullReplica.doTestNoLeader(TestPullReplica.java:490)
	at org.apache.solr.cloud.TestPullReplica.testKillLeader(TestPullReplica.java:309)
	at sun.reflect.NativeMethodAccessorImpl.invoke0(Native Method)
	at sun.reflect.NativeMethodAccessorImpl.invoke(NativeMethodAccessorImpl.java:62)
	at sun.reflect.DelegatingMethodAccessorImpl.invoke(DelegatingMethodAccessorImpl.java:43)
	at java.lang.reflect.Method.invoke(Method.java:498)
	at com.carrotsearch.randomizedtesting.RandomizedRunner.invoke(RandomizedRunner.java:1737)
	at com.carrotsearch.randomizedtesting.RandomizedRunner$8.evaluate(RandomizedRunner.java:934)
	at com.carrotsearch.randomizedtesting.RandomizedRunner$9.evaluate(RandomizedRunner.java:970)
	at com.carrotsearch.randomizedtesting.RandomizedRunner$10.evaluate(RandomizedRunner.java:984)
	at com.carrotsearch.randomizedtesting.rules.SystemPropertiesRestoreRule$1.evaluate(SystemPropertiesRestoreRule.java:57)
	at org.apache.lucene.util.TestRuleSetupTeardownChained$1.evaluate(TestRuleSetupTeardownChained.java:49)
	at org.apache.lucene.util.AbstractBeforeAfterRule$1.evaluate(AbstractBeforeAfterRule.java:45)
	at org.apache.lucene.util.TestRuleThreadAndTestName$1.evaluate(TestRuleThreadAndTestName.java:48)
	at org.apache.lucene.util.TestRuleIgnoreAfterMaxFailures$1.evaluate(TestRuleIgnoreAfterMaxFailures.java:64)
	at org.apache.lucene.util.TestRuleMarkFailure$1.evaluate(TestRuleMarkFailure.java:47)
	at com.carrotsearch.randomizedtesting.rules.StatementAdapter.evaluate(StatementAdapter.java:36)
	at com.carrotsearch.randomizedtesting.ThreadLeakControl$StatementRunner.run(ThreadLeakControl.java:368)
	at com.carrotsearch.randomizedtesting.ThreadLeakControl.forkTimeoutingTask(ThreadLeakControl.java:817)
	at com.carrotsearch.randomizedtesting.ThreadLeakControl$3.evaluate(ThreadLeakControl.java:468)
	at com.carrotsearch.randomizedtesting.RandomizedRunner.runSingleTest(RandomizedRunner.java:943)
	at com.carrotsearch.randomizedtesting.RandomizedRunner$5.evaluate(RandomizedRunner.java:829)
	at com.carrotsearch.randomizedtesting.RandomizedRunner$6.evaluate(RandomizedRunner.java:879)
	at com.carrotsearch.randomizedtesting.RandomizedRunner$7.evaluate(RandomizedRunner.java:890)
	at com.carrotsearch.randomizedtesting.rules.StatementAdapter.evaluate(StatementAdapter.java:36)
	at com.carrotsearch.randomizedtesting.rules.SystemPropertiesRestoreRule$1.evaluate(SystemPropertiesRestoreRule.java:57)
	at org.apache.lucene.util.AbstractBeforeAfterRule$1.evaluate(AbstractBeforeAfterRule.java:45)
	at com.carrotsearch.randomizedtesting.rules.StatementAdapter.evaluate(StatementAdapter.java:36)
	at org.apache.lucene.util.TestRuleStoreClassName$1.evaluate(TestRuleStoreClassName.java:41)
	at com.carrotsearch.randomizedtesting.rules.NoShadowingOrOverridesOnMethodsRule$1.evaluate(NoShadowingOrOverridesOnMethodsRule.java:40)
	at com.carrotsearch.randomizedtesting.rules.NoShadowingOrOverridesOnMethodsRule$1.evaluate(NoShadowingOrOverridesOnMethodsRule.java:40)
	at com.carrotsearch.randomizedtesting.rules.StatementAdapter.evaluate(StatementAdapter.java:36)
	at com.carrotsearch.randomizedtesting.rules.StatementAdapter.evaluate(StatementAdapter.java:36)
	at com.carrotsearch.randomizedtesting.rules.StatementAdapter.evaluate(StatementAdapter.java:36)
	at org.apache.lucene.util.TestRuleAssertionsRequired$1.evaluate(TestRuleAssertionsRequired.java:53)
	at org.apache.lucene.util.TestRuleMarkFailure$1.evaluate(TestRuleMarkFailure.java:47)
	at org.apache.lucene.util.TestRuleIgnoreAfterMaxFailures$1.evaluate(TestRuleIgnoreAfterMaxFailures.java:64)
	at org.apache.lucene.util.TestRuleIgnoreTestSuites$1.evaluate(TestRuleIgnoreTestSuites.java:54)
	at com.carrotsearch.randomizedtesting.rules.StatementAdapter.evaluate(StatementAdapter.java:36)
	at com.carrotsearch.randomizedtesting.ThreadLeakControl$StatementRunner.run(ThreadLeakControl.java:368)
	at java.lang.Thread.run(Thread.java:748)


FAILED:  org.apache.solr.cloud.TestPullReplica.testRemoveAllWriterReplicas

Error Message:
Replica core_node4 not up to date after 10 seconds expected:<1> but was:<0>

Stack Trace:
java.lang.AssertionError: Replica core_node4 not up to date after 10 seconds expected:<1> but was:<0>
	at __randomizedtesting.SeedInfo.seed([F5F55A0D6C698C6B:66FBC636789765C2]:0)
	at org.junit.Assert.fail(Assert.java:93)
	at org.junit.Assert.failNotEquals(Assert.java:647)
	at org.junit.Assert.assertEquals(Assert.java:128)
	at org.junit.Assert.assertEquals(Assert.java:472)
	at org.apache.solr.cloud.TestPullReplica.waitForNumDocsInAllReplicas(TestPullReplica.java:542)
	at org.apache.solr.cloud.TestPullReplica.doTestNoLeader(TestPullReplica.java:490)
	at org.apache.solr.cloud.TestPullReplica.testRemoveAllWriterReplicas(TestPullReplica.java:303)
	at sun.reflect.NativeMethodAccessorImpl.invoke0(Native Method)
	at sun.reflect.NativeMethodAccessorImpl.invoke(NativeMethodAccessorImpl.java:62)
	at sun.reflect.DelegatingMethodAccessorImpl.invoke(DelegatingMethodAccessorImpl.java:43)
	at java.lang.reflect.Method.invoke(Method.java:498)
	at com.carrotsearch.randomizedtesting.RandomizedRunner.invoke(RandomizedRunner.java:1737)
	at com.carrotsearch.randomizedtesting.RandomizedRunner$8.evaluate(RandomizedRunner.java:934)
	at com.carrotsearch.randomizedtesting.RandomizedRunner$9.evaluate(RandomizedRunner.java:970)
	at com.carrotsearch.randomizedtesting.RandomizedRunner$10.evaluate(RandomizedRunner.java:984)
	at com.carrotsearch.randomizedtesting.rules.SystemPropertiesRestoreRule$1.evaluate(SystemPropertiesRestoreRule.java:57)
	at org.apache.lucene.util.TestRuleSetupTeardownChained$1.evaluate(TestRuleSetupTeardownChained.java:49)
	at org.apache.lucene.util.AbstractBeforeAfterRule$1.evaluate(AbstractBeforeAfterRule.java:45)
	at org.apache.lucene.util.TestRuleThreadAndTestName$1.evaluate(TestRuleThreadAndTestName.java:48)
	at org.apache.lucene.util.TestRuleIgnoreAfterMaxFailures$1.evaluate(TestRuleIgnoreAfterMaxFailures.java:64)
	at org.apache.lucene.util.TestRuleMarkFailure$1.evaluate(TestRuleMarkFailure.java:47)
	at com.carrotsearch.randomizedtesting.rules.StatementAdapter.evaluate(StatementAdapter.java:36)
	at com.carrotsearch.randomizedtesting.ThreadLeakControl$StatementRunner.run(ThreadLeakControl.java:368)
	at com.carrotsearch.randomizedtesting.ThreadLeakControl.forkTimeoutingTask(ThreadLeakControl.java:817)
	at com.carrotsearch.randomizedtesting.ThreadLeakControl$3.evaluate(ThreadLeakControl.java:468)
	at com.carrotsearch.randomizedtesting.RandomizedRunner.runSingleTest(RandomizedRunner.java:943)
	at com.carrotsearch.randomizedtesting.RandomizedRunner$5.evaluate(RandomizedRunner.java:829)
	at com.carrotsearch.randomizedtesting.RandomizedRunner$6.evaluate(RandomizedRunner.java:879)
	at com.carrotsearch.randomizedtesting.RandomizedRunner$7.evaluate(RandomizedRunner.java:890)
	at com.carrotsearch.randomizedtesting.rules.StatementAdapter.evaluate(StatementAdapter.java:36)
	at com.carrotsearch.randomizedtesting.rules.SystemPropertiesRestoreRule$1.evaluate(SystemPropertiesRestoreRule.java:57)
	at org.apache.lucene.util.AbstractBeforeAfterRule$1.evaluate(AbstractBeforeAfterRule.java:45)
	at com.carrotsearch.randomizedtesting.rules.StatementAdapter.evaluate(StatementAdapter.java:36)
	at org.apache.lucene.util.TestRuleStoreClassName$1.evaluate(TestRuleStoreClassName.java:41)
	at com.carrotsearch.randomizedtesting.rules.NoShadowingOrOverridesOnMethodsRule$1.evaluate(NoShadowingOrOverridesOnMethodsRule.java:40)
	at com.carrotsearch.randomizedtesting.rules.NoShadowingOrOverridesOnMethodsRule$1.evaluate(NoShadowingOrOverridesOnMethodsRule.java:40)
	at com.carrotsearch.randomizedtesting.rules.StatementAdapter.evaluate(StatementAdapter.java:36)
	at com.carrotsearch.randomizedtesting.rules.StatementAdapter.evaluate(StatementAdapter.java:36)
	at com.carrotsearch.randomizedtesting.rules.StatementAdapter.evaluate(StatementAdapter.java:36)
	at org.apache.lucene.util.TestRuleAssertionsRequired$1.evaluate(TestRuleAssertionsRequired.java:53)
	at org.apache.lucene.util.TestRuleMarkFailure$1.evaluate(TestRuleMarkFailure.java:47)
	at org.apache.lucene.util.TestRuleIgnoreAfterMaxFailures$1.evaluate(TestRuleIgnoreAfterMaxFailures.java:64)
	at org.apache.lucene.util.TestRuleIgnoreTestSuites$1.evaluate(TestRuleIgnoreTestSuites.java:54)
	at com.carrotsearch.randomizedtesting.rules.StatementAdapter.evaluate(StatementAdapter.java:36)
	at com.carrotsearch.randomizedtesting.ThreadLeakControl$StatementRunner.run(ThreadLeakControl.java:368)
	at java.lang.Thread.run(Thread.java:748)


FAILED:  org.apache.solr.cloud.TestPullReplica.testKillLeader

Error Message:
Replica core_node4 not up to date after 10 seconds expected:<1> but was:<0>

Stack Trace:
java.lang.AssertionError: Replica core_node4 not up to date after 10 seconds expected:<1> but was:<0>
	at __randomizedtesting.SeedInfo.seed([F5F55A0D6C698C6B:BCE3AEB90ED2183D]:0)
	at org.junit.Assert.fail(Assert.java:93)
	at org.junit.Assert.failNotEquals(Assert.java:647)
	at org.junit.Assert.assertEquals(Assert.java:128)
	at org.junit.Assert.assertEquals(Assert.java:472)
	at org.apache.solr.cloud.TestPullReplica.waitForNumDocsInAllReplicas(TestPullReplica.java:542)
	at org.apache.solr.cloud.TestPullReplica.doTestNoLeader(TestPullReplica.java:490)
	at org.apache.solr.cloud.TestPullReplica.testKillLeader(TestPullReplica.java:309)
	at sun.reflect.NativeMethodAccessorImpl.invoke0(Native Method)
	at sun.reflect.NativeMethodAccessorImpl.invoke(NativeMethodAccessorImpl.java:62)
	at sun.reflect.DelegatingMethodAccessorImpl.invoke(DelegatingMethodAccessorImpl.java:43)
	at java.lang.reflect.Method.invoke(Method.java:498)
	at com.carrotsearch.randomizedtesting.RandomizedRunner.invoke(RandomizedRunner.java:1737)
	at com.carrotsearch.randomizedtesting.RandomizedRunner$8.evaluate(RandomizedRunner.java:934)
	at com.carrotsearch.randomizedtesting.RandomizedRunner$9.evaluate(RandomizedRunner.java:970)
	at com.carrotsearch.randomizedtesting.RandomizedRunner$10.evaluate(RandomizedRunner.java:984)
	at com.carrotsearch.randomizedtesting.rules.SystemPropertiesRestoreRule$1.evaluate(SystemPropertiesRestoreRule.java:57)
	at org.apache.lucene.util.TestRuleSetupTeardownChained$1.evaluate(TestRuleSetupTeardownChained.java:49)
	at org.apache.lucene.util.AbstractBeforeAfterRule$1.evaluate(AbstractBeforeAfterRule.java:45)
	at org.apache.lucene.util.TestRuleThreadAndTestName$1.evaluate(TestRuleThreadAndTestName.java:48)
	at org.apache.lucene.util.TestRuleIgnoreAfterMaxFailures$1.evaluate(TestRuleIgnoreAfterMaxFailures.java:64)
	at org.apache.lucene.util.TestRuleMarkFailure$1.evaluate(TestRuleMarkFailure.java:47)
	at com.carrotsearch.randomizedtesting.rules.StatementAdapter.evaluate(StatementAdapter.java:36)
	at com.carrotsearch.randomizedtesting.ThreadLeakControl$StatementRunner.run(ThreadLeakControl.java:368)
	at com.carrotsearch.randomizedtesting.ThreadLeakControl.forkTimeoutingTask(ThreadLeakControl.java:817)
	at com.carrotsearch.randomizedtesting.ThreadLeakControl$3.evaluate(ThreadLeakControl.java:468)
	at com.carrotsearch.randomizedtesting.RandomizedRunner.runSingleTest(RandomizedRunner.java:943)
	at com.carrotsearch.randomizedtesting.RandomizedRunner$5.evaluate(RandomizedRunner.java:829)
	at com.carrotsearch.randomizedtesting.RandomizedRunner$6.evaluate(RandomizedRunner.java:879)
	at com.carrotsearch.randomizedtesting.RandomizedRunner$7.evaluate(RandomizedRunner.java:890)
	at com.carrotsearch.randomizedtesting.rules.StatementAdapter.evaluate(StatementAdapter.java:36)
	at com.carrotsearch.randomizedtesting.rules.SystemPropertiesRestoreRule$1.evaluate(SystemPropertiesRestoreRule.java:57)
	at org.apache.lucene.util.AbstractBeforeAfterRule$1.evaluate(AbstractBeforeAfterRule.java:45)
	at com.carrotsearch.randomizedtesting.rules.StatementAdapter.evaluate(StatementAdapter.java:36)
	at org.apache.lucene.util.TestRuleStoreClassName$1.evaluate(TestRuleStoreClassName.java:41)
	at com.carrotsearch.randomizedtesting.rules.NoShadowingOrOverridesOnMethodsRule$1.evaluate(NoShadowingOrOverridesOnMethodsRule.java:40)
	at com.carrotsearch.randomizedtesting.rules.NoShadowingOrOverridesOnMethodsRule$1.evaluate(NoShadowingOrOverridesOnMethodsRule.java:40)
	at com.carrotsearch.randomizedtesting.rules.StatementAdapter.evaluate(StatementAdapter.java:36)
	at com.carrotsearch.randomizedtesting.rules.StatementAdapter.evaluate(StatementAdapter.java:36)
	at com.carrotsearch.randomizedtesting.rules.StatementAdapter.evaluate(StatementAdapter.java:36)
	at org.apache.lucene.util.TestRuleAssertionsRequired$1.evaluate(TestRuleAssertionsRequired.java:53)
	at org.apache.lucene.util.TestRuleMarkFailure$1.evaluate(TestRuleMarkFailure.java:47)
	at org.apache.lucene.util.TestRuleIgnoreAfterMaxFailures$1.evaluate(TestRuleIgnoreAfterMaxFailures.java:64)
	at org.apache.lucene.util.TestRuleIgnoreTestSuites$1.evaluate(TestRuleIgnoreTestSuites.java:54)
	at com.carrotsearch.randomizedtesting.rules.StatementAdapter.evaluate(StatementAdapter.java:36)
	at com.carrotsearch.randomizedtesting.ThreadLeakControl$StatementRunner.run(ThreadLeakControl.java:368)
	at java.lang.Thread.run(Thread.java:748)


FAILED:  org.apache.solr.cloud.TestPullReplica.testRemoveAllWriterReplicas

Error Message:
Replica core_node4 not up to date after 10 seconds expected:<1> but was:<0>

Stack Trace:
java.lang.AssertionError: Replica core_node4 not up to date after 10 seconds expected:<1> but was:<0>
	at __randomizedtesting.SeedInfo.seed([F5F55A0D6C698C6B:66FBC636789765C2]:0)
	at org.junit.Assert.fail(Assert.java:93)
	at org.junit.Assert.failNotEquals(Assert.java:647)
	at org.junit.Assert.assertEquals(Assert.java:128)
	at org.junit.Assert.assertEquals(Assert.java:472)
	at org.apache.solr.cloud.TestPullReplica.waitForNumDocsInAllReplicas(TestPullReplica.java:542)
	at org.apache.solr.cloud.TestPullReplica.doTestNoLeader(TestPullReplica.java:490)
	at org.apache.solr.cloud.TestPullReplica.testRemoveAllWriterReplicas(TestPullReplica.java:303)
	at sun.reflect.NativeMethodAccessorImpl.invoke0(Native Method)
	at sun.reflect.NativeMethodAccessorImpl.invoke(NativeMethodAccessorImpl.java:62)
	at sun.reflect.DelegatingMethodAccessorImpl.invoke(DelegatingMethodAccessorImpl.java:43)
	at java.lang.reflect.Method.invoke(Method.java:498)
	at com.carrotsearch.randomizedtesting.RandomizedRunner.invoke(RandomizedRunner.java:1737)
	at com.carrotsearch.randomizedtesting.RandomizedRunner$8.evaluate(RandomizedRunner.java:934)
	at com.carrotsearch.randomizedtesting.RandomizedRunner$9.evaluate(RandomizedRunner.java:970)
	at com.carrotsearch.randomizedtesting.RandomizedRunner$10.evaluate(RandomizedRunner.java:984)
	at com.carrotsearch.randomizedtesting.rules.SystemPropertiesRestoreRule$1.evaluate(SystemPropertiesRestoreRule.java:57)
	at org.apache.lucene.util.TestRuleSetupTeardownChained$1.evaluate(TestRuleSetupTeardownChained.java:49)
	at org.apache.lucene.util.AbstractBeforeAfterRule$1.evaluate(AbstractBeforeAfterRule.java:45)
	at org.apache.lucene.util.TestRuleThreadAndTestName$1.evaluate(TestRuleThreadAndTestName.java:48)
	at org.apache.lucene.util.TestRuleIgnoreAfterMaxFailures$1.evaluate(TestRuleIgnoreAfterMaxFailures.java:64)
	at org.apache.lucene.util.TestRuleMarkFailure$1.evaluate(TestRuleMarkFailure.java:47)
	at com.carrotsearch.randomizedtesting.rules.StatementAdapter.evaluate(StatementAdapter.java:36)
	at com.carrotsearch.randomizedtesting.ThreadLeakControl$StatementRunner.run(ThreadLeakControl.java:368)
	at com.carrotsearch.randomizedtesting.ThreadLeakControl.forkTimeoutingTask(ThreadLeakControl.java:817)
	at com.carrotsearch.randomizedtesting.ThreadLeakControl$3.evaluate(ThreadLeakControl.java:468)
	at com.carrotsearch.randomizedtesting.RandomizedRunner.runSingleTest(RandomizedRunner.java:943)
	at com.carrotsearch.randomizedtesting.RandomizedRunner$5.evaluate(RandomizedRunner.java:829)
	at com.carrotsearch.randomizedtesting.RandomizedRunner$6.evaluate(RandomizedRunner.java:879)
	at com.carrotsearch.randomizedtesting.RandomizedRunner$7.evaluate(RandomizedRunner.java:890)
	at com.carrotsearch.randomizedtesting.rules.StatementAdapter.evaluate(StatementAdapter.java:36)
	at com.carrotsearch.randomizedtesting.rules.SystemPropertiesRestoreRule$1.evaluate(SystemPropertiesRestoreRule.java:57)
	at org.apache.lucene.util.AbstractBeforeAfterRule$1.evaluate(AbstractBeforeAfterRule.java:45)
	at com.carrotsearch.randomizedtesting.rules.StatementAdapter.evaluate(StatementAdapter.java:36)
	at org.apache.lucene.util.TestRuleStoreClassName$1.evaluate(TestRuleStoreClassName.java:41)
	at com.carrotsearch.randomizedtesting.rules.NoShadowingOrOverridesOnMethodsRule$1.evaluate(NoShadowingOrOverridesOnMethodsRule.java:40)
	at com.carrotsearch.randomizedtesting.rules.NoShadowingOrOverridesOnMethodsRule$1.evaluate(NoShadowingOrOverridesOnMethodsRule.java:40)
	at com.carrotsearch.randomizedtesting.rules.StatementAdapter.evaluate(StatementAdapter.java:36)
	at com.carrotsearch.randomizedtesting.rules.StatementAdapter.evaluate(StatementAdapter.java:36)
	at com.carrotsearch.randomizedtesting.rules.StatementAdapter.evaluate(StatementAdapter.java:36)
	at org.apache.lucene.util.TestRuleAssertionsRequired$1.evaluate(TestRuleAssertionsRequired.java:53)
	at org.apache.lucene.util.TestRuleMarkFailure$1.evaluate(TestRuleMarkFailure.java:47)
	at org.apache.lucene.util.TestRuleIgnoreAfterMaxFailures$1.evaluate(TestRuleIgnoreAfterMaxFailures.java:64)
	at org.apache.lucene.util.TestRuleIgnoreTestSuites$1.evaluate(TestRuleIgnoreTestSuites.java:54)
	at com.carrotsearch.randomizedtesting.rules.StatementAdapter.evaluate(StatementAdapter.java:36)
	at com.carrotsearch.randomizedtesting.ThreadLeakControl$StatementRunner.run(ThreadLeakControl.java:368)
	at java.lang.Thread.run(Thread.java:748)


FAILED:  org.apache.solr.cloud.TestPullReplica.testKillLeader

Error Message:
Replica core_node4 not up to date after 10 seconds expected:<1> but was:<0>

Stack Trace:
java.lang.AssertionError: Replica core_node4 not up to date after 10 seconds expected:<1> but was:<0>
	at __randomizedtesting.SeedInfo.seed([F5F55A0D6C698C6B:BCE3AEB90ED2183D]:0)
	at org.junit.Assert.fail(Assert.java:93)
	at org.junit.Assert.failNotEquals(Assert.java:647)
	at org.junit.Assert.assertEquals(Assert.java:128)
	at org.junit.Assert.assertEquals(Assert.java:472)
	at org.apache.solr.cloud.TestPullReplica.waitForNumDocsInAllReplicas(TestPullReplica.java:542)
	at org.apache.solr.cloud.TestPullReplica.doTestNoLeader(TestPullReplica.java:490)
	at org.apache.solr.cloud.TestPullReplica.testKillLeader(TestPullReplica.java:309)
	at sun.reflect.NativeMethodAccessorImpl.invoke0(Native Method)
	at sun.reflect.NativeMethodAccessorImpl.invoke(NativeMethodAccessorImpl.java:62)
	at sun.reflect.DelegatingMethodAccessorImpl.invoke(DelegatingMethodAccessorImpl.java:43)
	at java.lang.reflect.Method.invoke(Method.java:498)
	at com.carrotsearch.randomizedtesting.RandomizedRunner.invoke(RandomizedRunner.java:1737)
	at com.carrotsearch.randomizedtesting.RandomizedRunner$8.evaluate(RandomizedRunner.java:934)
	at com.carrotsearch.randomizedtesting.RandomizedRunner$9.evaluate(RandomizedRunner.java:970)
	at com.carrotsearch.randomizedtesting.RandomizedRunner$10.evaluate(RandomizedRunner.java:984)
	at com.carrotsearch.randomizedtesting.rules.SystemPropertiesRestoreRule$1.evaluate(SystemPropertiesRestoreRule.java:57)
	at org.apache.lucene.util.TestRuleSetupTeardownChained$1.evaluate(TestRuleSetupTeardownChained.java:49)
	at org.apache.lucene.util.AbstractBeforeAfterRule$1.evaluate(AbstractBeforeAfterRule.java:45)
	at org.apache.lucene.util.TestRuleThreadAndTestName$1.evaluate(TestRuleThreadAndTestName.java:48)
	at org.apache.lucene.util.TestRuleIgnoreAfterMaxFailures$1.evaluate(TestRuleIgnoreAfterMaxFailures.java:64)
	at org.apache.lucene.util.TestRuleMarkFailure$1.evaluate(TestRuleMarkFailure.java:47)
	at com.carrotsearch.randomizedtesting.rules.StatementAdapter.evaluate(StatementAdapter.java:36)
	at com.carrotsearch.randomizedtesting.ThreadLeakControl$StatementRunner.run(ThreadLeakControl.java:368)
	at com.carrotsearch.randomizedtesting.ThreadLeakControl.forkTimeoutingTask(ThreadLeakControl.java:817)
	at com.carrotsearch.randomizedtesting.ThreadLeakControl$3.evaluate(ThreadLeakControl.java:468)
	at com.carrotsearch.randomizedtesting.RandomizedRunner.runSingleTest(RandomizedRunner.java:943)
	at com.carrotsearch.randomizedtesting.RandomizedRunner$5.evaluate(RandomizedRunner.java:829)
	at com.carrotsearch.randomizedtesting.RandomizedRunner$6.evaluate(RandomizedRunner.java:879)
	at com.carrotsearch.randomizedtesting.RandomizedRunner$7.evaluate(RandomizedRunner.java:890)
	at com.carrotsearch.randomizedtesting.rules.StatementAdapter.evaluate(StatementAdapter.java:36)
	at com.carrotsearch.randomizedtesting.rules.SystemPropertiesRestoreRule$1.evaluate(SystemPropertiesRestoreRule.java:57)
	at org.apache.lucene.util.AbstractBeforeAfterRule$1.evaluate(AbstractBeforeAfterRule.java:45)
	at com.carrotsearch.randomizedtesting.rules.StatementAdapter.evaluate(StatementAdapter.java:36)
	at org.apache.lucene.util.TestRuleStoreClassName$1.evaluate(TestRuleStoreClassName.java:41)
	at com.carrotsearch.randomizedtesting.rules.NoShadowingOrOverridesOnMethodsRule$1.evaluate(NoShadowingOrOverridesOnMethodsRule.java:40)
	at com.carrotsearch.randomizedtesting.rules.NoShadowingOrOverridesOnMethodsRule$1.evaluate(NoShadowingOrOverridesOnMethodsRule.java:40)
	at com.carrotsearch.randomizedtesting.rules.StatementAdapter.evaluate(StatementAdapter.java:36)
	at com.carrotsearch.randomizedtesting.rules.StatementAdapter.evaluate(StatementAdapter.java:36)
	at com.carrotsearch.randomizedtesting.rules.StatementAdapter.evaluate(StatementAdapter.java:36)
	at org.apache.lucene.util.TestRuleAssertionsRequired$1.evaluate(TestRuleAssertionsRequired.java:53)
	at org.apache.lucene.util.TestRuleMarkFailure$1.evaluate(TestRuleMarkFailure.java:47)
	at org.apache.lucene.util.TestRuleIgnoreAfterMaxFailures$1.evaluate(TestRuleIgnoreAfterMaxFailures.java:64)
	at org.apache.lucene.util.TestRuleIgnoreTestSuites$1.evaluate(TestRuleIgnoreTestSuites.java:54)
	at com.carrotsearch.randomizedtesting.rules.StatementAdapter.evaluate(StatementAdapter.java:36)
	at com.carrotsearch.randomizedtesting.ThreadLeakControl$StatementRunner.run(ThreadLeakControl.java:368)
	at java.lang.Thread.run(Thread.java:748)


FAILED:  org.apache.solr.cloud.TestPullReplica.testRemoveAllWriterReplicas

Error Message:
Replica core_node4 not up to date after 10 seconds expected:<1> but was:<0>

Stack Trace:
java.lang.AssertionError: Replica core_node4 not up to date after 10 seconds expected:<1> but was:<0>
	at __randomizedtesting.SeedInfo.seed([F5F55A0D6C698C6B:66FBC636789765C2]:0)
	at org.junit.Assert.fail(Assert.java:93)
	at org.junit.Assert.failNotEquals(Assert.java:647)
	at org.junit.Assert.assertEquals(Assert.java:128)
	at org.junit.Assert.assertEquals(Assert.java:472)
	at org.apache.solr.cloud.TestPullReplica.waitForNumDocsInAllReplicas(TestPullReplica.java:542)
	at org.apache.solr.cloud.TestPullReplica.doTestNoLeader(TestPullReplica.java:490)
	at org.apache.solr.cloud.TestPullReplica.testRemoveAllWriterReplicas(TestPullReplica.java:303)
	at sun.reflect.NativeMethodAccessorImpl.invoke0(Native Method)
	at sun.reflect.NativeMethodAccessorImpl.invoke(NativeMethodAccessorImpl.java:62)
	at sun.reflect.DelegatingMethodAccessorImpl.invoke(DelegatingMethodAccessorImpl.java:43)
	at java.lang.reflect.Method.invoke(Method.java:498)
	at com.carrotsearch.randomizedtesting.RandomizedRunner.invoke(RandomizedRunner.java:1737)
	at com.carrotsearch.randomizedtesting.RandomizedRunner$8.evaluate(RandomizedRunner.java:934)
	at com.carrotsearch.randomizedtesting.RandomizedRunner$9.evaluate(RandomizedRunner.java:970)
	at com.carrotsearch.randomizedtesting.RandomizedRunner$10.evaluate(RandomizedRunner.java:984)
	at com.carrotsearch.randomizedtesting.rules.SystemPropertiesRestoreRule$1.evaluate(SystemPropertiesRestoreRule.java:57)
	at org.apache.lucene.util.TestRuleSetupTeardownChained$1.evaluate(TestRuleSetupTeardownChained.java:49)
	at org.apache.lucene.util.AbstractBeforeAfterRule$1.evaluate(AbstractBeforeAfterRule.java:45)
	at org.apache.lucene.util.TestRuleThreadAndTestName$1.evaluate(TestRuleThreadAndTestName.java:48)
	at org.apache.lucene.util.TestRuleIgnoreAfterMaxFailures$1.evaluate(TestRuleIgnoreAfterMaxFailures.java:64)
	at org.apache.lucene.util.TestRuleMarkFailure$1.evaluate(TestRuleMarkFailure.java:47)
	at com.carrotsearch.randomizedtesting.rules.StatementAdapter.evaluate(StatementAdapter.java:36)
	at com.carrotsearch.randomizedtesting.ThreadLeakControl$StatementRunner.run(ThreadLeakControl.java:368)
	at com.carrotsearch.randomizedtesting.ThreadLeakControl.forkTimeoutingTask(ThreadLeakControl.java:817)
	at com.carrotsearch.randomizedtesting.ThreadLeakControl$3.evaluate(ThreadLeakControl.java:468)
	at com.carrotsearch.randomizedtesting.RandomizedRunner.runSingleTest(RandomizedRunner.java:943)
	at com.carrotsearch.randomizedtesting.RandomizedRunner$5.evaluate(RandomizedRunner.java:829)
	at com.carrotsearch.randomizedtesting.RandomizedRunner$6.evaluate(RandomizedRunner.java:879)
	at com.carrotsearch.randomizedtesting.RandomizedRunner$7.evaluate(RandomizedRunner.java:890)
	at com.carrotsearch.randomizedtesting.rules.StatementAdapter.evaluate(StatementAdapter.java:36)
	at com.carrotsearch.randomizedtesting.rules.SystemPropertiesRestoreRule$1.evaluate(SystemPropertiesRestoreRule.java:57)
	at org.apache.lucene.util.AbstractBeforeAfterRule$1.evaluate(AbstractBeforeAfterRule.java:45)
	at com.carrotsearch.randomizedtesting.rules.StatementAdapter.evaluate(StatementAdapter.java:36)
	at org.apache.lucene.util.TestRuleStoreClassName$1.evaluate(TestRuleStoreClassName.java:41)
	at com.carrotsearch.randomizedtesting.rules.NoShadowingOrOverridesOnMethodsRule$1.evaluate(NoShadowingOrOverridesOnMethodsRule.java:40)
	at com.carrotsearch.randomizedtesting.rules.NoShadowingOrOverridesOnMethodsRule$1.evaluate(NoShadowingOrOverridesOnMethodsRule.java:40)
	at com.carrotsearch.randomizedtesting.rules.StatementAdapter.evaluate(StatementAdapter.java:36)
	at com.carrotsearch.randomizedtesting.rules.StatementAdapter.evaluate(StatementAdapter.java:36)
	at com.carrotsearch.randomizedtesting.rules.StatementAdapter.evaluate(StatementAdapter.java:36)
	at org.apache.lucene.util.TestRuleAssertionsRequired$1.evaluate(TestRuleAssertionsRequired.java:53)
	at org.apache.lucene.util.TestRuleMarkFailure$1.evaluate(TestRuleMarkFailure.java:47)
	at org.apache.lucene.util.TestRuleIgnoreAfterMaxFailures$1.evaluate(TestRuleIgnoreAfterMaxFailures.java:64)
	at org.apache.lucene.util.TestRuleIgnoreTestSuites$1.evaluate(TestRuleIgnoreTestSuites.java:54)
	at com.carrotsearch.randomizedtesting.rules.StatementAdapter.evaluate(StatementAdapter.java:36)
	at com.carrotsearch.randomizedtesting.ThreadLeakControl$StatementRunner.run(ThreadLeakControl.java:368)
	at java.lang.Thread.run(Thread.java:748)




Build Log:
[...truncated 13054 lines...]
   [junit4] Suite: org.apache.solr.cloud.TestPullReplica
   [junit4]   2> 611311 INFO  (SUITE-TestPullReplica-seed#[F5F55A0D6C698C6B]-worker) [    ] o.a.s.SolrTestCaseJ4 SecureRandom sanity checks: test.solr.allowed.securerandom=null & java.security.egd=file:/dev/./urandom
   [junit4]   2> Creating dataDir: /home/jenkins/workspace/Lucene-Solr-master-Linux/solr/build/solr-core/test/J0/temp/solr.cloud.TestPullReplica_F5F55A0D6C698C6B-001/init-core-data-001
   [junit4]   2> 611312 WARN  (SUITE-TestPullReplica-seed#[F5F55A0D6C698C6B]-worker) [    ] o.a.s.SolrTestCaseJ4 startTrackingSearchers: numOpens=1 numCloses=1
   [junit4]   2> 611312 INFO  (SUITE-TestPullReplica-seed#[F5F55A0D6C698C6B]-worker) [    ] o.a.s.SolrTestCaseJ4 Using PointFields (NUMERIC_POINTS_SYSPROP=true) w/NUMERIC_DOCVALUES_SYSPROP=false
   [junit4]   2> 611313 INFO  (SUITE-TestPullReplica-seed#[F5F55A0D6C698C6B]-worker) [    ] o.a.s.SolrTestCaseJ4 Randomized ssl (false) and clientAuth (true) via: @org.apache.solr.util.RandomizeSSL(reason=, ssl=NaN, value=NaN, clientAuth=NaN)
   [junit4]   2> 611313 INFO  (SUITE-TestPullReplica-seed#[F5F55A0D6C698C6B]-worker) [    ] o.a.s.c.MiniSolrCloudCluster Starting cluster of 2 servers in /home/jenkins/workspace/Lucene-Solr-master-Linux/solr/build/solr-core/test/J0/temp/solr.cloud.TestPullReplica_F5F55A0D6C698C6B-001/tempDir-001
   [junit4]   2> 611313 INFO  (SUITE-TestPullReplica-seed#[F5F55A0D6C698C6B]-worker) [    ] o.a.s.c.ZkTestServer STARTING ZK TEST SERVER
   [junit4]   2> 611313 INFO  (Thread-3520) [    ] o.a.s.c.ZkTestServer client port:0.0.0.0/0.0.0.0:0
   [junit4]   2> 611313 INFO  (Thread-3520) [    ] o.a.s.c.ZkTestServer Starting server
   [junit4]   2> 611315 ERROR (Thread-3520) [    ] o.a.z.s.ZooKeeperServer ZKShutdownHandler is not registered, so ZooKeeper server won't take any action on ERROR or SHUTDOWN server state changes
   [junit4]   2> 611413 INFO  (SUITE-TestPullReplica-seed#[F5F55A0D6C698C6B]-worker) [    ] o.a.s.c.ZkTestServer start zk server on port:33493
   [junit4]   2> 611416 INFO  (zkConnectionManagerCallback-1716-thread-1) [    ] o.a.s.c.c.ConnectionManager zkClient has connected
   [junit4]   2> 611420 INFO  (jetty-launcher-1713-thread-1) [    ] o.e.j.s.Server jetty-9.4.11.v20180605; built: 2018-06-05T18:24:03.829Z; git: d5fc0523cfa96bfebfbda19606cad384d772f04c; jvm 1.8.0_172-b11
   [junit4]   2> 611422 INFO  (jetty-launcher-1713-thread-2) [    ] o.e.j.s.Server jetty-9.4.11.v20180605; built: 2018-06-05T18:24:03.829Z; git: d5fc0523cfa96bfebfbda19606cad384d772f04c; jvm 1.8.0_172-b11
   [junit4]   2> 611425 INFO  (jetty-launcher-1713-thread-1) [    ] o.e.j.s.session DefaultSessionIdManager workerName=node0
   [junit4]   2> 611425 INFO  (jetty-launcher-1713-thread-1) [    ] o.e.j.s.session No SessionScavenger set, using defaults
   [junit4]   2> 611425 INFO  (jetty-launcher-1713-thread-1) [    ] o.e.j.s.session node0 Scavenging every 660000ms
   [junit4]   2> 611425 INFO  (jetty-launcher-1713-thread-1) [    ] o.e.j.s.h.ContextHandler Started o.e.j.s.ServletContextHandler@14d86426{/solr,null,AVAILABLE}
   [junit4]   2> 611426 INFO  (jetty-launcher-1713-thread-2) [    ] o.e.j.s.session DefaultSessionIdManager workerName=node0
   [junit4]   2> 611426 INFO  (jetty-launcher-1713-thread-2) [    ] o.e.j.s.session No SessionScavenger set, using defaults
   [junit4]   2> 611426 INFO  (jetty-launcher-1713-thread-2) [    ] o.e.j.s.session node0 Scavenging every 600000ms
   [junit4]   2> 611426 INFO  (jetty-launcher-1713-thread-2) [    ] o.e.j.s.h.ContextHandler Started o.e.j.s.ServletContextHandler@326473b8{/solr,null,AVAILABLE}
   [junit4]   2> 611427 INFO  (jetty-launcher-1713-thread-2) [    ] o.e.j.s.AbstractConnector Started ServerConnector@36d79ce3{HTTP/1.1,[http/1.1]}{127.0.0.1:39103}
   [junit4]   2> 611427 INFO  (jetty-launcher-1713-thread-1) [    ] o.e.j.s.AbstractConnector Started ServerConnector@56231315{HTTP/1.1,[http/1.1]}{127.0.0.1:46143}
   [junit4]   2> 611427 INFO  (jetty-launcher-1713-thread-2) [    ] o.e.j.s.Server Started @611458ms
   [junit4]   2> 611427 INFO  (jetty-launcher-1713-thread-1) [    ] o.e.j.s.Server Started @611458ms
   [junit4]   2> 611427 INFO  (jetty-launcher-1713-thread-2) [    ] o.a.s.c.s.e.JettySolrRunner Jetty properties: {hostContext=/solr, hostPort=39103}
   [junit4]   2> 611427 INFO  (jetty-launcher-1713-thread-1) [    ] o.a.s.c.s.e.JettySolrRunner Jetty properties: {hostContext=/solr, hostPort=46143}
   [junit4]   2> 611427 ERROR (jetty-launcher-1713-thread-2) [    ] o.a.s.u.StartupLoggingUtils Missing Java Option solr.log.dir. Logging may be missing or incomplete.
   [junit4]   2> 611427 INFO  (jetty-launcher-1713-thread-2) [    ] o.a.s.s.SolrDispatchFilter Using logger factory org.apache.logging.slf4j.Log4jLoggerFactory
   [junit4]   2> 611427 ERROR (jetty-launcher-1713-thread-1) [    ] o.a.s.u.StartupLoggingUtils Missing Java Option solr.log.dir. Logging may be missing or incomplete.
   [junit4]   2> 611427 INFO  (jetty-launcher-1713-thread-1) [    ] o.a.s.s.SolrDispatchFilter Using logger factory org.apache.logging.slf4j.Log4jLoggerFactory
   [junit4]   2> 611427 INFO  (jetty-launcher-1713-thread-2) [    ] o.a.s.s.SolrDispatchFilter  ___      _       Welcome to Apache Solr™ version 8.0.0
   [junit4]   2> 611427 INFO  (jetty-launcher-1713-thread-2) [    ] o.a.s.s.SolrDispatchFilter / __| ___| |_ _   Starting in cloud mode on port null
   [junit4]   2> 611427 INFO  (jetty-launcher-1713-thread-1) [    ] o.a.s.s.SolrDispatchFilter  ___      _       Welcome to Apache Solr™ version 8.0.0
   [junit4]   2> 611427 INFO  (jetty-launcher-1713-thread-2) [    ] o.a.s.s.SolrDispatchFilter \__ \/ _ \ | '_|  Install dir: null
   [junit4]   2> 611427 INFO  (jetty-launcher-1713-thread-1) [    ] o.a.s.s.SolrDispatchFilter / __| ___| |_ _   Starting in cloud mode on port null
   [junit4]   2> 611427 INFO  (jetty-launcher-1713-thread-2) [    ] o.a.s.s.SolrDispatchFilter |___/\___/_|_|    Start time: 2018-07-09T15:03:37.944Z
   [junit4]   2> 611427 INFO  (jetty-launcher-1713-thread-1) [    ] o.a.s.s.SolrDispatchFilter \__ \/ _ \ | '_|  Install dir: null
   [junit4]   2> 611427 INFO  (jetty-launcher-1713-thread-1) [    ] o.a.s.s.SolrDispatchFilter |___/\___/_|_|    Start time: 2018-07-09T15:03:37.944Z
   [junit4]   2> 611429 INFO  (zkConnectionManagerCallback-1718-thread-1) [    ] o.a.s.c.c.ConnectionManager zkClient has connected
   [junit4]   2> 611429 INFO  (zkConnectionManagerCallback-1720-thread-1) [    ] o.a.s.c.c.ConnectionManager zkClient has connected
   [junit4]   2> 611429 INFO  (jetty-launcher-1713-thread-2) [    ] o.a.s.s.SolrDispatchFilter solr.xml found in ZooKeeper. Loading...
   [junit4]   2> 611429 INFO  (jetty-launcher-1713-thread-1) [    ] o.a.s.s.SolrDispatchFilter solr.xml found in ZooKeeper. Loading...
   [junit4]   2> 611432 WARN  (NIOServerCxn.Factory:0.0.0.0/0.0.0.0:0) [    ] o.a.z.s.NIOServerCnxn Unable to read additional data from client sessionid 0x10024d2cc700002, likely client has closed socket
   [junit4]   2> 611500 INFO  (jetty-launcher-1713-thread-2) [    ] o.a.s.c.ZkContainer Zookeeper client=127.0.0.1:33493/solr
   [junit4]   2> 611501 INFO  (zkConnectionManagerCallback-1724-thread-1) [    ] o.a.s.c.c.ConnectionManager zkClient has connected
   [junit4]   2> 611503 INFO  (zkConnectionManagerCallback-1726-thread-1) [    ] o.a.s.c.c.ConnectionManager zkClient has connected
   [junit4]   2> 611515 INFO  (jetty-launcher-1713-thread-1) [    ] o.a.s.c.ZkContainer Zookeeper client=127.0.0.1:33493/solr
   [junit4]   2> 611516 INFO  (zkConnectionManagerCallback-1732-thread-1) [    ] o.a.s.c.c.ConnectionManager zkClient has connected
   [junit4]   2> 611517 INFO  (zkConnectionManagerCallback-1734-thread-1) [    ] o.a.s.c.c.ConnectionManager zkClient has connected
   [junit4]   2> 611521 INFO  (jetty-launcher-1713-thread-1) [n:127.0.0.1:46143_solr    ] o.a.s.c.Overseer Overseer (id=null) closing
   [junit4]   2> 611521 INFO  (jetty-launcher-1713-thread-1) [n:127.0.0.1:46143_solr    ] o.a.s.c.OverseerElectionContext I am going to be the leader 127.0.0.1:46143_solr
   [junit4]   2> 611522 INFO  (jetty-launcher-1713-thread-1) [n:127.0.0.1:46143_solr    ] o.a.s.c.Overseer Overseer (id=72098081829552134-127.0.0.1:46143_solr-n_0000000000) starting
   [junit4]   2> 611526 INFO  (zkConnectionManagerCallback-1741-thread-1) [    ] o.a.s.c.c.ConnectionManager zkClient has connected
   [junit4]   2> 611526 INFO  (jetty-launcher-1713-thread-1) [n:127.0.0.1:46143_solr    ] o.a.s.c.s.i.ZkClientClusterStateProvider Cluster at 127.0.0.1:33493/solr ready
   [junit4]   2> 611527 INFO  (jetty-launcher-1713-thread-1) [n:127.0.0.1:46143_solr    ] o.a.s.c.ZkController Register node as live in ZooKeeper:/live_nodes/127.0.0.1:46143_solr
   [junit4]   2> 611527 DEBUG (OverseerAutoScalingTriggerThread-72098081829552134-127.0.0.1:46143_solr-n_0000000000) [    ] o.a.s.c.a.OverseerTriggerThread Adding .auto_add_replicas and .scheduled_maintenance triggers
   [junit4]   2> 611528 DEBUG (OverseerAutoScalingTriggerThread-72098081829552134-127.0.0.1:46143_solr-n_0000000000) [    ] o.a.s.c.a.OverseerTriggerThread Refreshing /autoscaling.json with znode version 1
   [junit4]   2> 611528 DEBUG (OverseerAutoScalingTriggerThread-72098081829552134-127.0.0.1:46143_solr-n_0000000000) [    ] o.a.s.c.a.OverseerTriggerThread Current znodeVersion 1, lastZnodeVersion -1
   [junit4]   2> 611528 DEBUG (OverseerAutoScalingTriggerThread-72098081829552134-127.0.0.1:46143_solr-n_0000000000) [    ] o.a.s.c.a.OverseerTriggerThread Processed trigger updates upto znodeVersion 1
   [junit4]   2> 611530 INFO  (zkCallback-1733-thread-1) [    ] o.a.s.c.c.ZkStateReader Updated live nodes from ZooKeeper... (0) -> (1)
   [junit4]   2> 611530 INFO  (zkCallback-1740-thread-1) [    ] o.a.s.c.c.ZkStateReader Updated live nodes from ZooKeeper... (0) -> (1)
   [junit4]   2> 611530 DEBUG (OverseerAutoScalingTriggerThread-72098081829552134-127.0.0.1:46143_solr-n_0000000000) [    ] o.a.s.c.a.NodeLostTrigger NodeLostTrigger .auto_add_replicas - Initial livenodes: [127.0.0.1:46143_solr]
   [junit4]   2> 611531 DEBUG (OverseerAutoScalingTriggerThread-72098081829552134-127.0.0.1:46143_solr-n_0000000000) [    ] o.a.s.c.a.OverseerTriggerThread -- clean old nodeAdded markers
   [junit4]   2> 611531 DEBUG (OverseerAutoScalingTriggerThread-72098081829552134-127.0.0.1:46143_solr-n_0000000000) [    ] o.a.s.c.a.OverseerTriggerThread Current znodeVersion 1, lastZnodeVersion 1
   [junit4]   2> 611531 DEBUG (ScheduledTrigger-3004-thread-1) [    ] o.a.s.c.a.NodeLostTrigger Running NodeLostTrigger: .auto_add_replicas with currently live nodes: 1
   [junit4]   2> 611539 INFO  (jetty-launcher-1713-thread-2) [n:127.0.0.1:39103_solr    ] o.a.s.c.c.ZkStateReader Updated live nodes from ZooKeeper... (0) -> (1)
   [junit4]   2> 611540 INFO  (jetty-launcher-1713-thread-2) [n:127.0.0.1:39103_solr    ] o.a.s.c.Overseer Overseer (id=null) closing
   [junit4]   2> 611540 INFO  (jetty-launcher-1713-thread-2) [n:127.0.0.1:39103_solr    ] o.a.s.c.TransientSolrCoreCacheDefault Allocating transient cache for 2147483647 transient cores
   [junit4]   2> 611540 INFO  (jetty-launcher-1713-thread-2) [n:127.0.0.1:39103_solr    ] o.a.s.c.ZkController Register node as live in ZooKeeper:/live_nodes/127.0.0.1:39103_solr
   [junit4]   2> 611541 INFO  (zkCallback-1740-thread-1) [    ] o.a.s.c.c.ZkStateReader Updated live nodes from ZooKeeper... (1) -> (2)
   [junit4]   2> 611541 INFO  (zkCallback-1733-thread-1) [    ] o.a.s.c.c.ZkStateReader Updated live nodes from ZooKeeper... (1) -> (2)
   [junit4]   2> 611541 INFO  (zkCallback-1725-thread-1) [    ] o.a.s.c.c.ZkStateReader Updated live nodes from ZooKeeper... (1) -> (2)
   [junit4]   2> 611542 INFO  (jetty-launcher-1713-thread-1) [n:127.0.0.1:46143_solr    ] o.a.s.h.a.MetricsHistoryHandler No .system collection, keeping metrics history in memory.
   [junit4]   2> 611551 INFO  (zkConnectionManagerCallback-1747-thread-1) [    ] o.a.s.c.c.ConnectionManager zkClient has connected
   [junit4]   2> 611551 INFO  (jetty-launcher-1713-thread-2) [n:127.0.0.1:39103_solr    ] o.a.s.c.c.ZkStateReader Updated live nodes from ZooKeeper... (0) -> (2)
   [junit4]   2> 611552 INFO  (jetty-launcher-1713-thread-2) [n:127.0.0.1:39103_solr    ] o.a.s.c.s.i.ZkClientClusterStateProvider Cluster at 127.0.0.1:33493/solr ready
   [junit4]   2> 611552 INFO  (jetty-launcher-1713-thread-2) [n:127.0.0.1:39103_solr    ] o.a.s.h.a.MetricsHistoryHandler No .system collection, keeping metrics history in memory.
   [junit4]   2> 611561 INFO  (jetty-launcher-1713-thread-1) [n:127.0.0.1:46143_solr    ] o.a.s.m.r.SolrJmxReporter JMX monitoring for 'solr_46143.solr.node' (registry 'solr.node') enabled at server: com.sun.jmx.mbeanserver.JmxMBeanServer@56302932
   [junit4]   2> 611561 INFO  (jetty-launcher-1713-thread-2) [n:127.0.0.1:39103_solr    ] o.a.s.m.r.SolrJmxReporter JMX monitoring for 'solr_39103.solr.node' (registry 'solr.node') enabled at server: com.sun.jmx.mbeanserver.JmxMBeanServer@56302932
   [junit4]   2> 611565 INFO  (jetty-launcher-1713-thread-1) [n:127.0.0.1:46143_solr    ] o.a.s.m.r.SolrJmxReporter JMX monitoring for 'solr_46143.solr.jvm' (registry 'solr.jvm') enabled at server: com.sun.jmx.mbeanserver.JmxMBeanServer@56302932
   [junit4]   2> 611565 INFO  (jetty-launcher-1713-thread-1) [n:127.0.0.1:46143_solr    ] o.a.s.m.r.SolrJmxReporter JMX monitoring for 'solr_46143.solr.jetty' (registry 'solr.jetty') enabled at server: com.sun.jmx.mbeanserver.JmxMBeanServer@56302932
   [junit4]   2> 611566 INFO  (jetty-launcher-1713-thread-2) [n:127.0.0.1:39103_solr    ] o.a.s.m.r.SolrJmxReporter JMX monitoring for 'solr_39103.solr.jvm' (registry 'solr.jvm') enabled at server: com.sun.jmx.mbeanserver.JmxMBeanServer@56302932
   [junit4]   2> 611566 INFO  (jetty-launcher-1713-thread-2) [n:127.0.0.1:39103_solr    ] o.a.s.m.r.SolrJmxReporter JMX monitoring for 'solr_39103.solr.jetty' (registry 'solr.jetty') enabled at server: com.sun.jmx.mbeanserver.JmxMBeanServer@56302932
   [junit4]   2> 611566 INFO  (jetty-launcher-1713-thread-1) [n:127.0.0.1:46143_solr    ] o.a.s.c.CorePropertiesLocator Found 0 core definitions underneath /home/jenkins/workspace/Lucene-Solr-master-Linux/solr/build/solr-core/test/J0/temp/solr.cloud.TestPullReplica_F5F55A0D6C698C6B-001/tempDir-001/node1/.
   [junit4]   2> 611567 INFO  (jetty-launcher-1713-thread-2) [n:127.0.0.1:39103_solr    ] o.a.s.c.CorePropertiesLocator Found 0 core definitions underneath /home/jenkins/workspace/Lucene-Solr-master-Linux/solr/build/solr-core/test/J0/temp/solr.cloud.TestPullReplica_F5F55A0D6C698C6B-001/tempDir-001/node2/.
   [junit4]   2> 611590 INFO  (zkConnectionManagerCallback-1750-thread-1) [    ] o.a.s.c.c.ConnectionManager zkClient has connected
   [junit4]   2> 611592 INFO  (zkConnectionManagerCallback-1755-thread-1) [    ] o.a.s.c.c.ConnectionManager zkClient has connected
   [junit4]   2> 611593 INFO  (SUITE-TestPullReplica-seed#[F5F55A0D6C698C6B]-worker) [    ] o.a.s.c.c.ZkStateReader Updated live nodes from ZooKeeper... (0) -> (2)
   [junit4]   2> 611593 INFO  (SUITE-TestPullReplica-seed#[F5F55A0D6C698C6B]-worker) [    ] o.a.s.c.s.i.ZkClientClusterStateProvider Cluster at 127.0.0.1:33493/solr ready
   [junit4]   2> 611595 INFO  (SUITE-TestPullReplica-seed#[F5F55A0D6C698C6B]-worker) [    ] o.a.s.c.TestPullReplica Using legacyCloud?: false
   [junit4]   2> 611597 INFO  (qtp502198834-8749) [n:127.0.0.1:39103_solr    ] o.a.s.h.a.CollectionsHandler Invoked Collection Action :clusterprop with params val=false&name=legacyCloud&action=CLUSTERPROP&wt=javabin&version=2 and sendToOCPQueue=true
   [junit4]   2> 611597 INFO  (qtp502198834-8749) [n:127.0.0.1:39103_solr    ] o.a.s.s.HttpSolrCall [admin] webapp=null path=/admin/collections params={val=false&name=legacyCloud&action=CLUSTERPROP&wt=javabin&version=2} status=0 QTime=0
   [junit4]   2> 611606 INFO  (TEST-TestPullReplica.testAddDocs-seed#[F5F55A0D6C698C6B]) [    ] o.a.s.SolrTestCaseJ4 ###Starting testAddDocs
   [junit4]   2> 611607 INFO  (qtp502198834-8739) [n:127.0.0.1:39103_solr    ] o.a.s.h.a.CollectionsHandler Invoked Collection Action :create with params pullReplicas=3&collection.configName=conf&maxShardsPerNode=100&name=pull_replica_test_add_docs&nrtReplicas=1&action=CREATE&numShards=1&tlogReplicas=0&wt=javabin&version=2 and sendToOCPQueue=true
   [junit4]   2> 611608 INFO  (OverseerThreadFactory-3006-thread-1) [    ] o.a.s.c.a.c.CreateCollectionCmd Create collection pull_replica_test_add_docs
   [junit4]   2> 611608 WARN  (OverseerThreadFactory-3006-thread-1) [    ] o.a.s.c.a.c.CreateCollectionCmd Specified number of replicas of 4 on collection pull_replica_test_add_docs is higher than the number of Solr instances currently live or live and part of your createNodeSet(2). It's unusual to run two replica of the same slice on the same Solr-instance.
   [junit4]   2> 611714 INFO  (OverseerStateUpdate-72098081829552134-127.0.0.1:46143_solr-n_0000000000) [    ] o.a.s.c.o.SliceMutator createReplica() {
   [junit4]   2>   "operation":"ADDREPLICA",
   [junit4]   2>   "collection":"pull_replica_test_add_docs",
   [junit4]   2>   "shard":"shard1",
   [junit4]   2>   "core":"pull_replica_test_add_docs_shard1_replica_n1",
   [junit4]   2>   "state":"down",
   [junit4]   2>   "base_url":"http://127.0.0.1:46143/solr",
   [junit4]   2>   "type":"NRT",
   [junit4]   2>   "waitForFinalState":"false"} 
   [junit4]   2> 611714 INFO  (OverseerStateUpdate-72098081829552134-127.0.0.1:46143_solr-n_0000000000) [    ] o.a.s.c.o.SliceMutator createReplica() {
   [junit4]   2>   "operation":"ADDREPLICA",
   [junit4]   2>   "collection":"pull_replica_test_add_docs",
   [junit4]   2>   "shard":"shard1",
   [junit4]   2>   "core":"pull_replica_test_add_docs_shard1_replica_p2",
   [junit4]   2>   "state":"down",
   [junit4]   2>   "base_url":"http://127.0.0.1:39103/solr",
   [junit4]   2>   "type":"PULL",
   [junit4]   2>   "waitForFinalState":"false"} 
   [junit4]   2> 611715 INFO  (OverseerStateUpdate-72098081829552134-127.0.0.1:46143_solr-n_0000000000) [    ] o.a.s.c.o.SliceMutator createReplica() {
   [junit4]   2>   "operation":"ADDREPLICA",
   [junit4]   2>   "collection":"pull_replica_test_add_docs",
   [junit4]   2>   "shard":"shard1",
   [junit4]   2>   "core":"pull_replica_test_add_docs_shard1_replica_p4",
   [junit4]   2>   "state":"down",
   [junit4]   2>   "base_url":"http://127.0.0.1:46143/solr",
   [junit4]   2>   "type":"PULL",
   [junit4]   2>   "waitForFinalState":"false"} 
   [junit4]   2> 611716 INFO  (OverseerStateUpdate-72098081829552134-127.0.0.1:46143_solr-n_0000000000) [    ] o.a.s.c.o.SliceMutator createReplica() {
   [junit4]   2>   "operation":"ADDREPLICA",
   [junit4]   2>   "collection":"pull_replica_test_add_docs",
   [junit4]   2>   "shard":"shard1",
   [junit4]   2>   "core":"pull_replica_test_add_docs_shard1_replica_p6",
   [junit4]   2>   "state":"down",
   [junit4]   2>   "base_url":"http://127.0.0.1:39103/solr",
   [junit4]   2>   "type":"PULL",
   [junit4]   2>   "waitForFinalState":"false"} 
   [junit4]   2> 611918 INFO  (qtp2062410457-8734) [n:127.0.0.1:46143_solr    x:pull_replica_test_add_docs_shard1_replica_n1] o.a.s.h.a.CoreAdminOperation core create command qt=/admin/cores&coreNodeName=core_node3&collection.configName=conf&newCollection=true&name=pull_replica_test_add_docs_shard1_replica_n1&action=CREATE&numShards=1&collection=pull_replica_test_add_docs&shard=shard1&wt=javabin&version=2&replicaType=NRT
   [junit4]   2> 611918 INFO  (qtp502198834-8741) [n:127.0.0.1:39103_solr    x:pull_replica_test_add_docs_shard1_replica_p2] o.a.s.h.a.CoreAdminOperation core create command qt=/admin/cores&coreNodeName=core_node5&collection.configName=conf&newCollection=true&name=pull_replica_test_add_docs_shard1_replica_p2&action=CREATE&numShards=1&collection=pull_replica_test_add_docs&shard=shard1&wt=javabin&version=2&replicaType=PULL
   [junit4]   2> 611919 INFO  (qtp2062410457-8734) [n:127.0.0.1:46143_solr    x:pull_replica_test_add_docs_shard1_replica_n1] o.a.s.c.TransientSolrCoreCacheDefault Allocating transient cache for 2147483647 transient cores
   [junit4]   2> 611919 INFO  (qtp2062410457-8742) [n:127.0.0.1:46143_solr    x:pull_replica_test_add_docs_shard1_replica_p4] o.a.s.h.a.CoreAdminOperation core create command qt=/admin/cores&coreNodeName=core_node7&collection.configName=conf&newCollection=true&name=pull_replica_test_add_docs_shard1_replica_p4&action=CREATE&numShards=1&collection=pull_replica_test_add_docs&shard=shard1&wt=javabin&version=2&replicaType=PULL
   [junit4]   2> 611919 INFO  (qtp502198834-8743) [n:127.0.0.1:39103_solr    x:pull_replica_test_add_docs_shard1_replica_p6] o.a.s.h.a.CoreAdminOperation core create command qt=/admin/cores&coreNodeName=core_node8&collection.configName=conf&newCollection=true&name=pull_replica_test_add_docs_shard1_replica_p6&action=CREATE&numShards=1&collection=pull_replica_test_add_docs&shard=shard1&wt=javabin&version=2&replicaType=PULL
   [junit4]   2> 612532 DEBUG (ScheduledTrigger-3004-thread-3) [    ] o.a.s.c.a.NodeLostTrigger Running NodeLostTrigger: .auto_add_replicas with currently live nodes: 2
   [junit4]   2> 612927 INFO  (qtp502198834-8743) [n:127.0.0.1:39103_solr c:pull_replica_test_add_docs s:shard1 r:core_node8 x:pull_replica_test_add_docs_shard1_replica_p6] o.a.s.c.SolrConfig Using Lucene MatchVersion: 8.0.0
   [junit4]   2> 612927 INFO  (qtp2062410457-8742) [n:127.0.0.1:46143_solr c:pull_replica_test_add_docs s:shard1 r:core_node7 x:pull_replica_test_add_docs_shard1_replica_p4] o.a.s.c.SolrConfig Using Lucene MatchVersion: 8.0.0
   [junit4]   2> 612928 INFO  (qtp502198834-8741) [n:127.0.0.1:39103_solr c:pull_replica_test_add_docs s:shard1 r:core_node5 x:pull_replica_test_add_docs_shard1_replica_p2] o.a.s.c.SolrConfig Using Lucene MatchVersion: 8.0.0
   [junit4]   2> 612928 INFO  (qtp2062410457-8734) [n:127.0.0.1:46143_solr c:pull_replica_test_add_docs s:shard1 r:core_node3 x:pull_replica_test_add_docs_shard1_replica_n1] o.a.s.c.SolrConfig Using Lucene MatchVersion: 8.0.0
   [junit4]   2> 612943 INFO  (qtp2062410457-8742) [n:127.0.0.1:46143_solr c:pull_replica_test_add_docs s:shard1 r:core_node7 x:pull_replica_test_add_docs_shard1_replica_p4] o.a.s.s.IndexSchema [pull_replica_test_add_docs_shard1_replica_p4] Schema name=minimal
   [junit4]   2> 612943 INFO  (qtp502198834-8743) [n:127.0.0.1:39103_solr c:pull_replica_test_add_docs s:shard1 r:core_node8 x:pull_replica_test_add_docs_shard1_replica_p6] o.a.s.s.IndexSchema [pull_replica_test_add_docs_shard1_replica_p6] Schema name=minimal
   [junit4]   2> 612943 INFO  (qtp502198834-8741) [n:127.0.0.1:39103_solr c:pull_replica_test_add_docs s:shard1 r:core_node5 x:pull_replica_test_add_docs_shard1_replica_p2] o.a.s.s.IndexSchema [pull_replica_test_add_docs_shard1_replica_p2] Schema name=minimal
   [junit4]   2> 612944 INFO  (qtp2062410457-8734) [n:127.0.0.1:46143_solr c:pull_replica_test_add_docs s:shard1 r:core_node3 x:pull_replica_test_add_docs_shard1_replica_n1] o.a.s.s.IndexSchema [pull_replica_test_add_docs_shard1_replica_n1] Schema name=minimal
   [junit4]   2> 612945 INFO  (qtp502198834-8741) [n:127.0.0.1:39103_solr c:pull_replica_test_add_docs s:shard1 r:core_node5 x:pull_replica_test_add_docs_shard1_replica_p2] o.a.s.s.IndexSchema Loaded schema minimal/1.1 with uniqueid field id
   [junit4]   2> 612945 INFO  (qtp502198834-8743) [n:127.0.0.1:39103_solr c:pull_replica_test_add_docs s:shard1 r:core_node8 x:pull_replica_test_add_docs_shard1_replica_p6] o.a.s.s.IndexSchema Loaded schema minimal/1.1 with uniqueid field id
   [junit4]   2> 612945 INFO  (qtp2062410457-8742) [n:127.0.0.1:46143_solr c:pull_replica_test_add_docs s:shard1 r:core_node7 x:pull_replica_test_add_docs_shard1_replica_p4] o.a.s.s.IndexSchema Loaded schema minimal/1.1 with uniqueid field id
   [junit4]   2> 612945 INFO  (qtp2062410457-8734) [n:127.0.0.1:46143_solr c:pull_replica_test_add_docs s:shard1 r:core_node3 x:pull_replica_test_add_docs_shard1_replica_n1] o.a.s.s.IndexSchema Loaded schema minimal/1.1 with uniqueid field id
   [junit4]   2> 612945 INFO  (qtp2062410457-8734) [n:127.0.0.1:46143_solr c:pull_replica_test_add_docs s:shard1 r:core_node3 x:pull_replica_test_add_docs_shard1_replica_n1] o.a.s.c.CoreContainer Creating SolrCore 'pull_replica_test_add_docs_shard1_replica_n1' using configuration from collection pull_replica_test_add_docs, trusted=true
   [junit4]   2> 612945 INFO  (qtp502198834-8741) [n:127.0.0.1:39103_solr c:pull_replica_test_add_docs s:shard1 r:core_node5 x:pull_replica_test_add_docs_shard1_replica_p2] o.a.s.c.CoreContainer Creating SolrCore 'pull_replica_test_add_docs_shard1_replica_p2' using configuration from collection pull_replica_test_add_docs, trusted=true
   [junit4]   2> 612945 INFO  (qtp2062410457-8742) [n:127.0.0.1:46143_solr c:pull_replica_test_add_docs s:shard1 r:core_node7 x:pull_replica_test_add_docs_shard1_replica_p4] o.a.s.c.CoreContainer Creating SolrCore 'pull_replica_test_add_docs_shard1_replica_p4' using configuration from collection pull_replica_test_add_docs, trusted=true
   [junit4]   2> 612945 INFO  (qtp502198834-8743) [n:127.0.0.1:39103_solr c:pull_replica_test_add_docs s:shard1 r:core_node8 x:pull_replica_test_add_docs_shard1_replica_p6] o.a.s.c.CoreContainer Creating SolrCore 'pull_replica_test_add_docs_shard1_replica_p6' using configuration from collection pull_replica_test_add_docs, trusted=true
   [junit4]   2> 612946 INFO  (qtp502198834-8743) [n:127.0.0.1:39103_solr c:pull_replica_test_add_docs s:shard1 r:core_node8 x:pull_replica_test_add_docs_shard1_replica_p6] o.a.s.m.r.SolrJmxReporter JMX monitoring for 'solr_39103.solr.core.pull_replica_test_add_docs.shard1.replica_p6' (registry 'solr.core.pull_replica_test_add_docs.shard1.replica_p6') enabled at server: com.sun.jmx.mbeanserver.JmxMBeanServer@56302932
   [junit4]   2> 612946 INFO  (qtp502198834-8741) [n:127.0.0.1:39103_solr c:pull_replica_test_add_docs s:shard1 r:core_node5 x:pull_replica_test_add_docs_shard1_replica_p2] o.a.s.m.r.SolrJmxReporter JMX monitoring for 'solr_39103.solr.core.pull_replica_test_add_docs.shard1.replica_p2' (registry 'solr.core.pull_replica_test_add_docs.shard1.replica_p2') enabled at server: com.sun.jmx.mbeanserver.JmxMBeanServer@56302932
   [junit4]   2> 612946 INFO  (qtp2062410457-8742) [n:127.0.0.1:46143_solr c:pull_replica_test_add_docs s:shard1 r:core_node7 x:pull_replica_test_add_docs_shard1_replica_p4] o.a.s.m.r.SolrJmxReporter JMX monitoring for 'solr_46143.solr.core.pull_replica_test_add_docs.shard1.replica_p4' (registry 'solr.core.pull_replica_test_add_docs.shard1.replica_p4') enabled at server: com.sun.jmx.mbeanserver.JmxMBeanServer@56302932
   [junit4]   2> 612946 INFO  (qtp2062410457-8734) [n:127.0.0.1:46143_solr c:pull_replica_test_add_docs s:shard1 r:core_node3 x:pull_replica_test_add_docs_shard1_replica_n1] o.a.s.m.r.SolrJmxReporter JMX monitoring for 'solr_46143.solr.core.pull_replica_test_add_docs.shard1.replica_n1' (registry 'solr.core.pull_replica_test_add_docs.shard1.replica_n1') enabled at server: com.sun.jmx.mbeanserver.JmxMBeanServer@56302932
   [junit4]   2> 612946 INFO  (qtp502198834-8741) [n:127.0.0.1:39103_solr c:pull_replica_test_add_docs s:shard1 r:core_node5 x:pull_replica_test_add_docs_shard1_replica_p2] o.a.s.c.SolrCore solr.RecoveryStrategy.Builder
   [junit4]   2> 612946 INFO  (qtp502198834-8743) [n:127.0.0.1:39103_solr c:pull_replica_test_add_docs s:shard1 r:core_node8 x:pull_replica_test_add_docs_shard1_replica_p6] o.a.s.c.SolrCore solr.RecoveryStrategy.Builder
   [junit4]   2> 612946 INFO  (qtp2062410457-8742) [n:127.0.0.1:46143_solr c:pull_replica_test_add_docs s:shard1 r:core_node7 x:pull_replica_test_add_docs_shard1_replica_p4] o.a.s.c.SolrCore solr.RecoveryStrategy.Builder
   [junit4]   2> 612946 INFO  (qtp502198834-8741) [n:127.0.0.1:39103_solr c:pull_replica_test_add_docs s:shard1 r:core_node5 x:pull_replica_test_add_docs_shard1_replica_p2] o.a.s.c.SolrCore [[pull_replica_test_add_docs_shard1_replica_p2] ] Opening new SolrCore at [/home/jenkins/workspace/Lucene-Solr-master-Linux/solr/build/solr-core/test/J0/temp/solr.cloud.TestPullReplica_F5F55A0D6C698C6B-001/tempDir-001/node2/pull_replica_test_add_docs_shard1_replica_p2], dataDir=[/home/jenkins/workspace/Lucene-Solr-master-Linux/solr/build/solr-core/test/J0/temp/solr.cloud.TestPullReplica_F5F55A0D6C698C6B-001/tempDir-001/node2/./pull_replica_test_add_docs_shard1_replica_p2/data/]
   [junit4]   2> 612946 INFO  (qtp502198834-8743) [n:127.0.0.1:39103_solr c:pull_replica_test_add_docs s:shard1 r:core_node8 x:pull_replica_test_add_docs_shard1_replica_p6] o.a.s.c.SolrCore [[pull_replica_test_add_docs_shard1_replica_p6] ] Opening new SolrCore at [/home/jenkins/workspace/Lucene-Solr-master-Linux/solr/build/solr-core/test/J0/temp/solr.cloud.TestPullReplica_F5F55A0D6C698C6B-001/tempDir-001/node2/pull_replica_test_add_docs_shard1_replica_p6], dataDir=[/home/jenkins/workspace/Lucene-Solr-master-Linux/solr/build/solr-core/test/J0/temp/solr.cloud.TestPullReplica_F5F55A0D6C698C6B-001/tempDir-001/node2/./pull_replica_test_add_docs_shard1_replica_p6/data/]
   [junit4]   2> 612946 INFO  (qtp2062410457-8742) [n:127.0.0.1:46143_solr c:pull_replica_test_add_docs s:shard1 r:core_node7 x:pull_replica_test_add_docs_shard1_replica_p4] o.a.s.c.SolrCore [[pull_replica_test_add_docs_shard1_replica_p4] ] Opening new SolrCore at [/home/jenkins/workspace/Lucene-Solr-master-Linux/solr/build/solr-core/test/J0/temp/solr.cloud.TestPullReplica_F5F55A0D6C698C6B-001/tempDir-001/node1/pull_replica_test_add_docs_shard1_replica_p4], dataDir=[/home/jenkins/workspace/Lucene-Solr-master-Linux/solr/build/solr-core/test/J0/temp/solr.cloud.TestPullReplica_F5F55A0D6C698C6B-001/tempDir-001/node1/./pull_replica_test_add_docs_shard1_replica_p4/data/]
   [junit4]   2> 612946 INFO  (qtp2062410457-8734) [n:127.0.0.1:46143_solr c:pull_replica_test_add_docs s:shard1 r:core_node3 x:pull_replica_test_add_docs_shard1_replica_n1] o.a.s.c.SolrCore solr.RecoveryStrategy.Builder
   [junit4]   2> 612946 INFO  (qtp2062410457-8734) [n:127.0.0.1:46143_solr c:pull_replica_test_add_docs s:shard1 r:core_node3 x:pull_replica_test_add_docs_shard1_replica_n1] o.a.s.c.SolrCore [[pull_replica_test_add_docs_shard1_replica_n1] ] Opening new SolrCore at [/home/jenkins/workspace/Lucene-Solr-master-Linux/solr/build/solr-core/test/J0/temp/solr.cloud.TestPullReplica_F5F55A0D6C698C6B-001/tempDir-001/node1/pull_replica_test_add_docs_shard1_replica_n1], dataDir=[/home/jenkins/workspace/Lucene-Solr-master-Linux/solr/build/solr-core/test/J0/temp/solr.cloud.TestPullReplica_F5F55A0D6C698C6B-001/tempDir-001/node1/./pull_replica_test_add_docs_shard1_replica_n1/data/]
   [junit4]   2> 612977 INFO  (qtp502198834-8743) [n:127.0.0.1:39103_solr c:pull_replica_test_add_docs s:shard1 r:core_node8 x:pull_replica_test_add_docs_shard1_replica_p6] o.a.s.u.CommitTracker Hard AutoCommit: disabled
   [junit4]   2> 612977 INFO  (qtp502198834-8743) [n:127.0.0.1:39103_solr c:pull_replica_test_add_docs s:shard1 r:core_node8 x:pull_replica_test_add_docs_shard1_replica_p6] o.a.s.u.CommitTracker Soft AutoCommit: disabled
   [junit4]   2> 612978 INFO  (qtp502198834-8743) [n:127.0.0.1:39103_solr c:pull_replica_test_add_docs s:shard1 r:core_node8 x:pull_replica_test_add_docs_shard1_replica_p6] o.a.s.s.SolrIndexSearcher Opening [Searcher@113d81c7[pull_replica_test_add_docs_shard1_replica_p6] main]
   [junit4]   2> 612978 INFO  (qtp2062410457-8742) [n:127.0.0.1:46143_solr c:pull_replica_test_add_docs s:shard1 r:core_node7 x:pull_replica_test_add_docs_shard1_replica_p4] o.a.s.u.CommitTracker Hard AutoCommit: disabled
   [junit4]   2> 612978 INFO  (qtp2062410457-8742) [n:127.0.0.1:46143_solr c:pull_replica_test_add_docs s:shard1 r:core_node7 x:pull_replica_test_add_docs_shard1_replica_p4] o.a.s.u.CommitTracker Soft AutoCommit: disabled
   [junit4]   2> 612979 INFO  (qtp502198834-8743) [n:127.0.0.1:39103_solr c:pull_replica_test_add_docs s:shard1 r:core_node8 x:pull_replica_test_add_docs_shard1_replica_p6] o.a.s.r.ManagedResourceStorage Configured ZooKeeperStorageIO with znodeBase: /configs/conf
   [junit4]   2> 612979 INFO  (qtp502198834-8743) [n:127.0.0.1:39103_solr c:pull_replica_test_add_docs s:shard1 r:core_node8 x:pull_replica_test_add_docs_shard1_replica_p6] o.a.s.r.ManagedResourceStorage Loaded null at path _rest_managed.json using ZooKeeperStorageIO:path=/configs/conf
   [junit4]   2> 612979 INFO  (qtp2062410457-8742) [n:127.0.0.1:46143_solr c:pull_replica_test_add_docs s:shard1 r:core_node7 x:pull_replica_test_add_docs_shard1_replica_p4] o.a.s.s.SolrIndexSearcher Opening [Searcher@aa930e5[pull_replica_test_add_docs_shard1_replica_p4] main]
   [junit4]   2> 612980 INFO  (qtp502198834-8743) [n:127.0.0.1:39103_solr c:pull_replica_test_add_docs s:shard1 r:core_node8 x:pull_replica_test_add_docs_shard1_replica_p6] o.a.s.h.ReplicationHandler Commits will be reserved for 10000ms.
   [junit4]   2> 612980 INFO  (qtp2062410457-8742) [n:127.0.0.1:46143_solr c:pull_replica_test_add_docs s:shard1 r:core_node7 x:pull_replica_test_add_docs_shard1_replica_p4] o.a.s.r.ManagedResourceStorage Configured ZooKeeperStorageIO with znodeBase: /configs/conf
   [junit4]   2> 612980 INFO  (qtp2062410457-8742) [n:127.0.0.1:46143_solr c:pull_replica_test_add_docs s:shard1 r:core_node7 x:pull_replica_test_add_docs_shard1_replica_p4] o.a.s.r.ManagedResourceStorage Loaded null at path _rest_managed.json using ZooKeeperStorageIO:path=/configs/conf
   [junit4]   2> 612980 INFO  (searcherExecutor-3018-thread-1-processing-n:127.0.0.1:39103_solr x:pull_replica_test_add_docs_shard1_replica_p6 c:pull_replica_test_add_docs s:shard1 r:core_node8) [n:127.0.0.1:39103_solr c:pull_replica_test_add_docs s:shard1 r:core_node8 x:pull_replica_test_add_docs_shard1_replica_p6] o.a.s.c.SolrCore [pull_replica_test_add_docs_shard1_replica_p6] Registered new searcher Searcher@113d81c7[pull_replica_test_add_docs_shard1_replica_p6] main{ExitableDirectoryReader(UninvertingDirectoryReader())}
   [junit4]   2> 612995 INFO  (qtp2062410457-8742) [n:127.0.0.1:46143_solr c:pull_replica_test_add_docs s:shard1 r:core_node7 x:pull_replica_test_add_docs_shard1_replica_p4] o.a.s.h.ReplicationHandler Commits will be reserved for 10000ms.
   [junit4]   2> 612996 INFO  (searcherExecutor-3017-thread-1-processing-n:127.0.0.1:46143_solr x:pull_replica_test_add_docs_shard1_replica_p4 c:pull_replica_test_add_docs s:shard1 r:core_node7) [n:127.0.0.1:46143_solr c:pull_replica_test_add_docs s:shard1 r:core_node7 x:pull_replica_test_add_docs_shard1_replica_p4] o.a.s.c.SolrCore [pull_replica_test_add_docs_shard1_replica_p4] Registered new searcher Searcher@aa930e5[pull_replica_test_add_docs_shard1_replica_p4] main{ExitableDirectoryReader(UninvertingDirectoryReader())}
   [junit4]   2> 612996 INFO  (qtp502198834-8743) [n:127.0.0.1:39103_solr c:pull_replica_test_add_docs s:shard1 r:core_node8 x:pull_replica_test_add_docs_shard1_replica_p6] o.a.s.c.ZkController pull_replica_test_add_docs_shard1_replica_p6 starting background replication from leader
   [junit4]   2> 612997 INFO  (qtp502198834-8743) [n:127.0.0.1:39103_solr c:pull_replica_test_add_docs s:shard1 r:core_node8 x:pull_replica_test_add_docs_shard1_replica_p6] o.a.s.c.ReplicateFromLeader Will start replication from leader with poll interval: 00:00:03
   [junit4]   2> 612997 INFO  (qtp2062410457-8742) [n:127.0.0.1:46143_solr c:pull_replica_test_add_docs s:shard1 r:core_node7 x:pull_replica_test_add_docs_shard1_replica_p4] o.a.s.c.ZkController pull_replica_test_add_docs_shard1_replica_p4 starting background replication from leader
   [junit4]   2> 612997 INFO  (qtp2062410457-8742) [n:127.0.0.1:46143_solr c:pull_replica_test_add_docs s:shard1 r:core_node7 x:pull_replica_test_add_docs_shard1_replica_p4] o.a.s.c.ReplicateFromLeader Will start replication from leader with poll interval: 00:00:03
   [junit4]   2> 612997 INFO  (qtp502198834-8743) [n:127.0.0.1:39103_solr c:pull_replica_test_add_docs s:shard1 r:core_node8 x:pull_replica_test_add_docs_shard1_replica_p6] o.a.s.h.ReplicationHandler Poll scheduled at an interval of 3000ms
   [junit4]   2> 612997 INFO  (qtp502198834-8743) [n:127.0.0.1:39103_solr c:pull_replica_test_add_docs s:shard1 r:core_node8 x:pull_replica_test_add_docs_shard1_replica_p6] o.a.s.h.ReplicationHandler Commits will be reserved for 10000ms.
   [junit4]   2> 612998 INFO  (qtp2062410457-8742) [n:127.0.0.1:46143_solr c:pull_replica_test_add_docs s:shard1 r:core_node7 x:pull_replica_test_add_docs_shard1_replica_p4] o.a.s.h.ReplicationHandler Poll scheduled at an interval of 3000ms
   [junit4]   2> 612998 INFO  (qtp2062410457-8742) [n:127.0.0.1:46143_solr c:pull_replica_test_add_docs s:shard1 r:core_node7 x:pull_replica_test_add_docs_shard1_replica_p4] o.a.s.h.ReplicationHandler Commits will be reserved for 10000ms.
   [junit4]   2> 612998 INFO  (qtp2062410457-8734) [n:127.0.0.1:46143_solr c:pull_replica_test_add_docs s:shard1 r:core_node3 x:pull_replica_test_add_docs_shard1_replica_n1] o.a.s.u.UpdateHandler Using UpdateLog implementation: org.apache.solr.update.UpdateLog
   [junit4]   2> 612998 INFO  (qtp2062410457-8734) [n:127.0.0.1:46143_solr c:pull_replica_test_add_docs s:shard1 r:core_node3 x:pull_replica_test_add_docs_shard1_replica_n1] o.a.s.u.UpdateLog Initializing UpdateLog: dataDir=null defaultSyncLevel=FLUSH numRecordsToKeep=100 maxNumLogsToKeep=10 numVersionBuckets=65536
   [junit4]   2> 612999 INFO  (qtp2062410457-8734) [n:127.0.0.1:46143_solr c:pull_replica_test_add_docs s:shard1 r:core_node3 x:pull_replica_test_add_docs_shard1_replica_n1] o.a.s.u.CommitTracker Hard AutoCommit: disabled
   [junit4]   2> 612999 INFO  (qtp2062410457-8734) [n:127.0.0.1:46143_solr c:pull_replica_test_add_docs s:shard1 r:core_node3 x:pull_replica_test_add_docs_shard1_replica_n1] o.a.s.u.CommitTracker Soft AutoCommit: disabled
   [junit4]   2> 613000 INFO  (qtp502198834-8741) [n:127.0.0.1:39103_solr c:pull_replica_test_add_docs s:shard1 r:core_node5 x:pull_replica_test_add_docs_shard1_replica_p2] o.a.s.u.CommitTracker Hard AutoCommit: disabled
   [junit4]   2> 613000 INFO  (qtp502198834-8741) [n:127.0.0.1:39103_solr c:pull_replica_test_add_docs s:shard1 r:core_node5 x:pull_replica_test_add_docs_shard1_replica_p2] o.a.s.u.CommitTracker Soft AutoCommit: disabled
   [junit4]   2> 613000 INFO  (qtp2062410457-8734) [n:127.0.0.1:46143_solr c:pull_replica_test_add_docs s:shard1 r:core_node3 x:pull_replica_test_add_docs_shard1_replica_n1] o.a.s.s.SolrIndexSearcher Opening [Searcher@3ff1049b[pull_replica_test_add_docs_shard1_replica_n1] main]
   [junit4]   2> 613001 INFO  (qtp2062410457-8734) [n:127.0.0.1:46143_solr c:pull_replica_test_add_docs s:shard1 r:core_node3 x:pull_replica_test_add_docs_shard1_replica_n1] o.a.s.r.ManagedResourceStorage Configured ZooKeeperStorageIO with znodeBase: /configs/conf
   [junit4]   2> 613001 INFO  (qtp2062410457-8734) [n:127.0.0.1:46143_solr c:pull_replica_test_add_docs s:shard1 r:core_node3 x:pull_replica_test_add_docs_shard1_replica_n1] o.a.s.r.ManagedResourceStorage Loaded null at path _rest_managed.json using ZooKeeperStorageIO:path=/configs/conf
   [junit4]   2> 613001 INFO  (qtp502198834-8741) [n:127.0.0.1:39103_solr c:pull_replica_test_add_docs s:shard1 r:core_node5 x:pull_replica_test_add_docs_shard1_replica_p2] o.a.s.s.SolrIndexSearcher Opening [Searcher@7145225f[pull_replica_test_add_docs_shard1_replica_p2] main]
   [junit4]   2> 613002 INFO  (qtp2062410457-8734) [n:127.0.0.1:46143_solr c:pull_replica_test_add_docs s:shard1 r:core_node3 x:pull_replica_test_add_docs_shard1_replica_n1] o.a.s.h.ReplicationHandler Commits will be reserved for 10000ms.
   [junit4]   2> 613002 INFO  (qtp502198834-8741) [n:127.0.0.1:39103_solr c:pull_replica_test_add_docs s:shard1 r:core_node5 x:pull_replica_test_add_docs_shard1_replica_p2] o.a.s.r.ManagedResourceStorage Configured ZooKeeperStorageIO with znodeBase: /configs/conf
   [junit4]   2> 613002 INFO  (qtp502198834-8741) [n:127.0.0.1:39103_solr c:pull_replica_test_add_docs s:shard1 r:core_node5 x:pull_replica_test_add_docs_shard1_replica_p2] o.a.s.r.ManagedResourceStorage Loaded null at path _rest_managed.json using ZooKeeperStorageIO:path=/configs/conf
   [junit4]   2> 613002 INFO  (searcherExecutor-3015-thread-1-processing-n:127.0.0.1:46143_solr x:pull_replica_test_add_docs_shard1_replica_n1 c:pull_replica_test_add_docs s:shard1 r:core_node3) [n:127.0.0.1:46143_solr c:pull_replica_test_add_docs s:shard1 r:core_node3 x:pull_replica_test_add_docs_shard1_replica_n1] o.a.s.c.SolrCore [pull_replica_test_add_docs_shard1_replica_n1] Registered new searcher Searcher@3ff1049b[pull_replica_test_add_docs_shard1_replica_n1] main{ExitableDirectoryReader(UninvertingDirectoryReader())}
   [junit4]   2> 613002 INFO  (qtp2062410457-8734) [n:127.0.0.1:46143_solr c:pull_replica_test_add_docs s:shard1 r:core_node3 x:pull_replica_test_add_docs_shard1_replica_n1] o.a.s.u.UpdateLog Could not find max version in index or recent updates, using new clock 1605525694860754944
   [junit4]   2> 613003 INFO  (qtp502198834-8741) [n:127.0.0.1:39103_solr c:pull_replica_test_add_docs s:shard1 r:core_node5 x:pull_replica_test_add_docs_shard1_replica_p2] o.a.s.h.ReplicationHandler Commits will be reserved for 10000ms.
   [junit4]   2> 613003 INFO  (searcherExecutor-3016-thread-1-processing-n:127.0.0.1:39103_solr x:pull_replica_test_add_docs_shard1_replica_p2 c:pull_replica_test_add_docs s:shard1 r:core_node5) [n:127.0.0.1:39103_solr c:pull_replica_test_add_docs s:shard1 r:core_node5 x:pull_replica_test_add_docs_shard1_replica_p2] o.a.s.c.SolrCore [pull_replica_test_add_docs_shard1_replica_p2] Registered new searcher Searcher@7145225f[pull_replica_test_add_docs_shard1_replica_p2] main{ExitableDirectoryReader(UninvertingDirectoryReader())}
   [junit4]   2> 613003 INFO  (qtp502198834-8741) [n:127.0.0.1:39103_solr c:pull_replica_test_add_docs s:shard1 r:core_node5 x:pull_replica_test_add_docs_shard1_replica_p2] o.a.s.c.ZkController pull_replica_test_add_docs_shard1_replica_p2 starting background replication from leader
   [junit4]   2> 613003 INFO  (qtp502198834-8741) [n:127.0.0.1:39103_solr c:pull_replica_test_add_docs s:shard1 r:core_node5 x:pull_replica_test_add_docs_shard1_replica_p2] o.a.s.c.ReplicateFromLeader Will start replication from leader with poll interval: 00:00:03
   [junit4]   2> 613004 INFO  (qtp502198834-8741) [n:127.0.0.1:39103_solr c:pull_replica_test_add_docs s:shard1 r:core_node5 x:pull_replica_test_add_docs_shard1_replica_p2] o.a.s.h.ReplicationHandler Poll scheduled at an interval of 3000ms
   [junit4]   2> 613004 INFO  (qtp502198834-8741) [n:127.0.0.1:39103_solr c:pull_replica_test_add_docs s:shard1 r:core_node5 x:pull_replica_test_add_docs_shard1_replica_p2] o.a.s.h.ReplicationHandler Commits will be reserved for 10000ms.
   [junit4]   2> 613004 INFO  (qtp2062410457-8734) [n:127.0.0.1:46143_solr c:pull_replica_test_add_docs s:shard1 r:core_node3 x:pull_replica_test_add_docs_shard1_replica_n1] o.a.s.c.ZkShardTerms Successful update of terms at /collections/pull_replica_test_add_docs/terms/shard1 to Terms{values={core_node3=0}, version=0}
   [junit4]   2> 613006 INFO  (qtp2062410457-8734) [n:127.0.0.1:46143_solr c:pull_replica_test_add_docs s:shard1 r:core_node3 x:pull_replica_test_add_docs_shard1_replica_n1] o.a.s.c.ShardLeaderElectionContext Enough replicas found to continue.
   [junit4]   2> 613006 INFO  (qtp2062410457-8734) [n:127.0.0.1:46143_solr c:pull_replica_test_add_docs s:shard1 r:core_node3 x:pull_replica_test_add_docs_shard1_replica_n1] o.a.s.c.ShardLeaderElectionContext I may be the new leader - try and sync
   [junit4]   2> 613006 INFO  (qtp2062410457-8734) [n:127.0.0.1:46143_solr c:pull_replica_test_add_docs s:shard1 r:core_node3 x:pull_replica_test_add_docs_shard1_replica_n1] o.a.s.c.SyncStrategy Sync replicas to http://127.0.0.1:46143/solr/pull_replica_test_add_docs_shard1_replica_n1/
   [junit4]   2> 613006 INFO  (qtp2062410457-8734) [n:127.0.0.1:46143_solr c:pull_replica_test_add_docs s:shard1 r:core_node3 x:pull_replica_test_add_docs_shard1_replica_n1] o.a.s.c.SyncStrategy Sync Success - now sync replicas to me
   [junit4]   2> 613006 INFO  (qtp2062410457-8734) [n:127.0.0.1:46143_solr c:pull_replica_test_add_docs s:shard1 r:core_node3 x:pull_replica_test_add_docs_shard1_replica_n1] o.a.s.c.SyncStrategy http://127.0.0.1:46143/solr/pull_replica_test_add_docs_shard1_replica_n1/ has no replicas
   [junit4]   2> 613006 INFO  (qtp2062410457-8734) [n:127.0.0.1:46143_solr c:pull_replica_test_add_docs s:shard1 r:core_node3 x:pull_replica_test_add_docs_shard1_replica_n1] o.a.s.c.ShardLeaderElectionContext Found all replicas participating in election, clear LIR
   [junit4]   2> 613007 INFO  (qtp2062410457-8734) [n:127.0.0.1:46143_solr c:pull_replica_test_add_docs s:shard1 r:core_node3 x:pull_replica_test_add_docs_shard1_replica_n1] o.a.s.c.ShardLeaderElectionContext I am the new leader: http://127.0.0.1:46143/solr/pull_replica_test_add_docs_shard1_replica_n1/ shard1
   [junit4]   2> 613109 INFO  (qtp2062410457-8734) [n:127.0.0.1:46143_solr c:pull_replica_test_add_docs s:shard1 r:core_node3 x:pull_replica_test_add_docs_shard1_replica_n1] o.a.s.c.ZkController I am the leader, no recovery necessary
   [junit4]   2> 613128 INFO  (qtp2062410457-8734) [n:127.0.0.1:46143_solr c:pull_replica_test_add_docs s:shard1 r:core_node3 x:pull_replica_test_add_docs_shard1_replica_n1] o.a.s.s.HttpSolrCall [admin] webapp=null path=/admin/cores params={qt=/admin/cores&coreNodeName=core_node3&collection.configName=conf&newCollection=true&name=pull_replica_test_add_docs_shard1_replica_n1&action=CREATE&numShards=1&collection=pull_replica_test_add_docs&shard=shard1&wt=javabin&version=2&replicaType=NRT} status=0 QTime=1210
   [junit4]   2> 613150 INFO  (indexFetcher-3030-thread-1) [    ] o.a.s.h.IndexFetcher Replica core_node3 is leader but it's state is down, skipping replication
   [junit4]   2> 613151 INFO  (indexFetcher-3029-thread-1) [    ] o.a.s.h.IndexFetcher Replica core_node3 is leader but it's state is down, skipping replication
   [junit4]   2> 613211 INFO  (zkCallback-1733-thread-1) [    ] o.a.s.c.c.ZkStateReader A cluster state change: [WatchedEvent state:SyncConnected type:NodeDataChanged path:/collections/pull_replica_test_add_docs/state.json] for collection [pull_replica_test_add_docs] has occurred - updating... (live nodes size: [2])
   [junit4]   2> 613533 DEBUG (ScheduledTrigger-3004-thread-4) [    ] o.a.s.c.a.NodeLostTrigger Running NodeLostTrigger: .auto_add_replicas with currently live nodes: 2
   [junit4]   2> 614032 INFO  (qtp502198834-8741) [n:127.0.0.1:39103_solr c:pull_replica_test_add_docs s:shard1 r:core_node5 x:pull_replica_test_add_docs_shard1_replica_p2] o.a.s.s.HttpSolrCall [admin] webapp=null path=/admin/cores params={qt=/admin/cores&coreNodeName=core_node5&collection.configName=conf&newCollection=true&name=pull_replica_test_add_docs_shard1_replica_p2&action=CREATE&numShards=1&collection=pull_replica_test_add_docs&shard=shard1&wt=javabin&version=2&replicaType=PULL} status=0 QTime=2113
   [junit4]   2> 614032 INFO  (qtp502198834-8743) [n:127.0.0.1:39103_solr c:pull_replica_test_add_docs s:shard1 r:core_node8 x:pull_replica_test_add_docs_shard1_replica_p6] o.a.s.s.HttpSolrCall [admin] webapp=null path=/admin/cores params={qt=/admin/cores&coreNodeName=core_node8&collection.configName=conf&newCollection=true&name=pull_replica_test_add_docs_shard1_replica_p6&action=CREATE&numShards=1&collection=pull_replica_test_add_docs&shard=shard1&wt=javabin&version=2&replicaType=PULL} status=0 QTime=2112
   [junit4]   2> 614036 INFO  (qtp2062410457-8742) [n:127.0.0.1:46143_solr c:pull_replica_test_add_docs s:shard1 r:core_node7 x:pull_replica_test_add_docs_shard1_replica_p4] o.a.s.s.HttpSolrCall [admin] webapp=null path=/admin/cores params={qt=/admin/cores&coreNodeName=core_node7&collection.configName=conf&newCollection=true&name=pull_replica_test_add_docs_shard1_replica_p4&action=CREATE&numShards=1&collection=pull_replica_test_add_docs&shard=shard1&wt=javabin&version=2&replicaType=PULL} status=0 QTime=2116
   [junit4]   2> 614038 INFO  (qtp502198834-8739) [n:127.0.0.1:39103_solr    ] o.a.s.h.a.CollectionsHandler Wait for new collection to be active for at most 30 seconds. Check all shard replicas
   [junit4]   2> 614107 INFO  (zkCallback-1725-thread-2) [    ] o.a.s.c.c.ZkStateReader A cluster state change: [WatchedEvent state:SyncConnected type:NodeDataChanged path:/collections/pull_replica_test_add_docs/state.json] for collection [pull_replica_test_add_docs] has occurred - updating... (live nodes size: [2])
   [junit4]   2> 614107 INFO  (zkCallback-1733-thread-1) [    ] o.a.s.c.c.ZkStateReader A cluster state change: [WatchedEvent state:SyncConnected type:NodeDataChanged path:/collections/pull_replica_test_add_docs/state.json] for collection [pull_replica_test_add_docs] has occurred - updating... (live nodes size: [2])
   [junit4]   2> 614533 DEBUG (ScheduledTrigger-3004-thread-3) [    ] o.a.s.c.a.NodeLostTrigger Running NodeLostTrigger: .auto_add_replicas with currently live nodes: 2
   [junit4]   2> 615039 INFO  (qtp502198834-8739) [n:127.0.0.1:39103_solr    ] o.a.s.s.HttpSolrCall [admin] webapp=null path=/admin/collections params={pullReplicas=3&collection.configName=conf&maxShardsPerNode=100&name=pull_replica_test_add_docs&nrtReplicas=1&action=CREATE&numShards=1&tlogReplicas=0&wt=javabin&version=2} status=0 QTime=3431
   [junit4]   2> 615045 INFO  (qtp2062410457-8736) [n:127.0.0.1:46143_solr c:pull_replica_test_add_docs s:shard1 r:core_node3 x:pull_replica_test_add_docs_shard1_replica_n1] o.a.s.c.ZkShardTerms Successful update of terms at /collections/pull_replica_test_add_docs/terms/shard1 to Terms{values={core_node3=1}, version=1}
   [junit4]   2> 615045 INFO  (qtp2062410457-8736) [n:127.0.0.1:46143_solr c:pull_replica_test_add_docs s:shard1 r:core_node3 x:pull_replica_test_add_docs_shard1_replica_n1] o.a.s.u.p.LogUpdateProcessorFactory [pull_replica_test_add_docs_shard1_replica_n1]  webapp=/solr path=/update params={wt=javabin&version=2}{add=[1 (1605525697000898560)]} 0 2
   [junit4]   2> 615046 INFO  (qtp2062410457-8740

[...truncated too long message...]

dminHandler.handleRequestBody(CoreAdminHandler.java:180)
   [junit4]   2>         at org.apache.solr.handler.RequestHandlerBase.handleRequest(RequestHandlerBase.java:199)
   [junit4]   2>         at org.apache.solr.client.solrj.embedded.EmbeddedSolrServer.request(EmbeddedSolrServer.java:143)
   [junit4]   2>         at org.apache.solr.client.solrj.SolrRequest.process(SolrRequest.java:194)
   [junit4]   2>         at org.apache.solr.client.solrj.SolrRequest.process(SolrRequest.java:211)
   [junit4]   2>         at org.apache.solr.client.solrj.request.CoreAdminRequest.reloadCore(CoreAdminRequest.java:583)
   [junit4]   2>         at org.apache.solr.client.solrj.embedded.TestSolrProperties.testProperties(TestSolrProperties.java:124)
   [junit4]   2>         at sun.reflect.NativeMethodAccessorImpl.invoke0(Native Method)
   [junit4]   2>         at sun.reflect.NativeMethodAccessorImpl.invoke(NativeMethodAccessorImpl.java:62)
   [junit4]   2>         at sun.reflect.DelegatingMethodAccessorImpl.invoke(DelegatingMethodAccessorImpl.java:43)
   [junit4]   2>         at java.lang.reflect.Method.invoke(Method.java:498)
   [junit4]   2>         at com.carrotsearch.randomizedtesting.RandomizedRunner.invoke(RandomizedRunner.java:1737)
   [junit4]   2>         at com.carrotsearch.randomizedtesting.RandomizedRunner$8.evaluate(RandomizedRunner.java:934)
   [junit4]   2>         at com.carrotsearch.randomizedtesting.RandomizedRunner$9.evaluate(RandomizedRunner.java:970)
   [junit4]   2>         at com.carrotsearch.randomizedtesting.RandomizedRunner$10.evaluate(RandomizedRunner.java:984)
   [junit4]   2>         at com.carrotsearch.randomizedtesting.rules.SystemPropertiesRestoreRule$1.evaluate(SystemPropertiesRestoreRule.java:57)
   [junit4]   2>         at org.apache.lucene.util.TestRuleSetupTeardownChained$1.evaluate(TestRuleSetupTeardownChained.java:49)
   [junit4]   2>         at org.apache.lucene.util.AbstractBeforeAfterRule$1.evaluate(AbstractBeforeAfterRule.java:45)
   [junit4]   2>         at org.apache.lucene.util.TestRuleThreadAndTestName$1.evaluate(TestRuleThreadAndTestName.java:48)
   [junit4]   2>         at org.apache.lucene.util.TestRuleIgnoreAfterMaxFailures$1.evaluate(TestRuleIgnoreAfterMaxFailures.java:64)
   [junit4]   2>         at org.apache.lucene.util.TestRuleMarkFailure$1.evaluate(TestRuleMarkFailure.java:47)
   [junit4]   2>         at com.carrotsearch.randomizedtesting.rules.StatementAdapter.evaluate(StatementAdapter.java:36)
   [junit4]   2>         at com.carrotsearch.randomizedtesting.ThreadLeakControl$StatementRunner.run(ThreadLeakControl.java:368)
   [junit4]   2>         at com.carrotsearch.randomizedtesting.ThreadLeakControl.forkTimeoutingTask(ThreadLeakControl.java:817)
   [junit4]   2>         at com.carrotsearch.randomizedtesting.ThreadLeakControl$3.evaluate(ThreadLeakControl.java:468)
   [junit4]   2>         at com.carrotsearch.randomizedtesting.RandomizedRunner.runSingleTest(RandomizedRunner.java:943)
   [junit4]   2>         at com.carrotsearch.randomizedtesting.RandomizedRunner$5.evaluate(RandomizedRunner.java:829)
   [junit4]   2>         at com.carrotsearch.randomizedtesting.RandomizedRunner$6.evaluate(RandomizedRunner.java:879)
   [junit4]   2>         at com.carrotsearch.randomizedtesting.RandomizedRunner$7.evaluate(RandomizedRunner.java:890)
   [junit4]   2>         at com.carrotsearch.randomizedtesting.rules.StatementAdapter.evaluate(StatementAdapter.java:36)
   [junit4]   2>         at com.carrotsearch.randomizedtesting.rules.SystemPropertiesRestoreRule$1.evaluate(SystemPropertiesRestoreRule.java:57)
   [junit4]   2>         at org.apache.lucene.util.AbstractBeforeAfterRule$1.evaluate(AbstractBeforeAfterRule.java:45)
   [junit4]   2>         at com.carrotsearch.randomizedtesting.rules.StatementAdapter.evaluate(StatementAdapter.java:36)
   [junit4]   2>         at org.apache.lucene.util.TestRuleStoreClassName$1.evaluate(TestRuleStoreClassName.java:41)
   [junit4]   2>         at com.carrotsearch.randomizedtesting.rules.NoShadowingOrOverridesOnMethodsRule$1.evaluate(NoShadowingOrOverridesOnMethodsRule.java:40)
   [junit4]   2>         at com.carrotsearch.randomizedtesting.rules.NoShadowingOrOverridesOnMethodsRule$1.evaluate(NoShadowingOrOverridesOnMethodsRule.java:40)
   [junit4]   2>         at com.carrotsearch.randomizedtesting.rules.StatementAdapter.evaluate(StatementAdapter.java:36)
   [junit4]   2>         at com.carrotsearch.randomizedtesting.rules.StatementAdapter.evaluate(StatementAdapter.java:36)
   [junit4]   2>         at com.carrotsearch.randomizedtesting.rules.StatementAdapter.evaluate(StatementAdapter.java:36)
   [junit4]   2>         at org.apache.lucene.util.TestRuleAssertionsRequired$1.evaluate(TestRuleAssertionsRequired.java:53)
   [junit4]   2>         at org.apache.lucene.util.TestRuleMarkFailure$1.evaluate(TestRuleMarkFailure.java:47)
   [junit4]   2>         at org.apache.lucene.util.TestRuleIgnoreAfterMaxFailures$1.evaluate(TestRuleIgnoreAfterMaxFailures.java:64)
   [junit4]   2>         at org.apache.lucene.util.TestRuleIgnoreTestSuites$1.evaluate(TestRuleIgnoreTestSuites.java:54)
   [junit4]   2>         at com.carrotsearch.randomizedtesting.rules.StatementAdapter.evaluate(StatementAdapter.java:36)
   [junit4]   2>         at com.carrotsearch.randomizedtesting.ThreadLeakControl$StatementRunner.run(ThreadLeakControl.java:368)
   [junit4]   2>         at java.lang.Thread.run(Thread.java:748)
   [junit4]   2> NOTE: test params are: codec=Asserting(Lucene70): {core1=PostingsFormat(name=MockRandom), core0=PostingsFormat(name=LuceneVarGapDocFreqInterval), id=PostingsFormat(name=Asserting)}, docValues:{}, maxPointsInLeafNode=236, maxMBSortInHeap=5.057663114164683, sim=Asserting(org.apache.lucene.search.similarities.AssertingSimilarity@577ca31a), locale=de-GR, timezone=Africa/Lubumbashi
   [junit4]   2> NOTE: Linux 4.15.0-24-generic amd64/Oracle Corporation 1.8.0_172 (64-bit)/cpus=8,threads=10,free=484932360,total=518979584
   [junit4]   2> NOTE: All tests run in this JVM: [TestSolrProperties]
   [junit4]   2> NOTE: reproduce with: ant test  -Dtestcase=TestSolrProperties -Dtests.seed=F16ADC998060EDDE -Dtests.multiplier=3 -Dtests.slow=true -Dtests.badapples=true -Dtests.locale=de-GR -Dtests.timezone=Africa/Lubumbashi -Dtests.asserts=true -Dtests.file.encoding=ISO-8859-1
   [junit4] ERROR   0.00s J1 | TestSolrProperties (suite) <<<
   [junit4]    > Throwable #1: java.lang.Exception: Suite timeout exceeded (>= 7200000 msec).
   [junit4]    > 	at __randomizedtesting.SeedInfo.seed([F16ADC998060EDDE]:0)
   [junit4] Completed [3/5 (3!)] on J1 in 7284.33s, 1 test, 2 errors <<< FAILURES!
   [junit4] 
   [junit4] Suite: org.apache.solr.client.solrj.embedded.TestSolrProperties
   [junit4] Completed [4/5 (3!)] on J2 in 0.01s, 1 test, 1 skipped
   [junit4] 
   [junit4] Suite: org.apache.solr.client.solrj.embedded.TestSolrProperties
   [junit4] Completed [5/5 (3!)] on J0 in 0.01s, 1 test, 1 skipped
   [junit4] 
   [junit4] 
   [junit4] Tests with failures [seed: F16ADC998060EDDE]:
   [junit4]   - org.apache.solr.client.solrj.embedded.TestSolrProperties.testProperties
   [junit4]   - org.apache.solr.client.solrj.embedded.TestSolrProperties.testProperties
   [junit4]   - org.apache.solr.client.solrj.embedded.TestSolrProperties.testProperties
   [junit4]   - org.apache.solr.client.solrj.embedded.TestSolrProperties (suite)
   [junit4]   - org.apache.solr.client.solrj.embedded.TestSolrProperties (suite)
   [junit4]   - org.apache.solr.client.solrj.embedded.TestSolrProperties (suite)
   [junit4] 
   [junit4] 
   [junit4] JVM J0:     0.61 ..  7285.61 =  7285.00s
   [junit4] JVM J1:     0.61 ..  7285.38 =  7284.77s
   [junit4] JVM J2:     0.60 ..  7285.45 =  7284.85s
   [junit4] Execution time total: 2 hours 1 minute 25 seconds
   [junit4] Tests summary: 5 suites, 5 tests, 3 suite-level errors, 3 errors, 2 ignored

BUILD FAILED
/home/jenkins/workspace/Lucene-Solr-master-Linux/lucene/common-build.xml:1568: The following error occurred while executing this line:
/home/jenkins/workspace/Lucene-Solr-master-Linux/lucene/common-build.xml:1092: There were test failures: 5 suites, 5 tests, 3 suite-level errors, 3 errors, 2 ignored [seed: F16ADC998060EDDE]

Total time: 121 minutes 26 seconds

[repro] Setting last failure code to 256

[repro] Failures:
[repro]   3/5 failed: org.apache.solr.client.solrj.embedded.TestSolrProperties
[repro]   3/5 failed: org.apache.solr.cloud.TestPullReplica
[repro]   3/5 failed: org.apache.solr.handler.component.InfixSuggestersTest
[repro] Exiting with code 256
+ mv lucene/build lucene/build.repro
+ mv solr/build solr/build.repro
+ mv lucene/build.orig lucene/build
+ mv solr/build.orig solr/build
Archiving artifacts
Setting ANT_1_8_2_HOME=/var/lib/jenkins/tools/hudson.tasks.Ant_AntInstallation/ANT_1.8.2
[WARNINGS] Parsing warnings in console log with parser Java Compiler (javac)
Setting ANT_1_8_2_HOME=/var/lib/jenkins/tools/hudson.tasks.Ant_AntInstallation/ANT_1.8.2
Setting ANT_1_8_2_HOME=/var/lib/jenkins/tools/hudson.tasks.Ant_AntInstallation/ANT_1.8.2
<Git Blamer> Using GitBlamer to create author and commit information for all warnings.
<Git Blamer> GIT_COMMIT=963cceebffaeda880e611377e5818982b9d0e7ab, workspace=/var/lib/jenkins/workspace/Lucene-Solr-master-Linux
[WARNINGS] Computing warning deltas based on reference build #22425
Recording test results
Setting ANT_1_8_2_HOME=/var/lib/jenkins/tools/hudson.tasks.Ant_AntInstallation/ANT_1.8.2
Build step 'Publish JUnit test result report' changed build result to UNSTABLE
Email was triggered for: Unstable (Test Failures)
Sending email for trigger: Unstable (Test Failures)
Setting ANT_1_8_2_HOME=/var/lib/jenkins/tools/hudson.tasks.Ant_AntInstallation/ANT_1.8.2
Setting ANT_1_8_2_HOME=/var/lib/jenkins/tools/hudson.tasks.Ant_AntInstallation/ANT_1.8.2
Setting ANT_1_8_2_HOME=/var/lib/jenkins/tools/hudson.tasks.Ant_AntInstallation/ANT_1.8.2
Setting ANT_1_8_2_HOME=/var/lib/jenkins/tools/hudson.tasks.Ant_AntInstallation/ANT_1.8.2

Mime
View raw message