lucene-dev mailing list archives

Site index · List index
Message view « Date » · « Thread »
Top « Date » · « Thread »
From Policeman Jenkins Server <jenk...@thetaphi.de>
Subject [JENKINS] Lucene-Solr-7.x-Solaris (64bit/jdk1.8.0) - Build # 718 - Unstable!
Date Thu, 12 Jul 2018 03:56:07 GMT
Build: https://jenkins.thetaphi.de/job/Lucene-Solr-7.x-Solaris/718/
Java: 64bit/jdk1.8.0 -XX:+UseCompressedOops -XX:+UseSerialGC

1 tests failed.
FAILED:  org.apache.solr.handler.component.InfixSuggestersTest.testShutdownDuringBuild

Error Message:
junit.framework.AssertionFailedError: Unexpected wrapped exception type, expected CoreIsClosedException

Stack Trace:
java.util.concurrent.ExecutionException: junit.framework.AssertionFailedError: Unexpected wrapped exception type, expected CoreIsClosedException
	at __randomizedtesting.SeedInfo.seed([AF0B759D88602506:70861722B6097064]:0)
	at java.util.concurrent.FutureTask.report(FutureTask.java:122)
	at java.util.concurrent.FutureTask.get(FutureTask.java:192)
	at org.apache.solr.handler.component.InfixSuggestersTest.testShutdownDuringBuild(InfixSuggestersTest.java:130)
	at sun.reflect.NativeMethodAccessorImpl.invoke0(Native Method)
	at sun.reflect.NativeMethodAccessorImpl.invoke(NativeMethodAccessorImpl.java:62)
	at sun.reflect.DelegatingMethodAccessorImpl.invoke(DelegatingMethodAccessorImpl.java:43)
	at java.lang.reflect.Method.invoke(Method.java:498)
	at com.carrotsearch.randomizedtesting.RandomizedRunner.invoke(RandomizedRunner.java:1737)
	at com.carrotsearch.randomizedtesting.RandomizedRunner$8.evaluate(RandomizedRunner.java:934)
	at com.carrotsearch.randomizedtesting.RandomizedRunner$9.evaluate(RandomizedRunner.java:970)
	at com.carrotsearch.randomizedtesting.RandomizedRunner$10.evaluate(RandomizedRunner.java:984)
	at com.carrotsearch.randomizedtesting.rules.SystemPropertiesRestoreRule$1.evaluate(SystemPropertiesRestoreRule.java:57)
	at org.apache.lucene.util.TestRuleSetupTeardownChained$1.evaluate(TestRuleSetupTeardownChained.java:49)
	at org.apache.lucene.util.AbstractBeforeAfterRule$1.evaluate(AbstractBeforeAfterRule.java:45)
	at org.apache.lucene.util.TestRuleThreadAndTestName$1.evaluate(TestRuleThreadAndTestName.java:48)
	at org.apache.lucene.util.TestRuleIgnoreAfterMaxFailures$1.evaluate(TestRuleIgnoreAfterMaxFailures.java:64)
	at org.apache.lucene.util.TestRuleMarkFailure$1.evaluate(TestRuleMarkFailure.java:47)
	at com.carrotsearch.randomizedtesting.rules.StatementAdapter.evaluate(StatementAdapter.java:36)
	at com.carrotsearch.randomizedtesting.ThreadLeakControl$StatementRunner.run(ThreadLeakControl.java:368)
	at com.carrotsearch.randomizedtesting.ThreadLeakControl.forkTimeoutingTask(ThreadLeakControl.java:817)
	at com.carrotsearch.randomizedtesting.ThreadLeakControl$3.evaluate(ThreadLeakControl.java:468)
	at com.carrotsearch.randomizedtesting.RandomizedRunner.runSingleTest(RandomizedRunner.java:943)
	at com.carrotsearch.randomizedtesting.RandomizedRunner$5.evaluate(RandomizedRunner.java:829)
	at com.carrotsearch.randomizedtesting.RandomizedRunner$6.evaluate(RandomizedRunner.java:879)
	at com.carrotsearch.randomizedtesting.RandomizedRunner$7.evaluate(RandomizedRunner.java:890)
	at com.carrotsearch.randomizedtesting.rules.StatementAdapter.evaluate(StatementAdapter.java:36)
	at com.carrotsearch.randomizedtesting.rules.SystemPropertiesRestoreRule$1.evaluate(SystemPropertiesRestoreRule.java:57)
	at org.apache.lucene.util.AbstractBeforeAfterRule$1.evaluate(AbstractBeforeAfterRule.java:45)
	at com.carrotsearch.randomizedtesting.rules.StatementAdapter.evaluate(StatementAdapter.java:36)
	at org.apache.lucene.util.TestRuleStoreClassName$1.evaluate(TestRuleStoreClassName.java:41)
	at com.carrotsearch.randomizedtesting.rules.NoShadowingOrOverridesOnMethodsRule$1.evaluate(NoShadowingOrOverridesOnMethodsRule.java:40)
	at com.carrotsearch.randomizedtesting.rules.NoShadowingOrOverridesOnMethodsRule$1.evaluate(NoShadowingOrOverridesOnMethodsRule.java:40)
	at com.carrotsearch.randomizedtesting.rules.StatementAdapter.evaluate(StatementAdapter.java:36)
	at com.carrotsearch.randomizedtesting.rules.StatementAdapter.evaluate(StatementAdapter.java:36)
	at com.carrotsearch.randomizedtesting.rules.StatementAdapter.evaluate(StatementAdapter.java:36)
	at org.apache.lucene.util.TestRuleAssertionsRequired$1.evaluate(TestRuleAssertionsRequired.java:53)
	at org.apache.lucene.util.TestRuleMarkFailure$1.evaluate(TestRuleMarkFailure.java:47)
	at org.apache.lucene.util.TestRuleIgnoreAfterMaxFailures$1.evaluate(TestRuleIgnoreAfterMaxFailures.java:64)
	at org.apache.lucene.util.TestRuleIgnoreTestSuites$1.evaluate(TestRuleIgnoreTestSuites.java:54)
	at com.carrotsearch.randomizedtesting.rules.StatementAdapter.evaluate(StatementAdapter.java:36)
	at com.carrotsearch.randomizedtesting.ThreadLeakControl$StatementRunner.run(ThreadLeakControl.java:368)
	at java.lang.Thread.run(Thread.java:748)
Caused by: junit.framework.AssertionFailedError: Unexpected wrapped exception type, expected CoreIsClosedException
	at org.apache.lucene.util.LuceneTestCase.expectThrows(LuceneTestCase.java:2704)
	at org.apache.solr.handler.component.InfixSuggestersTest.lambda$testShutdownDuringBuild$3(InfixSuggestersTest.java:121)
	at java.util.concurrent.FutureTask.run(FutureTask.java:266)
	at org.apache.solr.common.util.ExecutorUtil$MDCAwareThreadPoolExecutor.lambda$execute$0(ExecutorUtil.java:209)
	at java.util.concurrent.ThreadPoolExecutor.runWorker(ThreadPoolExecutor.java:1149)
	at java.util.concurrent.ThreadPoolExecutor$Worker.run(ThreadPoolExecutor.java:624)
	... 1 more
Caused by: java.lang.RuntimeException: Exception during query
	at org.apache.solr.SolrTestCaseJ4.assertQ(SolrTestCaseJ4.java:917)
	at org.apache.solr.SolrTestCaseJ4.assertQ(SolrTestCaseJ4.java:877)
	at org.apache.solr.handler.component.InfixSuggestersTest.lambda$null$2(InfixSuggestersTest.java:122)
	at org.apache.lucene.util.LuceneTestCase.expectThrows(LuceneTestCase.java:2696)
	... 6 more
Caused by: org.apache.solr.common.SolrException: SolrCoreState already closed.
	at org.apache.solr.update.DefaultSolrCoreState.lock(DefaultSolrCoreState.java:186)
	at org.apache.solr.update.DefaultSolrCoreState.getIndexWriter(DefaultSolrCoreState.java:121)
	at org.apache.solr.update.SolrCoreState.getTragicException(SolrCoreState.java:198)
	at org.apache.solr.core.CoreContainer.checkTragicException(CoreContainer.java:1805)
	at org.apache.solr.handler.RequestHandlerBase.handleRequest(RequestHandlerBase.java:212)
	at org.apache.solr.core.SolrCore.execute(SolrCore.java:2541)
	at org.apache.solr.util.TestHarness.query(TestHarness.java:337)
	at org.apache.solr.util.TestHarness.query(TestHarness.java:319)
	at org.apache.solr.SolrTestCaseJ4.assertQ(SolrTestCaseJ4.java:891)
	... 9 more




Build Log:
[...truncated 14436 lines...]
   [junit4] Suite: org.apache.solr.handler.component.InfixSuggestersTest
   [junit4]   2> Creating dataDir: /export/home/jenkins/workspace/Lucene-Solr-7.x-Solaris/solr/build/solr-core/test/J0/temp/solr.handler.component.InfixSuggestersTest_AF0B759D88602506-001/init-core-data-001
   [junit4]   2> 3424784 INFO  (SUITE-InfixSuggestersTest-seed#[AF0B759D88602506]-worker) [    ] o.a.s.c.SolrResourceLoader [null] Added 2 libs to classloader, from paths: [/export/home/jenkins/workspace/Lucene-Solr-7.x-Solaris/solr/core/src/test-files/solr/collection1/lib, /export/home/jenkins/workspace/Lucene-Solr-7.x-Solaris/solr/core/src/test-files/solr/collection1/lib/classes]
   [junit4]   2> 3424805 INFO  (SUITE-InfixSuggestersTest-seed#[AF0B759D88602506]-worker) [    ] o.a.s.c.SolrConfig Using Lucene MatchVersion: 7.5.0
   [junit4]   2> 3424813 INFO  (SUITE-InfixSuggestersTest-seed#[AF0B759D88602506]-worker) [    ] o.a.s.s.IndexSchema [null] Schema name=test
   [junit4]   2> 3424887 INFO  (SUITE-InfixSuggestersTest-seed#[AF0B759D88602506]-worker) [    ] o.a.s.s.IndexSchema Loaded schema test/1.0 with uniqueid field id
   [junit4]   2> 3425455 INFO  (SUITE-InfixSuggestersTest-seed#[AF0B759D88602506]-worker) [    ] o.a.s.c.TransientSolrCoreCacheDefault Allocating transient cache for 2147483647 transient cores
   [junit4]   2> 3425455 INFO  (SUITE-InfixSuggestersTest-seed#[AF0B759D88602506]-worker) [    ] o.a.s.h.a.MetricsHistoryHandler No .system collection, keeping metrics history in memory.
   [junit4]   2> 3425467 INFO  (SUITE-InfixSuggestersTest-seed#[AF0B759D88602506]-worker) [    ] o.a.s.m.r.SolrJmxReporter JMX monitoring for 'solr.node' (registry 'solr.node') enabled at server: com.sun.jmx.mbeanserver.JmxMBeanServer@67d1cb03
   [junit4]   2> 3425473 INFO  (SUITE-InfixSuggestersTest-seed#[AF0B759D88602506]-worker) [    ] o.a.s.m.r.SolrJmxReporter JMX monitoring for 'solr.jvm' (registry 'solr.jvm') enabled at server: com.sun.jmx.mbeanserver.JmxMBeanServer@67d1cb03
   [junit4]   2> 3425473 INFO  (SUITE-InfixSuggestersTest-seed#[AF0B759D88602506]-worker) [    ] o.a.s.m.r.SolrJmxReporter JMX monitoring for 'solr.jetty' (registry 'solr.jetty') enabled at server: com.sun.jmx.mbeanserver.JmxMBeanServer@67d1cb03
   [junit4]   2> 3425475 INFO  (coreLoadExecutor-13715-thread-1) [    x:collection1] o.a.s.c.SolrResourceLoader [null] Added 2 libs to classloader, from paths: [/export/home/jenkins/workspace/Lucene-Solr-7.x-Solaris/solr/core/src/test-files/solr/collection1/lib, /export/home/jenkins/workspace/Lucene-Solr-7.x-Solaris/solr/core/src/test-files/solr/collection1/lib/classes]
   [junit4]   2> 3425512 INFO  (coreLoadExecutor-13715-thread-1) [    x:collection1] o.a.s.c.SolrConfig Using Lucene MatchVersion: 7.5.0
   [junit4]   2> 3425542 INFO  (coreLoadExecutor-13715-thread-1) [    x:collection1] o.a.s.s.IndexSchema [collection1] Schema name=test
   [junit4]   2> 3425660 INFO  (coreLoadExecutor-13715-thread-1) [    x:collection1] o.a.s.s.IndexSchema Loaded schema test/1.0 with uniqueid field id
   [junit4]   2> 3425667 INFO  (coreLoadExecutor-13715-thread-1) [    x:collection1] o.a.s.c.CoreContainer Creating SolrCore 'collection1' using configuration from instancedir /export/home/jenkins/workspace/Lucene-Solr-7.x-Solaris/solr/core/src/test-files/solr/collection1, trusted=true
   [junit4]   2> 3425667 INFO  (coreLoadExecutor-13715-thread-1) [    x:collection1] o.a.s.m.r.SolrJmxReporter JMX monitoring for 'solr.core.collection1' (registry 'solr.core.collection1') enabled at server: com.sun.jmx.mbeanserver.JmxMBeanServer@67d1cb03
   [junit4]   2> 3425667 INFO  (coreLoadExecutor-13715-thread-1) [    x:collection1] o.a.s.c.SolrCore solr.RecoveryStrategy.Builder
   [junit4]   2> 3425667 INFO  (coreLoadExecutor-13715-thread-1) [    x:collection1] o.a.s.c.SolrCore [[collection1] ] Opening new SolrCore at [/export/home/jenkins/workspace/Lucene-Solr-7.x-Solaris/solr/core/src/test-files/solr/collection1], dataDir=[/export/home/jenkins/workspace/Lucene-Solr-7.x-Solaris/solr/build/solr-core/test/J0/temp/solr.handler.component.InfixSuggestersTest_AF0B759D88602506-001/init-core-data-001/]
   [junit4]   2> 3425668 INFO  (coreLoadExecutor-13715-thread-1) [    x:collection1] o.a.s.u.RandomMergePolicy RandomMergePolicy wrapping class org.apache.lucene.index.AlcoholicMergePolicy: [AlcoholicMergePolicy: minMergeSize=0, mergeFactor=10, maxMergeSize=1750512644, maxMergeSizeForForcedMerge=9223372036854775807, calibrateSizeByDeletes=true, maxMergeDocs=2147483647, maxCFSSegmentSizeMB=8.796093022207999E12, noCFSRatio=0.1]
   [junit4]   2> 3425719 INFO  (coreLoadExecutor-13715-thread-1) [    x:collection1] o.a.s.u.CommitTracker Hard AutoCommit: disabled
   [junit4]   2> 3425719 INFO  (coreLoadExecutor-13715-thread-1) [    x:collection1] o.a.s.u.CommitTracker Soft AutoCommit: disabled
   [junit4]   2> 3425719 INFO  (coreLoadExecutor-13715-thread-1) [    x:collection1] o.a.s.u.RandomMergePolicy RandomMergePolicy wrapping class org.apache.lucene.index.TieredMergePolicy: [TieredMergePolicy: maxMergeAtOnce=34, maxMergeAtOnceExplicit=36, maxMergedSegmentMB=3.814453125, floorSegmentMB=0.22265625, forceMergeDeletesPctAllowed=13.835931273256612, segmentsPerTier=16.0, maxCFSSegmentSizeMB=8.796093022207999E12, noCFSRatio=0.10960683391675206, reclaimDeletesWeight=1.8094981098157494
   [junit4]   2> 3425720 INFO  (coreLoadExecutor-13715-thread-1) [    x:collection1] o.a.s.s.SolrIndexSearcher Opening [Searcher@7d167afe[collection1] main]
   [junit4]   2> 3425720 WARN  (coreLoadExecutor-13715-thread-1) [    x:collection1] o.a.s.r.ManagedResourceStorage Cannot write to config directory /export/home/jenkins/workspace/Lucene-Solr-7.x-Solaris/solr/core/src/test-files/solr/collection1/conf; switching to use InMemory storage instead.
   [junit4]   2> 3425720 INFO  (coreLoadExecutor-13715-thread-1) [    x:collection1] o.a.s.h.c.SuggestComponent Initializing SuggestComponent
   [junit4]   2> 3425720 INFO  (coreLoadExecutor-13715-thread-1) [    x:collection1] o.a.s.s.s.SolrSuggester init: {name=shortRandomAnalyzingInfixSuggester,lookupImpl=AnalyzingInfixLookupFactory,dictionaryImpl=RandomTestDictionaryFactory,randDictMaxItems=100,indexPath=short_random_analyzing_infix_suggester,suggestAnalyzerFieldType=text,buildOnCommit=false,buildOnStartup=false}
   [junit4]   2> 3425752 INFO  (coreLoadExecutor-13715-thread-1) [    x:collection1] o.a.s.s.s.SolrSuggester Dictionary loaded with params: {name=shortRandomAnalyzingInfixSuggester,lookupImpl=AnalyzingInfixLookupFactory,dictionaryImpl=RandomTestDictionaryFactory,randDictMaxItems=100,indexPath=short_random_analyzing_infix_suggester,suggestAnalyzerFieldType=text,buildOnCommit=false,buildOnStartup=false}
   [junit4]   2> 3425752 INFO  (coreLoadExecutor-13715-thread-1) [    x:collection1] o.a.s.h.c.SuggestComponent Initializing SuggestComponent
   [junit4]   2> 3425752 INFO  (coreLoadExecutor-13715-thread-1) [    x:collection1] o.a.s.s.s.SolrSuggester init: {name=longRandomAnalyzingInfixSuggester,lookupImpl=AnalyzingInfixLookupFactory,dictionaryImpl=RandomTestDictionaryFactory,randDictMaxItems=100000,indexPath=long_random_analyzing_infix_suggester,suggestAnalyzerFieldType=text,buildOnCommit=false,buildOnStartup=false}
   [junit4]   2> 3425752 INFO  (coreLoadExecutor-13715-thread-1) [    x:collection1] o.a.s.s.s.SolrSuggester Dictionary loaded with params: {name=longRandomAnalyzingInfixSuggester,lookupImpl=AnalyzingInfixLookupFactory,dictionaryImpl=RandomTestDictionaryFactory,randDictMaxItems=100000,indexPath=long_random_analyzing_infix_suggester,suggestAnalyzerFieldType=text,buildOnCommit=false,buildOnStartup=false}
   [junit4]   2> 3425752 INFO  (coreLoadExecutor-13715-thread-1) [    x:collection1] o.a.s.h.c.SuggestComponent Initializing SuggestComponent
   [junit4]   2> 3425752 INFO  (coreLoadExecutor-13715-thread-1) [    x:collection1] o.a.s.s.s.SolrSuggester init: {name=shortRandomBlendedInfixSuggester,lookupImpl=BlendedInfixLookupFactory,dictionaryImpl=RandomTestDictionaryFactory,randDictMaxItems=100,blenderType=position_linear,suggestAnalyzerFieldType=text,indexPath=short_random_blended_infix_suggester,highlight=true,buildOnStartup=false,buildOnCommit=false}
   [junit4]   2> 3425753 INFO  (coreLoadExecutor-13715-thread-1) [    x:collection1] o.a.s.s.s.SolrSuggester Dictionary loaded with params: {name=shortRandomBlendedInfixSuggester,lookupImpl=BlendedInfixLookupFactory,dictionaryImpl=RandomTestDictionaryFactory,randDictMaxItems=100,blenderType=position_linear,suggestAnalyzerFieldType=text,indexPath=short_random_blended_infix_suggester,highlight=true,buildOnStartup=false,buildOnCommit=false}
   [junit4]   2> 3425753 INFO  (coreLoadExecutor-13715-thread-1) [    x:collection1] o.a.s.h.ReplicationHandler Commits will be reserved for 10000ms.
   [junit4]   2> 3425766 INFO  (TEST-InfixSuggestersTest.testTwoSuggestersBuildThenReload-seed#[AF0B759D88602506]) [    ] o.a.s.h.c.SuggestComponent SuggestComponent prepare with : qt=/suggest_analyzing_infix_short_dictionary&suggest=true&suggest.buildAll=true&wt=xml&indent=off
   [junit4]   2> 3425766 INFO  (searcherExecutor-13716-thread-1-processing-x:collection1) [    x:collection1] o.a.s.c.SolrCore [collection1] Registered new searcher Searcher@7d167afe[collection1] main{ExitableDirectoryReader(UninvertingDirectoryReader())}
   [junit4]   2> 3425766 INFO  (TEST-InfixSuggestersTest.testTwoSuggestersBuildThenReload-seed#[AF0B759D88602506]) [    ] o.a.s.s.s.SolrSuggester SolrSuggester.build(shortRandomAnalyzingInfixSuggester)
   [junit4]   2> 3425794 INFO  (TEST-InfixSuggestersTest.testTwoSuggestersBuildThenReload-seed#[AF0B759D88602506]) [    ] o.a.s.s.s.RandomTestDictionaryFactory org.apache.solr.spelling.suggest.RandomTestDictionaryFactory$RandomTestDictionary.enabled.shortRandomAnalyzingInfixSuggester disabled after emitting 100 items.
   [junit4]   2> 3425835 INFO  (TEST-InfixSuggestersTest.testTwoSuggestersBuildThenReload-seed#[AF0B759D88602506]) [    ] o.a.s.h.c.SuggestComponent SuggestComponent process with : qt=/suggest_analyzing_infix_short_dictionary&suggest=true&suggest.buildAll=true&wt=xml&indent=off
   [junit4]   2> 3425835 INFO  (TEST-InfixSuggestersTest.testTwoSuggestersBuildThenReload-seed#[AF0B759D88602506]) [    ] o.a.s.c.S.Request [collection1]  webapp=null path=null params={qt=/suggest_analyzing_infix_short_dictionary&suggest.buildAll=true&wt=xml} status=0 QTime=69
   [junit4]   2> 3425837 ERROR (TEST-InfixSuggestersTest.testTwoSuggestersBuildThenReload-seed#[AF0B759D88602506]) [    ] o.a.s.c.CorePropertiesLocator Couldn't load core descriptor from /export/home/jenkins/workspace/Lucene-Solr-7.x-Solaris/solr/core/src/test-files/solr/collection1/core.properties:java.nio.file.NoSuchFileException: /export/home/jenkins/workspace/Lucene-Solr-7.x-Solaris/solr/core/src/test-files/solr/collection1/core.properties
   [junit4]   2> 3425837 INFO  (TEST-InfixSuggestersTest.testTwoSuggestersBuildThenReload-seed#[AF0B759D88602506]) [    ] o.a.s.c.SolrResourceLoader [null] Added 2 libs to classloader, from paths: [/export/home/jenkins/workspace/Lucene-Solr-7.x-Solaris/solr/core/src/test-files/solr/collection1/lib, /export/home/jenkins/workspace/Lucene-Solr-7.x-Solaris/solr/core/src/test-files/solr/collection1/lib/classes]
   [junit4]   2> 3425863 INFO  (TEST-InfixSuggestersTest.testTwoSuggestersBuildThenReload-seed#[AF0B759D88602506]) [    ] o.a.s.c.SolrConfig Using Lucene MatchVersion: 7.5.0
   [junit4]   2> 3425869 INFO  (TEST-InfixSuggestersTest.testTwoSuggestersBuildThenReload-seed#[AF0B759D88602506]) [    ] o.a.s.s.IndexSchema [collection1] Schema name=test
   [junit4]   2> 3425954 INFO  (TEST-InfixSuggestersTest.testTwoSuggestersBuildThenReload-seed#[AF0B759D88602506]) [    ] o.a.s.s.IndexSchema Loaded schema test/1.0 with uniqueid field id
   [junit4]   2> 3425962 INFO  (TEST-InfixSuggestersTest.testTwoSuggestersBuildThenReload-seed#[AF0B759D88602506]) [    ] o.a.s.c.CoreContainer Reloading SolrCore 'collection1' using configuration from instancedir /export/home/jenkins/workspace/Lucene-Solr-7.x-Solaris/solr/core/src/test-files/solr/collection1
   [junit4]   2> 3425983 INFO  (TEST-InfixSuggestersTest.testTwoSuggestersBuildThenReload-seed#[AF0B759D88602506]) [    x:collection1] o.a.s.m.r.SolrJmxReporter JMX monitoring for 'solr.core.collection1' (registry 'solr.core.collection1') enabled at server: com.sun.jmx.mbeanserver.JmxMBeanServer@67d1cb03
   [junit4]   2> 3425984 INFO  (TEST-InfixSuggestersTest.testTwoSuggestersBuildThenReload-seed#[AF0B759D88602506]) [    x:collection1] o.a.s.c.SolrCore [[collection1] ] Opening new SolrCore at [/export/home/jenkins/workspace/Lucene-Solr-7.x-Solaris/solr/core/src/test-files/solr/collection1], dataDir=[/export/home/jenkins/workspace/Lucene-Solr-7.x-Solaris/solr/build/solr-core/test/J0/temp/solr.handler.component.InfixSuggestersTest_AF0B759D88602506-001/init-core-data-001/]
   [junit4]   2> 3426055 INFO  (TEST-InfixSuggestersTest.testTwoSuggestersBuildThenReload-seed#[AF0B759D88602506]) [    x:collection1] o.a.s.u.CommitTracker Hard AutoCommit: disabled
   [junit4]   2> 3426055 INFO  (TEST-InfixSuggestersTest.testTwoSuggestersBuildThenReload-seed#[AF0B759D88602506]) [    x:collection1] o.a.s.u.CommitTracker Soft AutoCommit: disabled
   [junit4]   2> 3426056 INFO  (TEST-InfixSuggestersTest.testTwoSuggestersBuildThenReload-seed#[AF0B759D88602506]) [    x:collection1] o.a.s.s.SolrIndexSearcher Opening [Searcher@25c242f0[collection1] main]
   [junit4]   2> 3426057 WARN  (TEST-InfixSuggestersTest.testTwoSuggestersBuildThenReload-seed#[AF0B759D88602506]) [    x:collection1] o.a.s.r.ManagedResourceStorage Cannot write to config directory /export/home/jenkins/workspace/Lucene-Solr-7.x-Solaris/solr/core/src/test-files/solr/collection1/conf; switching to use InMemory storage instead.
   [junit4]   2> 3426057 INFO  (TEST-InfixSuggestersTest.testTwoSuggestersBuildThenReload-seed#[AF0B759D88602506]) [    x:collection1] o.a.s.h.c.SuggestComponent Initializing SuggestComponent
   [junit4]   2> 3426057 INFO  (TEST-InfixSuggestersTest.testTwoSuggestersBuildThenReload-seed#[AF0B759D88602506]) [    x:collection1] o.a.s.s.s.SolrSuggester init: {name=shortRandomAnalyzingInfixSuggester,lookupImpl=AnalyzingInfixLookupFactory,dictionaryImpl=RandomTestDictionaryFactory,randDictMaxItems=100,indexPath=short_random_analyzing_infix_suggester,suggestAnalyzerFieldType=text,buildOnCommit=false,buildOnStartup=false}
   [junit4]   2> 3426058 INFO  (TEST-InfixSuggestersTest.testTwoSuggestersBuildThenReload-seed#[AF0B759D88602506]) [    x:collection1] o.a.s.s.s.SolrSuggester Dictionary loaded with params: {name=shortRandomAnalyzingInfixSuggester,lookupImpl=AnalyzingInfixLookupFactory,dictionaryImpl=RandomTestDictionaryFactory,randDictMaxItems=100,indexPath=short_random_analyzing_infix_suggester,suggestAnalyzerFieldType=text,buildOnCommit=false,buildOnStartup=false}
   [junit4]   2> 3426058 INFO  (TEST-InfixSuggestersTest.testTwoSuggestersBuildThenReload-seed#[AF0B759D88602506]) [    x:collection1] o.a.s.h.c.SuggestComponent Initializing SuggestComponent
   [junit4]   2> 3426058 INFO  (TEST-InfixSuggestersTest.testTwoSuggestersBuildThenReload-seed#[AF0B759D88602506]) [    x:collection1] o.a.s.s.s.SolrSuggester init: {name=longRandomAnalyzingInfixSuggester,lookupImpl=AnalyzingInfixLookupFactory,dictionaryImpl=RandomTestDictionaryFactory,randDictMaxItems=100000,indexPath=long_random_analyzing_infix_suggester,suggestAnalyzerFieldType=text,buildOnCommit=false,buildOnStartup=false}
   [junit4]   2> 3426058 INFO  (TEST-InfixSuggestersTest.testTwoSuggestersBuildThenReload-seed#[AF0B759D88602506]) [    x:collection1] o.a.s.s.s.SolrSuggester Dictionary loaded with params: {name=longRandomAnalyzingInfixSuggester,lookupImpl=AnalyzingInfixLookupFactory,dictionaryImpl=RandomTestDictionaryFactory,randDictMaxItems=100000,indexPath=long_random_analyzing_infix_suggester,suggestAnalyzerFieldType=text,buildOnCommit=false,buildOnStartup=false}
   [junit4]   2> 3426058 INFO  (TEST-InfixSuggestersTest.testTwoSuggestersBuildThenReload-seed#[AF0B759D88602506]) [    x:collection1] o.a.s.h.c.SuggestComponent Initializing SuggestComponent
   [junit4]   2> 3426058 INFO  (TEST-InfixSuggestersTest.testTwoSuggestersBuildThenReload-seed#[AF0B759D88602506]) [    x:collection1] o.a.s.s.s.SolrSuggester init: {name=shortRandomBlendedInfixSuggester,lookupImpl=BlendedInfixLookupFactory,dictionaryImpl=RandomTestDictionaryFactory,randDictMaxItems=100,blenderType=position_linear,suggestAnalyzerFieldType=text,indexPath=short_random_blended_infix_suggester,highlight=true,buildOnStartup=false,buildOnCommit=false}
   [junit4]   2> 3426059 INFO  (TEST-InfixSuggestersTest.testTwoSuggestersBuildThenReload-seed#[AF0B759D88602506]) [    x:collection1] o.a.s.s.s.SolrSuggester Dictionary loaded with params: {name=shortRandomBlendedInfixSuggester,lookupImpl=BlendedInfixLookupFactory,dictionaryImpl=RandomTestDictionaryFactory,randDictMaxItems=100,blenderType=position_linear,suggestAnalyzerFieldType=text,indexPath=short_random_blended_infix_suggester,highlight=true,buildOnStartup=false,buildOnCommit=false}
   [junit4]   2> 3426059 INFO  (TEST-InfixSuggestersTest.testTwoSuggestersBuildThenReload-seed#[AF0B759D88602506]) [    x:collection1] o.a.s.h.ReplicationHandler Commits will be reserved for 10000ms.
   [junit4]   2> 3426060 INFO  (TEST-InfixSuggestersTest.testTwoSuggestersBuildThenReload-seed#[AF0B759D88602506]) [    x:collection1] o.a.s.u.RandomMergePolicy RandomMergePolicy wrapping class org.apache.lucene.index.AlcoholicMergePolicy: [AlcoholicMergePolicy: minMergeSize=0, mergeFactor=10, maxMergeSize=1540088398, maxMergeSizeForForcedMerge=9223372036854775807, calibrateSizeByDeletes=true, maxMergeDocs=2147483647, maxCFSSegmentSizeMB=8.796093022207999E12, noCFSRatio=0.1]
   [junit4]   2> 3426060 INFO  (TEST-InfixSuggestersTest.testTwoSuggestersBuildThenReload-seed#[AF0B759D88602506]) [    x:collection1] o.a.s.u.DefaultSolrCoreState New IndexWriter is ready to be used.
   [junit4]   2> 3426061 INFO  (searcherExecutor-13720-thread-1-processing-x:collection1) [    x:collection1] o.a.s.c.SolrCore [collection1] Registered new searcher Searcher@25c242f0[collection1] main{ExitableDirectoryReader(UninvertingDirectoryReader())}
   [junit4]   2> 3426061 INFO  (TEST-InfixSuggestersTest.testTwoSuggestersBuildThenReload-seed#[AF0B759D88602506]) [    x:collection1] o.a.s.s.SolrIndexSearcher Opening [Searcher@36c5ed90[collection1] main]
   [junit4]   2> 3426061 INFO  (TEST-InfixSuggestersTest.testTwoSuggestersBuildThenReload-seed#[AF0B759D88602506]) [    x:collection1] o.a.s.c.SolrCore [collection1]  CLOSING SolrCore org.apache.solr.core.SolrCore@7db9a74c
   [junit4]   2> 3426061 INFO  (TEST-InfixSuggestersTest.testTwoSuggestersBuildThenReload-seed#[AF0B759D88602506]) [    x:collection1] o.a.s.m.SolrMetricManager Closing metric reporters for registry=solr.core.collection1, tag=7db9a74c
   [junit4]   2> 3426062 INFO  (TEST-InfixSuggestersTest.testTwoSuggestersBuildThenReload-seed#[AF0B759D88602506]) [    x:collection1] o.a.s.m.r.SolrJmxReporter Closing reporter [org.apache.solr.metrics.reporters.SolrJmxReporter@262516ab: rootName = null, domain = solr.core.collection1, service url = null, agent id = null] for registry solr.core.collection1 / com.codahale.metrics.MetricRegistry@d01c9e8
   [junit4]   2> 3426063 INFO  (searcherExecutor-13720-thread-1-processing-x:collection1) [    x:collection1] o.a.s.c.SolrCore [collection1] Registered new searcher Searcher@36c5ed90[collection1] main{ExitableDirectoryReader(UninvertingDirectoryReader())}
   [junit4]   2> 3426068 INFO  (TEST-InfixSuggestersTest.testTwoSuggestersBuildThenReload-seed#[AF0B759D88602506]) [    x:collection1] o.a.s.h.c.SuggestComponent SuggestComponent prepare with : qt=/suggest_blended_infix_short_dictionary&suggest.onlyMorePopular=true&indent=off&suggest.count=10&suggest=true&suggest.collate=true&suggest.buildAll=true&suggest.dictionary=shortRandomBlendedInfixSuggester&wt=xml
   [junit4]   2> 3426068 INFO  (TEST-InfixSuggestersTest.testTwoSuggestersBuildThenReload-seed#[AF0B759D88602506]) [    x:collection1] o.a.s.s.s.SolrSuggester SolrSuggester.build(shortRandomBlendedInfixSuggester)
   [junit4]   2> 3426086 INFO  (TEST-InfixSuggestersTest.testTwoSuggestersBuildThenReload-seed#[AF0B759D88602506]) [    x:collection1] o.a.s.s.s.RandomTestDictionaryFactory org.apache.solr.spelling.suggest.RandomTestDictionaryFactory$RandomTestDictionary.enabled.shortRandomBlendedInfixSuggester disabled after emitting 100 items.
   [junit4]   2> 3426118 INFO  (TEST-InfixSuggestersTest.testTwoSuggestersBuildThenReload-seed#[AF0B759D88602506]) [    x:collection1] o.a.s.h.c.SuggestComponent SuggestComponent process with : qt=/suggest_blended_infix_short_dictionary&suggest.onlyMorePopular=true&indent=off&suggest.count=10&suggest=true&suggest.collate=true&suggest.buildAll=true&suggest.dictionary=shortRandomBlendedInfixSuggester&wt=xml
   [junit4]   2> 3426118 INFO  (TEST-InfixSuggestersTest.testTwoSuggestersBuildThenReload-seed#[AF0B759D88602506]) [    x:collection1] o.a.s.c.S.Request [collection1]  webapp=null path=null params={qt=/suggest_blended_infix_short_dictionary&suggest.buildAll=true&wt=xml} status=0 QTime=50
   [junit4]   2> 3426119 ERROR (TEST-InfixSuggestersTest.testTwoSuggestersBuildThenReload-seed#[AF0B759D88602506]) [    x:collection1] o.a.s.c.CorePropertiesLocator Couldn't load core descriptor from /export/home/jenkins/workspace/Lucene-Solr-7.x-Solaris/solr/core/src/test-files/solr/collection1/core.properties:java.nio.file.NoSuchFileException: /export/home/jenkins/workspace/Lucene-Solr-7.x-Solaris/solr/core/src/test-files/solr/collection1/core.properties
   [junit4]   2> 3426119 INFO  (TEST-InfixSuggestersTest.testTwoSuggestersBuildThenReload-seed#[AF0B759D88602506]) [    x:collection1] o.a.s.c.SolrResourceLoader [null] Added 2 libs to classloader, from paths: [/export/home/jenkins/workspace/Lucene-Solr-7.x-Solaris/solr/core/src/test-files/solr/collection1/lib, /export/home/jenkins/workspace/Lucene-Solr-7.x-Solaris/solr/core/src/test-files/solr/collection1/lib/classes]
   [junit4]   2> 3426137 INFO  (TEST-InfixSuggestersTest.testTwoSuggestersBuildThenReload-seed#[AF0B759D88602506]) [    x:collection1] o.a.s.c.SolrConfig Using Lucene MatchVersion: 7.5.0
   [junit4]   2> 3426144 INFO  (TEST-InfixSuggestersTest.testTwoSuggestersBuildThenReload-seed#[AF0B759D88602506]) [    x:collection1] o.a.s.s.IndexSchema [collection1] Schema name=test
   [junit4]   2> 3426219 INFO  (TEST-InfixSuggestersTest.testTwoSuggestersBuildThenReload-seed#[AF0B759D88602506]) [    x:collection1] o.a.s.s.IndexSchema Loaded schema test/1.0 with uniqueid field id
   [junit4]   2> 3426225 INFO  (TEST-InfixSuggestersTest.testTwoSuggestersBuildThenReload-seed#[AF0B759D88602506]) [    x:collection1] o.a.s.c.CoreContainer Reloading SolrCore 'collection1' using configuration from instancedir /export/home/jenkins/workspace/Lucene-Solr-7.x-Solaris/solr/core/src/test-files/solr/collection1
   [junit4]   2> 3426244 INFO  (TEST-InfixSuggestersTest.testTwoSuggestersBuildThenReload-seed#[AF0B759D88602506]) [    x:collection1] o.a.s.m.r.SolrJmxReporter JMX monitoring for 'solr.core.collection1' (registry 'solr.core.collection1') enabled at server: com.sun.jmx.mbeanserver.JmxMBeanServer@67d1cb03
   [junit4]   2> 3426244 INFO  (TEST-InfixSuggestersTest.testTwoSuggestersBuildThenReload-seed#[AF0B759D88602506]) [    x:collection1] o.a.s.c.SolrCore [[collection1] ] Opening new SolrCore at [/export/home/jenkins/workspace/Lucene-Solr-7.x-Solaris/solr/core/src/test-files/solr/collection1], dataDir=[/export/home/jenkins/workspace/Lucene-Solr-7.x-Solaris/solr/build/solr-core/test/J0/temp/solr.handler.component.InfixSuggestersTest_AF0B759D88602506-001/init-core-data-001/]
   [junit4]   2> 3426295 INFO  (TEST-InfixSuggestersTest.testTwoSuggestersBuildThenReload-seed#[AF0B759D88602506]) [    x:collection1] o.a.s.u.CommitTracker Hard AutoCommit: disabled
   [junit4]   2> 3426295 INFO  (TEST-InfixSuggestersTest.testTwoSuggestersBuildThenReload-seed#[AF0B759D88602506]) [    x:collection1] o.a.s.u.CommitTracker Soft AutoCommit: disabled
   [junit4]   2> 3426297 INFO  (TEST-InfixSuggestersTest.testTwoSuggestersBuildThenReload-seed#[AF0B759D88602506]) [    x:collection1] o.a.s.s.SolrIndexSearcher Opening [Searcher@33178bdd[collection1] main]
   [junit4]   2> 3426297 WARN  (TEST-InfixSuggestersTest.testTwoSuggestersBuildThenReload-seed#[AF0B759D88602506]) [    x:collection1] o.a.s.r.ManagedResourceStorage Cannot write to config directory /export/home/jenkins/workspace/Lucene-Solr-7.x-Solaris/solr/core/src/test-files/solr/collection1/conf; switching to use InMemory storage instead.
   [junit4]   2> 3426297 INFO  (TEST-InfixSuggestersTest.testTwoSuggestersBuildThenReload-seed#[AF0B759D88602506]) [    x:collection1] o.a.s.h.c.SuggestComponent Initializing SuggestComponent
   [junit4]   2> 3426297 INFO  (TEST-InfixSuggestersTest.testTwoSuggestersBuildThenReload-seed#[AF0B759D88602506]) [    x:collection1] o.a.s.s.s.SolrSuggester init: {name=shortRandomAnalyzingInfixSuggester,lookupImpl=AnalyzingInfixLookupFactory,dictionaryImpl=RandomTestDictionaryFactory,randDictMaxItems=100,indexPath=short_random_analyzing_infix_suggester,suggestAnalyzerFieldType=text,buildOnCommit=false,buildOnStartup=false}
   [junit4]   2> 3426298 INFO  (TEST-InfixSuggestersTest.testTwoSuggestersBuildThenReload-seed#[AF0B759D88602506]) [    x:collection1] o.a.s.s.s.SolrSuggester Dictionary loaded with params: {name=shortRandomAnalyzingInfixSuggester,lookupImpl=AnalyzingInfixLookupFactory,dictionaryImpl=RandomTestDictionaryFactory,randDictMaxItems=100,indexPath=short_random_analyzing_infix_suggester,suggestAnalyzerFieldType=text,buildOnCommit=false,buildOnStartup=false}
   [junit4]   2> 3426298 INFO  (TEST-InfixSuggestersTest.testTwoSuggestersBuildThenReload-seed#[AF0B759D88602506]) [    x:collection1] o.a.s.h.c.SuggestComponent Initializing SuggestComponent
   [junit4]   2> 3426298 INFO  (TEST-InfixSuggestersTest.testTwoSuggestersBuildThenReload-seed#[AF0B759D88602506]) [    x:collection1] o.a.s.s.s.SolrSuggester init: {name=longRandomAnalyzingInfixSuggester,lookupImpl=AnalyzingInfixLookupFactory,dictionaryImpl=RandomTestDictionaryFactory,randDictMaxItems=100000,indexPath=long_random_analyzing_infix_suggester,suggestAnalyzerFieldType=text,buildOnCommit=false,buildOnStartup=false}
   [junit4]   2> 3426299 INFO  (TEST-InfixSuggestersTest.testTwoSuggestersBuildThenReload-seed#[AF0B759D88602506]) [    x:collection1] o.a.s.s.s.SolrSuggester Dictionary loaded with params: {name=longRandomAnalyzingInfixSuggester,lookupImpl=AnalyzingInfixLookupFactory,dictionaryImpl=RandomTestDictionaryFactory,randDictMaxItems=100000,indexPath=long_random_analyzing_infix_suggester,suggestAnalyzerFieldType=text,buildOnCommit=false,buildOnStartup=false}
   [junit4]   2> 3426299 INFO  (TEST-InfixSuggestersTest.testTwoSuggestersBuildThenReload-seed#[AF0B759D88602506]) [    x:collection1] o.a.s.h.c.SuggestComponent Initializing SuggestComponent
   [junit4]   2> 3426299 INFO  (TEST-InfixSuggestersTest.testTwoSuggestersBuildThenReload-seed#[AF0B759D88602506]) [    x:collection1] o.a.s.s.s.SolrSuggester init: {name=shortRandomBlendedInfixSuggester,lookupImpl=BlendedInfixLookupFactory,dictionaryImpl=RandomTestDictionaryFactory,randDictMaxItems=100,blenderType=position_linear,suggestAnalyzerFieldType=text,indexPath=short_random_blended_infix_suggester,highlight=true,buildOnStartup=false,buildOnCommit=false}
   [junit4]   2> 3426300 INFO  (TEST-InfixSuggestersTest.testTwoSuggestersBuildThenReload-seed#[AF0B759D88602506]) [    x:collection1] o.a.s.s.s.SolrSuggester Dictionary loaded with params: {name=shortRandomBlendedInfixSuggester,lookupImpl=BlendedInfixLookupFactory,dictionaryImpl=RandomTestDictionaryFactory,randDictMaxItems=100,blenderType=position_linear,suggestAnalyzerFieldType=text,indexPath=short_random_blended_infix_suggester,highlight=true,buildOnStartup=false,buildOnCommit=false}
   [junit4]   2> 3426300 INFO  (TEST-InfixSuggestersTest.testTwoSuggestersBuildThenReload-seed#[AF0B759D88602506]) [    x:collection1] o.a.s.h.ReplicationHandler Commits will be reserved for 10000ms.
   [junit4]   2> 3426300 INFO  (TEST-InfixSuggestersTest.testTwoSuggestersBuildThenReload-seed#[AF0B759D88602506]) [    x:collection1] o.a.s.u.RandomMergePolicy RandomMergePolicy wrapping class org.apache.lucene.index.LogDocMergePolicy: [LogDocMergePolicy: minMergeSize=1000, mergeFactor=26, maxMergeSize=9223372036854775807, maxMergeSizeForForcedMerge=9223372036854775807, calibrateSizeByDeletes=false, maxMergeDocs=2147483647, maxCFSSegmentSizeMB=8.796093022207999E12, noCFSRatio=0.49561983063711235]
   [junit4]   2> 3426301 INFO  (TEST-InfixSuggestersTest.testTwoSuggestersBuildThenReload-seed#[AF0B759D88602506]) [    x:collection1] o.a.s.u.DefaultSolrCoreState New IndexWriter is ready to be used.
   [junit4]   2> 3426301 INFO  (searcherExecutor-13724-thread-1-processing-x:collection1) [    x:collection1] o.a.s.c.SolrCore [collection1] Registered new searcher Searcher@33178bdd[collection1] main{ExitableDirectoryReader(UninvertingDirectoryReader())}
   [junit4]   2> 3426301 INFO  (TEST-InfixSuggestersTest.testTwoSuggestersBuildThenReload-seed#[AF0B759D88602506]) [    x:collection1] o.a.s.s.SolrIndexSearcher Opening [Searcher@350d918b[collection1] main]
   [junit4]   2> 3426302 INFO  (TEST-InfixSuggestersTest.testTwoSuggestersBuildThenReload-seed#[AF0B759D88602506]) [    x:collection1] o.a.s.c.SolrCore [collection1]  CLOSING SolrCore org.apache.solr.core.SolrCore@1d9a640a
   [junit4]   2> 3426302 INFO  (TEST-InfixSuggestersTest.testTwoSuggestersBuildThenReload-seed#[AF0B759D88602506]) [    x:collection1] o.a.s.m.SolrMetricManager Closing metric reporters for registry=solr.core.collection1, tag=1d9a640a
   [junit4]   2> 3426302 INFO  (TEST-InfixSuggestersTest.testTwoSuggestersBuildThenReload-seed#[AF0B759D88602506]) [    x:collection1] o.a.s.m.r.SolrJmxReporter Closing reporter [org.apache.solr.metrics.reporters.SolrJmxReporter@6c2e369: rootName = null, domain = solr.core.collection1, service url = null, agent id = null] for registry solr.core.collection1 / com.codahale.metrics.MetricRegistry@d01c9e8
   [junit4]   2> 3426303 INFO  (searcherExecutor-13724-thread-1-processing-x:collection1) [    x:collection1] o.a.s.c.SolrCore [collection1] Registered new searcher Searcher@350d918b[collection1] main{ExitableDirectoryReader(UninvertingDirectoryReader())}
   [junit4]   2> 3426314 INFO  (TEST-InfixSuggestersTest.testAnalyzingInfixSuggesterBuildThenReload-seed#[AF0B759D88602506]) [    x:collection1] o.a.s.h.c.SuggestComponent SuggestComponent prepare with : qt=/suggest_analyzing_infix_short_dictionary&suggest=true&suggest.buildAll=true&wt=xml&indent=off
   [junit4]   2> 3426314 INFO  (TEST-InfixSuggestersTest.testAnalyzingInfixSuggesterBuildThenReload-seed#[AF0B759D88602506]) [    x:collection1] o.a.s.s.s.SolrSuggester SolrSuggester.build(shortRandomAnalyzingInfixSuggester)
   [junit4]   2> 3426319 INFO  (TEST-InfixSuggestersTest.testAnalyzingInfixSuggesterBuildThenReload-seed#[AF0B759D88602506]) [    x:collection1] o.a.s.s.s.RandomTestDictionaryFactory org.apache.solr.spelling.suggest.RandomTestDictionaryFactory$RandomTestDictionary.enabled.shortRandomAnalyzingInfixSuggester disabled after emitting 100 items.
   [junit4]   2> 3426365 INFO  (TEST-InfixSuggestersTest.testAnalyzingInfixSuggesterBuildThenReload-seed#[AF0B759D88602506]) [    x:collection1] o.a.s.h.c.SuggestComponent SuggestComponent process with : qt=/suggest_analyzing_infix_short_dictionary&suggest=true&suggest.buildAll=true&wt=xml&indent=off
   [junit4]   2> 3426365 INFO  (TEST-InfixSuggestersTest.testAnalyzingInfixSuggesterBuildThenReload-seed#[AF0B759D88602506]) [    x:collection1] o.a.s.c.S.Request [collection1]  webapp=null path=null params={qt=/suggest_analyzing_infix_short_dictionary&suggest.buildAll=true&wt=xml} status=0 QTime=51
   [junit4]   2> 3426365 ERROR (TEST-InfixSuggestersTest.testAnalyzingInfixSuggesterBuildThenReload-seed#[AF0B759D88602506]) [    x:collection1] o.a.s.c.CorePropertiesLocator Couldn't load core descriptor from /export/home/jenkins/workspace/Lucene-Solr-7.x-Solaris/solr/core/src/test-files/solr/collection1/core.properties:java.nio.file.NoSuchFileException: /export/home/jenkins/workspace/Lucene-Solr-7.x-Solaris/solr/core/src/test-files/solr/collection1/core.properties
   [junit4]   2> 3426366 INFO  (TEST-InfixSuggestersTest.testAnalyzingInfixSuggesterBuildThenReload-seed#[AF0B759D88602506]) [    x:collection1] o.a.s.c.SolrResourceLoader [null] Added 2 libs to classloader, from paths: [/export/home/jenkins/workspace/Lucene-Solr-7.x-Solaris/solr/core/src/test-files/solr/collection1/lib, /export/home/jenkins/workspace/Lucene-Solr-7.x-Solaris/solr/core/src/test-files/solr/collection1/lib/classes]
   [junit4]   2> 3426391 INFO  (TEST-InfixSuggestersTest.testAnalyzingInfixSuggesterBuildThenReload-seed#[AF0B759D88602506]) [    x:collection1] o.a.s.c.SolrConfig Using Lucene MatchVersion: 7.5.0
   [junit4]   2> 3426397 INFO  (TEST-InfixSuggestersTest.testAnalyzingInfixSuggesterBuildThenReload-seed#[AF0B759D88602506]) [    x:collection1] o.a.s.s.IndexSchema [collection1] Schema name=test
   [junit4]   2> 3426487 INFO  (TEST-InfixSuggestersTest.testAnalyzingInfixSuggesterBuildThenReload-seed#[AF0B759D88602506]) [    x:collection1] o.a.s.s.IndexSchema Loaded schema test/1.0 with uniqueid field id
   [junit4]   2> 3426494 INFO  (TEST-InfixSuggestersTest.testAnalyzingInfixSuggesterBuildThenReload-seed#[AF0B759D88602506]) [    x:collection1] o.a.s.c.CoreContainer Reloading SolrCore 'collection1' using configuration from instancedir /export/home/jenkins/workspace/Lucene-Solr-7.x-Solaris/solr/core/src/test-files/solr/collection1
   [junit4]   2> 3426516 INFO  (TEST-InfixSuggestersTest.testAnalyzingInfixSuggesterBuildThenReload-seed#[AF0B759D88602506]) [    x:collection1] o.a.s.m.r.SolrJmxReporter JMX monitoring for 'solr.core.collection1' (registry 'solr.core.collection1') enabled at server: com.sun.jmx.mbeanserver.JmxMBeanServer@67d1cb03
   [junit4]   2> 3426516 INFO  (TEST-InfixSuggestersTest.testAnalyzingInfixSuggesterBuildThenReload-seed#[AF0B759D88602506]) [    x:collection1] o.a.s.c.SolrCore [[collection1] ] Opening new SolrCore at [/export/home/jenkins/workspace/Lucene-Solr-7.x-Solaris/solr/core/src/test-files/solr/collection1], dataDir=[/export/home/jenkins/workspace/Lucene-Solr-7.x-Solaris/solr/build/solr-core/test/J0/temp/solr.handler.component.InfixSuggestersTest_AF0B759D88602506-001/init-core-data-001/]
   [junit4]   2> 3426564 INFO  (TEST-InfixSuggestersTest.testAnalyzingInfixSuggesterBuildThenReload-seed#[AF0B759D88602506]) [    x:collection1] o.a.s.u.CommitTracker Hard AutoCommit: disabled
   [junit4]   2> 3426564 INFO  (TEST-InfixSuggestersTest.testAnalyzingInfixSuggesterBuildThenReload-seed#[AF0B759D88602506]) [    x:collection1] o.a.s.u.CommitTracker Soft AutoCommit: disabled
   [junit4]   2> 3426565 INFO  (TEST-InfixSuggestersTest.testAnalyzingInfixSuggesterBuildThenReload-seed#[AF0B759D88602506]) [    x:collection1] o.a.s.s.SolrIndexSearcher Opening [Searcher@5152b0e6[collection1] main]
   [junit4]   2> 3426565 WARN  (TEST-InfixSuggestersTest.testAnalyzingInfixSuggesterBuildThenReload-seed#[AF0B759D88602506]) [    x:collection1] o.a.s.r.ManagedResourceStorage Cannot write to config directory /export/home/jenkins/workspace/Lucene-Solr-7.x-Solaris/solr/core/src/test-files/solr/collection1/conf; switching to use InMemory storage instead.
   [junit4]   2> 3426566 INFO  (TEST-InfixSuggestersTest.testAnalyzingInfixSuggesterBuildThenReload-seed#[AF0B759D88602506]) [    x:collection1] o.a.s.h.c.SuggestComponent Initializing SuggestComponent
   [junit4]   2> 3426566 INFO  (TEST-InfixSuggestersTest.testAnalyzingInfixSuggesterBuildThenReload-seed#[AF0B759D88602506]) [    x:collection1] o.a.s.s.s.SolrSuggester init: {name=shortRandomAnalyzingInfixSuggester,lookupImpl=AnalyzingInfixLookupFactory,dictionaryImpl=RandomTestDictionaryFactory,randDictMaxItems=100,indexPath=short_random_analyzing_infix_suggester,suggestAnalyzerFieldType=text,buildOnCommit=false,buildOnStartup=false}
   [junit4]   2> 3426567 INFO  (TEST-InfixSuggestersTest.testAnalyzingInfixSuggesterBuildThenReload-seed#[AF0B759D88602506]) [    x:collection1] o.a.s.s.s.SolrSuggester Dictionary loaded with params: {name=shortRandomAnalyzingInfixSuggester,lookupImpl=AnalyzingInfixLookupFactory,dictionaryImpl=RandomTestDictionaryFactory,randDictMaxItems=100,indexPath=short_random_analyzing_infix_suggester,suggestAnalyzerFieldType=text,buildOnCommit=false,buildOnStartup=false}
   [junit4]   2> 3426567 INFO  (TEST-InfixSuggestersTest.testAnalyzingInfixSuggesterBuildThenReload-seed#[AF0B759D88602506]) [    x:collection1] o.a.s.h.c.SuggestComponent Initializing SuggestComponent
   [junit4]   2> 3426567 INFO  (TEST-InfixSuggestersTest.testAnalyzingInfixSuggesterBuildThenReload-seed#[AF0B759D88602506]) [    x:collection1] o.a.s.s.s.SolrSuggester init: {name=longRandomAnalyzingInfixSuggester,lookupImpl=AnalyzingInfixLookupFactory,dictionaryImpl=RandomTestDictionaryFactory,randDictMaxItems=100000,indexPath=long_random_analyzing_infix_suggester,suggestAnalyzerFieldType=text,buildOnCommit=false,buildOnStartup=false}
   [junit4]   2> 3426568 INFO  (TEST-InfixSuggestersTest.testAnalyzingInfixSuggesterBuildThenReload-seed#[AF0B759D88602506]) [    x:collection1] o.a.s.s.s.SolrSuggester Dictionary loaded with params: {name=longRandomAnalyzingInfixSuggester,lookupImpl=AnalyzingInfixLookupFactory,dictionaryImpl=RandomTestDictionaryFactory,randDictMaxItems=100000,indexPath=long_random_analyzing_infix_suggester,suggestAnalyzerFieldType=text,buildOnCommit=false,buildOnStartup=false}
   [junit4]   2> 3426568 INFO  (TEST-InfixSuggestersTest.testAnalyzingInfixSuggesterBuildThenReload-seed#[AF0B759D88602506]) [    x:collection1] o.a.s.h.c.SuggestComponent Initializing SuggestComponent
   [junit4]   2> 3426568 INFO  (TEST-InfixSuggestersTest.testAnalyzingInfixSuggesterBuildThenReload-seed#[AF0B759D88602506]) [    x:collection1] o.a.s.s.s.SolrSuggester init: {name=shortRandomBlendedInfixSuggester,lookupImpl=BlendedInfixLookupFactory,dictionaryImpl=RandomTestDictionaryFactory,randDictMaxItems=100,blenderType=position_linear,suggestAnalyzerFieldType=text,indexPath=short_random_blended_infix_suggester,highlight=true,buildOnStartup=false,buildOnCommit=false}
   [junit4]   2> 3426569 INFO  (TEST-InfixSuggestersTest.testAnalyzingInfixSuggesterBuildThenReload-seed#[AF0B759D88602506]) [    x:collection1] o.a.s.s.s.SolrSuggester Dictionary loaded with params: {name=shortRandomBlendedInfixSuggester,lookupImpl=BlendedInfixLookupFactory,dictionaryImpl=RandomTestDictionaryFactory,randDictMaxItems=100,blenderType=position_linear,suggestAnalyzerFieldType=text,indexPath=short_random_blended_infix_suggester,highlight=true,buildOnStartup=false,buildOnCommit=false}
   [junit4]   2> 3426569 INFO  (TEST-InfixSuggestersTest.testAnalyzingInfixSuggesterBuildThenReload-seed#[AF0B759D88602506]) [    x:collection1] o.a.s.h.ReplicationHandler Commits will be reserved for 10000ms.
   [junit4]   2> 3426569 INFO  (TEST-InfixSuggestersTest.testAnalyzingInfixSuggesterBuildThenReload-seed#[AF0B759D88602506]) [    x:collection1] o.a.s.u.RandomMergePolicy RandomMergePolicy wrapping class org.apache.lucene.index.LogByteSizeMergePolicy: [LogByteSizeMergePolicy: minMergeSize=1677721, mergeFactor=15, maxMergeSize=2147483648, maxMergeSizeForForcedMerge=9223372036854775807, calibrateSizeByDeletes=false, maxMergeDocs=2147483647, maxCFSSegmentSizeMB=8.796093022207999E12, noCFSRatio=1.0]
   [junit4]   2> 3426569 INFO  (TEST-InfixSuggestersTest.testAnalyzingInfixSuggesterBuildThenReload-seed#[AF0B759D88602506]) [    x:collection1] o.a.s.u.DefaultSolrCoreState New IndexWriter is ready to be used.
   [junit4]   2> 3426570 INFO  (searcherExecutor-13728-thread-1-processing-x:collection1) [    x:collection1] o.a.s.c.SolrCore [collection1] Registered new searcher Searcher@5152b0e6[collection1] main{ExitableDirectoryReader(UninvertingDirectoryReader())}
   [junit4]   2> 3426570 INFO  (TEST-InfixSuggestersTest.testAnalyzingInfixSuggesterBuildThenReload-seed#[AF0B759D88602506]) [    x:collection1] o.a.s.s.SolrIndexSearcher Opening [Searcher@266a9b15[collection1] main]
   [junit4]   2> 3426570 INFO  (TEST-InfixSuggestersTest.testAnalyzingInfixSuggesterBuildThenReload-seed#[AF0B759D88602506]) [    x:collection1] o.a.s.c.SolrCore [collection1]  CLOSING SolrCore org.apache.solr.core.SolrCore@18c4a478
   [junit4]   2> 3426570 INFO  (TEST-InfixSuggestersTest.testAnalyzingInfixSuggesterBuildThenReload-seed#[AF0B759D88602506]) [    x:collection1] o.a.s.m.SolrMetricManager Closing metric reporters for registry=solr.core.collection1, tag=18c4a478
   [junit4]   2> 3426570 INFO  (TEST-InfixSuggestersTest.testAnalyzingInfixSuggesterBuildThenReload-seed#[AF0B759D88602506]) [    x:collection1] o.a.s.m.r.SolrJmxReporter Closing reporter [org.apache.solr.metrics.reporters.SolrJmxReporter@3e3a5cf6: rootName = null, domain = solr.core.collection1, service url = null, agent id = null] for registry solr.core.collection1 / com.codahale.metrics.MetricRegistry@d01c9e8
   [junit4]   2> 3426571 INFO  (searcherExecutor-13728-thread-1-processing-x:collection1) [    x:collection1] o.a.s.c.SolrCore [collection1] Registered new searcher Searcher@266a9b15[collection1] main{ExitableDirectoryReader(UninvertingDirectoryReader())}
   [junit4]   2> 3426581 INFO  (TEST-InfixSuggestersTest.testBlendedInfixSuggesterBuildThenReload-seed#[AF0B759D88602506]) [    x:collection1] o.a.s.h.c.SuggestComponent SuggestComponent prepare with : qt=/suggest_blended_infix_short_dictionary&suggest.onlyMorePopular=true&indent=off&suggest.count=10&suggest=true&suggest.collate=true&suggest.buildAll=true&suggest.dictionary=shortRandomBlendedInfixSuggester&wt=xml
   [junit4]   2> 3426581 INFO  (TEST-InfixSuggestersTest.testBlendedInfixSuggesterBuildThenReload-seed#[AF0B759D88602506]) [    x:collection1] o.a.s.s.s.SolrSuggester SolrSuggester.build(shortRandomBlendedInfixSuggester)
   [junit4]   2> 3426591 INFO  (TEST-InfixSuggestersTest.testBlendedInfixSuggesterBuildThenReload-seed#[AF0B759D88602506]) [    x:collection1] o.a.s.s.s.RandomTestDictionaryFactory org.apache.solr.spelling.suggest.RandomTestDictionaryFactory$RandomTestDictionary.enabled.shortRandomBlendedInfixSuggester disabled after emitting 100 items.
   [junit4]   2> 3426622 INFO  (TEST-InfixSuggestersTest.testBlendedInfixSuggesterBuildThenReload-seed#[AF0B759D88602506]) [    x:collection1] o.a.s.h.c.SuggestComponent SuggestComponent process with : qt=/suggest_blended_infix_short_dictionary&suggest.onlyMorePopular=true&indent=off&suggest.count=10&suggest=true&suggest.collate=true&suggest.buildAll=true&suggest.dictionary=shortRandomBlendedInfixSuggester&wt=xml
   [junit4]   2> 3426622 INFO  (TEST-InfixSuggestersTest.testBlendedInfixSuggesterBuildThenReload-seed#[AF0B759D88602506]) [    x:collection1] o.a.s.c.S.Request [collection1]  webapp=null path=null params={qt=/suggest_blended_infix_short_dictionary&suggest.buildAll=true&wt=xml} status=0 QTime=41
   [junit4]   2> 3426622 ERROR (TEST-InfixSuggestersTest.testBlendedInfixSuggesterBuildThenReload-seed#[AF0B759D88602506]) [    x:collection1] o.a.s.c.CorePropertiesLocator Couldn't load core descriptor from /export/home/jenkins/workspace/Lucene-Solr-7.x-Solaris/solr/core/src/test-files/solr/collection1/core.properties:java.nio.file.NoSuchFileException: /export/home/jenkins/workspace/Lucene-Solr-7.x-Solaris/solr/core/src/test-files/solr/collection1/core.properties
   [junit4]   2> 3426622 INFO  (TEST-InfixSuggestersTest.testBlendedInfixSuggesterBuildThenReload-seed#[AF0B759D88602506]) [    x:collection1] o.a.s.c.SolrResourceLoader [null] Added 2 libs to classloader, from paths: [/export/home/jenkins/workspace/Lucene-Solr-7.x-Solaris/solr/core/src/test-files/solr/collection1/lib, /export/home/jenkins/workspace/Lucene-Solr-7.x-Solaris/solr/core/src/test-files/solr/collection1/lib/classes]
   [junit4]   2> 3426643 INFO  (TEST-InfixSuggestersTest.testBlendedInfixSuggesterBuildThenReload-seed#[AF0B759D88602506]) [    x:collection1] o.a.s.c.SolrConfig Using Lucene MatchVersion: 7.5.0
   [junit4]   2> 3426648 INFO  (TEST-InfixSuggestersTest.testBlendedInfixSuggesterBuildThenReload-seed#[AF0B759D88602506]) [    x:collection1] o.a.s.s.IndexSchema [collection1] Schema name=test
   [junit4]   2> 3426723 INFO  (TEST-InfixSuggestersTest.testBlendedInfixSuggesterBuildThenReload-seed#[AF0B759D88602506]) [    x:collection1] o.a.s.s.IndexSchema Loaded schema test/1.0 with uniqueid field id
   [junit4]   2> 3426729 INFO  (TEST-InfixSuggestersTest.testBlendedInfixSuggesterBuildThenReload-seed#[AF0B759D88602506]) [    x:collection1] o.a.s.c.CoreContainer Reloading SolrCore 'collection1' using configuration from instancedir /export/home/jenkins/workspace/Lucene-Solr-7.x-Solaris/solr/core/src/test-files/solr/collection1
   [junit4]   2> 3426749 INFO  (TEST-InfixSuggestersTest.testBlendedInfixSuggesterBuildThenReload-seed#[AF0B759D88602506]) [    x:collection1] o.a.s.m.r.SolrJmxReporter JMX monitoring for 'solr.core.collection1' (registry 'solr.core.collection1') enabled at server: com.sun.jmx.mbeanserver.JmxMBeanServer@67d1cb03
   [junit4]   2> 3426749 INFO  (TEST-InfixSuggestersTest.testBlendedInfixSuggesterBuildThenReload-seed#[AF0B759D88602506]) [    x:collection1] o.a.s.c.SolrCore [[collection1] ] Opening new SolrCore at [/export/home/jenkins/workspace/Lucene-Solr-7.x-Solaris/solr/core/src/test-files/solr/collection1], dataDir=[/export/home/jenkins/workspace/Lucene-Solr-7.x-Solaris/solr/build/solr-core/test/J0/temp/solr.handler.component.InfixSuggestersTest_AF0B759D88602506-001/init-core-data-001/]
   [junit4]   2> 3426795 INFO  (TEST-InfixSuggestersTest.testBlendedInfixSuggesterBuildThenReload-seed#[AF0B759D88602506]) [    x:collection1] o.a.s.u.CommitTracker Hard AutoCommit: disabled
   [junit4]   2> 3426795 INFO  (TEST-InfixSuggestersTest.testBlendedInfixSuggesterBuildThenReload-seed#[AF0B759D88602506]) [    x:collection1] o.a.s.u.CommitTracker Soft AutoCommit: disabled
   [junit4]   2> 3426796 INFO  (TEST-InfixSuggestersTest.testBlendedInfixSuggesterBuildThenReload-seed#[AF0B759D88602506]) [    x:collection1] o.a.s.s.SolrIndexSearcher Opening [Searcher@bf8cbdf[collection1] main]
   [junit4]   2> 3426796 WARN  (TEST-InfixSuggestersTest.testBlendedInfixSuggesterBuildThenReload-seed#[AF0B759D88602506]) [    x:collection1] o.a.s.r.ManagedResourceStorage Cannot write to config directory /export/home/jenkins/workspace/Lucene-Solr-7.x-Solaris/solr/core/src/test-files/solr/collection1/conf; switching to use InMemory storage instead.
   [junit4]   2> 3426797 INFO  (TEST-InfixSuggestersTest.testBlendedInfixSuggesterBuildThenReload-seed#[AF0B759D88602506]) [    x:collection1] o.a.s.h.c.SuggestComponent Initializing SuggestComponent
   [junit4]   2> 3426797 INFO  (TEST-InfixSuggestersTest.testBlendedInfixSuggesterBuildThenReload-seed#[AF0B759D88602506]) [    x:collection1] o.a.s.s.s.SolrSuggester init: {name=shortRandomAnalyzingInfixSuggester,lookupImpl=AnalyzingInfixLookupFactory,dictionaryImpl=RandomTestDictionaryFactory,randDictMaxItems=100,indexPath=short_random_analyzing_infix_suggester,suggestAnalyzerFieldType=text,buildOnCommit=false,buildOnStartup=false}
   [junit4]   2> 3426798 INFO  (TEST-InfixSuggestersTest.testBlendedInfixSuggesterBuildThenReload-seed#[AF0B759D88602506]) [    x:collection1] o.a.s.s.s.SolrSuggester Dictionary loaded with params: {name=shortRandomAnalyzingInfixSuggester,lookupImpl=AnalyzingInfixLookupFactory,dictionaryImpl=RandomTestDictionaryFactory,randDictMaxItems=100,indexPath=short_random_analyzing_infix_suggester,suggestAnalyzerFieldType=text,buildOnCommit=false,buildOnStartup=false}
   [junit4]   2> 3426798 INFO  (TEST-InfixSuggestersTest.testBlendedInfixSuggesterBuildThenReload-seed#[AF0B759D88602506]) [    x:collection1] o.a.s.h.c.SuggestComponent Initializing SuggestComponent
   [junit4]   2> 3426798 INFO  (TEST-InfixSuggestersTest.testBlendedInfixSuggesterBuildThenReload-seed#[AF0B759D88602506]) [    x:collection1] o.a.s.s.s.SolrSuggester init: {name=longRandomAnalyzingInfixSuggester,lookupImpl=AnalyzingInfixLookupFactory,dictionaryImpl=RandomTestDictionaryFactory,randDictMaxItems=100000,indexPath=long_random_analyzing_infix_suggester,suggestAnalyzerFieldType=text,buildOnCommit=false,buildOnStartup=false}
   [junit4]   2> 3426798 INFO  (TEST-InfixSuggestersTest.testBlendedInfixSuggesterBuildThenReload-seed#[AF0B759D88602506]) [    x:collection1] o.a.s.s.s.SolrSuggester Dictionary loaded with params: {name=longRandomAnalyzingInfixSuggester,lookupImpl=AnalyzingInfixLookupFactory,dictionaryImpl=RandomTestDictionaryFactory,randDictMaxItems=100000,indexPath=long_random_analyzing_infix_suggester,suggestAnalyzerFieldType=text,buildOnCommit=false,buildOnStartup=false}
   [junit4]   2> 3426798 INFO  (TEST-InfixSuggestersTest.testBlendedInfixSuggesterBuildThenReload-seed#[AF0B759D88602506]) [    x:collection1] o.a.s.h.c.SuggestComponent Initializing SuggestComponent
   [junit4]   2> 3426798 INFO  (TEST-InfixSuggestersTest.testBlendedInfixSuggesterBuildThenReload-seed#[AF0B759D88602506]) [    x:collection1] o.a.s.s.s.SolrSuggester init: {name=shortRandomBlendedInfixSuggester,lookupImpl=BlendedInfixLookupFactory,dictionaryImpl=RandomTestDictionaryFactory,randDictMaxItems=100,blenderType=position_linear,suggestAnalyzerFieldType=text,indexPath=short_random_blended_infix_suggester,highlight=true,buildOnStartup=false,buildOnCommit=false}
   [junit4]   2> 3426799 INFO  (TEST-InfixSuggestersTest.testBlendedInfixSuggesterBuildThenReload-seed#[AF0B759D88602506]) [    x:collection1] o.a.s.s.s.SolrSuggester Dictionary loaded with params: {name=shortRandomBlendedInfixSuggester,lookupImpl=BlendedInfixLookupFactory,dictionaryImpl=RandomTestDictionaryFactory,randDictMaxItems=100,blenderType=position_linear,suggestAnalyzerFieldType=text,indexPath=short_random_blended_infix_suggester,highlight=true,buildOnStartup=false,buildOnCommit=false}
   [junit4]   2> 3426799 INFO  (TEST-InfixSuggestersTest.testBlendedInfixSuggesterBuildThenReload-seed#[AF0B759D88602506]) [    x:collection1] o.a.s.h.ReplicationHandler Commits will be reserved for 10000ms.
   [junit4]   2> 3426799 INFO  (TEST-InfixSuggestersTest.testBlendedInfixSuggesterBuildThenReload-seed#[AF0B759D88602506]) [    x:collection1] o.a.s.u.RandomMergePolicy RandomMergePolicy wrapping class org.apache.lucene.index.TieredMergePolicy: [TieredMergePolicy: maxMergeAtOnce=36, maxMergeAtOnceExplicit=41, maxMergedSegmentMB=31.8046875, floorSegmentMB=1.21484375, forceMergeDeletesPctAllowed=20.409043662711813, segmentsPerTier=13.0, maxCFSSegmentSizeMB=8.796093022207999E12, noCFSRatio=0.5049887525176275, reclaimDeletesWeight=0.270804483636363
   [junit4]   2> 3426800 INFO  (TEST-InfixSuggestersTest.testBlendedInfixSuggesterBuildThenReload-seed#[AF0B759D88602506]) [    x:collection1] o.a.s.u.DefaultSolrCoreState New IndexWriter is ready to be used.
   [junit4]   2> 3426800 INFO  (searcherExecutor-13732-thread-1-processing-x:collection1) [    x:collection1] o.a.s.c.SolrCore [collection1] Registered new searcher Searcher@bf8cbdf[collection1] main{ExitableDirectoryReader(UninvertingDirectoryReader())}
   [junit4]   2> 3426800 INFO  (TEST-InfixSuggestersTest.testBlendedInfixSuggesterBuildThenReload-seed#[AF0B759D88602506]) [    x:collection1] o.a.s.s.SolrIndexSearcher Opening [Searcher@44cf3f27[collection1] main]
   [junit4]   2> 3426801 INFO  (TEST-InfixSuggestersTest.testBlendedInfixSuggesterBuildThenReload-seed#[AF0B759D88602506]) [    x:collection1] o.a.s.c.SolrCore [collection1]  CLOSING SolrCore org.apache.solr.core.SolrCore@abb654f
   [junit4]   2> 3426801 INFO  (TEST-InfixSuggestersTest.testBlendedInfixSuggesterBuildThenReload-seed#[AF0B759D88602506]) [    x:collection1] o.a.s.m.SolrMetricManager Closing metric reporters for registry=solr.core.collection1, tag=abb654f
   [junit4]   2> 3426801 INFO  (TEST-InfixSuggestersTest.testBlendedInfixSuggesterBuildThenReload-seed#[AF0B759D88602506]) [    x:collection1] o.a.s.m.r.SolrJmxReporter Closing reporter [org.apache.solr.metrics.reporters.SolrJmxReporter@3099faa7: rootName = null, domain = solr.core.collection1, service url = null, agent id = null] for registry solr.core.collection1 / com.codahale.metrics.MetricRegistry@d01c9e8
   [junit4]   2> 3426802 INFO  (searcherExecutor-13732-thread-1-processing-x:collection1) [    x:collection1] o.a.s.c.SolrCore [collection1] Registered new searcher Searcher@44cf3f27[collection1] main{ExitableDirectoryReader(UninvertingDirectoryReader())}
   [junit4]   2> 3426823 INFO  (AnalyzingInfixSuggesterTest-12963-thread-1-processing-x:collection1) [    x:collection1] o.a.s.h.c.SuggestComponent SuggestComponent prepare with : qt=/suggest_analyzing_infix_long_dictionary&suggest=true&suggest.buildAll=true&wt=xml&indent=off
   [junit4]   2> 3426823 INFO  (AnalyzingInfixSuggesterTest-12963-thread-1-processing-x:collection1) [    x:collection1] o.a.s.s.s.SolrSuggester SolrSuggester.build(longRandomAnalyzingInfixSuggester)
   [junit4]   2> 3426854 INFO  (AnalyzingInfixSuggesterTest-12963-thread-1-processing-x:collection1) [    x:collection1] o.a.s.s.s.RandomTestDictionaryFactory org.apache.solr.spelling.suggest.RandomTestDictionaryFactory$RandomTestDictionary.enabled.longRandomAnalyzingInfixSuggester emitted 1000 items.
   [junit4]   2> 3426883 INFO  (AnalyzingInfixSuggesterTest-12963-thread-1-processing-x:collection1) [    x:collection1] o.a.s.s.s.RandomTestDictionaryFactory org.apache.solr.spelling.suggest.RandomTestDictionaryFactory$RandomTestDictionary.enabled.longRandomAnalyzingInfixSuggester emitted 2000 items.
   [junit4]   2> 3426913 INFO  (AnalyzingInfixSuggesterTest-12963-thread-1-processing-x:collection1) [    x:collection1] o.a.s.s.s.RandomTestDictionaryFactory org.apache.solr.spelling.suggest.RandomTestDictionaryFactory$RandomTestDictionary.enabled.longRandomAnalyzingInfixSuggester emitted 3000 items.
   [junit4]   2> 3426941 INFO  (TEST-InfixSuggestersTest.testShutdownDuringBuild-seed#[AF0B759D88602506]) [    x:collection1] o.a.s.c.CoreContainer Shutting down CoreContainer instance=1923541164
   [junit4]   2> 3426944 INFO  (TEST-InfixSuggestersTest.testShutdownDuringBuild-seed#[AF0B759D88602506]) [    x:collection1] o.a.s.m.SolrMetricManager Closing metric reporters for registry=solr.node, tag=null
   [junit4]   2> 3426944 INFO  (TEST-InfixSuggestersTest.testShutdownDuringBuild-seed#[AF0B759D88602506]) [    x:collection1] o.a.s.m.r.SolrJmxReporter Closing reporter [org.apache.solr.metrics.reporters.SolrJmxReporter@2f3073db: rootName = null, domain = solr.node, service url = null, agent id = null] for registry solr.node / com.codahale.metrics.MetricRegistry@6401700c
   [junit4]   2> 3426948 INFO  (TEST-InfixSuggestersTest.testShutdownDuringBuild-seed#[AF0B759D88602506]) [    x:collection1] o.a.s.m.SolrMetricManager Closing metric reporters for registry=solr.jvm, tag=null
   [junit4]   2> 3426948 INFO  (TEST-InfixSuggestersTest.testShutdownDuringBuild-seed#[AF0B759D88602506]) [    x:collection1] o.a.s.m.r.SolrJmxReporter Closing reporter [org.apache.solr.metrics.reporters.SolrJmxReporter@1c256ba: rootName = null, domain = solr.jvm, service url = null, agent id = null] for registry solr.jvm / com.codahale.metrics.MetricRegistry@64e8a881
   [junit4]   2> 3426950 INFO  (TEST-InfixSuggestersTest.testShutdownDuringBuild-seed#[AF0B759D88602506]) [    x:collection1] o.a.s.m.SolrMetricManager Closing metric reporters for registry=solr.jetty, tag=null
   [junit4]   2> 3426950 INFO  (TEST-InfixSuggestersTest.testShutdownDuringBuild-seed#[AF0B759D88602506]) [    x:collection1] o.a.s.m.r.SolrJmxReporter Closing reporter [org.apache.solr.metrics.reporters.SolrJmxReporter@751c4b43: rootName = null, domain = solr.jetty, service url = null, agent id = null] for registry solr.jetty / com.codahale.metrics.MetricRegistry@28ce6935
   [junit4]   2> 3426950 INFO  (coreCloseExecutor-13736-thread-1-processing-x:collection1) [    x:collection1] o.a.s.c.SolrCore [collection1]  CLOSING SolrCore org.apache.solr.core.SolrCore@734b9668
   [junit4]   2> 3426950 INFO  (coreCloseExecutor-13736-thread-1-processing-x:collection1) [    x:collection1] o.a.s.m.SolrMetricManager Closing metric reporters for registry=solr.core.collection1, tag=734b9668
   [junit4]   2> 3426951 INFO  (coreCloseExecutor-13736-thread-1-processing-x:collection1) [    x:collection1] o.a.s.m.r.SolrJmxReporter Closing reporter [org.apache.solr.metrics.reporters.SolrJmxReporter@5f24cd15: rootName = null, domain = solr.core.collection1, service url = null, agent id = null] for registry solr.core.collection1 / com.codahale.metrics.MetricRegistry@d01c9e8
   [junit4]   2> 3427424 INFO  (TEST-InfixSuggestersTest.testShutdownDuringBuild-seed#[AF0B759D88602506]) [    x:collection1] o.a.s.c.SolrResourceLoader [null] Added 2 libs to classloader, from paths: [/export/home/jenkins/workspace/Lucene-Solr-7.x-Solaris/solr/core/src/test-files/solr/collection1/lib, /export/home/jenkins/workspace/Lucene-Solr-7.x-Solaris/solr/core/src/test-files/solr/collection1/lib/classes]
   [junit4]   2> 3427448 INFO  (TEST-InfixSuggestersTest.testShutdownDuringBuild-seed#[AF0B759D88602506]) [    x:collection1] o.a.s.c.SolrConfig Using Lucene MatchVersion: 7.5.0
   [junit4]   2> 3427454 INFO  (TEST-InfixSuggestersTest.testShutdownDuringBuild-seed#[AF0B759D88602506]) [    x:collection1] o.a.s.s.IndexSchema [null] Schema name=test
   [junit4]   2> 3427518 INFO  (TEST-InfixSuggestersTest.testShutdownDuringBuild-seed#[AF0B759D88602506]) [    x:collection1] o.a.s.s.IndexSchema Loaded schema test/1.0 with uniqueid field id
   [junit4]   2> 3428307 INFO  (TEST-InfixSuggestersTest.testShutdownDuringBuild-seed#[AF0B759D88602506]) [    x:collection1] o.a.s.c.TransientSolrCoreCacheDefault Allocating transient cache for 2147483647 transient cores
   [junit4]   2> 3428307 INFO  (TEST-InfixSuggestersTest.testShutdownDuringBuild-seed#[AF0B759D88602506]) [    x:collection1] o.a.s.h.a.MetricsHistoryHandler No .system collection, keeping metrics history in memory.
   [junit4]   2> 3428321 INFO  (TEST-InfixSuggestersTest.testShutdownDuringBuild-seed#[AF0B759D88602506]) [    x:collection1] o.a.s.m.r.SolrJmxReporter JMX monitoring for 'solr.node' (registry 'solr.node') enabled at server: com.sun.jmx.mbeanserver.JmxMBeanServer@67d1cb03
   [junit4]   2> 3428327 INFO  (TEST-InfixSuggestersTest.testShutdownDuringBuild-seed#[AF0B759D88602506]) [    x:collection1] o.a.s.m.r.SolrJmxReporter JMX monitoring for 'solr.jvm' (registry 'solr.jvm') enabled at server: com.sun.jmx.mbeanserver.JmxMBeanServer@67d1cb03
   [junit4]   2> 3428328 INFO  (TEST-InfixSuggestersTest.testShutdownDuringBuild-seed#[AF0B759D88602506]) [    x:collection1] o.a.s.m.r.SolrJmxReporter JMX monitoring for 'solr.jetty' (registry 'solr.jetty') enabled at server: com.sun.jmx.mbeanserver.JmxMBeanServer@67d1cb03
   [junit4]   2> 3428329 INFO  (coreLoadExecutor-13746-thread-1-processing-x:collection1) [    x:collection1] o.a.s.c.SolrResourceLoader [null] Added 2 libs to classloader, from paths: [/export/home/jenkins/workspace/Lucene-Solr-7.x-Solaris/solr/core/src/test-files/solr/collection1/lib, /export/home/jenkins/workspace/Lucene-Solr-7.x-Solaris/solr/core/src/test-files/solr/collection1/lib/classes]
   [junit4]   2> 3428350 INFO  (coreLoadExecutor-13746-thread-1-processing-x:collection1) [    x:collection1] o.a.s.c.SolrConfig Using Lucene MatchVersion: 7.5.0
   [junit4]   2> 3428357 INFO  (coreLoadExecutor-13746-thread-1-processing-x:collection1) [    x:collection1] o.a.s.s.IndexSchema [collection1] Schema name=test
   [junit4]   2> 3428427 INFO  (coreLoadExecutor-13746-thread-1-processing-x:collection1) [    x:collection1] o.a.s.s.IndexSchema Loaded schema test/1.0 with uniqueid field id
   [junit4]   2> 3428434 INFO  (coreLoadExecutor-13746-thread-1-processing-x:collection1) [    x:collection1] o.a.s.c.CoreContainer Creating SolrCore 'collection1' using configuration from instancedir /export/home/jenkins/workspace/Lucene-Solr-7.x-Solaris/solr/core/src/test-files/solr/collection1, trusted=true
   [junit4]   2> 3428434 INFO  (coreLoadExecutor-13746-thread-1-processing-x:collection1) [    x:collection1] o.a.s.m.r.SolrJmxReporter JMX monitoring for 'solr.core.collection1' (registry 'solr.core.collection1') enabled at server: com.sun.jmx.mbeanserver.JmxMBeanServer@67d1cb03
   [junit4]   2> 3428434 INFO  (coreLoadExecutor-13746-thread-1-processing-x:collection1) [    x:collection1] o.a.s.c.SolrCore solr.RecoveryStrategy.Builder
   [junit4]   2> 3428434 INFO  (coreLoadExecutor-13746-thread-1-processing-x:collection1) [    x:collection1] o.a.s.c.SolrCore [[collection1] ] Opening new SolrCore at [/export/home/jenkins/workspace/Lucene-Solr-7.x-Solaris/solr/core/src/test-files/solr/collection1], dataDir=[/export/home/jenkins/workspace/Lucene-Solr-7.x-Solaris/solr/build/solr-core/test/J0/temp/solr.handler.component.InfixSuggestersTest_AF0B759D88602506-001/init-core-data-001/]
   [junit4]   2> 3428476 INFO  (coreLoadExecutor-13746-thread-1-processing-x:collection1) [    x:collection1] o.a.s.u.CommitTracker Hard AutoCommit: disabled
   [junit4]   2> 3428476 INFO  (coreLoadExecutor-13746-thread-1-processing-x:collection1) [    x:collection1] o.a.s.u.CommitTracker Soft AutoCommit: disabled
   [junit4]   2> 3428477 INFO  (coreLoadExecutor-13746-thread-1-processing-x:collection1) [    x:collection1] o.a.s.u.RandomMergePolicy RandomMergePolicy wrapping class org.apache.lucene.index.AlcoholicMergePolicy: [AlcoholicMergePolicy: minMergeSize=0, mergeFactor=10, maxMergeSize=1750512644, maxMergeSizeForForcedMerge=9223372036854775807, calibrateSizeByDeletes=true, maxMergeDocs=2147483647, maxCFSSegmentSizeMB=8.796093022207999E12, noCFSRatio=0.1]
   [junit4]   2> 3428477 INFO  (coreLoadExecutor-13746-thread-1-processing-x:collection1) [    x:collection1] o.a.s.s.SolrIndexSearcher Opening [Searcher@5b2b4e66[collection1] main]
   [junit4]   2> 3428478 WARN  (coreLoadExecutor-13746-thread-1-processing-x:collection1) [    x:collection1] o.a.s.r.ManagedResourceStorage Cannot write to config directory /export/home/jenkins/workspace/Lucene-Solr-7.x-Solaris/solr/core/src/test-files/solr/collection1/conf; switching to use InMemory storage instead.
   [junit4]   2> 3428478 INFO  (coreLoadExecutor-13746-thread-1-processing-x:collection1) [    x:collection1] o.a.s.h.c.SuggestComponent Initializing SuggestComponent
   [junit4]   2> 3428478 INFO  (coreLoadExecutor-13746-thread-1-processing-x:collection1) [    x:collection1] o.a.s.s.s.SolrSuggester init: {name=shortRandomAnalyzingInfixSuggester,lookupImpl=AnalyzingInfixLookupFactory,dictionaryImpl=RandomTestDictionaryFactory,randDictMaxItems=100,indexPath=short_random_analyzing_infix_suggester,suggestAnalyzerFieldType=text,buildOnCommit=false,buildOnStartup=false}
   [junit4]   2> 3428479 INFO  (coreLoadExecutor-13746-thread-1-processing-x:collection1) [    x:collection1] o.a.s.s.s.SolrSuggester Dictionary loaded with params: {name=shortRandomAnalyzingInfixSuggester,lookupImpl=AnalyzingInfixLookupFactory,dictionaryImpl=RandomTestDictionaryFactory,randDictMaxItems=100,indexPath=short_random_analyzing_infix_suggester,suggestAnalyzerFieldType=text,buildOnCommit=false,buildOnStartup=false}
   [junit4]   2> 3428479 INFO  (coreLoadExecutor-13746-thread-1-processing-x:collection1) [    x:collection1] o.a.s.h.c.SuggestComponent Initializing SuggestComponent
   [junit4]   2> 3428479 INFO  (coreLoadExecutor-13746-thread-1-processing-x:collection1) [    x:collection1] o.a.s.s.s.SolrSuggester init: {name=longRandomAnalyzingInfixSuggester,lookupImpl=AnalyzingInfixLookupFactory,dictionaryImpl=RandomTestDictionaryFactory,randDictMaxItems=100000,indexPath=long_random_analyzing_infix_suggester,suggestAnalyzerFieldType=text,buildOnCommit=false,buildOnStartup=false}
   [junit4]   2> 3428482 INFO  (coreLoadExecutor-13746-thread-1-processing-x:collection1) [    x:collection1] o.a.s.s.s.SolrSuggester Dictionary loaded with params: {name=longRandomAnalyzingInfixSuggester,lookupImpl=AnalyzingInfixLookupFactory,dictionaryImpl=RandomTestDictionaryFactory,randDictMaxItems=100000,indexPath=long_random_analyzing_infix_suggester,suggestAnalyzerFieldType=text,buildOnCommit=false,buildOnStartup=false}
   [junit4]   2> 3428482 INFO  (coreLoadExecutor-13746-thread-1-processing-x:collection1) [    x:collection1] o.a.s.h.c.SuggestComponent Initializing SuggestComponent
   [junit4]   2> 3428482 INFO  (coreLoadExecutor-13746-thread-1-processing-x:collection1) [    x:collection1] o.a.s.s.s.SolrSuggester init: {name=shortRandomBlendedInfixSuggester,lookupImpl=BlendedInfixLookupFactory,dictionaryImpl=RandomTestDictionaryFactory,randDictMaxItems=100,blenderType=position_linear,suggestAnalyzerFieldType=text,indexPath=short_random_blended_infix_suggester,highlight=true,buildOnStartup=false,buildOnCommit=false}
   [junit4]   2> 3428482 INFO  (coreLoadExecutor-13746-thread-1-processing-x:collection1) [    x:collection1] o.a.s.s.s.SolrSuggester Dictionary loaded with params: {name=shortRandomBlendedInfixSuggester,lookupImpl=BlendedInfixLookupFactory,dictionaryImpl=RandomTestDictionaryFactory,randDictMaxItems=100,blenderType=position_linear,suggestAnalyzerFieldType=text,indexPath=short_random_blended_infix_suggester,highlight=true,buildOnStartup=false,buildOnCommit=false}
   [junit4]   2> 3428483 INFO  (coreLoadExecutor-13746-thread-1-processing-x:collection1) [    x:collection1] o.a.s.h.ReplicationHandler Commits will be reserved for 10000ms.
   [junit4]   2> NOTE: reproduce with: ant test  -Dtestcase=InfixSuggestersTest -Dtests.method=testShutdownDuringBuild -Dtests.seed=AF0B759D88602506 -Dtests.slow=true -Dtests.locale=es-PE -Dtests.timezone=ACT -Dtests.asserts=true -Dtests.file.encoding=US-ASCII
   [junit4] ERROR   1.67s J0 | InfixSuggestersTest.testShutdownDuringBuild <<<
   [junit4]    > Throwable #1: java.util.concurrent.ExecutionException: junit.framework.AssertionFailedError: Unexpected wrapped exception type, expected CoreIsClosedException
   [junit4]    > 	at __randomizedtesting.SeedInfo.seed([AF0B759D88602506:70861722B6097064]:0)
   [junit4]    > 	at java.util.concurrent.FutureTask.report(FutureTask.java:122)
   [junit4]    > 	at java.util.concurrent.FutureTask.get(FutureTask.java:192)
   [junit4]    > 	at org.apache.solr.handler.component.InfixSuggestersTest.testShutdownDuringBuild(InfixSuggestersTest.java:130)
   [junit4]    > 	at java.lang.Thread.run(Thread.java:748)
   [junit4]    > Caused by: junit.framework.AssertionFailedError: Unexpected wrapped exception type, expected CoreIsClosedException
   [junit4]    > 	at org.apache.lucene.util.LuceneTestCase.expectThrows(LuceneTestCase.java:2704)
   [junit4]    > 	at org.apache.solr.handler.component.InfixSuggestersTest.lambda$testShutdownDuringBuild$3(InfixSuggestersTest.java:121)
   [junit4]    > 	at java.util.concurrent.FutureTask.run(FutureTask.java:266)
   [junit4]    > 	at org.apache.solr.common.util.ExecutorUtil$MDCAwareThreadPoolExecutor.lambda$execute$0(ExecutorUtil.java:209)
   [junit4]    > 	at java.util.concurrent.ThreadPoolExecutor.runWorker(ThreadPoolExecutor.java:1149)
   [junit4]    > 	at java.util.concurrent.ThreadPoolExecutor$Worker.run(ThreadPoolExecutor.java:624)
   [junit4]    > 	... 1 more
   [junit4]    > Caused by: java.lang.RuntimeException: Exception during query
   [junit4]    > 	at org.apache.solr.SolrTestCaseJ4.assertQ(SolrTestCaseJ4.java:917)
   [junit4]    > 	at org.apache.solr.SolrTestCaseJ4.assertQ(SolrTestCaseJ4.java:877)
   [junit4]    > 	at org.apache.solr.handler.component.InfixSuggestersTest.lambda$null$2(InfixSuggestersTest.java:122)
   [junit4]    > 	at org.apache.lucene.util.LuceneTestCase.expectThrows(LuceneTestCase.java:2696)
   [junit4]    > 	... 6 more
   [junit4]    > Caused by: org.apache.solr.common.SolrException: SolrCoreState already closed.
   [junit4]    > 	at org.apache.solr.update.DefaultSolrCoreState.lock(DefaultSolrCoreState.java:186)
   [junit4]    > 	at org.apache.solr.update.DefaultSolrCoreState.getIndexWriter(DefaultSolrCoreState.java:121)
   [junit4]    > 	at org.apache.solr.update.SolrCoreState.getTragicException(SolrCoreState.java:198)
   [junit4]    > 	at org.apache.solr.core.CoreContainer.checkTragicException(CoreContainer.java:1805)
   [junit4]    > 	at org.apache.solr.handler.RequestHandlerBase.handleRequest(RequestHandlerBase.java:212)
   [junit4]    > 	at org.apache.solr.core.SolrCore.execute(SolrCore.java:2541)
   [junit4]    > 	at org.apache.solr.util.TestHarness.query(TestHarness.java:337)
   [junit4]    > 	at org.apache.solr.util.TestHarness.query(TestHarness.java:319)
   [junit4]    > 	at org.apache.solr.SolrTestCaseJ4.assertQ(SolrTestCaseJ4.java:891)
   [junit4]    > 	... 9 more
   [junit4]   2> 3428490 ERROR (TEST-InfixSuggestersTest.testReloadDuringBuild-seed#[AF0B759D88602506]) [    x:collection1] o.a.s.c.CorePropertiesLocator Couldn't load core descriptor from /export/home/jenkins/workspace/Lucene-Solr-7.x-Solaris/solr/core/src/test-files/solr/collection1/core.properties:java.nio.file.NoSuchFileException: /export/home/jenkins/workspace/Lucene-Solr-7.x-Solaris/solr/core/src/test-files/solr/collection1/core.properties
   [junit4]   2> 3428491 INFO  (AnalyzingInfixSuggesterTest-12966-thread-1-processing-x:collection1) [    x:collection1] o.a.s.h.c.SuggestComponent SuggestComponent prepare with : qt=/suggest_analyzing_infix_long_dictionary&suggest=true&suggest.buildAll=true&wt=xml&indent=off
   [junit4]   2> 3428491 INFO  (TEST-InfixSuggestersTest.testReloadDuringBuild-seed#[AF0B759D88602506]) [    x:collection1] o.a.s.c.SolrResourceLoader [null] Added 2 libs to classloader, from paths: [/export/home/jenkins/workspace/Lucene-Solr-7.x-Solaris/solr/core/src/test-files/solr/collection1/lib, /export/home/jenkins/workspace/Lucene-Solr-7.x-Solaris/solr/core/src/test-files/solr/collection1/lib/classes]
   [junit4]   2> 3428510 INFO  (TEST-InfixSuggestersTest.testReloadDuringBuild-seed#[AF0B759D88602506]) [    x:collection1] o.a.s.c.SolrConfig Using Lucene MatchVersion: 7.5.0
   [junit4]   2> 3428516 INFO  (TEST-InfixSuggestersTest.testReloadDuringBuild-seed#[AF0B759D88602506]) [    x:collection1] o.a.s.s.IndexSchema [collection1] Schema name=test
   [junit4]   2> 3428530 INFO  (searcherExecutor-13747-thread-1-processing-x:collection1) [    x:collection1] o.a.s.c.SolrCore [collection1] Registered new searcher Searcher@5b2b4e66[collection1] main{ExitableDirectoryReader(UninvertingDirectoryReader())}
   [junit4]   2> 3428530 INFO  (AnalyzingInfixSuggesterTest-12966-thread-1-processing-x:collection1) [    x:collection1] o.a.s.s.s.SolrSuggester SolrSuggester.build(longRandomAnalyzingInfixSuggester)
   [junit4]   2> 3428561 INFO  (AnalyzingInfixSuggesterTest-12966-thread-1-processing-x:collection1) [    x:collection1] o.a.s.s.s.RandomTestDictionaryFactory org.apache.solr.spelling.suggest.RandomTestDictionaryFactory$RandomTestDictionary.enabled.longRandomAnalyzingInfixSuggester emitted 1000 items.
   [junit4]   2> 3428587 INFO  (AnalyzingInfixSuggesterTest-12966-thread-1-processing-x:collection1) [    x:collection1] o.a.s.s.s.RandomTestDictionaryFactory org.apache.solr.spelling.suggest.RandomTestDictionaryFactory$RandomTestDictionary.enabled.longRandomAnalyzingInfixSuggester emitted 2000 items.
   [junit4]   2> 3428637 INFO  (TEST-InfixSuggestersTest.testReloadDuringBuild-seed#[AF0B759D88602506]) [    x:collection1] o.a.s.s.IndexSchema Loaded schema test/1.0 with uniqueid field id
   [junit4]   2> 3428639 INFO  (AnalyzingInfixSuggesterTest-12966-thread-1-processing-x:collection1) [    x:collection1] o.a.s.s.s.RandomTestDictionaryFactory org.apache.solr.spelling.suggest.RandomTestDictionaryFactory$RandomTestDictionary.enabled.longRandomAnalyzingInfixSuggester emitted 3000 items.
   [junit4]   2> 3428643 INFO  (TEST-InfixSuggestersTest.testReloadDuringBuild-seed#[AF0B759D88602506]) [    x:collection1] o.a.s.c.CoreContainer Reloading SolrCore 'collection1' using configuration from instancedir /export/home/jenkins/workspace/Lucene-Solr-7.x-Solaris/solr/core/src/test-files/solr/collection1
   [junit4]   2> 3428664 INFO  (TEST-InfixSuggestersTest.testReloadDuringBuild-seed#[AF0B759D88602506]) [    x:collection1] o.a.s.m.r.SolrJmxReporter JMX monitoring for 'solr.core.collection1' (registry 'solr.core.collection1') enabled at server: com.sun.jmx.mbeanserver.JmxMBeanServer@67d1cb03
   [junit4]   2> 3428664 INFO  (TEST-InfixSuggestersTest.testReloadDuringBuild-seed#[AF0B759D88602506]) [    x:collection1] o.a.s.c.SolrCore [[collection1] ] Opening new SolrCore at [/export/home/jenkins/workspace/Lucene-Solr-7.x-Solaris/solr/core/src/test-files/solr/collection1], dataDir=[/export/home/jenkins/workspace/Lucene-Solr-7.x-Solaris/solr/build/solr-core/test/J0/temp/solr.handler.component.InfixSuggestersTest_AF0B759D88602506-001/init-core-data-001/]
   [junit4]   2> 3428668 INFO  (AnalyzingInfixSuggesterTest-12966-thread-1-processing-x:collection1) [    x:collection1] o.a.s.s.s.RandomTestDictionaryFactory org.apache.solr.spelling.suggest.RandomTestDictionaryFactory$RandomTestDictionary.enabled.longRandomAnalyzingInfixSuggester emitted 4000 items.
   [junit4]   2> 3428696 INFO  (AnalyzingInfixSuggesterTest-12966-thread-1-processing-x:collection1) [    x:collection1] o.a.s.s.s.RandomTestDictionaryFactory org.apache.solr.spelling.suggest.RandomTestDictionaryFactory$RandomTestDictionary.enabled.longRandomAnalyzingInfixSuggester emitted 5000 items.
   [junit4]   2> 3428709 INFO  (TEST-InfixSuggestersTest.testReloadDuringBuild-seed#[AF0B759D88602506]) [    x:collection1] o.a.s.u.CommitTracker Hard AutoCommit: disabled
   [junit4]   2> 3428709 INFO  (TEST-InfixSuggestersTest.testReloadDuringBuild-seed#[AF0B759D88602506]) [    x:collection1] o.a.s.u.CommitTracker Soft AutoCommit: disabled
   [junit4]   2> 3428710 INFO  (TEST-InfixSuggestersTest.testReloadDuringBuild-seed#[AF0B759D88602506]) [    x:collection1] o.a.s.s.SolrIndexSearcher Opening [Searcher@2081782f[collection1] main]
   [junit4]   2> 3428711 WARN  (TEST-InfixSuggestersTest.testReloadDuringBuild-seed#[AF0B759D88602506]) [    x:collection1] o.a.s.r.ManagedResourceStorage Cannot write to config directory /export/home/jenkins/workspace/Lucene-Solr-7.x-Solaris/solr/core/src/test-files/solr/collection1/conf; switching to use InMemory storage instead.
   [junit4]   2> 3428711 INFO  (TEST-InfixSuggestersTest.testReloadDuringBuild-seed#[AF0B759D88602506]) [    x:collection1] o.a.s.h.c.SuggestComponent Initializing SuggestComponent
   [junit4]   2> 3428711 INFO  (TEST-InfixSuggestersTest.testReloadDuringBuild-seed#[AF0B759D88602506]) [    x:collection1] o.a.s.s.s.SolrSuggester init: {name=shortRandomAnalyzingInfixSuggester,lookupImpl=AnalyzingInfixLookupFactory,dictionaryImpl=RandomTestDictionaryFactory,randDictMaxItems=100,indexPath=short_random_analyzing_infix_suggester,suggestAnalyzerFieldType=text,buildOnCommit=false,buildOnStartup=false}
   [junit4]   2> 3428712 INFO  (TEST-InfixSuggestersTest.testReloadDuringBuild-seed#[AF0B759D88602506]) [    x:collection1] o.a.s.s.s.SolrSuggester Dictionary loaded with params: {name=shortRandomAnalyzingInfixSuggester,lookupImpl=AnalyzingInfixLookupFactory,dictionaryImpl=RandomTestDictionaryFactory,randDictMaxItems=100,indexPath=short_random_analyzing_infix_suggester,suggestAnalyzerFieldType=text,buildOnCommit=false,buildOnStartup=false}
   [junit4]   2> 3428712 INFO  (TEST-InfixSuggestersTest.testReloadDuringBuild-seed#[AF0B759D88602506]) [    x:collection1] o.a.s.h.c.SuggestComponent Initializing SuggestComponent
   [junit4]   2> 3428712 INFO  (TEST-InfixSuggestersTest.testReloadDuringBuild-seed#[AF0B759D88602506]) [    x:collection1] o.a.s.s.s.SolrSuggester init: {name=longRandomAnalyzingInfixSuggester,lookupImpl=AnalyzingInfixLookupFactory,dictionaryImpl=RandomTestDictionaryFactory,randDictMaxItems=100000,indexPath=long_random_analyzing_infix_suggester,suggestAnalyzerFieldType=text,buildOnCommit=false,buildOnStartup=false}
   [junit4]   2> 3428713 INFO  (TEST-InfixSuggestersTest.testReloadDuringBuild-seed#[AF0B759D88602506]) [    x:collection1] o.a.s.s.s.SolrSuggester Dictionary loaded with params: {name=longRandomAnalyzingInfixSuggester,lookupImpl=AnalyzingInfixLookupFactory,dictionaryImpl=RandomTestDictionaryFactory,randDictMaxItems=100000,indexPath=long_random_analyzing_infix_suggester,suggestAnalyzerFieldType=text,buildOnCommit=false,buildOnStartup=false}
   [junit4]   2> 3428713 INFO  (TEST-InfixSuggestersTest.testReloadDuringBuild-seed#[AF0B759D88602506]) [    x:collection1] o.a.s.h.c.SuggestComponent Initializing SuggestComponent
   [junit4]   2> 3428714 INFO  (TEST-InfixSuggestersTest.testReloadDuringBuild-seed#[AF0B759D88602506]) [    x:collection1] o.a.s.s.s.SolrSuggester init: {name=shortRandomBlendedInfixSuggester,lookupImpl=BlendedInfixLookupFactory,dictionaryImpl=RandomTestDictionaryFactory,randDictMaxItems=100,blenderType=position_linear,suggestAnalyzerFieldType=text,indexPath=short_random_blended_infix_suggester,highlight=true,buildOnStartup=false,buildOnCommit=false}
   [junit4]   2> 3428714 INFO  (TEST-InfixSuggestersTest.testReloadDuringBuild-seed#[AF0B759D88602506]) [    x:collection1] o.a.s.s.s.SolrSuggester Dictionary loaded with params: {name=shortRandomBlendedInfixSuggester,lookupImpl=BlendedInfixLookupFactory,dictionaryImpl=RandomTestDictionaryFactory,randDictMaxItems=100,blenderType=position_linear,suggestAnalyzerFieldType=text,indexPath=short_random_blended_infix_suggester,highlight=true,buildOnStartup=false,buildOnCommit=false}
   [junit4]   2> 3428714 INFO  (TEST-InfixSuggestersTest.testReloadDuringBuild-seed#[AF0B759D88602506]) [    x:collection1] o.a.s.h.ReplicationHandler Commits will be reserved for 10000ms.
   [junit4]   2> 3428715 INFO  (TEST-InfixSuggestersTest.testReloadDuringBuild-seed#[AF0B759D88602506]) [    x:collection1] o.a.s.u.RandomMergePolicy RandomMergePolicy wrapping class org.apache.lucene.index.TieredMergePolicy: [TieredMergePolicy: maxMergeAtOnce=27, maxMergeAtOnceExplicit=36, maxMergedSegmentMB=64.3759765625, floorSegmentMB=0.3837890625, forceMergeDeletesPctAllowed=3.048354303153623, segmentsPerTier=41.0, maxCFSSegmentSizeMB=8.796093022207999E12, noCFSRatio=1.0, reclaimDeletesWeight=3.0906852714554462
   [junit4]   2> 3428715 INFO  (TEST-InfixSuggestersTest.testReloadDuringBuild-seed#[AF0B759D88602506]) [    x:collection1] o.a.s.u.DefaultSolrCoreState New IndexWriter is ready to be used.
   [junit4]   2> 3428715 INFO  (searcherExecutor-13751-thread-1-processing-x:collection1) [    x:collection1] o.a.s.c.SolrCore [collection1] Registered new searcher Searcher@2081782f[collection1] main{ExitableDirectoryReader(UninvertingDirectoryReader())}
   [junit4]   2> 3428716 INFO  (TEST-InfixSuggestersTest.testReloadDuringBuild-seed#[AF0B759D88602506]) [    x:collection1] o.a.s.s.SolrIndexSearcher Opening [Searcher@26679cf1[collection1] main]
   [junit4]   2> 3428716 INFO  (TEST-InfixSuggestersTest.testReloadDuringBuild-seed#[AF0B759D88602506]) [    x:collection1] o.a.s.c.SolrCore [collection1]  CLOSING SolrCore org.apache.solr.core.SolrCore@7f9fb7f3
   [junit4]   2> 3428716 INFO  (TEST-InfixSuggestersTest.testReloadDuringBuild-seed#[AF0B759D88602506]) [    x:collection1] o.a.s.m.SolrMetricManager Closing metric reporters for registry=solr.core.collection1, tag=7f9fb7f3
   [junit4]   2> 3428716 INFO  (TEST-InfixSuggestersTest.testReloadDuringBuild-seed#[AF0B759D88602506]) [    x:collection1] o.a.s.m.r.SolrJmxReporter Closing reporter [org.apache.solr.metrics.reporters.SolrJmxReporter@a7dba6: rootName = null, domain = solr.core.collection1, service url = null, agent id = null] for registry solr.core.collection1 / com.codahale.metrics.MetricRegistry@48216561
   [junit4]   2> 3428716 INFO  (searcherExecutor-13751-thread-1-processing-x:collection1) [    x:collection1] o.a.s.c.SolrCore [collection1] Registered new searcher Searcher@26679cf1[collection1] main{ExitableDirectoryReader(UninvertingDirectoryReader())}
   [junit4]   2> 3428915 ERROR (AnalyzingInfixSuggesterTest-12966-thread-1-processing-x:collection1) [    x:collection1] o.a.s.h.RequestHandlerBase org.apache.solr.update.SolrCoreState$CoreIsClosedException: Suggester build has been interrupted by a core reload or shutdown.
   [junit4]   2> 	at org.apache.solr.spelling.suggest.SolrSuggester.build(SolrSuggester.java:183)
   [junit4]   2> 	at org.apache.solr.handler.component.SuggestComponent.prepare(SuggestComponent.java:185)
   [junit4]   2> 	at org.apache.solr.handler.component.SearchHandler.handleRequestBody(SearchHandler.java:272)
   [junit4]   2> 	at org.apache.solr.handler.RequestHandlerBase.handleRequest(RequestHandlerBase.java:199)
   [junit4]   2> 	at org.apache.solr.core.SolrCore.execute(SolrCore.java:2541)
   [junit4]   2> 	at org.apache.solr.util.TestHarness.query(TestHarness.java:337)
   [junit4]   2> 	at org.apache.solr.util.TestHarness.query(TestHarness.java:319)
   [junit4]   2> 	at org.apache.solr.SolrTestCaseJ4.assertQ(SolrTestCaseJ4.java:891)
   [junit4]   2> 	at org.apache.solr.SolrTestCaseJ4.assertQ(SolrTestCaseJ4.java:877)
   [junit4]   2> 	at org.apache.solr.handler.component.InfixSuggestersTest.lambda$null$0(InfixSuggestersTest.java:102)
   [junit4]   2> 	at org.apache.lucene.util.LuceneTestCase.expectThrows(LuceneTestCase.java:2696)
   [junit4]   2> 	at org.apache.solr.handler.component.InfixSuggestersTest.lambda$testReloadDuringBuild$1(InfixSuggestersTest.java:101)
   [junit4]   2> 	at java.util.concurrent.FutureTask.run(FutureTask.java:266)
   [junit4]   2> 	at org.apache.solr.common.util.ExecutorUtil$MDCAwareThreadPoolExecutor.lambda$execute$0(ExecutorUtil.java:209)
   [junit4]   2> 	at java.util.concurrent.ThreadPoolExecutor.runWorker(ThreadPoolExecutor.java:1149)
   [junit4]   2> 	at java.util.concurrent.ThreadPoolExecutor$Worker.run(ThreadPoolExecutor.java:624)
   [junit4]   2> 	at java.lang.Thread.run(Thread.java:748)
   [junit4]   2> Caused by: org.apache.lucene.store.AlreadyClosedException: this IndexWriter is closed
   [junit4]   2> 	at org.apache.lucene.index.IndexWriter.ensureOpen(IndexWriter.java:671)
   [junit4]   2> 	at org.apache.lucene.index.IndexWriter.ensureOpen(IndexWriter.java:685)
   [junit4]   2> 	at org.apache.lucene.index.IndexWriter.updateDocument(IndexWriter.java:1600)
   [junit4]   2> 	at org.apache.lucene.index.IndexWriter.addDocument(IndexWriter.java:1222)
   [junit4]   2> 	at org.apache.lucene.search.suggest.analyzing.AnalyzingInfixSuggester.add(AnalyzingInfixSuggester.java:396)
   [junit4]   2> 	at org.apache.lucene.search.suggest.analyzing.AnalyzingInfixSuggester.build(AnalyzingInfixSuggester.java:310)
   [junit4]   2> 	at org.apache.lucene.search.suggest.Lookup.build(Lookup.java:190)
   [junit4]   2> 	at org.apache.solr.spelling.suggest.SolrSuggester.build(SolrSuggester.java:181)
   [junit4]   2> 	... 16 more
   [junit4]   2> 
   [junit4]   2> 3428915 INFO  (AnalyzingInfixSuggesterTest-12966-thread-1-processing-x:collection1) [    x:collection1] o.a.s.c.S.Request [collection1]  webapp=null path=null params={qt=/suggest_analyzing_infix_long_dictionary&suggest.buildAll=true&wt=xml} status=500 QTime=424
   [junit4]   2> 3428918 INFO  (TEST-InfixSuggestersTest.test2xBuildReload-seed#[AF0B759D88602506]) [    x:collection1] o.a.s.h.c.SuggestComponent SuggestCompone

[...truncated too long message...]

ecuting 5 suites with 2 JVMs.
   [junit4] 
   [junit4] Started J1 PID(11947@serv1-vm3).
   [junit4] Started J0 PID(11946@serv1-vm3).
   [junit4] Suite: org.apache.solr.handler.component.InfixSuggestersTest
   [junit4] OK      1.89s J0 | InfixSuggestersTest.testTwoSuggestersBuildThenReload
   [junit4] OK      0.72s J0 | InfixSuggestersTest.testAnalyzingInfixSuggesterBuildThenReload
   [junit4] OK      0.73s J0 | InfixSuggestersTest.testBlendedInfixSuggesterBuildThenReload
   [junit4] OK      2.16s J0 | InfixSuggestersTest.testShutdownDuringBuild
   [junit4] OK      1.36s J0 | InfixSuggestersTest.testReloadDuringBuild
   [junit4] OK      1.12s J0 | InfixSuggestersTest.test2xBuildReload
   [junit4] OK      0.77s J0 | InfixSuggestersTest.testBuildThen2xReload
   [junit4] Completed [1/5] on J0 in 15.33s, 7 tests
   [junit4] 
   [junit4] Suite: org.apache.solr.handler.component.InfixSuggestersTest
   [junit4] OK      1.65s J1 | InfixSuggestersTest.testTwoSuggestersBuildThenReload
   [junit4] OK      0.57s J1 | InfixSuggestersTest.testAnalyzingInfixSuggesterBuildThenReload
   [junit4] OK      0.82s J1 | InfixSuggestersTest.testBlendedInfixSuggesterBuildThenReload
   [junit4] OK      1.91s J1 | InfixSuggestersTest.testShutdownDuringBuild
   [junit4] OK      1.46s J1 | InfixSuggestersTest.testReloadDuringBuild
   [junit4] OK      1.13s J1 | InfixSuggestersTest.test2xBuildReload
   [junit4] OK      1.05s J1 | InfixSuggestersTest.testBuildThen2xReload
   [junit4] Completed [2/5] on J1 in 15.67s, 7 tests
   [junit4] 
   [junit4] Duplicate suite name used with XML reports: org.apache.solr.handler.component.InfixSuggestersTest. This may confuse tools that process XML reports. Set 'ignoreDuplicateSuites' to true to skip this message.
   [junit4] Suite: org.apache.solr.handler.component.InfixSuggestersTest
   [junit4] OK      0.64s J0 | InfixSuggestersTest.testTwoSuggestersBuildThenReload
   [junit4] OK      0.61s J0 | InfixSuggestersTest.testAnalyzingInfixSuggesterBuildThenReload
   [junit4] OK      0.42s J0 | InfixSuggestersTest.testBlendedInfixSuggesterBuildThenReload
   [junit4] OK      1.40s J0 | InfixSuggestersTest.testShutdownDuringBuild
   [junit4] OK      5.00s J0 | InfixSuggestersTest.testReloadDuringBuild
   [junit4] OK      0.61s J0 | InfixSuggestersTest.test2xBuildReload
   [junit4] OK      0.51s J0 | InfixSuggestersTest.testBuildThen2xReload
   [junit4] Completed [3/5] on J0 in 10.47s, 7 tests
   [junit4] 
   [junit4] Suite: org.apache.solr.handler.component.InfixSuggestersTest
   [junit4] OK      0.73s J1 | InfixSuggestersTest.testTwoSuggestersBuildThenReload
   [junit4] OK      0.38s J1 | InfixSuggestersTest.testAnalyzingInfixSuggesterBuildThenReload
   [junit4] OK      0.63s J1 | InfixSuggestersTest.testBlendedInfixSuggesterBuildThenReload
   [junit4] OK      7.45s J1 | InfixSuggestersTest.testShutdownDuringBuild
   [junit4] OK      1.25s J1 | InfixSuggestersTest.testReloadDuringBuild
   [junit4] OK      0.68s J1 | InfixSuggestersTest.test2xBuildReload
   [junit4] OK      0.68s J1 | InfixSuggestersTest.testBuildThen2xReload
   [junit4] Completed [4/5] on J1 in 13.25s, 7 tests
   [junit4] 
   [junit4] Suite: org.apache.solr.handler.component.InfixSuggestersTest
   [junit4] OK      1.04s J0 | InfixSuggestersTest.testTwoSuggestersBuildThenReload
   [junit4] OK      0.38s J0 | InfixSuggestersTest.testAnalyzingInfixSuggesterBuildThenReload
   [junit4] OK      0.47s J0 | InfixSuggestersTest.testBlendedInfixSuggesterBuildThenReload
   [junit4] OK      0.90s J0 | InfixSuggestersTest.testShutdownDuringBuild
   [junit4] OK      0.48s J0 | InfixSuggestersTest.testReloadDuringBuild
   [junit4] OK      0.49s J0 | InfixSuggestersTest.test2xBuildReload
   [junit4] OK      0.46s J0 | InfixSuggestersTest.testBuildThen2xReload
   [junit4] Completed [5/5] on J0 in 4.96s, 7 tests
   [junit4] 
   [junit4] JVM J0:     0.69 ..    32.56 =    31.86s
   [junit4] JVM J1:     0.67 ..    30.74 =    30.07s
   [junit4] Execution time total: 32 seconds
   [junit4] Tests summary: 5 suites, 35 tests
   [junit4] Could not remove temporary path: /export/home/jenkins/workspace/Lucene-Solr-7.x-Solaris/solr/build/solr-core/test/J0 (java.nio.file.DirectoryNotEmptyException: Remaining files: [/export/home/jenkins/workspace/Lucene-Solr-7.x-Solaris/solr/build/solr-core/test/J0/temp])
   [junit4] Could not remove temporary path: /export/home/jenkins/workspace/Lucene-Solr-7.x-Solaris/solr/build/solr-core/test/J1 (java.nio.file.DirectoryNotEmptyException: Remaining files: [/export/home/jenkins/workspace/Lucene-Solr-7.x-Solaris/solr/build/solr-core/test/J1/temp])
     [echo] 5 slowest tests:
[junit4:tophints] 219.84s | org.apache.solr.update.TestInPlaceUpdatesDistrib
[junit4:tophints] 116.70s | org.apache.solr.update.SoftAutoCommitTest
[junit4:tophints] 114.19s | org.apache.solr.cloud.ZkFailoverTest
[junit4:tophints] 107.24s | org.apache.solr.cloud.TestTlogReplica
[junit4:tophints] 103.52s | org.apache.solr.cloud.DeleteReplicaTest

-check-totals:

test-nocompile:

BUILD SUCCESSFUL
Total time: 35 seconds
[repro] Failures:
[repro]   0/5 failed: org.apache.solr.handler.component.InfixSuggestersTest
[repro] Exiting with code 0
+ mv lucene/build lucene/build.repro
+ mv solr/build solr/build.repro
+ mv lucene/build.orig lucene/build
+ mv solr/build.orig solr/build
Archiving artifacts
Setting ANT_1_8_2_HOME=/export/home/jenkins/tools/hudson.tasks.Ant_AntInstallation/ANT_1.8.2
java.lang.InterruptedException: no matches found within 10000
	at hudson.FilePath$ValidateAntFileMask.hasMatch(FilePath.java:2843)
	at hudson.FilePath$ValidateAntFileMask.invoke(FilePath.java:2722)
	at hudson.FilePath$ValidateAntFileMask.invoke(FilePath.java:2703)
	at hudson.FilePath$FileCallableWrapper.call(FilePath.java:3082)
Also:   hudson.remoting.Channel$CallSiteStackTrace: Remote call to Solaris VBOX
		at hudson.remoting.Channel.attachCallSiteStackTrace(Channel.java:1741)
		at hudson.remoting.UserRequest$ExceptionResponse.retrieve(UserRequest.java:357)
		at hudson.remoting.Channel.call(Channel.java:955)
		at hudson.FilePath.act(FilePath.java:1089)
		at hudson.FilePath.act(FilePath.java:1078)
		at hudson.FilePath.validateAntFileMask(FilePath.java:2701)
		at hudson.tasks.ArtifactArchiver.perform(ArtifactArchiver.java:243)
		at hudson.tasks.BuildStepCompatibilityLayer.perform(BuildStepCompatibilityLayer.java:81)
		at hudson.tasks.BuildStepMonitor$1.perform(BuildStepMonitor.java:20)
		at hudson.model.AbstractBuild$AbstractBuildExecution.perform(AbstractBuild.java:744)
		at hudson.model.AbstractBuild$AbstractBuildExecution.performAllBuildSteps(AbstractBuild.java:690)
		at hudson.model.Build$BuildExecution.post2(Build.java:186)
		at hudson.model.AbstractBuild$AbstractBuildExecution.post(AbstractBuild.java:635)
		at hudson.model.Run.execute(Run.java:1840)
		at hudson.model.FreeStyleBuild.run(FreeStyleBuild.java:43)
		at hudson.model.ResourceController.execute(ResourceController.java:97)
		at hudson.model.Executor.run(Executor.java:429)
Caused: hudson.FilePath$TunneledInterruptedException
	at hudson.FilePath$FileCallableWrapper.call(FilePath.java:3084)
	at hudson.remoting.UserRequest.perform(UserRequest.java:212)
	at hudson.remoting.UserRequest.perform(UserRequest.java:54)
	at hudson.remoting.Request$2.run(Request.java:369)
	at hudson.remoting.InterceptingExecutorService$1.call(InterceptingExecutorService.java:72)
	at java.util.concurrent.FutureTask.run(FutureTask.java:266)
	at java.util.concurrent.ThreadPoolExecutor.runWorker(ThreadPoolExecutor.java:1149)
	at java.util.concurrent.ThreadPoolExecutor$Worker.run(ThreadPoolExecutor.java:624)
	at java.lang.Thread.run(Thread.java:748)
Caused: java.lang.InterruptedException: java.lang.InterruptedException: no matches found within 10000
	at hudson.FilePath.act(FilePath.java:1091)
	at hudson.FilePath.act(FilePath.java:1078)
	at hudson.FilePath.validateAntFileMask(FilePath.java:2701)
	at hudson.tasks.ArtifactArchiver.perform(ArtifactArchiver.java:243)
	at hudson.tasks.BuildStepCompatibilityLayer.perform(BuildStepCompatibilityLayer.java:81)
	at hudson.tasks.BuildStepMonitor$1.perform(BuildStepMonitor.java:20)
	at hudson.model.AbstractBuild$AbstractBuildExecution.perform(AbstractBuild.java:744)
	at hudson.model.AbstractBuild$AbstractBuildExecution.performAllBuildSteps(AbstractBuild.java:690)
	at hudson.model.Build$BuildExecution.post2(Build.java:186)
	at hudson.model.AbstractBuild$AbstractBuildExecution.post(AbstractBuild.java:635)
	at hudson.model.Run.execute(Run.java:1840)
	at hudson.model.FreeStyleBuild.run(FreeStyleBuild.java:43)
	at hudson.model.ResourceController.execute(ResourceController.java:97)
	at hudson.model.Executor.run(Executor.java:429)
No artifacts found that match the file pattern "**/*.events,heapdumps/**,**/*_pid*.log". Configuration error?
[WARNINGS] Parsing warnings in console log with parser Java Compiler (javac)
Setting ANT_1_8_2_HOME=/export/home/jenkins/tools/hudson.tasks.Ant_AntInstallation/ANT_1.8.2
Setting ANT_1_8_2_HOME=/export/home/jenkins/tools/hudson.tasks.Ant_AntInstallation/ANT_1.8.2
<Git Blamer> Using GitBlamer to create author and commit information for all warnings.
<Git Blamer> GIT_COMMIT=f3e8180bd71cdc3e51a72e9e529a8e69251bdda5, workspace=/export/home/jenkins/workspace/Lucene-Solr-7.x-Solaris
[WARNINGS] Computing warning deltas based on reference build #717
Recording test results
Setting ANT_1_8_2_HOME=/export/home/jenkins/tools/hudson.tasks.Ant_AntInstallation/ANT_1.8.2
Build step 'Publish JUnit test result report' changed build result to UNSTABLE
Email was triggered for: Unstable (Test Failures)
Sending email for trigger: Unstable (Test Failures)
Setting ANT_1_8_2_HOME=/export/home/jenkins/tools/hudson.tasks.Ant_AntInstallation/ANT_1.8.2
Setting ANT_1_8_2_HOME=/export/home/jenkins/tools/hudson.tasks.Ant_AntInstallation/ANT_1.8.2
Setting ANT_1_8_2_HOME=/export/home/jenkins/tools/hudson.tasks.Ant_AntInstallation/ANT_1.8.2
Setting ANT_1_8_2_HOME=/export/home/jenkins/tools/hudson.tasks.Ant_AntInstallation/ANT_1.8.2

Mime
View raw message