lucene-dev mailing list archives

Site index · List index
Message view « Date » · « Thread »
Top « Date » · « Thread »
From Policeman Jenkins Server <jenk...@thetaphi.de>
Subject [JENKINS] Lucene-Solr-7.x-Solaris (64bit/jdk1.8.0) - Build # 715 - Unstable!
Date Tue, 10 Jul 2018 15:55:34 GMT
Build: https://jenkins.thetaphi.de/job/Lucene-Solr-7.x-Solaris/715/
Java: 64bit/jdk1.8.0 -XX:-UseCompressedOops -XX:+UseConcMarkSweepGC

1 tests failed.
FAILED:  org.apache.solr.cloud.MoveReplicaHDFSTest.testFailedMove

Error Message:
No live SolrServers available to handle this request:[http://127.0.0.1:48937/solr/MoveReplicaHDFSTest_failed_coll_true, http://127.0.0.1:36705/solr/MoveReplicaHDFSTest_failed_coll_true, http://127.0.0.1:44379/solr/MoveReplicaHDFSTest_failed_coll_true]

Stack Trace:
org.apache.solr.client.solrj.SolrServerException: No live SolrServers available to handle this request:[http://127.0.0.1:48937/solr/MoveReplicaHDFSTest_failed_coll_true, http://127.0.0.1:36705/solr/MoveReplicaHDFSTest_failed_coll_true, http://127.0.0.1:44379/solr/MoveReplicaHDFSTest_failed_coll_true]
	at __randomizedtesting.SeedInfo.seed([227DD5EDF03DB896:88B0061F47EE6D46]:0)
	at org.apache.solr.client.solrj.impl.LBHttpSolrClient.request(LBHttpSolrClient.java:462)
	at org.apache.solr.client.solrj.impl.CloudSolrClient.sendRequest(CloudSolrClient.java:1106)
	at org.apache.solr.client.solrj.impl.CloudSolrClient.requestWithRetryOnStaleState(CloudSolrClient.java:886)
	at org.apache.solr.client.solrj.impl.CloudSolrClient.requestWithRetryOnStaleState(CloudSolrClient.java:993)
	at org.apache.solr.client.solrj.impl.CloudSolrClient.request(CloudSolrClient.java:819)
	at org.apache.solr.client.solrj.SolrRequest.process(SolrRequest.java:194)
	at org.apache.solr.client.solrj.SolrClient.query(SolrClient.java:942)
	at org.apache.solr.cloud.MoveReplicaTest.testFailedMove(MoveReplicaTest.java:288)
	at sun.reflect.NativeMethodAccessorImpl.invoke0(Native Method)
	at sun.reflect.NativeMethodAccessorImpl.invoke(NativeMethodAccessorImpl.java:62)
	at sun.reflect.DelegatingMethodAccessorImpl.invoke(DelegatingMethodAccessorImpl.java:43)
	at java.lang.reflect.Method.invoke(Method.java:498)
	at com.carrotsearch.randomizedtesting.RandomizedRunner.invoke(RandomizedRunner.java:1737)
	at com.carrotsearch.randomizedtesting.RandomizedRunner$8.evaluate(RandomizedRunner.java:934)
	at com.carrotsearch.randomizedtesting.RandomizedRunner$9.evaluate(RandomizedRunner.java:970)
	at com.carrotsearch.randomizedtesting.RandomizedRunner$10.evaluate(RandomizedRunner.java:984)
	at com.carrotsearch.randomizedtesting.rules.SystemPropertiesRestoreRule$1.evaluate(SystemPropertiesRestoreRule.java:57)
	at org.apache.lucene.util.TestRuleSetupTeardownChained$1.evaluate(TestRuleSetupTeardownChained.java:49)
	at org.apache.lucene.util.AbstractBeforeAfterRule$1.evaluate(AbstractBeforeAfterRule.java:45)
	at org.apache.lucene.util.TestRuleThreadAndTestName$1.evaluate(TestRuleThreadAndTestName.java:48)
	at org.apache.lucene.util.TestRuleIgnoreAfterMaxFailures$1.evaluate(TestRuleIgnoreAfterMaxFailures.java:64)
	at org.apache.lucene.util.TestRuleMarkFailure$1.evaluate(TestRuleMarkFailure.java:47)
	at com.carrotsearch.randomizedtesting.rules.StatementAdapter.evaluate(StatementAdapter.java:36)
	at com.carrotsearch.randomizedtesting.ThreadLeakControl$StatementRunner.run(ThreadLeakControl.java:368)
	at com.carrotsearch.randomizedtesting.ThreadLeakControl.forkTimeoutingTask(ThreadLeakControl.java:817)
	at com.carrotsearch.randomizedtesting.ThreadLeakControl$3.evaluate(ThreadLeakControl.java:468)
	at com.carrotsearch.randomizedtesting.RandomizedRunner.runSingleTest(RandomizedRunner.java:943)
	at com.carrotsearch.randomizedtesting.RandomizedRunner$5.evaluate(RandomizedRunner.java:829)
	at com.carrotsearch.randomizedtesting.RandomizedRunner$6.evaluate(RandomizedRunner.java:879)
	at com.carrotsearch.randomizedtesting.RandomizedRunner$7.evaluate(RandomizedRunner.java:890)
	at com.carrotsearch.randomizedtesting.rules.StatementAdapter.evaluate(StatementAdapter.java:36)
	at com.carrotsearch.randomizedtesting.rules.SystemPropertiesRestoreRule$1.evaluate(SystemPropertiesRestoreRule.java:57)
	at org.apache.lucene.util.AbstractBeforeAfterRule$1.evaluate(AbstractBeforeAfterRule.java:45)
	at com.carrotsearch.randomizedtesting.rules.StatementAdapter.evaluate(StatementAdapter.java:36)
	at org.apache.lucene.util.TestRuleStoreClassName$1.evaluate(TestRuleStoreClassName.java:41)
	at com.carrotsearch.randomizedtesting.rules.NoShadowingOrOverridesOnMethodsRule$1.evaluate(NoShadowingOrOverridesOnMethodsRule.java:40)
	at com.carrotsearch.randomizedtesting.rules.NoShadowingOrOverridesOnMethodsRule$1.evaluate(NoShadowingOrOverridesOnMethodsRule.java:40)
	at com.carrotsearch.randomizedtesting.rules.StatementAdapter.evaluate(StatementAdapter.java:36)
	at com.carrotsearch.randomizedtesting.rules.StatementAdapter.evaluate(StatementAdapter.java:36)
	at com.carrotsearch.randomizedtesting.rules.StatementAdapter.evaluate(StatementAdapter.java:36)
	at org.apache.lucene.util.TestRuleAssertionsRequired$1.evaluate(TestRuleAssertionsRequired.java:53)
	at org.apache.lucene.util.TestRuleMarkFailure$1.evaluate(TestRuleMarkFailure.java:47)
	at org.apache.lucene.util.TestRuleIgnoreAfterMaxFailures$1.evaluate(TestRuleIgnoreAfterMaxFailures.java:64)
	at org.apache.lucene.util.TestRuleIgnoreTestSuites$1.evaluate(TestRuleIgnoreTestSuites.java:54)
	at com.carrotsearch.randomizedtesting.rules.StatementAdapter.evaluate(StatementAdapter.java:36)
	at com.carrotsearch.randomizedtesting.ThreadLeakControl$StatementRunner.run(ThreadLeakControl.java:368)
	at java.lang.Thread.run(Thread.java:748)
Caused by: org.apache.solr.client.solrj.impl.HttpSolrClient$RemoteSolrException: Error from server at http://127.0.0.1:48937/solr/MoveReplicaHDFSTest_failed_coll_true: no servers hosting shard: shard2
	at org.apache.solr.client.solrj.impl.HttpSolrClient.executeMethod(HttpSolrClient.java:643)
	at org.apache.solr.client.solrj.impl.HttpSolrClient.request(HttpSolrClient.java:255)
	at org.apache.solr.client.solrj.impl.HttpSolrClient.request(HttpSolrClient.java:244)
	at org.apache.solr.client.solrj.impl.LBHttpSolrClient.doRequest(LBHttpSolrClient.java:483)
	at org.apache.solr.client.solrj.impl.LBHttpSolrClient.request(LBHttpSolrClient.java:413)
	... 46 more




Build Log:
[...truncated 13870 lines...]
   [junit4] Suite: org.apache.solr.cloud.MoveReplicaHDFSTest
   [junit4]   2> Creating dataDir: /export/home/jenkins/workspace/Lucene-Solr-7.x-Solaris/solr/build/solr-core/test/J0/temp/solr.cloud.MoveReplicaHDFSTest_227DD5EDF03DB896-001/init-core-data-001
   [junit4]   2> 2338434 INFO  (SUITE-MoveReplicaHDFSTest-seed#[227DD5EDF03DB896]-worker) [    ] o.a.s.c.MiniSolrCloudCluster Starting cluster of 4 servers in /export/home/jenkins/workspace/Lucene-Solr-7.x-Solaris/solr/build/solr-core/test/J0/temp/solr.cloud.MoveReplicaHDFSTest_227DD5EDF03DB896-001/tempDir-001
   [junit4]   2> 2338435 INFO  (SUITE-MoveReplicaHDFSTest-seed#[227DD5EDF03DB896]-worker) [    ] o.a.s.c.ZkTestServer STARTING ZK TEST SERVER
   [junit4]   2> 2338435 INFO  (Thread-4212) [    ] o.a.s.c.ZkTestServer client port:0.0.0.0/0.0.0.0:0
   [junit4]   2> 2338435 INFO  (Thread-4212) [    ] o.a.s.c.ZkTestServer Starting server
   [junit4]   2> 2338437 ERROR (Thread-4212) [    ] o.a.z.s.ZooKeeperServer ZKShutdownHandler is not registered, so ZooKeeper server won't take any action on ERROR or SHUTDOWN server state changes
   [junit4]   2> 2338535 INFO  (SUITE-MoveReplicaHDFSTest-seed#[227DD5EDF03DB896]-worker) [    ] o.a.s.c.ZkTestServer start zk server on port:56291
   [junit4]   2> 2338537 INFO  (zkConnectionManagerCallback-9060-thread-1) [    ] o.a.s.c.c.ConnectionManager zkClient has connected
   [junit4]   2> 2338542 INFO  (jetty-launcher-9057-thread-1) [    ] o.e.j.s.Server jetty-9.4.11.v20180605; built: 2018-06-05T18:24:03.829Z; git: d5fc0523cfa96bfebfbda19606cad384d772f04c; jvm 1.8.0_172-b11
   [junit4]   2> 2338542 INFO  (jetty-launcher-9057-thread-2) [    ] o.e.j.s.Server jetty-9.4.11.v20180605; built: 2018-06-05T18:24:03.829Z; git: d5fc0523cfa96bfebfbda19606cad384d772f04c; jvm 1.8.0_172-b11
   [junit4]   2> 2338542 INFO  (jetty-launcher-9057-thread-4) [    ] o.e.j.s.Server jetty-9.4.11.v20180605; built: 2018-06-05T18:24:03.829Z; git: d5fc0523cfa96bfebfbda19606cad384d772f04c; jvm 1.8.0_172-b11
   [junit4]   2> 2338542 INFO  (jetty-launcher-9057-thread-3) [    ] o.e.j.s.Server jetty-9.4.11.v20180605; built: 2018-06-05T18:24:03.829Z; git: d5fc0523cfa96bfebfbda19606cad384d772f04c; jvm 1.8.0_172-b11
   [junit4]   2> 2338544 INFO  (jetty-launcher-9057-thread-1) [    ] o.e.j.s.session DefaultSessionIdManager workerName=node0
   [junit4]   2> 2338544 INFO  (jetty-launcher-9057-thread-1) [    ] o.e.j.s.session No SessionScavenger set, using defaults
   [junit4]   2> 2338544 INFO  (jetty-launcher-9057-thread-1) [    ] o.e.j.s.session node0 Scavenging every 660000ms
   [junit4]   2> 2338544 INFO  (jetty-launcher-9057-thread-1) [    ] o.e.j.s.h.ContextHandler Started o.e.j.s.ServletContextHandler@695abb29{/solr,null,AVAILABLE}
   [junit4]   2> 2338545 INFO  (jetty-launcher-9057-thread-1) [    ] o.e.j.s.AbstractConnector Started ServerConnector@34f65773{HTTP/1.1,[http/1.1]}{127.0.0.1:36705}
   [junit4]   2> 2338545 INFO  (jetty-launcher-9057-thread-4) [    ] o.e.j.s.session DefaultSessionIdManager workerName=node0
   [junit4]   2> 2338545 INFO  (jetty-launcher-9057-thread-1) [    ] o.e.j.s.Server Started @2339818ms
   [junit4]   2> 2338545 INFO  (jetty-launcher-9057-thread-4) [    ] o.e.j.s.session No SessionScavenger set, using defaults
   [junit4]   2> 2338545 INFO  (jetty-launcher-9057-thread-1) [    ] o.a.s.c.s.e.JettySolrRunner Jetty properties: {hostContext=/solr, hostPort=36705}
   [junit4]   2> 2338545 INFO  (jetty-launcher-9057-thread-4) [    ] o.e.j.s.session node0 Scavenging every 600000ms
   [junit4]   2> 2338545 ERROR (jetty-launcher-9057-thread-1) [    ] o.a.s.u.StartupLoggingUtils Missing Java Option solr.log.dir. Logging may be missing or incomplete.
   [junit4]   2> 2338545 INFO  (jetty-launcher-9057-thread-1) [    ] o.a.s.s.SolrDispatchFilter Using logger factory org.apache.logging.slf4j.Log4jLoggerFactory
   [junit4]   2> 2338546 INFO  (jetty-launcher-9057-thread-1) [    ] o.a.s.s.SolrDispatchFilter  ___      _       Welcome to Apache Solr? version 7.5.0
   [junit4]   2> 2338546 INFO  (jetty-launcher-9057-thread-4) [    ] o.e.j.s.h.ContextHandler Started o.e.j.s.ServletContextHandler@46b478ba{/solr,null,AVAILABLE}
   [junit4]   2> 2338546 INFO  (jetty-launcher-9057-thread-1) [    ] o.a.s.s.SolrDispatchFilter / __| ___| |_ _   Starting in cloud mode on port null
   [junit4]   2> 2338546 INFO  (jetty-launcher-9057-thread-1) [    ] o.a.s.s.SolrDispatchFilter \__ \/ _ \ | '_|  Install dir: null
   [junit4]   2> 2338546 INFO  (jetty-launcher-9057-thread-1) [    ] o.a.s.s.SolrDispatchFilter |___/\___/_|_|    Start time: 2018-07-10T14:58:36.976Z
   [junit4]   2> 2338546 INFO  (jetty-launcher-9057-thread-4) [    ] o.e.j.s.AbstractConnector Started ServerConnector@73bb388f{HTTP/1.1,[http/1.1]}{127.0.0.1:51961}
   [junit4]   2> 2338546 INFO  (jetty-launcher-9057-thread-4) [    ] o.e.j.s.Server Started @2339818ms
   [junit4]   2> 2338546 INFO  (jetty-launcher-9057-thread-4) [    ] o.a.s.c.s.e.JettySolrRunner Jetty properties: {hostContext=/solr, hostPort=51961}
   [junit4]   2> 2338546 ERROR (jetty-launcher-9057-thread-4) [    ] o.a.s.u.StartupLoggingUtils Missing Java Option solr.log.dir. Logging may be missing or incomplete.
   [junit4]   2> 2338546 INFO  (jetty-launcher-9057-thread-4) [    ] o.a.s.s.SolrDispatchFilter Using logger factory org.apache.logging.slf4j.Log4jLoggerFactory
   [junit4]   2> 2338546 INFO  (jetty-launcher-9057-thread-4) [    ] o.a.s.s.SolrDispatchFilter  ___      _       Welcome to Apache Solr? version 7.5.0
   [junit4]   2> 2338546 INFO  (jetty-launcher-9057-thread-4) [    ] o.a.s.s.SolrDispatchFilter / __| ___| |_ _   Starting in cloud mode on port null
   [junit4]   2> 2338546 INFO  (jetty-launcher-9057-thread-4) [    ] o.a.s.s.SolrDispatchFilter \__ \/ _ \ | '_|  Install dir: null
   [junit4]   2> 2338546 INFO  (jetty-launcher-9057-thread-4) [    ] o.a.s.s.SolrDispatchFilter |___/\___/_|_|    Start time: 2018-07-10T14:58:36.976Z
   [junit4]   2> 2338548 INFO  (jetty-launcher-9057-thread-3) [    ] o.e.j.s.session DefaultSessionIdManager workerName=node0
   [junit4]   2> 2338548 INFO  (jetty-launcher-9057-thread-3) [    ] o.e.j.s.session No SessionScavenger set, using defaults
   [junit4]   2> 2338548 INFO  (jetty-launcher-9057-thread-3) [    ] o.e.j.s.session node0 Scavenging every 660000ms
   [junit4]   2> 2338550 INFO  (jetty-launcher-9057-thread-2) [    ] o.e.j.s.session DefaultSessionIdManager workerName=node0
   [junit4]   2> 2338550 INFO  (jetty-launcher-9057-thread-2) [    ] o.e.j.s.session No SessionScavenger set, using defaults
   [junit4]   2> 2338550 INFO  (jetty-launcher-9057-thread-2) [    ] o.e.j.s.session node0 Scavenging every 660000ms
   [junit4]   2> 2338550 INFO  (jetty-launcher-9057-thread-2) [    ] o.e.j.s.h.ContextHandler Started o.e.j.s.ServletContextHandler@5a4c23a7{/solr,null,AVAILABLE}
   [junit4]   2> 2338552 INFO  (jetty-launcher-9057-thread-3) [    ] o.e.j.s.h.ContextHandler Started o.e.j.s.ServletContextHandler@8047673{/solr,null,AVAILABLE}
   [junit4]   2> 2338552 INFO  (jetty-launcher-9057-thread-3) [    ] o.e.j.s.AbstractConnector Started ServerConnector@5a18d055{HTTP/1.1,[http/1.1]}{127.0.0.1:52256}
   [junit4]   2> 2338552 INFO  (jetty-launcher-9057-thread-3) [    ] o.e.j.s.Server Started @2339825ms
   [junit4]   2> 2338553 INFO  (jetty-launcher-9057-thread-3) [    ] o.a.s.c.s.e.JettySolrRunner Jetty properties: {hostContext=/solr, hostPort=52256}
   [junit4]   2> 2338553 ERROR (jetty-launcher-9057-thread-3) [    ] o.a.s.u.StartupLoggingUtils Missing Java Option solr.log.dir. Logging may be missing or incomplete.
   [junit4]   2> 2338553 INFO  (jetty-launcher-9057-thread-3) [    ] o.a.s.s.SolrDispatchFilter Using logger factory org.apache.logging.slf4j.Log4jLoggerFactory
   [junit4]   2> 2338555 INFO  (zkConnectionManagerCallback-9064-thread-1) [    ] o.a.s.c.c.ConnectionManager zkClient has connected
   [junit4]   2> 2338554 INFO  (jetty-launcher-9057-thread-2) [    ] o.e.j.s.AbstractConnector Started ServerConnector@51551dcd{HTTP/1.1,[http/1.1]}{127.0.0.1:44379}
   [junit4]   2> 2338555 INFO  (jetty-launcher-9057-thread-3) [    ] o.a.s.s.SolrDispatchFilter  ___      _       Welcome to Apache Solr? version 7.5.0
   [junit4]   2> 2338556 INFO  (jetty-launcher-9057-thread-2) [    ] o.e.j.s.Server Started @2339828ms
   [junit4]   2> 2338556 INFO  (jetty-launcher-9057-thread-3) [    ] o.a.s.s.SolrDispatchFilter / __| ___| |_ _   Starting in cloud mode on port null
   [junit4]   2> 2338556 INFO  (jetty-launcher-9057-thread-2) [    ] o.a.s.c.s.e.JettySolrRunner Jetty properties: {hostContext=/solr, hostPort=44379}
   [junit4]   2> 2338556 INFO  (jetty-launcher-9057-thread-3) [    ] o.a.s.s.SolrDispatchFilter \__ \/ _ \ | '_|  Install dir: null
   [junit4]   2> 2338556 INFO  (jetty-launcher-9057-thread-3) [    ] o.a.s.s.SolrDispatchFilter |___/\___/_|_|    Start time: 2018-07-10T14:58:36.986Z
   [junit4]   2> 2338556 ERROR (jetty-launcher-9057-thread-2) [    ] o.a.s.u.StartupLoggingUtils Missing Java Option solr.log.dir. Logging may be missing or incomplete.
   [junit4]   2> 2338556 INFO  (jetty-launcher-9057-thread-2) [    ] o.a.s.s.SolrDispatchFilter Using logger factory org.apache.logging.slf4j.Log4jLoggerFactory
   [junit4]   2> 2338556 INFO  (jetty-launcher-9057-thread-2) [    ] o.a.s.s.SolrDispatchFilter  ___      _       Welcome to Apache Solr? version 7.5.0
   [junit4]   2> 2338556 INFO  (jetty-launcher-9057-thread-2) [    ] o.a.s.s.SolrDispatchFilter / __| ___| |_ _   Starting in cloud mode on port null
   [junit4]   2> 2338556 INFO  (jetty-launcher-9057-thread-2) [    ] o.a.s.s.SolrDispatchFilter \__ \/ _ \ | '_|  Install dir: null
   [junit4]   2> 2338556 INFO  (jetty-launcher-9057-thread-2) [    ] o.a.s.s.SolrDispatchFilter |___/\___/_|_|    Start time: 2018-07-10T14:58:36.986Z
   [junit4]   2> 2338556 INFO  (jetty-launcher-9057-thread-4) [    ] o.a.s.s.SolrDispatchFilter solr.xml found in ZooKeeper. Loading...
   [junit4]   2> 2338556 INFO  (zkConnectionManagerCallback-9062-thread-1) [    ] o.a.s.c.c.ConnectionManager zkClient has connected
   [junit4]   2> 2338558 INFO  (jetty-launcher-9057-thread-1) [    ] o.a.s.s.SolrDispatchFilter solr.xml found in ZooKeeper. Loading...
   [junit4]   2> 2338558 INFO  (zkConnectionManagerCallback-9068-thread-1) [    ] o.a.s.c.c.ConnectionManager zkClient has connected
   [junit4]   2> 2338558 INFO  (zkConnectionManagerCallback-9066-thread-1) [    ] o.a.s.c.c.ConnectionManager zkClient has connected
   [junit4]   2> 2338559 INFO  (jetty-launcher-9057-thread-3) [    ] o.a.s.s.SolrDispatchFilter solr.xml found in ZooKeeper. Loading...
   [junit4]   2> 2338567 INFO  (jetty-launcher-9057-thread-2) [    ] o.a.s.s.SolrDispatchFilter solr.xml found in ZooKeeper. Loading...
   [junit4]   2> 2338572 WARN  (NIOServerCxn.Factory:0.0.0.0/0.0.0.0:0) [    ] o.a.z.s.NIOServerCnxn Unable to read additional data from client sessionid 0x10183a15ebe0001, likely client has closed socket
   [junit4]   2> 2338577 WARN  (NIOServerCxn.Factory:0.0.0.0/0.0.0.0:0) [    ] o.a.z.s.NIOServerCnxn Unable to read additional data from client sessionid 0x10183a15ebe0003, likely client has closed socket
   [junit4]   2> 2338577 WARN  (NIOServerCxn.Factory:0.0.0.0/0.0.0.0:0) [    ] o.a.z.s.NIOServerCnxn Unable to read additional data from client sessionid 0x10183a15ebe0002, likely client has closed socket
   [junit4]   2> 2339097 INFO  (jetty-launcher-9057-thread-4) [    ] o.a.s.c.ZkContainer Zookeeper client=127.0.0.1:56291/solr
   [junit4]   2> 2339098 INFO  (zkConnectionManagerCallback-9072-thread-1) [    ] o.a.s.c.c.ConnectionManager zkClient has connected
   [junit4]   2> 2339099 INFO  (zkConnectionManagerCallback-9074-thread-1) [    ] o.a.s.c.c.ConnectionManager zkClient has connected
   [junit4]   2> 2339180 INFO  (jetty-launcher-9057-thread-2) [    ] o.a.s.c.ZkContainer Zookeeper client=127.0.0.1:56291/solr
   [junit4]   2> 2339182 INFO  (zkConnectionManagerCallback-9080-thread-1) [    ] o.a.s.c.c.ConnectionManager zkClient has connected
   [junit4]   2> 2339196 INFO  (jetty-launcher-9057-thread-4) [n:127.0.0.1:51961_solr    ] o.a.s.c.Overseer Overseer (id=null) closing
   [junit4]   2> 2339197 INFO  (jetty-launcher-9057-thread-4) [n:127.0.0.1:51961_solr    ] o.a.s.c.OverseerElectionContext I am going to be the leader 127.0.0.1:51961_solr
   [junit4]   2> 2339198 INFO  (jetty-launcher-9057-thread-4) [n:127.0.0.1:51961_solr    ] o.a.s.c.Overseer Overseer (id=72483798117122054-127.0.0.1:51961_solr-n_0000000000) starting
   [junit4]   2> 2339205 INFO  (zkConnectionManagerCallback-9083-thread-1) [    ] o.a.s.c.c.ConnectionManager zkClient has connected
   [junit4]   2> 2339207 INFO  (zkConnectionManagerCallback-9087-thread-1) [    ] o.a.s.c.c.ConnectionManager zkClient has connected
   [junit4]   2> 2339212 INFO  (jetty-launcher-9057-thread-4) [n:127.0.0.1:51961_solr    ] o.a.s.c.s.i.ZkClientClusterStateProvider Cluster at 127.0.0.1:56291/solr ready
   [junit4]   2> 2339214 INFO  (jetty-launcher-9057-thread-4) [n:127.0.0.1:51961_solr    ] o.a.s.c.ZkController Register node as live in ZooKeeper:/live_nodes/127.0.0.1:51961_solr
   [junit4]   2> 2339218 INFO  (zkCallback-9073-thread-1) [    ] o.a.s.c.c.ZkStateReader Updated live nodes from ZooKeeper... (0) -> (1)
   [junit4]   2> 2339218 INFO  (jetty-launcher-9057-thread-2) [n:127.0.0.1:44379_solr    ] o.a.s.c.Overseer Overseer (id=null) closing
   [junit4]   2> 2339218 INFO  (zkCallback-9082-thread-1) [    ] o.a.s.c.c.ZkStateReader Updated live nodes from ZooKeeper... (0) -> (1)
   [junit4]   2> 2339220 INFO  (jetty-launcher-9057-thread-2) [n:127.0.0.1:44379_solr    ] o.a.s.c.TransientSolrCoreCacheDefault Allocating transient cache for 2147483647 transient cores
   [junit4]   2> 2339220 INFO  (jetty-launcher-9057-thread-2) [n:127.0.0.1:44379_solr    ] o.a.s.c.ZkController Register node as live in ZooKeeper:/live_nodes/127.0.0.1:44379_solr
   [junit4]   2> 2339221 INFO  (zkCallback-9082-thread-1) [    ] o.a.s.c.c.ZkStateReader Updated live nodes from ZooKeeper... (1) -> (2)
   [junit4]   2> 2339221 INFO  (zkCallback-9073-thread-1) [    ] o.a.s.c.c.ZkStateReader Updated live nodes from ZooKeeper... (1) -> (2)
   [junit4]   2> 2339241 INFO  (zkConnectionManagerCallback-9094-thread-1) [    ] o.a.s.c.c.ConnectionManager zkClient has connected
   [junit4]   2> 2339242 INFO  (jetty-launcher-9057-thread-2) [n:127.0.0.1:44379_solr    ] o.a.s.c.c.ZkStateReader Updated live nodes from ZooKeeper... (0) -> (2)
   [junit4]   2> 2339243 INFO  (jetty-launcher-9057-thread-2) [n:127.0.0.1:44379_solr    ] o.a.s.c.s.i.ZkClientClusterStateProvider Cluster at 127.0.0.1:56291/solr ready
   [junit4]   2> 2339244 INFO  (jetty-launcher-9057-thread-2) [n:127.0.0.1:44379_solr    ] o.a.s.h.a.MetricsHistoryHandler No .system collection, keeping metrics history in memory.
   [junit4]   2> 2339249 INFO  (jetty-launcher-9057-thread-3) [    ] o.a.s.c.ZkContainer Zookeeper client=127.0.0.1:56291/solr
   [junit4]   2> 2339255 INFO  (zkCallback-9086-thread-1) [    ] o.a.s.c.c.ZkStateReader Updated live nodes from ZooKeeper... (0) -> (2)
   [junit4]   2> 2339261 INFO  (jetty-launcher-9057-thread-4) [n:127.0.0.1:51961_solr    ] o.a.s.h.a.MetricsHistoryHandler No .system collection, keeping metrics history in memory.
   [junit4]   2> 2339265 INFO  (jetty-launcher-9057-thread-2) [n:127.0.0.1:44379_solr    ] o.a.s.m.r.SolrJmxReporter JMX monitoring for 'solr_44379.solr.node' (registry 'solr.node') enabled at server: com.sun.jmx.mbeanserver.JmxMBeanServer@6b43b62a
   [junit4]   2> 2339268 INFO  (zkConnectionManagerCallback-9099-thread-1) [    ] o.a.s.c.c.ConnectionManager zkClient has connected
   [junit4]   2> 2339271 INFO  (zkConnectionManagerCallback-9102-thread-1) [    ] o.a.s.c.c.ConnectionManager zkClient has connected
   [junit4]   2> 2339273 INFO  (jetty-launcher-9057-thread-2) [n:127.0.0.1:44379_solr    ] o.a.s.m.r.SolrJmxReporter JMX monitoring for 'solr_44379.solr.jvm' (registry 'solr.jvm') enabled at server: com.sun.jmx.mbeanserver.JmxMBeanServer@6b43b62a
   [junit4]   2> 2339273 INFO  (jetty-launcher-9057-thread-2) [n:127.0.0.1:44379_solr    ] o.a.s.m.r.SolrJmxReporter JMX monitoring for 'solr_44379.solr.jetty' (registry 'solr.jetty') enabled at server: com.sun.jmx.mbeanserver.JmxMBeanServer@6b43b62a
   [junit4]   2> 2339274 INFO  (jetty-launcher-9057-thread-2) [n:127.0.0.1:44379_solr    ] o.a.s.c.CorePropertiesLocator Found 0 core definitions underneath /export/home/jenkins/workspace/Lucene-Solr-7.x-Solaris/solr/build/solr-core/test/J0/temp/solr.cloud.MoveReplicaHDFSTest_227DD5EDF03DB896-001/tempDir-001/node2/.
   [junit4]   2> 2339275 INFO  (jetty-launcher-9057-thread-4) [n:127.0.0.1:51961_solr    ] o.a.s.m.r.SolrJmxReporter JMX monitoring for 'solr_51961.solr.node' (registry 'solr.node') enabled at server: com.sun.jmx.mbeanserver.JmxMBeanServer@6b43b62a
   [junit4]   2> 2339281 INFO  (jetty-launcher-9057-thread-4) [n:127.0.0.1:51961_solr    ] o.a.s.m.r.SolrJmxReporter JMX monitoring for 'solr_51961.solr.jvm' (registry 'solr.jvm') enabled at server: com.sun.jmx.mbeanserver.JmxMBeanServer@6b43b62a
   [junit4]   2> 2339281 INFO  (jetty-launcher-9057-thread-4) [n:127.0.0.1:51961_solr    ] o.a.s.m.r.SolrJmxReporter JMX monitoring for 'solr_51961.solr.jetty' (registry 'solr.jetty') enabled at server: com.sun.jmx.mbeanserver.JmxMBeanServer@6b43b62a
   [junit4]   2> 2339281 INFO  (jetty-launcher-9057-thread-4) [n:127.0.0.1:51961_solr    ] o.a.s.c.CorePropertiesLocator Found 0 core definitions underneath /export/home/jenkins/workspace/Lucene-Solr-7.x-Solaris/solr/build/solr-core/test/J0/temp/solr.cloud.MoveReplicaHDFSTest_227DD5EDF03DB896-001/tempDir-001/node4/.
   [junit4]   2> 2339292 INFO  (jetty-launcher-9057-thread-3) [n:127.0.0.1:52256_solr    ] o.a.s.c.c.ZkStateReader Updated live nodes from ZooKeeper... (0) -> (2)
   [junit4]   2> 2339295 INFO  (jetty-launcher-9057-thread-3) [n:127.0.0.1:52256_solr    ] o.a.s.c.Overseer Overseer (id=null) closing
   [junit4]   2> 2339297 INFO  (jetty-launcher-9057-thread-3) [n:127.0.0.1:52256_solr    ] o.a.s.c.TransientSolrCoreCacheDefault Allocating transient cache for 2147483647 transient cores
   [junit4]   2> 2339297 INFO  (jetty-launcher-9057-thread-3) [n:127.0.0.1:52256_solr    ] o.a.s.c.ZkController Register node as live in ZooKeeper:/live_nodes/127.0.0.1:52256_solr
   [junit4]   2> 2339298 INFO  (zkCallback-9073-thread-1) [    ] o.a.s.c.c.ZkStateReader Updated live nodes from ZooKeeper... (2) -> (3)
   [junit4]   2> 2339299 INFO  (zkCallback-9093-thread-1) [    ] o.a.s.c.c.ZkStateReader Updated live nodes from ZooKeeper... (2) -> (3)
   [junit4]   2> 2339299 INFO  (zkCallback-9082-thread-1) [    ] o.a.s.c.c.ZkStateReader Updated live nodes from ZooKeeper... (2) -> (3)
   [junit4]   2> 2339299 INFO  (zkCallback-9101-thread-1) [    ] o.a.s.c.c.ZkStateReader Updated live nodes from ZooKeeper... (2) -> (3)
   [junit4]   2> 2339307 INFO  (zkCallback-9086-thread-1) [    ] o.a.s.c.c.ZkStateReader Updated live nodes from ZooKeeper... (2) -> (3)
   [junit4]   2> 2339318 INFO  (zkConnectionManagerCallback-9109-thread-1) [    ] o.a.s.c.c.ConnectionManager zkClient has connected
   [junit4]   2> 2339319 INFO  (jetty-launcher-9057-thread-3) [n:127.0.0.1:52256_solr    ] o.a.s.c.c.ZkStateReader Updated live nodes from ZooKeeper... (0) -> (3)
   [junit4]   2> 2339321 INFO  (jetty-launcher-9057-thread-3) [n:127.0.0.1:52256_solr    ] o.a.s.c.s.i.ZkClientClusterStateProvider Cluster at 127.0.0.1:56291/solr ready
   [junit4]   2> 2339321 INFO  (jetty-launcher-9057-thread-3) [n:127.0.0.1:52256_solr    ] o.a.s.h.a.MetricsHistoryHandler No .system collection, keeping metrics history in memory.
   [junit4]   2> 2339333 INFO  (jetty-launcher-9057-thread-3) [n:127.0.0.1:52256_solr    ] o.a.s.m.r.SolrJmxReporter JMX monitoring for 'solr_52256.solr.node' (registry 'solr.node') enabled at server: com.sun.jmx.mbeanserver.JmxMBeanServer@6b43b62a
   [junit4]   2> 2339338 INFO  (jetty-launcher-9057-thread-3) [n:127.0.0.1:52256_solr    ] o.a.s.m.r.SolrJmxReporter JMX monitoring for 'solr_52256.solr.jvm' (registry 'solr.jvm') enabled at server: com.sun.jmx.mbeanserver.JmxMBeanServer@6b43b62a
   [junit4]   2> 2339338 INFO  (jetty-launcher-9057-thread-3) [n:127.0.0.1:52256_solr    ] o.a.s.m.r.SolrJmxReporter JMX monitoring for 'solr_52256.solr.jetty' (registry 'solr.jetty') enabled at server: com.sun.jmx.mbeanserver.JmxMBeanServer@6b43b62a
   [junit4]   2> 2339339 INFO  (jetty-launcher-9057-thread-3) [n:127.0.0.1:52256_solr    ] o.a.s.c.CorePropertiesLocator Found 0 core definitions underneath /export/home/jenkins/workspace/Lucene-Solr-7.x-Solaris/solr/build/solr-core/test/J0/temp/solr.cloud.MoveReplicaHDFSTest_227DD5EDF03DB896-001/tempDir-001/node3/.
   [junit4]   2> 2340145 INFO  (jetty-launcher-9057-thread-1) [    ] o.a.s.c.ZkContainer Zookeeper client=127.0.0.1:56291/solr
   [junit4]   2> 2340147 INFO  (zkConnectionManagerCallback-9114-thread-1) [    ] o.a.s.c.c.ConnectionManager zkClient has connected
   [junit4]   2> 2340150 INFO  (zkConnectionManagerCallback-9116-thread-1) [    ] o.a.s.c.c.ConnectionManager zkClient has connected
   [junit4]   2> 2340161 INFO  (jetty-launcher-9057-thread-1) [n:127.0.0.1:36705_solr    ] o.a.s.c.c.ZkStateReader Updated live nodes from ZooKeeper... (0) -> (3)
   [junit4]   2> 2340165 INFO  (jetty-launcher-9057-thread-1) [n:127.0.0.1:36705_solr    ] o.a.s.c.Overseer Overseer (id=null) closing
   [junit4]   2> 2340168 INFO  (jetty-launcher-9057-thread-1) [n:127.0.0.1:36705_solr    ] o.a.s.c.TransientSolrCoreCacheDefault Allocating transient cache for 2147483647 transient cores
   [junit4]   2> 2340168 INFO  (jetty-launcher-9057-thread-1) [n:127.0.0.1:36705_solr    ] o.a.s.c.ZkController Register node as live in ZooKeeper:/live_nodes/127.0.0.1:36705_solr
   [junit4]   2> 2340170 INFO  (zkCallback-9073-thread-1) [    ] o.a.s.c.c.ZkStateReader Updated live nodes from ZooKeeper... (3) -> (4)
   [junit4]   2> 2340170 INFO  (zkCallback-9082-thread-1) [    ] o.a.s.c.c.ZkStateReader Updated live nodes from ZooKeeper... (3) -> (4)
   [junit4]   2> 2340170 INFO  (zkCallback-9086-thread-1) [    ] o.a.s.c.c.ZkStateReader Updated live nodes from ZooKeeper... (3) -> (4)
   [junit4]   2> 2340170 INFO  (zkCallback-9108-thread-1) [    ] o.a.s.c.c.ZkStateReader Updated live nodes from ZooKeeper... (3) -> (4)
   [junit4]   2> 2340170 INFO  (zkCallback-9093-thread-1) [    ] o.a.s.c.c.ZkStateReader Updated live nodes from ZooKeeper... (3) -> (4)
   [junit4]   2> 2340171 INFO  (zkCallback-9101-thread-1) [    ] o.a.s.c.c.ZkStateReader Updated live nodes from ZooKeeper... (3) -> (4)
   [junit4]   2> 2340171 INFO  (zkCallback-9115-thread-1) [    ] o.a.s.c.c.ZkStateReader Updated live nodes from ZooKeeper... (3) -> (4)
   [junit4]   2> 2340188 INFO  (zkConnectionManagerCallback-9123-thread-1) [    ] o.a.s.c.c.ConnectionManager zkClient has connected
   [junit4]   2> 2340191 INFO  (jetty-launcher-9057-thread-1) [n:127.0.0.1:36705_solr    ] o.a.s.c.c.ZkStateReader Updated live nodes from ZooKeeper... (0) -> (4)
   [junit4]   2> 2340193 INFO  (jetty-launcher-9057-thread-1) [n:127.0.0.1:36705_solr    ] o.a.s.c.s.i.ZkClientClusterStateProvider Cluster at 127.0.0.1:56291/solr ready
   [junit4]   2> 2340193 INFO  (jetty-launcher-9057-thread-1) [n:127.0.0.1:36705_solr    ] o.a.s.h.a.MetricsHistoryHandler No .system collection, keeping metrics history in memory.
   [junit4]   2> 2340205 INFO  (jetty-launcher-9057-thread-1) [n:127.0.0.1:36705_solr    ] o.a.s.m.r.SolrJmxReporter JMX monitoring for 'solr_36705.solr.node' (registry 'solr.node') enabled at server: com.sun.jmx.mbeanserver.JmxMBeanServer@6b43b62a
   [junit4]   2> 2340209 INFO  (jetty-launcher-9057-thread-1) [n:127.0.0.1:36705_solr    ] o.a.s.m.r.SolrJmxReporter JMX monitoring for 'solr_36705.solr.jvm' (registry 'solr.jvm') enabled at server: com.sun.jmx.mbeanserver.JmxMBeanServer@6b43b62a
   [junit4]   2> 2340210 INFO  (jetty-launcher-9057-thread-1) [n:127.0.0.1:36705_solr    ] o.a.s.m.r.SolrJmxReporter JMX monitoring for 'solr_36705.solr.jetty' (registry 'solr.jetty') enabled at server: com.sun.jmx.mbeanserver.JmxMBeanServer@6b43b62a
   [junit4]   2> 2340210 INFO  (jetty-launcher-9057-thread-1) [n:127.0.0.1:36705_solr    ] o.a.s.c.CorePropertiesLocator Found 0 core definitions underneath /export/home/jenkins/workspace/Lucene-Solr-7.x-Solaris/solr/build/solr-core/test/J0/temp/solr.cloud.MoveReplicaHDFSTest_227DD5EDF03DB896-001/tempDir-001/node1/.
   [junit4]   2> 2340235 INFO  (zkConnectionManagerCallback-9126-thread-1) [    ] o.a.s.c.c.ConnectionManager zkClient has connected
   [junit4]   2> 2340239 INFO  (zkConnectionManagerCallback-9131-thread-1) [    ] o.a.s.c.c.ConnectionManager zkClient has connected
   [junit4]   2> 2340241 INFO  (SUITE-MoveReplicaHDFSTest-seed#[227DD5EDF03DB896]-worker) [    ] o.a.s.c.c.ZkStateReader Updated live nodes from ZooKeeper... (0) -> (4)
   [junit4]   2> 2340243 INFO  (SUITE-MoveReplicaHDFSTest-seed#[227DD5EDF03DB896]-worker) [    ] o.a.s.c.s.i.ZkClientClusterStateProvider Cluster at 127.0.0.1:56291/solr ready
   [junit4]   2> 2340250 INFO  (qtp1507862725-25524) [n:127.0.0.1:36705_solr    ] o.a.s.h.a.CollectionsHandler Invoked Collection Action :overseerstatus with params action=OVERSEERSTATUS&wt=javabin&version=2 and sendToOCPQueue=true
   [junit4]   2> 2340258 INFO  (qtp1507862725-25524) [n:127.0.0.1:36705_solr    ] o.a.s.s.HttpSolrCall [admin] webapp=null path=/admin/collections params={action=OVERSEERSTATUS&wt=javabin&version=2} status=0 QTime=8
   [junit4]   1> Formatting using clusterid: testClusterID
   [junit4]   2> 2340298 WARN  (SUITE-MoveReplicaHDFSTest-seed#[227DD5EDF03DB896]-worker) [    ] o.a.h.m.i.MetricsConfig Cannot locate configuration: tried hadoop-metrics2-namenode.properties,hadoop-metrics2.properties
   [junit4]   2> 2340305 WARN  (SUITE-MoveReplicaHDFSTest-seed#[227DD5EDF03DB896]-worker) [    ] o.a.h.h.HttpRequestLog Jetty request log can only be enabled using Log4j
   [junit4]   2> 2340306 INFO  (SUITE-MoveReplicaHDFSTest-seed#[227DD5EDF03DB896]-worker) [    ] o.m.log jetty-6.1.26
   [junit4]   2> 2340316 INFO  (SUITE-MoveReplicaHDFSTest-seed#[227DD5EDF03DB896]-worker) [    ] o.m.log Extract jar:file:/export/home/jenkins/.ivy2/cache/org.apache.hadoop/hadoop-hdfs/tests/hadoop-hdfs-2.7.4-tests.jar!/webapps/hdfs to ./temp/Jetty_serv1.vm3_59778_hdfs____92xrp1/webapp
   [junit4]   2> 2340771 INFO  (SUITE-MoveReplicaHDFSTest-seed#[227DD5EDF03DB896]-worker) [    ] o.m.log Started HttpServer2$SelectChannelConnectorWithSafeStartup@serv1-vm3:59778
   [junit4]   2> 2340912 WARN  (SUITE-MoveReplicaHDFSTest-seed#[227DD5EDF03DB896]-worker) [    ] o.a.h.h.HttpRequestLog Jetty request log can only be enabled using Log4j
   [junit4]   2> 2340913 INFO  (SUITE-MoveReplicaHDFSTest-seed#[227DD5EDF03DB896]-worker) [    ] o.m.log jetty-6.1.26
   [junit4]   2> 2340923 INFO  (SUITE-MoveReplicaHDFSTest-seed#[227DD5EDF03DB896]-worker) [    ] o.m.log Extract jar:file:/export/home/jenkins/.ivy2/cache/org.apache.hadoop/hadoop-hdfs/tests/hadoop-hdfs-2.7.4-tests.jar!/webapps/datanode to ./temp/Jetty_localhost_55751_datanode____.kw16hy/webapp
   [junit4]   2> 2341748 INFO  (SUITE-MoveReplicaHDFSTest-seed#[227DD5EDF03DB896]-worker) [    ] o.m.log Started HttpServer2$SelectChannelConnectorWithSafeStartup@localhost:55751
   [junit4]   2> 2341841 WARN  (SUITE-MoveReplicaHDFSTest-seed#[227DD5EDF03DB896]-worker) [    ] o.a.h.h.HttpRequestLog Jetty request log can only be enabled using Log4j
   [junit4]   2> 2341843 INFO  (SUITE-MoveReplicaHDFSTest-seed#[227DD5EDF03DB896]-worker) [    ] o.m.log jetty-6.1.26
   [junit4]   2> 2341859 INFO  (SUITE-MoveReplicaHDFSTest-seed#[227DD5EDF03DB896]-worker) [    ] o.m.log Extract jar:file:/export/home/jenkins/.ivy2/cache/org.apache.hadoop/hadoop-hdfs/tests/hadoop-hdfs-2.7.4-tests.jar!/webapps/datanode to ./temp/Jetty_localhost_36860_datanode____icwxzq/webapp
   [junit4]   2> 2341979 ERROR (DataNode: [[[DISK]file:/export/home/jenkins/workspace/Lucene-Solr-7.x-Solaris/solr/build/solr-core/test/J0/temp/solr.cloud.MoveReplicaHDFSTest_227DD5EDF03DB896-001/tempDir-002/hdfsBaseDir/data/data1/, [DISK]file:/export/home/jenkins/workspace/Lucene-Solr-7.x-Solaris/solr/build/solr-core/test/J0/temp/solr.cloud.MoveReplicaHDFSTest_227DD5EDF03DB896-001/tempDir-002/hdfsBaseDir/data/data2/]]  heartbeating to serv1-vm3/127.0.0.1:44738) [    ] o.a.h.h.s.d.DirectoryScanner dfs.datanode.directoryscan.throttle.limit.ms.per.sec set to value below 1 ms/sec. Assuming default value of 1000
   [junit4]   2> 2341988 INFO  (Block report processor) [    ] BlockStateChange BLOCK* processReport 0x171ac5e3ba8c02: from storage DS-c841a6d4-52e3-442b-b48e-904b79c11dfc node DatanodeRegistration(127.0.0.1:36329, datanodeUuid=991c9482-8359-4efc-b737-02658d04100d, infoPort=37403, infoSecurePort=0, ipcPort=59695, storageInfo=lv=-56;cid=testClusterID;nsid=1059426685;c=0), blocks: 0, hasStaleStorage: true, processing time: 0 msecs
   [junit4]   2> 2341988 INFO  (Block report processor) [    ] BlockStateChange BLOCK* processReport 0x171ac5e3ba8c02: from storage DS-b5917bd4-71f8-4d05-9dc7-39444b8ec23b node DatanodeRegistration(127.0.0.1:36329, datanodeUuid=991c9482-8359-4efc-b737-02658d04100d, infoPort=37403, infoSecurePort=0, ipcPort=59695, storageInfo=lv=-56;cid=testClusterID;nsid=1059426685;c=0), blocks: 0, hasStaleStorage: false, processing time: 0 msecs
   [junit4]   2> 2342256 INFO  (OverseerCollectionConfigSetProcessor-72483798117122054-127.0.0.1:51961_solr-n_0000000000) [    ] o.a.s.c.OverseerTaskQueue Response ZK path: /overseer/collection-queue-work/qnr-0000000000 doesn't exist.  Requestor may have disconnected from ZooKeeper
   [junit4]   2> 2342369 INFO  (SUITE-MoveReplicaHDFSTest-seed#[227DD5EDF03DB896]-worker) [    ] o.m.log Started HttpServer2$SelectChannelConnectorWithSafeStartup@localhost:36860
   [junit4]   2> 2342495 ERROR (DataNode: [[[DISK]file:/export/home/jenkins/workspace/Lucene-Solr-7.x-Solaris/solr/build/solr-core/test/J0/temp/solr.cloud.MoveReplicaHDFSTest_227DD5EDF03DB896-001/tempDir-002/hdfsBaseDir/data/data3/, [DISK]file:/export/home/jenkins/workspace/Lucene-Solr-7.x-Solaris/solr/build/solr-core/test/J0/temp/solr.cloud.MoveReplicaHDFSTest_227DD5EDF03DB896-001/tempDir-002/hdfsBaseDir/data/data4/]]  heartbeating to serv1-vm3/127.0.0.1:44738) [    ] o.a.h.h.s.d.DirectoryScanner dfs.datanode.directoryscan.throttle.limit.ms.per.sec set to value below 1 ms/sec. Assuming default value of 1000
   [junit4]   2> 2342501 INFO  (Block report processor) [    ] BlockStateChange BLOCK* processReport 0x171ac602452dfe: from storage DS-7630fd2b-2e8d-4825-a4a6-913889826c17 node DatanodeRegistration(127.0.0.1:34450, datanodeUuid=c2ab9680-2461-4e04-8adc-842de4ef23ca, infoPort=49102, infoSecurePort=0, ipcPort=40171, storageInfo=lv=-56;cid=testClusterID;nsid=1059426685;c=0), blocks: 0, hasStaleStorage: true, processing time: 0 msecs
   [junit4]   2> 2342501 INFO  (Block report processor) [    ] BlockStateChange BLOCK* processReport 0x171ac602452dfe: from storage DS-36af76f6-f867-4082-a650-05fe64a90c1f node DatanodeRegistration(127.0.0.1:34450, datanodeUuid=c2ab9680-2461-4e04-8adc-842de4ef23ca, infoPort=49102, infoSecurePort=0, ipcPort=40171, storageInfo=lv=-56;cid=testClusterID;nsid=1059426685;c=0), blocks: 0, hasStaleStorage: false, processing time: 0 msecs
   [junit4]   2> 2342702 INFO  (TEST-MoveReplicaHDFSTest.test-seed#[227DD5EDF03DB896]) [    ] o.a.s.c.c.ZkStateReader Updated live nodes from ZooKeeper... (0) -> (4)
   [junit4]   2> 2342707 INFO  (TEST-MoveReplicaHDFSTest.test-seed#[227DD5EDF03DB896]) [    ] o.e.j.s.Server jetty-9.4.11.v20180605; built: 2018-06-05T18:24:03.829Z; git: d5fc0523cfa96bfebfbda19606cad384d772f04c; jvm 1.8.0_172-b11
   [junit4]   2> 2342708 INFO  (TEST-MoveReplicaHDFSTest.test-seed#[227DD5EDF03DB896]) [    ] o.e.j.s.session DefaultSessionIdManager workerName=node0
   [junit4]   2> 2342708 INFO  (TEST-MoveReplicaHDFSTest.test-seed#[227DD5EDF03DB896]) [    ] o.e.j.s.session No SessionScavenger set, using defaults
   [junit4]   2> 2342708 INFO  (TEST-MoveReplicaHDFSTest.test-seed#[227DD5EDF03DB896]) [    ] o.e.j.s.session node0 Scavenging every 660000ms
   [junit4]   2> 2342709 INFO  (TEST-MoveReplicaHDFSTest.test-seed#[227DD5EDF03DB896]) [    ] o.e.j.s.h.ContextHandler Started o.e.j.s.ServletContextHandler@1e6fb6d6{/solr,null,AVAILABLE}
   [junit4]   2> 2342709 INFO  (TEST-MoveReplicaHDFSTest.test-seed#[227DD5EDF03DB896]) [    ] o.e.j.s.AbstractConnector Started ServerConnector@686d5263{HTTP/1.1,[http/1.1]}{127.0.0.1:48937}
   [junit4]   2> 2342709 INFO  (TEST-MoveReplicaHDFSTest.test-seed#[227DD5EDF03DB896]) [    ] o.e.j.s.Server Started @2343984ms
   [junit4]   2> 2342709 INFO  (TEST-MoveReplicaHDFSTest.test-seed#[227DD5EDF03DB896]) [    ] o.a.s.c.s.e.JettySolrRunner Jetty properties: {hostContext=/solr, hostPort=48937}
   [junit4]   2> 2342710 ERROR (TEST-MoveReplicaHDFSTest.test-seed#[227DD5EDF03DB896]) [    ] o.a.s.u.StartupLoggingUtils Missing Java Option solr.log.dir. Logging may be missing or incomplete.
   [junit4]   2> 2342710 INFO  (TEST-MoveReplicaHDFSTest.test-seed#[227DD5EDF03DB896]) [    ] o.a.s.s.SolrDispatchFilter Using logger factory org.apache.logging.slf4j.Log4jLoggerFactory
   [junit4]   2> 2342710 INFO  (TEST-MoveReplicaHDFSTest.test-seed#[227DD5EDF03DB896]) [    ] o.a.s.s.SolrDispatchFilter  ___      _       Welcome to Apache Solr? version 7.5.0
   [junit4]   2> 2342710 INFO  (TEST-MoveReplicaHDFSTest.test-seed#[227DD5EDF03DB896]) [    ] o.a.s.s.SolrDispatchFilter / __| ___| |_ _   Starting in cloud mode on port null
   [junit4]   2> 2342710 INFO  (TEST-MoveReplicaHDFSTest.test-seed#[227DD5EDF03DB896]) [    ] o.a.s.s.SolrDispatchFilter \__ \/ _ \ | '_|  Install dir: null
   [junit4]   2> 2342710 INFO  (TEST-MoveReplicaHDFSTest.test-seed#[227DD5EDF03DB896]) [    ] o.a.s.s.SolrDispatchFilter |___/\___/_|_|    Start time: 2018-07-10T14:58:41.140Z
   [junit4]   2> 2342712 INFO  (zkConnectionManagerCallback-9135-thread-1) [    ] o.a.s.c.c.ConnectionManager zkClient has connected
   [junit4]   2> 2342712 INFO  (TEST-MoveReplicaHDFSTest.test-seed#[227DD5EDF03DB896]) [    ] o.a.s.s.SolrDispatchFilter solr.xml found in ZooKeeper. Loading...
   [junit4]   2> 2342921 INFO  (TEST-MoveReplicaHDFSTest.test-seed#[227DD5EDF03DB896]) [    ] o.a.s.c.ZkContainer Zookeeper client=127.0.0.1:56291/solr
   [junit4]   2> 2342922 INFO  (zkConnectionManagerCallback-9139-thread-1) [    ] o.a.s.c.c.ConnectionManager zkClient has connected
   [junit4]   2> 2342925 INFO  (zkConnectionManagerCallback-9141-thread-1) [    ] o.a.s.c.c.ConnectionManager zkClient has connected
   [junit4]   2> 2342933 INFO  (TEST-MoveReplicaHDFSTest.test-seed#[227DD5EDF03DB896]) [n:127.0.0.1:48937_solr    ] o.a.s.c.c.ZkStateReader Updated live nodes from ZooKeeper... (0) -> (4)
   [junit4]   2> 2342937 INFO  (TEST-MoveReplicaHDFSTest.test-seed#[227DD5EDF03DB896]) [n:127.0.0.1:48937_solr    ] o.a.s.c.Overseer Overseer (id=null) closing
   [junit4]   2> 2342940 INFO  (TEST-MoveReplicaHDFSTest.test-seed#[227DD5EDF03DB896]) [n:127.0.0.1:48937_solr    ] o.a.s.c.TransientSolrCoreCacheDefault Allocating transient cache for 2147483647 transient cores
   [junit4]   2> 2342940 INFO  (TEST-MoveReplicaHDFSTest.test-seed#[227DD5EDF03DB896]) [n:127.0.0.1:48937_solr    ] o.a.s.c.ZkController Register node as live in ZooKeeper:/live_nodes/127.0.0.1:48937_solr
   [junit4]   2> 2342941 INFO  (zkCallback-9073-thread-1) [    ] o.a.s.c.c.ZkStateReader Updated live nodes from ZooKeeper... (4) -> (5)
   [junit4]   2> 2342941 INFO  (zkCallback-9082-thread-1) [    ] o.a.s.c.c.ZkStateReader Updated live nodes from ZooKeeper... (4) -> (5)
   [junit4]   2> 2342942 INFO  (zkCallback-9086-thread-1) [    ] o.a.s.c.c.ZkStateReader Updated live nodes from ZooKeeper... (4) -> (5)
   [junit4]   2> 2342942 INFO  (zkCallback-9093-thread-1) [    ] o.a.s.c.c.ZkStateReader Updated live nodes from ZooKeeper... (4) -> (5)
   [junit4]   2> 2342942 INFO  (zkCallback-9122-thread-1) [    ] o.a.s.c.c.ZkStateReader Updated live nodes from ZooKeeper... (4) -> (5)
   [junit4]   2> 2342942 INFO  (zkCallback-9108-thread-1) [    ] o.a.s.c.c.ZkStateReader Updated live nodes from ZooKeeper... (4) -> (5)
   [junit4]   2> 2342942 INFO  (zkCallback-9130-thread-1) [    ] o.a.s.c.c.ZkStateReader Updated live nodes from ZooKeeper... (4) -> (5)
   [junit4]   2> 2342942 INFO  (zkCallback-9130-thread-2) [    ] o.a.s.c.c.ZkStateReader Updated live nodes from ZooKeeper... (4) -> (5)
   [junit4]   2> 2342942 INFO  (zkCallback-9101-thread-1) [    ] o.a.s.c.c.ZkStateReader Updated live nodes from ZooKeeper... (4) -> (5)
   [junit4]   2> 2342943 INFO  (zkCallback-9115-thread-1) [    ] o.a.s.c.c.ZkStateReader Updated live nodes from ZooKeeper... (4) -> (5)
   [junit4]   2> 2342952 INFO  (zkCallback-9140-thread-1) [    ] o.a.s.c.c.ZkStateReader Updated live nodes from ZooKeeper... (4) -> (5)
   [junit4]   2> 2342972 INFO  (zkConnectionManagerCallback-9148-thread-1) [    ] o.a.s.c.c.ConnectionManager zkClient has connected
   [junit4]   2> 2342974 INFO  (TEST-MoveReplicaHDFSTest.test-seed#[227DD5EDF03DB896]) [n:127.0.0.1:48937_solr    ] o.a.s.c.c.ZkStateReader Updated live nodes from ZooKeeper... (0) -> (5)
   [junit4]   2> 2342975 INFO  (TEST-MoveReplicaHDFSTest.test-seed#[227DD5EDF03DB896]) [n:127.0.0.1:48937_solr    ] o.a.s.c.s.i.ZkClientClusterStateProvider Cluster at 127.0.0.1:56291/solr ready
   [junit4]   2> 2342976 INFO  (TEST-MoveReplicaHDFSTest.test-seed#[227DD5EDF03DB896]) [n:127.0.0.1:48937_solr    ] o.a.s.h.a.MetricsHistoryHandler No .system collection, keeping metrics history in memory.
   [junit4]   2> 2342990 INFO  (TEST-MoveReplicaHDFSTest.test-seed#[227DD5EDF03DB896]) [n:127.0.0.1:48937_solr    ] o.a.s.m.r.SolrJmxReporter JMX monitoring for 'solr_48937.solr.node' (registry 'solr.node') enabled at server: com.sun.jmx.mbeanserver.JmxMBeanServer@6b43b62a
   [junit4]   2> 2342997 INFO  (TEST-MoveReplicaHDFSTest.test-seed#[227DD5EDF03DB896]) [n:127.0.0.1:48937_solr    ] o.a.s.m.r.SolrJmxReporter JMX monitoring for 'solr_48937.solr.jvm' (registry 'solr.jvm') enabled at server: com.sun.jmx.mbeanserver.JmxMBeanServer@6b43b62a
   [junit4]   2> 2342997 INFO  (TEST-MoveReplicaHDFSTest.test-seed#[227DD5EDF03DB896]) [n:127.0.0.1:48937_solr    ] o.a.s.m.r.SolrJmxReporter JMX monitoring for 'solr_48937.solr.jetty' (registry 'solr.jetty') enabled at server: com.sun.jmx.mbeanserver.JmxMBeanServer@6b43b62a
   [junit4]   2> 2342998 INFO  (TEST-MoveReplicaHDFSTest.test-seed#[227DD5EDF03DB896]) [n:127.0.0.1:48937_solr    ] o.a.s.c.CorePropertiesLocator Found 0 core definitions underneath /export/home/jenkins/workspace/Lucene-Solr-7.x-Solaris/solr/build/solr-core/test/J0/temp/solr.cloud.MoveReplicaHDFSTest_227DD5EDF03DB896-001/tempDir-001/node5/.
   [junit4]   2> 2343038 INFO  (zkConnectionManagerCallback-9151-thread-1) [    ] o.a.s.c.c.ConnectionManager zkClient has connected
   [junit4]   2> 2343040 INFO  (TEST-MoveReplicaHDFSTest.test-seed#[227DD5EDF03DB896]) [    ] o.a.s.c.MoveReplicaTest total_jettys: 5
   [junit4]   2> 2343043 INFO  (qtp1507862725-25523) [n:127.0.0.1:36705_solr    ] o.a.s.h.a.CollectionsHandler Invoked Collection Action :create with params collection.configName=conf1&maxShardsPerNode=2&autoAddReplicas=false&name=MoveReplicaHDFSTest_coll_true&nrtReplicas=2&action=CREATE&numShards=2&wt=javabin&version=2 and sendToOCPQueue=true
   [junit4]   2> 2343046 INFO  (OverseerThreadFactory-9669-thread-2) [    ] o.a.s.c.a.c.CreateCollectionCmd Create collection MoveReplicaHDFSTest_coll_true
   [junit4]   2> 2343157 INFO  (OverseerStateUpdate-72483798117122054-127.0.0.1:51961_solr-n_0000000000) [    ] o.a.s.c.o.SliceMutator createReplica() {
   [junit4]   2>   "operation":"ADDREPLICA",
   [junit4]   2>   "collection":"MoveReplicaHDFSTest_coll_true",
   [junit4]   2>   "shard":"shard1",
   [junit4]   2>   "core":"MoveReplicaHDFSTest_coll_true_shard1_replica_n1",
   [junit4]   2>   "state":"down",
   [junit4]   2>   "base_url":"http://127.0.0.1:48937/solr",
   [junit4]   2>   "type":"NRT",
   [junit4]   2>   "waitForFinalState":"false"} 
   [junit4]   2> 2343160 INFO  (OverseerStateUpdate-72483798117122054-127.0.0.1:51961_solr-n_0000000000) [    ] o.a.s.c.o.SliceMutator createReplica() {
   [junit4]   2>   "operation":"ADDREPLICA",
   [junit4]   2>   "collection":"MoveReplicaHDFSTest_coll_true",
   [junit4]   2>   "shard":"shard1",
   [junit4]   2>   "core":"MoveReplicaHDFSTest_coll_true_shard1_replica_n2",
   [junit4]   2>   "state":"down",
   [junit4]   2>   "base_url":"http://127.0.0.1:51961/solr",
   [junit4]   2>   "type":"NRT",
   [junit4]   2>   "waitForFinalState":"false"} 
   [junit4]   2> 2343163 INFO  (OverseerStateUpdate-72483798117122054-127.0.0.1:51961_solr-n_0000000000) [    ] o.a.s.c.o.SliceMutator createReplica() {
   [junit4]   2>   "operation":"ADDREPLICA",
   [junit4]   2>   "collection":"MoveReplicaHDFSTest_coll_true",
   [junit4]   2>   "shard":"shard2",
   [junit4]   2>   "core":"MoveReplicaHDFSTest_coll_true_shard2_replica_n4",
   [junit4]   2>   "state":"down",
   [junit4]   2>   "base_url":"http://127.0.0.1:52256/solr",
   [junit4]   2>   "type":"NRT",
   [junit4]   2>   "waitForFinalState":"false"} 
   [junit4]   2> 2343166 INFO  (OverseerStateUpdate-72483798117122054-127.0.0.1:51961_solr-n_0000000000) [    ] o.a.s.c.o.SliceMutator createReplica() {
   [junit4]   2>   "operation":"ADDREPLICA",
   [junit4]   2>   "collection":"MoveReplicaHDFSTest_coll_true",
   [junit4]   2>   "shard":"shard2",
   [junit4]   2>   "core":"MoveReplicaHDFSTest_coll_true_shard2_replica_n6",
   [junit4]   2>   "state":"down",
   [junit4]   2>   "base_url":"http://127.0.0.1:36705/solr",
   [junit4]   2>   "type":"NRT",
   [junit4]   2>   "waitForFinalState":"false"} 
   [junit4]   2> 2343371 INFO  (qtp1507862725-25522) [n:127.0.0.1:36705_solr    x:MoveReplicaHDFSTest_coll_true_shard2_replica_n6] o.a.s.h.a.CoreAdminOperation core create command qt=/admin/cores&coreNodeName=core_node8&collection.configName=conf1&newCollection=true&name=MoveReplicaHDFSTest_coll_true_shard2_replica_n6&action=CREATE&numShards=2&collection=MoveReplicaHDFSTest_coll_true&shard=shard2&wt=javabin&version=2&replicaType=NRT
   [junit4]   2> 2343371 INFO  (qtp173491121-25542) [n:127.0.0.1:52256_solr    x:MoveReplicaHDFSTest_coll_true_shard2_replica_n4] o.a.s.h.a.CoreAdminOperation core create command qt=/admin/cores&coreNodeName=core_node7&collection.configName=conf1&newCollection=true&name=MoveReplicaHDFSTest_coll_true_shard2_replica_n4&action=CREATE&numShards=2&collection=MoveReplicaHDFSTest_coll_true&shard=shard2&wt=javabin&version=2&replicaType=NRT
   [junit4]   2> 2343372 INFO  (qtp1910414195-25534) [n:127.0.0.1:51961_solr    x:MoveReplicaHDFSTest_coll_true_shard1_replica_n2] o.a.s.h.a.CoreAdminOperation core create command qt=/admin/cores&coreNodeName=core_node5&collection.configName=conf1&newCollection=true&name=MoveReplicaHDFSTest_coll_true_shard1_replica_n2&action=CREATE&numShards=2&collection=MoveReplicaHDFSTest_coll_true&shard=shard1&wt=javabin&version=2&replicaType=NRT
   [junit4]   2> 2343372 INFO  (qtp1910414195-25534) [n:127.0.0.1:51961_solr    x:MoveReplicaHDFSTest_coll_true_shard1_replica_n2] o.a.s.c.TransientSolrCoreCacheDefault Allocating transient cache for 2147483647 transient cores
   [junit4]   2> 2343373 INFO  (qtp71428778-25816) [n:127.0.0.1:48937_solr    x:MoveReplicaHDFSTest_coll_true_shard1_replica_n1] o.a.s.h.a.CoreAdminOperation core create command qt=/admin/cores&coreNodeName=core_node3&collection.configName=conf1&newCollection=true&name=MoveReplicaHDFSTest_coll_true_shard1_replica_n1&action=CREATE&numShards=2&collection=MoveReplicaHDFSTest_coll_true&shard=shard1&wt=javabin&version=2&replicaType=NRT
   [junit4]   2> 2344949 INFO  (qtp1910414195-25534) [n:127.0.0.1:51961_solr c:MoveReplicaHDFSTest_coll_true s:shard1 r:core_node5 x:MoveReplicaHDFSTest_coll_true_shard1_replica_n2] o.a.s.c.SolrConfig Using Lucene MatchVersion: 7.5.0
   [junit4]   2> 2344949 INFO  (qtp1507862725-25522) [n:127.0.0.1:36705_solr c:MoveReplicaHDFSTest_coll_true s:shard2 r:core_node8 x:MoveReplicaHDFSTest_coll_true_shard2_replica_n6] o.a.s.c.SolrConfig Using Lucene MatchVersion: 7.5.0
   [junit4]   2> 2344950 INFO  (qtp71428778-25816) [n:127.0.0.1:48937_solr c:MoveReplicaHDFSTest_coll_true s:shard1 r:core_node3 x:MoveReplicaHDFSTest_coll_true_shard1_replica_n1] o.a.s.c.SolrConfig Using Lucene MatchVersion: 7.5.0
   [junit4]   2> 2344966 INFO  (qtp1910414195-25534) [n:127.0.0.1:51961_solr c:MoveReplicaHDFSTest_coll_true s:shard1 r:core_node5 x:MoveReplicaHDFSTest_coll_true_shard1_replica_n2] o.a.s.s.IndexSchema [MoveReplicaHDFSTest_coll_true_shard1_replica_n2] Schema name=minimal
   [junit4]   2> 2344966 INFO  (qtp71428778-25816) [n:127.0.0.1:48937_solr c:MoveReplicaHDFSTest_coll_true s:shard1 r:core_node3 x:MoveReplicaHDFSTest_coll_true_shard1_replica_n1] o.a.s.s.IndexSchema [MoveReplicaHDFSTest_coll_true_shard1_replica_n1] Schema name=minimal
   [junit4]   2> 2344968 INFO  (qtp1910414195-25534) [n:127.0.0.1:51961_solr c:MoveReplicaHDFSTest_coll_true s:shard1 r:core_node5 x:MoveReplicaHDFSTest_coll_true_shard1_replica_n2] o.a.s.s.IndexSchema Loaded schema minimal/1.1 with uniqueid field id
   [junit4]   2> 2344968 INFO  (qtp71428778-25816) [n:127.0.0.1:48937_solr c:MoveReplicaHDFSTest_coll_true s:shard1 r:core_node3 x:MoveReplicaHDFSTest_coll_true_shard1_replica_n1] o.a.s.s.IndexSchema Loaded schema minimal/1.1 with uniqueid field id
   [junit4]   2> 2344968 INFO  (qtp1910414195-25534) [n:127.0.0.1:51961_solr c:MoveReplicaHDFSTest_coll_true s:shard1 r:core_node5 x:MoveReplicaHDFSTest_coll_true_shard1_replica_n2] o.a.s.c.CoreContainer Creating SolrCore 'MoveReplicaHDFSTest_coll_true_shard1_replica_n2' using configuration from collection MoveReplicaHDFSTest_coll_true, trusted=true
   [junit4]   2> 2344968 INFO  (qtp71428778-25816) [n:127.0.0.1:48937_solr c:MoveReplicaHDFSTest_coll_true s:shard1 r:core_node3 x:MoveReplicaHDFSTest_coll_true_shard1_replica_n1] o.a.s.c.CoreContainer Creating SolrCore 'MoveReplicaHDFSTest_coll_true_shard1_replica_n1' using configuration from collection MoveReplicaHDFSTest_coll_true, trusted=true
   [junit4]   2> 2344968 INFO  (qtp173491121-25542) [n:127.0.0.1:52256_solr c:MoveReplicaHDFSTest_coll_true s:shard2 r:core_node7 x:MoveReplicaHDFSTest_coll_true_shard2_replica_n4] o.a.s.c.SolrConfig Using Lucene MatchVersion: 7.5.0
   [junit4]   2> 2344968 INFO  (qtp71428778-25816) [n:127.0.0.1:48937_solr c:MoveReplicaHDFSTest_coll_true s:shard1 r:core_node3 x:MoveReplicaHDFSTest_coll_true_shard1_replica_n1] o.a.s.m.r.SolrJmxReporter JMX monitoring for 'solr_48937.solr.core.MoveReplicaHDFSTest_coll_true.shard1.replica_n1' (registry 'solr.core.MoveReplicaHDFSTest_coll_true.shard1.replica_n1') enabled at server: com.sun.jmx.mbeanserver.JmxMBeanServer@6b43b62a
   [junit4]   2> 2344968 INFO  (qtp1910414195-25534) [n:127.0.0.1:51961_solr c:MoveReplicaHDFSTest_coll_true s:shard1 r:core_node5 x:MoveReplicaHDFSTest_coll_true_shard1_replica_n2] o.a.s.m.r.SolrJmxReporter JMX monitoring for 'solr_51961.solr.core.MoveReplicaHDFSTest_coll_true.shard1.replica_n2' (registry 'solr.core.MoveReplicaHDFSTest_coll_true.shard1.replica_n2') enabled at server: com.sun.jmx.mbeanserver.JmxMBeanServer@6b43b62a
   [junit4]   2> 2344971 INFO  (qtp1507862725-25522) [n:127.0.0.1:36705_solr c:MoveReplicaHDFSTest_coll_true s:shard2 r:core_node8 x:MoveReplicaHDFSTest_coll_true_shard2_replica_n6] o.a.s.s.IndexSchema [MoveReplicaHDFSTest_coll_true_shard2_replica_n6] Schema name=minimal
   [junit4]   2> 2344972 INFO  (qtp1507862725-25522) [n:127.0.0.1:36705_solr c:MoveReplicaHDFSTest_coll_true s:shard2 r:core_node8 x:MoveReplicaHDFSTest_coll_true_shard2_replica_n6] o.a.s.s.IndexSchema Loaded schema minimal/1.1 with uniqueid field id
   [junit4]   2> 2344972 INFO  (qtp1507862725-25522) [n:127.0.0.1:36705_solr c:MoveReplicaHDFSTest_coll_true s:shard2 r:core_node8 x:MoveReplicaHDFSTest_coll_true_shard2_replica_n6] o.a.s.c.CoreContainer Creating SolrCore 'MoveReplicaHDFSTest_coll_true_shard2_replica_n6' using configuration from collection MoveReplicaHDFSTest_coll_true, trusted=true
   [junit4]   2> 2344972 INFO  (qtp1507862725-25522) [n:127.0.0.1:36705_solr c:MoveReplicaHDFSTest_coll_true s:shard2 r:core_node8 x:MoveReplicaHDFSTest_coll_true_shard2_replica_n6] o.a.s.m.r.SolrJmxReporter JMX monitoring for 'solr_36705.solr.core.MoveReplicaHDFSTest_coll_true.shard2.replica_n6' (registry 'solr.core.MoveReplicaHDFSTest_coll_true.shard2.replica_n6') enabled at server: com.sun.jmx.mbeanserver.JmxMBeanServer@6b43b62a
   [junit4]   2> 2344975 INFO  (qtp71428778-25816) [n:127.0.0.1:48937_solr c:MoveReplicaHDFSTest_coll_true s:shard1 r:core_node3 x:MoveReplicaHDFSTest_coll_true_shard1_replica_n1] o.a.s.c.HdfsDirectoryFactory solr.hdfs.home=hdfs://serv1-vm3:44738/data
   [junit4]   2> 2344975 INFO  (qtp71428778-25816) [n:127.0.0.1:48937_solr c:MoveReplicaHDFSTest_coll_true s:shard1 r:core_node3 x:MoveReplicaHDFSTest_coll_true_shard1_replica_n1] o.a.s.c.HdfsDirectoryFactory Solr Kerberos Authentication disabled
   [junit4]   2> 2344975 INFO  (qtp71428778-25816) [n:127.0.0.1:48937_solr c:MoveReplicaHDFSTest_coll_true s:shard1 r:core_node3 x:MoveReplicaHDFSTest_coll_true_shard1_replica_n1] o.a.s.c.SolrCore solr.RecoveryStrategy.Builder
   [junit4]   2> 2344976 INFO  (qtp71428778-25816) [n:127.0.0.1:48937_solr c:MoveReplicaHDFSTest_coll_true s:shard1 r:core_node3 x:MoveReplicaHDFSTest_coll_true_shard1_replica_n1] o.a.s.c.SolrCore [[MoveReplicaHDFSTest_coll_true_shard1_replica_n1] ] Opening new SolrCore at [/export/home/jenkins/workspace/Lucene-Solr-7.x-Solaris/solr/build/solr-core/test/J0/temp/solr.cloud.MoveReplicaHDFSTest_227DD5EDF03DB896-001/tempDir-001/node5/MoveReplicaHDFSTest_coll_true_shard1_replica_n1], dataDir=[hdfs://serv1-vm3:44738/data/MoveReplicaHDFSTest_coll_true/core_node3/data/]
   [junit4]   2> 2344976 INFO  (qtp1910414195-25534) [n:127.0.0.1:51961_solr c:MoveReplicaHDFSTest_coll_true s:shard1 r:core_node5 x:MoveReplicaHDFSTest_coll_true_shard1_replica_n2] o.a.s.c.HdfsDirectoryFactory solr.hdfs.home=hdfs://serv1-vm3:44738/data
   [junit4]   2> 2344976 INFO  (qtp1910414195-25534) [n:127.0.0.1:51961_solr c:MoveReplicaHDFSTest_coll_true s:shard1 r:core_node5 x:MoveReplicaHDFSTest_coll_true_shard1_replica_n2] o.a.s.c.HdfsDirectoryFactory Solr Kerberos Authentication disabled
   [junit4]   2> 2344976 INFO  (qtp1910414195-25534) [n:127.0.0.1:51961_solr c:MoveReplicaHDFSTest_coll_true s:shard1 r:core_node5 x:MoveReplicaHDFSTest_coll_true_shard1_replica_n2] o.a.s.c.SolrCore solr.RecoveryStrategy.Builder
   [junit4]   2> 2344976 INFO  (qtp1910414195-25534) [n:127.0.0.1:51961_solr c:MoveReplicaHDFSTest_coll_true s:shard1 r:core_node5 x:MoveReplicaHDFSTest_coll_true_shard1_replica_n2] o.a.s.c.SolrCore [[MoveReplicaHDFSTest_coll_true_shard1_replica_n2] ] Opening new SolrCore at [/export/home/jenkins/workspace/Lucene-Solr-7.x-Solaris/solr/build/solr-core/test/J0/temp/solr.cloud.MoveReplicaHDFSTest_227DD5EDF03DB896-001/tempDir-001/node4/MoveReplicaHDFSTest_coll_true_shard1_replica_n2], dataDir=[hdfs://serv1-vm3:44738/data/MoveReplicaHDFSTest_coll_true/core_node5/data/]
   [junit4]   2> 2344976 INFO  (qtp71428778-25816) [n:127.0.0.1:48937_solr c:MoveReplicaHDFSTest_coll_true s:shard1 r:core_node3 x:MoveReplicaHDFSTest_coll_true_shard1_replica_n1] o.a.s.c.HdfsDirectoryFactory creating directory factory for path hdfs://serv1-vm3:44738/data/MoveReplicaHDFSTest_coll_true/core_node3/data/snapshot_metadata
   [junit4]   2> 2344976 INFO  (qtp1910414195-25534) [n:127.0.0.1:51961_solr c:MoveReplicaHDFSTest_coll_true s:shard1 r:core_node5 x:MoveReplicaHDFSTest_coll_true_shard1_replica_n2] o.a.s.c.HdfsDirectoryFactory creating directory factory for path hdfs://serv1-vm3:44738/data/MoveReplicaHDFSTest_coll_true/core_node5/data/snapshot_metadata
   [junit4]   2> 2344977 INFO  (qtp173491121-25542) [n:127.0.0.1:52256_solr c:MoveReplicaHDFSTest_coll_true s:shard2 r:core_node7 x:MoveReplicaHDFSTest_coll_true_shard2_replica_n4] o.a.s.s.IndexSchema [MoveReplicaHDFSTest_coll_true_shard2_replica_n4] Schema name=minimal
   [junit4]   2> 2344978 INFO  (qtp1507862725-25522) [n:127.0.0.1:36705_solr c:MoveReplicaHDFSTest_coll_true s:shard2 r:core_node8 x:MoveReplicaHDFSTest_coll_true_shard2_replica_n6] o.a.s.c.HdfsDirectoryFactory solr.hdfs.home=hdfs://serv1-vm3:44738/data
   [junit4]   2> 2344978 INFO  (qtp1507862725-25522) [n:127.0.0.1:36705_solr c:MoveReplicaHDFSTest_coll_true s:shard2 r:core_node8 x:MoveReplicaHDFSTest_coll_true_shard2_replica_n6] o.a.s.c.HdfsDirectoryFactory Solr Kerberos Authentication disabled
   [junit4]   2> 2344978 INFO  (qtp1507862725-25522) [n:127.0.0.1:36705_solr c:MoveReplicaHDFSTest_coll_true s:shard2 r:core_node8 x:MoveReplicaHDFSTest_coll_true_shard2_replica_n6] o.a.s.c.SolrCore solr.RecoveryStrategy.Builder
   [junit4]   2> 2344978 INFO  (qtp1507862725-25522) [n:127.0.0.1:36705_solr c:MoveReplicaHDFSTest_coll_true s:shard2 r:core_node8 x:MoveReplicaHDFSTest_coll_true_shard2_replica_n6] o.a.s.c.SolrCore [[MoveReplicaHDFSTest_coll_true_shard2_replica_n6] ] Opening new SolrCore at [/export/home/jenkins/workspace/Lucene-Solr-7.x-Solaris/solr/build/solr-core/test/J0/temp/solr.cloud.MoveReplicaHDFSTest_227DD5EDF03DB896-001/tempDir-001/node1/MoveReplicaHDFSTest_coll_true_shard2_replica_n6], dataDir=[hdfs://serv1-vm3:44738/data/MoveReplicaHDFSTest_coll_true/core_node8/data/]
   [junit4]   2> 2344981 INFO  (qtp1507862725-25522) [n:127.0.0.1:36705_solr c:MoveReplicaHDFSTest_coll_true s:shard2 r:core_node8 x:MoveReplicaHDFSTest_coll_true_shard2_replica_n6] o.a.s.c.HdfsDirectoryFactory creating directory factory for path hdfs://serv1-vm3:44738/data/MoveReplicaHDFSTest_coll_true/core_node8/data/snapshot_metadata
   [junit4]   2> 2344982 INFO  (qtp173491121-25542) [n:127.0.0.1:52256_solr c:MoveReplicaHDFSTest_coll_true s:shard2 r:core_node7 x:MoveReplicaHDFSTest_coll_true_shard2_replica_n4] o.a.s.s.IndexSchema Loaded schema minimal/1.1 with uniqueid field id
   [junit4]   2> 2344982 INFO  (qtp173491121-25542) [n:127.0.0.1:52256_solr c:MoveReplicaHDFSTest_coll_true s:shard2 r:core_node7 x:MoveReplicaHDFSTest_coll_true_shard2_replica_n4] o.a.s.c.CoreContainer Creating SolrCore 'MoveReplicaHDFSTest_coll_true_shard2_replica_n4' using configuration from collection MoveReplicaHDFSTest_coll_true, trusted=true
   [junit4]   2> 2344982 INFO  (qtp173491121-25542) [n:127.0.0.1:52256_solr c:MoveReplicaHDFSTest_coll_true s:shard2 r:core_node7 x:MoveReplicaHDFSTest_coll_true_shard2_replica_n4] o.a.s.m.r.SolrJmxReporter JMX monitoring for 'solr_52256.solr.core.MoveReplicaHDFSTest_coll_true.shard2.replica_n4' (registry 'solr.core.MoveReplicaHDFSTest_coll_true.shard2.replica_n4') enabled at server: com.sun.jmx.mbeanserver.JmxMBeanServer@6b43b62a
   [junit4]   2> 2344982 INFO  (qtp173491121-25542) [n:127.0.0.1:52256_solr c:MoveReplicaHDFSTest_coll_true s:shard2 r:core_node7 x:MoveReplicaHDFSTest_coll_true_shard2_replica_n4] o.a.s.c.HdfsDirectoryFactory solr.hdfs.home=hdfs://serv1-vm3:44738/data
   [junit4]   2> 2344982 INFO  (qtp173491121-25542) [n:127.0.0.1:52256_solr c:MoveReplicaHDFSTest_coll_true s:shard2 r:core_node7 x:MoveReplicaHDFSTest_coll_true_shard2_replica_n4] o.a.s.c.HdfsDirectoryFactory Solr Kerberos Authentication disabled
   [junit4]   2> 2344982 INFO  (qtp173491121-25542) [n:127.0.0.1:52256_solr c:MoveReplicaHDFSTest_coll_true s:shard2 r:core_node7 x:MoveReplicaHDFSTest_coll_true_shard2_replica_n4] o.a.s.c.SolrCore solr.RecoveryStrategy.Builder
   [junit4]   2> 2344982 INFO  (qtp173491121-25542) [n:127.0.0.1:52256_solr c:MoveReplicaHDFSTest_coll_true s:shard2 r:core_node7 x:MoveReplicaHDFSTest_coll_true_shard2_replica_n4] o.a.s.c.SolrCore [[MoveReplicaHDFSTest_coll_true_shard2_replica_n4] ] Opening new SolrCore at [/export/home/jenkins/workspace/Lucene-Solr-7.x-Solaris/solr/build/solr-core/test/J0/temp/solr.cloud.MoveReplicaHDFSTest_227DD5EDF03DB896-001/tempDir-001/node3/MoveReplicaHDFSTest_coll_true_shard2_replica_n4], dataDir=[hdfs://serv1-vm3:44738/data/MoveReplicaHDFSTest_coll_true/core_node7/data/]
   [junit4]   2> 2344984 INFO  (qtp173491121-25542) [n:127.0.0.1:52256_solr c:MoveReplicaHDFSTest_coll_true s:shard2 r:core_node7 x:MoveReplicaHDFSTest_coll_true_shard2_replica_n4] o.a.s.c.HdfsDirectoryFactory creating directory factory for path hdfs://serv1-vm3:44738/data/MoveReplicaHDFSTest_coll_true/core_node7/data/snapshot_metadata
   [junit4]   2> 2344990 WARN  (qtp71428778-25816) [n:127.0.0.1:48937_solr c:MoveReplicaHDFSTest_coll_true s:shard1 r:core_node3 x:MoveReplicaHDFSTest_coll_true_shard1_replica_n1] o.a.s.s.h.HdfsDirectory The NameNode is in SafeMode - Solr will wait 5 seconds and try again.
   [junit4]   2> 2344993 WARN  (qtp1507862725-25522) [n:127.0.0.1:36705_solr c:MoveReplicaHDFSTest_coll_true s:shard2 r:core_node8 x:MoveReplicaHDFSTest_coll_true_shard2_replica_n6] o.a.s.s.h.HdfsDirectory The NameNode is in SafeMode - Solr will wait 5 seconds and try again.
   [junit4]   2> 2344993 WARN  (qtp1910414195-25534) [n:127.0.0.1:51961_solr c:MoveReplicaHDFSTest_coll_true s:shard1 r:core_node5 x:MoveReplicaHDFSTest_coll_true_shard1_replica_n2] o.a.s.s.h.HdfsDirectory The NameNode is in SafeMode - Solr will wait 5 seconds and try again.
   [junit4]   2> 2344996 WARN  (qtp173491121-25542) [n:127.0.0.1:52256_solr c:MoveReplicaHDFSTest_coll_true s:shard2 r:core_node7 x:MoveReplicaHDFSTest_coll_true_shard2_replica_n4] o.a.s.s.h.HdfsDirectory The NameNode is in SafeMode - Solr will wait 5 seconds and try again.
   [junit4]   2> 2349991 WARN  (qtp71428778-25816) [n:127.0.0.1:48937_solr c:MoveReplicaHDFSTest_coll_true s:shard1 r:core_node3 x:MoveReplicaHDFSTest_coll_true_shard1_replica_n1] o.a.s.s.h.HdfsDirectory The NameNode is in SafeMode - Solr will wait 5 seconds and try again.
   [junit4]   2> 2349994 WARN  (qtp1507862725-25522) [n:127.0.0.1:36705_solr c:MoveReplicaHDFSTest_coll_true s:shard2 r:core_node8 x:MoveReplicaHDFSTest_coll_true_shard2_replica_n6] o.a.s.s.h.HdfsDirectory The NameNode is in SafeMode - Solr will wait 5 seconds and try again.
   [junit4]   2> 2349994 WARN  (qtp1910414195-25534) [n:127.0.0.1:51961_solr c:MoveReplicaHDFSTest_coll_true s:shard1 r:core_node5 x:MoveReplicaHDFSTest_coll_true_shard1_replica_n2] o.a.s.s.h.HdfsDirectory The NameNode is in SafeMode - Solr will wait 5 seconds and try again.
   [junit4]   2> 2349997 WARN  (qtp173491121-25542) [n:127.0.0.1:52256_solr c:MoveReplicaHDFSTest_coll_true s:shard2 r:core_node7 x:MoveReplicaHDFSTest_coll_true_shard2_replica_n4] o.a.s.s.h.HdfsDirectory The NameNode is in SafeMode - Solr will wait 5 seconds and try again.
   [junit4]   2> 2355025 INFO  (qtp71428778-25816) [n:127.0.0.1:48937_solr c:MoveReplicaHDFSTest_coll_true s:shard1 r:core_node3 x:MoveReplicaHDFSTest_coll_true_shard1_replica_n1] o.a.s.c.HdfsDirectoryFactory creating directory factory for path hdfs://serv1-vm3:44738/data/MoveReplicaHDFSTest_coll_true/core_node3/data
   [junit4]   2> 2355026 INFO  (qtp1910414195-25534) [n:127.0.0.1:51961_solr c:MoveReplicaHDFSTest_coll_true s:shard1 r:core_node5 x:MoveReplicaHDFSTest_coll_true_shard1_replica_n2] o.a.s.c.HdfsDirectoryFactory creating directory factory for path hdfs://serv1-vm3:44738/data/MoveReplicaHDFSTest_coll_true/core_node5/data
   [junit4]   2> 2355027 INFO  (qtp1507862725-25522) [n:127.0.0.1:36705_solr c:MoveReplicaHDFSTest_coll_true s:shard2 r:core_node8 x:MoveReplicaHDFSTest_coll_true_shard2_replica_n6] o.a.s.c.HdfsDirectoryFactory creating directory factory for path hdfs://serv1-vm3:44738/data/MoveReplicaHDFSTest_coll_true/core_node8/data
   [junit4]   2> 2355030 INFO  (qtp173491121-25542) [n:127.0.0.1:52256_solr c:MoveReplicaHDFSTest_coll_true s:shard2 r:core_node7 x:MoveReplicaHDFSTest_coll_true_shard2_replica_n4] o.a.s.c.HdfsDirectoryFactory creating directory factory for path hdfs://serv1-vm3:44738/data/MoveReplicaHDFSTest_coll_true/core_node7/data
   [junit4]   2> 2355067 INFO  (qtp1910414195-25534) [n:127.0.0.1:51961_solr c:MoveReplicaHDFSTest_coll_true s:shard1 r:core_node5 x:MoveReplicaHDFSTest_coll_true_shard1_replica_n2] o.a.s.c.HdfsDirectoryFactory creating directory factory for path hdfs://serv1-vm3:44738/data/MoveReplicaHDFSTest_coll_true/core_node5/data/index
   [junit4]   2> 2355073 INFO  (qtp1507862725-25522) [n:127.0.0.1:36705_solr c:MoveReplicaHDFSTest_coll_true s:shard2 r:core_node8 x:MoveReplicaHDFSTest_coll_true_shard2_replica_n6] o.a.s.c.HdfsDirectoryFactory creating directory factory for path hdfs://serv1-vm3:44738/data/MoveReplicaHDFSTest_coll_true/core_node8/data/index
   [junit4]   2> 2355075 INFO  (qtp173491121-25542) [n:127.0.0.1:52256_solr c:MoveReplicaHDFSTest_coll_true s:shard2 r:core_node7 x:MoveReplicaHDFSTest_coll_true_shard2_replica_n4] o.a.s.c.HdfsDirectoryFactory creating directory factory for path hdfs://serv1-vm3:44738/data/MoveReplicaHDFSTest_coll_true/core_node7/data/index
   [junit4]   2> 2355095 INFO  (qtp71428778-25816) [n:127.0.0.1:48937_solr c:MoveReplicaHDFSTest_coll_true s:shard1 r:core_node3 x:MoveReplicaHDFSTest_coll_true_shard1_replica_n1] o.a.s.c.HdfsDirectoryFactory creating directory factory for path hdfs://serv1-vm3:44738/data/MoveReplicaHDFSTest_coll_true/core_node3/data/index
   [junit4]   2> 2355147 INFO  (Block report processor) [    ] BlockStateChange BLOCK* addStoredBlock: blockMap updated: 127.0.0.1:34450 is added to blk_1073741825_1001{UCState=UNDER_CONSTRUCTION, truncateBlock=null, primaryNodeIndex=-1, replicas=[ReplicaUC[[DISK]DS-b5917bd4-71f8-4d05-9dc7-39444b8ec23b:NORMAL:127.0.0.1:36329|RBW], ReplicaUC[[DISK]DS-36af76f6-f867-4082-a650-05fe64a90c1f:NORMAL:127.0.0.1:34450|RBW]]} size 0
   [junit4]   2> 2355147 INFO  (Block report processor) [    ] BlockStateChange BLOCK* addStoredBlock: blockMap updated: 127.0.0.1:36329 is added to blk_1073741825_1001{UCState=UNDER_CONSTRUCTION, truncateBlock=null, primaryNodeIndex=-1, replicas=[ReplicaUC[[DISK]DS-b5917bd4-71f8-4d05-9dc7-39444b8ec23b:NORMAL:127.0.0.1:36329|RBW], ReplicaUC[[DISK]DS-36af76f6-f867-4082-a650-05fe64a90c1f:NORMAL:127.0.0.1:34450|RBW]]} size 0
   [junit4]   2> 2355161 INFO  (Block report processor) [    ] BlockStateChange BLOCK* addStoredBlock: blockMap updated: 127.0.0.1:34450 is added to blk_1073741826_1002{UCState=UNDER_CONSTRUCTION, truncateBlock=null, primaryNodeIndex=-1, replicas=[ReplicaUC[[DISK]DS-7630fd2b-2e8d-4825-a4a6-913889826c17:NORMAL:127.0.0.1:34450|RBW], ReplicaUC[[DISK]DS-c841a6d4-52e3-442b-b48e-904b79c11dfc:NORMAL:127.0.0.1:36329|RBW]]} size 0
   [junit4]   2> 2355163 INFO  (Block report processor) [    ] BlockStateChange BLOCK* addStoredBlock: blockMap updated: 127.0.0.1:36329 is added to blk_1073741826_1002 size 69
   [junit4]   2> 2355205 INFO  (Block report processor) [    ] BlockStateChange BLOCK* addStoredBlock: blockMap updated: 127.0.0.1:36329 is added to blk_1073741827_1003{UCState=UNDER_CONSTRUCTION, truncateBlock=null, primaryNodeIndex=-1, replicas=[ReplicaUC[[DISK]DS-7630fd2b-2e8d-4825-a4a6-913889826c17:NORMAL:127.0.0.1:34450|RBW], ReplicaUC[[DISK]DS-b5917bd4-71f8-4d05-9dc7-39444b8ec23b:NORMAL:127.0.0.1:36329|RBW]]} size 0
   [junit4]   2> 2355205 INFO  (Block report processor) [    ] BlockStateChange BLOCK* addStoredBlock: blockMap updated: 127.0.0.1:34450 is added to blk_1073741827_1003{UCState=UNDER_CONSTRUCTION, truncateBlock=null, primaryNodeIndex=-1, replicas=[ReplicaUC[[DISK]DS-b5917bd4-71f8-4d05-9dc7-39444b8ec23b:NORMAL:127.0.0.1:36329|RBW], ReplicaUC[[DISK]DS-36af76f6-f867-4082-a650-05fe64a90c1f:NORMAL:127.0.0.1:34450|FINALIZED]]} size 0
   [junit4]   2> 2355231 INFO  (qtp1910414195-25534) [n:127.0.0.1:51961_solr c:MoveReplicaHDFSTest_coll_true s:shard1 r:core_node5 x:MoveReplicaHDFSTest_coll_true_shard1_replica_n2] o.a.s.u.UpdateHandler Using UpdateLog implementation: org.apache.solr.update.HdfsUpdateLog
   [junit4]   2> 2355231 INFO  (qtp1910414195-25534) [n:127.0.0.1:51961_solr c:MoveReplicaHDFSTest_coll_true s:shard1 r:core_node5 x:MoveReplicaHDFSTest_coll_true_shard1_replica_n2] o.a.s.u.UpdateLog Initializing UpdateLog: dataDir=null defaultSyncLevel=FLUSH numRecordsToKeep=100 maxNumLogsToKeep=10 numVersionBuckets=65536
   [junit4]   2> 2355231 INFO  (qtp1910414195-25534) [n:127.0.0.1:51961_solr c:MoveReplicaHDFSTest_coll_true s:shard1 r:core_node5 x:MoveReplicaHDFSTest_coll_true_shard1_replica_n2] o.a.s.u.HdfsUpdateLog Initializing HdfsUpdateLog: tlogDfsReplication=3
   [junit4]   2> 2355251 INFO  (Block report processor) [    ] BlockStateChange BLOCK* addStoredBlock: blockMap updated: 127.0.0.1:36329 is added to blk_1073741828_1004{UCState=UNDER_CONSTRUCTION, truncateBlock=null, primaryNodeIndex=-1, replicas=[ReplicaUC[[DISK]DS-7630fd2b-2e8d-4825-a4a6-913889826c17:NORMAL:127.0.0.1:34450|RBW], ReplicaUC[[DISK]DS-c841a6d4-52e3-442b-b48e-904b79c11dfc:NORMAL:127.0.0.1:36329|RBW]]} size 0
   [junit4]   2> 2355251 INFO  (Block report processor) [    ] BlockStateChange BLOCK* addStoredBlock: blockMap updated: 127.0.0.1:34450 is added to blk_1073741828_1004{UCState=UNDER_CONSTRUCTION, truncateBlock=null, primaryNodeIndex=-1, replicas=[ReplicaUC[[DISK]DS-7630fd2b-2e8d-4825-a4a6-913889826c17:NORMAL:127.0.0.1:34450|RBW], ReplicaUC[[DISK]DS-c841a6d4-52e3-442b-b48e-904b79c11dfc:NORMAL:127.0.0.1:36329|RBW]]} size 0
   [junit4]   2> 2355265 INFO  (qtp173491121-25542) [n:127.0.0.1:52256_solr c:MoveReplicaHDFSTest_coll_true s:shard2 r:core_node7 x:MoveReplicaHDFSTest_coll_true_shard2_replica_n4] o.a.s.u.UpdateHandler Using UpdateLog implementation: org.apache.solr.update.HdfsUpdateLog
   [junit4]   2> 2355265 INFO  (qtp173491121-25542) [n:127.0.0.1:52256_solr c:MoveReplicaHDFSTest_coll_true s:shard2 r:core_node7 x:MoveReplicaHDFSTest_coll_true_shard2_replica_n4] o.a.s.u.UpdateLog Initializing UpdateLog: dataDir=null defaultSyncLevel=FLUSH numRecordsToKeep=100 maxNumLogsToKeep=10 numVersionBuckets=65536
   [junit4]   2> 2355265 INFO  (qtp173491121-25542) [n:127.0.0.1:52256_solr c:MoveReplicaHDFSTest_coll_true s:shard2 r:core_node7 x:MoveReplicaHDFSTest_coll_true_shard2_replica_n4] o.a.s.u.HdfsUpdateLog Initializing HdfsUpdateLog: tlogDfsReplication=3
   [junit4]   2> 2355281 INFO  (qtp173491121-25542) [n:127.0.0.1:52256_solr c:MoveReplicaHDFSTest_coll_true s:shard2 r:core_node7 x:MoveReplicaHDFSTest_coll_true_shard2_replica_n4] o.a.s.u.CommitTracker Hard AutoCommit: disabled
   [junit4]   2> 2355281 INFO  (qtp173491121-25542) [n:127.0.0.1:52256_solr c:MoveReplicaHDFSTest_coll_true s:shard2 r:core_node7 x:MoveReplicaHDFSTest_coll_true_shard2_replica_n4] o.a.s.u.CommitTracker Soft AutoCommit: disabled
   [junit4]   2> 2355285 INFO  (qtp1910414195-25534) [n:127.0.0.1:51961_solr c:MoveReplicaHDFSTest_coll_true s:shard1 r:core_node5 x:MoveReplicaHDFSTest_coll_true_shard1_replica_n2] o.a.s.u.CommitTracker Hard AutoCommit: disabled
   [junit4]   2> 2355285 INFO  (qtp1910414195-25534) [n:127.0.0.1:51961_solr c:MoveReplicaHDFSTest_coll_true s:shard1 r:core_node5 x:MoveReplicaHDFSTest_coll_true_shard1_replica_n2] o.a.s.u.CommitTracker Soft AutoCommit: disabled
   [junit4]   2> 2355294 INFO  (qtp173491121-25542) [n:127.0.0.1:52256_solr c:MoveReplicaHDFSTest_coll_true s:shard2 r:core_node7 x:MoveReplicaHDFSTest_coll_true_shard2_replica_n4] o.a.s.s.SolrIndexSearcher Opening [Searcher@9d6d532[MoveReplicaHDFSTest_coll_true_shard2_replica_n4] main]
   [junit4]   2> 2355295 INFO  (qtp1507862725-25522) [n:127.0.0.1:36705_solr c:MoveReplicaHDFSTest_coll_true s:shard2 r:core_node8 x:MoveReplicaHDFSTest_coll_true_shard2_replica_n6] o.a.s.u.UpdateHandler Using UpdateLog implementation: org.apache.solr.update.HdfsUpdateLog
   [junit4]   2> 2355295 INFO  (qtp1507862725-25522) [n:127.0.0.1:36705_solr c:MoveReplicaHDFSTest_coll_true s:shard2 r:core_node8 x:MoveReplicaHDFSTest_coll_true_shard2_replica_n6] o.a.s.u.UpdateLog Initializing UpdateLog: dataDir=null defaultSyncLevel=FLUSH numRecordsToKeep=100 maxNumLogsToKeep=10 numVersionBuckets=65536
   [junit4]   2> 2355295 INFO  (qtp1507862725-25522) [n:127.0.0.1:36705_solr c:MoveReplicaHDFSTest_coll_true s:shard2 r:core_node8 x:MoveReplicaHDFSTest_coll_true_shard2_replica_n6] o.a.s.u.HdfsUpdateLog Initializing HdfsUpdateLog: tlogDfsReplication=3
   [junit4]   2> 2355297 INFO  (qtp173491121-25542) [n:127.0.0.1:52256_solr c:MoveReplicaHDFSTest_coll_true s:shard2 r:core_node7 x:MoveReplicaHDFSTest_coll_true_shard2_replica_n4] o.a.s.r.ManagedResourceStorage Configured ZooKeeperStorageIO with znodeBase: /configs/conf1
   [junit4]   2> 2355297 INFO  (qtp173491121-25542) [n:127.0.0.1:52256_solr c:MoveReplicaHDFSTest_coll_true s:shard2 r:core_node7 x:MoveReplicaHDFSTest_coll_true_shard2_replica_n4] o.a.s.r.ManagedResourceStorage Loaded null at path _rest_managed.json using ZooKeeperStorageIO:path=/configs/conf1
   [junit4]   2> 2355297 INFO  (qtp173491121-25542) [n:127.0.0.1:52256_solr c:MoveReplicaHDFSTest_coll_true s:shard2 r:core_node7 x:MoveReplicaHDFSTest_coll_true_shard2_replica_n4] o.a.s.h.ReplicationHandler Commits will be reserved for 10000ms.
   [junit4]   2> 2355298 INFO  (searcherExecutor-9698-thread-1-processing-n:127.0.0.1:52256_solr x:MoveReplicaHDFSTest_coll_true_shard2_replica_n4 c:MoveReplicaHDFSTest_coll_true s:shard2 r:core_node7) [n:127.0.0.1:52256_solr c:MoveReplicaHDFSTest_coll_true s:shard2 r:core_node7 x:MoveReplicaHDFSTest_coll_true_shard2_replica_n4] o.a.s.c.SolrCore [MoveReplicaHDFSTest_coll_true_shard2_replica_n4] Registered new searcher Searcher@9d6d532[MoveReplicaHDFSTest_coll_true_shard2_replica_n4] main{ExitableDirectoryReader(UninvertingDirectoryReader())}
   [junit4]   2> 2355298 INFO  (qtp173491121-25542) [n:127.0.0.1:52256_solr c:MoveReplicaHDFSTest_coll_true s:shard2 r:core_node7 x:MoveReplicaHDFSTest_coll_true_shard2_replica_n4] o.a.s.u.UpdateLog Could not find max version in index or recent updates, using new clock 1605615992153571328
   [junit4]   2> 2355317 INFO  (qtp1507862725-25522) [n:127.0.0.1:36705_solr c:MoveReplicaHDFSTest_coll_true s:shard2 r:core_node8 x:MoveReplicaHDFSTest_coll_true_shard2_replica_n6] o.a.s.u.CommitTracker Hard AutoCommit: disabled
   [junit4]   2> 2355317 INFO  (qtp1507862725-25522) [n:127.0.0.1:36705_solr c:MoveReplicaHDFSTest_coll_true s:shard2 r:core_node8 x:MoveReplicaHDFSTest_coll_true_shard2_replica_n6] o.a.s.u.CommitTracker Soft AutoCommit: disabled
   [junit4]   2> 2355325 INFO  (qtp1910414195-25534) [n:127.0.0.1:51961_solr c:MoveReplicaHDFSTest_coll_true s:shard1 r:core_node5 x:MoveReplicaHDFSTest_coll_true_shard1_replica_n2] o.a.s.s.SolrIndexSearcher Opening [Searcher@61c128a[MoveReplicaHDFSTest_coll_true_shard1_replica_n2] main]
   [junit4]   2> 2355326 INFO  (qtp173491121-25542) [n:127.0.0.1:52256_solr c:MoveReplicaHDFSTest_coll_true s:shard2 r:core_node7 x:MoveReplicaHDFSTest_coll_true_shard2_replica_n4] o.a.s.c.ZkShardTerms Successful update of terms at /collections/MoveReplicaHDFSTest_coll_true/terms/shard2 to Terms{values={core_node7=0}, version=0}
   [junit4]   2> 2355327 INFO  (qtp1910414195-25534) [n:127.0.0.1:51961_solr c:MoveReplicaHDFSTest_coll_true s:shard1 r:core_node5 x:MoveReplicaHDFSTest_coll_true_shard1_replica_n2] o.a.s.r.ManagedResourceStorage Configured ZooKeeperStorageIO with znodeBase: /configs/conf1
   [junit4]   2> 2355328 INFO  (qtp1910414195-25534) [n:127.0.0.1:51961_solr c:MoveReplicaHDFSTest_coll_true s:shard1 r:core_node5 x:MoveReplicaHDFSTest_coll_true_shard1_replica_n2] o.a.s.r.ManagedResourceStorage Loaded null at path _rest_managed.json using ZooKeeperStorageIO:path=/configs/conf1
   [junit4]   2> 2355331 INFO  (qtp1910414195-25534) [n:127.0.0.1:51961_solr c:MoveReplicaHDFSTest_coll_true s:shard1 r:core_node5 x:MoveReplicaHDFSTest_coll_true_shard1_replica_n2] o.a.s.h.ReplicationHandler Commits will be reserved for 10000ms.
   [junit4]   2> 2355332 INFO  (searcherExecutor-9695-thread-1-processing-n:127.0.0.1:51961_solr x:MoveReplicaHDFSTest_coll_true_shard1_replica_n2 c:MoveReplicaHDFSTest_coll_true s:shard1 r:core_node5) [n:127.0.0.1:51961_solr c:MoveReplicaHDFSTest_coll_true s:shard1 r:core_node5 x:MoveReplicaHDFSTest_coll_true_shard1_replica_n2] o.a.s.c.SolrCore [MoveReplicaHDFSTest_coll_true_shard1_replica_n2] Registered new searcher Searcher@61c128a[MoveReplicaHDFSTest_coll_true_shard1_replica_n2] main{ExitableDirectoryReader(UninvertingDirectoryReader())}
   [junit4]   2> 2355332 INFO  (qtp1910414195-25534) [n:127.0.0.1:51961_solr c:MoveReplicaHDFSTest_coll_true s:shard1 r:core_node5 x:MoveReplicaHDFSTest_coll_true_shard1_replica_n2] o.a.s.u.UpdateLog Could not find max version in index or recent updates, using new clock 1605615992189222912
   [junit4]   2> 2355336 INFO  (qtp173491121-25542) [n:127.0.0.1:52256_solr c:MoveReplicaHDFSTest_coll_true s:shard2 r:core_node7 x:MoveReplicaHDFSTest_coll_true_shard2_replica_n4] o.a.s.c.ShardLeaderElectionContext Waiting until we see more replicas up for shard shard2: total=2 found=1 timeoutin=9998ms
   [junit4]   2> 2355340 INFO  (qtp1910414195-25534) [n:127.0.0.1:51961_solr c:MoveReplicaHDFSTest_coll_true s:shard1 r:core_node5 x:MoveReplicaHDFSTest_coll_true_shard1_replica_n2] o.a.s.c.ZkShardTerms Successful update of terms at /collections/MoveReplicaHDFSTest_coll_true/terms/shard1 to Terms{values={core_node5=0}, version=0}
   [junit4]   2> 2355346 INFO  (qtp1910414195-25534) [n:127.0.0.1:51961_solr c:MoveReplicaHDFSTest_coll_true s:shard1 r:core_node5 x:MoveReplicaHDFSTest_coll_true_shard1_replica_n2] o.a.s.c.ShardLeaderElectionContext Waiting until we see more replicas up for shard shard1: total=2 found=1 timeoutin=9999ms
   [junit4]   2> 2355350 INFO  (qtp1507862725-25522) [n:127.0.0.1:36705_solr c:MoveReplicaHDFSTest_coll_true s:shard2 r:core_node8 x:MoveReplicaHDFSTest_coll_true_shard2_replica_n6] o.a.s.s.SolrIndexSearcher Opening [Searcher@1d43d8c0[MoveReplicaHDFSTest_coll_true_shard2_replica_n6] main]
   [junit4]   2> 2355351 INFO  (qtp1507862725-25522) [n:127.0.0.1:36705_solr c:MoveReplicaHDFSTest_coll_true s:shard2 r:core_node8 x:MoveReplicaHDFSTest_coll_true_shard2_replica_n6] o.a.s.r.ManagedResourceStorage Configured ZooKeeperStorageIO with znodeBase: /configs/conf1
   [junit4]   2> 2355352 INFO  (qtp1507862725-25522) [n:127.0.0.1:36705_solr c:MoveReplicaHDFSTest_coll_true s:shard2 r:core_node8 x:MoveReplicaHDFSTest_coll_true_shard2_replica_n6] o.a.s.r.ManagedResourceStorage Loaded null at path _rest_managed.json using ZooKeeperStorageIO:path=/configs/conf1
   [junit4]   2> 2355352 INFO  (qtp1507862725-25522) [n:127.0.0.1:36705_solr c:MoveReplicaHDFSTest_coll_true s:shard2 r:core_node8 x:MoveReplicaHDFSTest_coll_true_shard2_replica_n6] o.a.s.h.ReplicationHandler Commits will be reserved for 10000ms.
   [junit4]   2> 2355353 INFO  (searcherExecutor-9697-thread-1-processing-n:127.0.0.1:36705_solr x:MoveReplicaHDFSTest_coll_true_shard2_replica_n6 c:MoveReplicaHDFSTest_coll_true s:shard2 r:core_node8) [n:127.0.0.1:36705_solr c:MoveReplicaHDFSTest_coll_true s:shard2 r:core_node8 x:MoveReplicaHDFSTest_coll_true_shard2_replica_n6] o.a.s.c.SolrCore [MoveReplicaHDFSTest_coll_true_shard2_replica_n6] Registered new searcher Searcher@1d43d8c0[MoveReplicaHDFSTest_coll_true_shard2_replica_n6] main{ExitableDirectoryReader(UninvertingDirectoryReader())}
   [junit4]   2> 2355353 INFO  (qtp1507862725-25522) [n:127.0.0.1:36705_solr c:MoveReplicaHDFSTest_coll_true s:shard2 r:core_node8 x:MoveReplicaHDFSTest_coll_true_shard2_replica_n6] o.a.s.u.UpdateLog Could not find max version in index or recent updates, using new clock 1605615992211243008
   [junit4]   2> 2355358 INFO  (qtp1507862725-25522) [n:127.0.0.1:36705_solr c:MoveReplicaHDFSTest_coll_true s:shard2 r:core_node8 x:MoveReplicaHDFSTest_coll_true_shard2_replica_n6] o.a.s.c.ZkShardTerms Successful update of terms at /collections/MoveReplicaHDFSTest_coll_true/terms/shard2 to Terms{values={core_node7=0, core_node8=0}, version=1}
   [junit4]   2> 2355377 INFO  (qtp71428778-25816) [n:127.0.0.1:48937_solr c:MoveReplicaHDFSTest_coll_true s:shard1 r:core_node3 x:MoveReplicaHDFSTest_coll_true_shard1_replica_n1] o.a.s.u.UpdateHandler Using UpdateLog implementation: org.apache.solr.update.HdfsUpdateLog
   [junit4]   2> 2355377 INFO  (qtp71428778-25816) [n:127.0.0.1:48937_solr c:MoveReplicaHDFSTest_coll_true s:shard1 r:core_node3 x:MoveReplicaHDFSTest_coll_true_shard1_replica_n1] o.a.s.u.UpdateLog Initializing UpdateLog: dataDir=null defaultSyncLevel=FLUSH numRecordsToKeep=100 maxNumLogsToKeep=10 numVersionBuckets=65536
   [junit4]   2> 2355377 INFO  (qtp71428778-25816) [n:127.0.0.1:48937_solr c:MoveReplicaHDFSTest_coll_true s:shard1 r:core_node3 x:MoveReplicaHDFSTest_coll_true_shard1_replica_n1] o.a.s.u.HdfsUpdateLog Initializing HdfsUpdateLog: tlogDfsReplication=3
   [junit4]   2> 2355403 INFO  (qtp71428778-25816) [n:127.0.0.1:48937_solr c:MoveReplicaHDFSTest_coll_true s:shard1 r:core_node3 x:MoveReplicaHDFSTest_coll_true_shard1_replica_n1] o.a.s.u.CommitTracker Hard AutoCommit: disabled
   [junit4]   2> 2355403 INFO  (qtp71428778-25816) [n:127.0.0.1:48937_solr c:MoveReplicaHDFSTest_coll_true s:shard1 r:core_node3 x:MoveReplicaHDFSTest_coll_true_shard1_replica_n1] o.a.s.u.CommitTracker Soft AutoCommit: disabled
   [junit4]   2> 2355416 INFO  (qtp71428778-25816) [n:127.0.0.1:48937_solr c:MoveReplicaHDFSTest_coll_true s:shard1 r:core_node3 x:MoveReplicaHDFSTest_coll_true_shard1_replica_n1] o.a.s.s.SolrIndexSearcher Opening [Searcher@901d3ce[MoveReplicaHDFSTest_coll_true_shard1_replica_n1] main]
   [junit4]   2> 2355417 INFO  (qtp71428778-25816) [n:127.0.0.1:48937_solr c:MoveReplicaHDFSTest_coll_true s:shard1 r:core_node3 x:MoveReplicaHDFSTest_coll_true_shard1_replica_n1] o.a.s.r.ManagedResourceStorage Configured ZooKeeperStorageIO with znodeBase: /configs/conf1
   [junit4]   2> 2355418 INFO  (qtp71428778-25816) [n:127.0.0.1:48937_solr c:MoveReplicaHDFSTest_coll_true s:shard1 r:core_node3 x:MoveReplicaHDFSTest_coll_true_shard1_replica_n1] o.a.s.r.ManagedResourceStorage Loaded null at path _rest_managed.json using ZooKeeperStorageIO:path=/configs/conf1
   [junit4]   2> 2355418 INFO  (qtp71428778-25816) [n:127.0.0.1:48937_solr c:MoveReplicaHDFSTest_coll_true s:shard1 r:core_node3 x:MoveReplicaHDFSTest_coll_true_shard1_replica_n1] o.a.s.h.ReplicationHandler Commits will be reserved for 10000ms.
   [junit4]   2> 2355419 INFO  (searcherExecutor-9696-thread-1-processing-n:127.0.0.1:48937_solr x:MoveReplicaHDFSTest_coll_true_shard1_replica_n1 c:MoveReplicaHDFSTest_coll_true s:shard1 r:core_node3) [n:127.0.0.1:48937_solr c:MoveReplicaHDFSTest_coll_true s:shard1 r:core_node3 x:MoveReplicaHDFSTest_coll_true_shard1_replica_n1] o.a.s.c.SolrCore [MoveReplicaHDFSTest_coll_true_shard1_replica_n1] Registered new searcher Searcher@901d3ce[MoveReplicaHDFSTest_coll_true_shard1_replica_n1] main{ExitableDirectoryReader(UninvertingDirectoryReader())}
   [junit4]   2> 2355419 INFO  (qtp71428778-25816) [n:127.0.0.1:48937_solr c:MoveReplicaHDFSTest_coll_true s:shard1 r:core_node3 x:MoveReplicaHDFSTest_coll_true_shard1_replica_n1] o.a.s.u.UpdateLog Could not find max version in index or recent updates, using new clock 1605615992280449024
   [junit4]   2> 2355424 INFO  (qtp71428778-25816) [n:127.0.0.1:48937_solr c:MoveReplicaHDFSTest_coll_true s:shard1 r:core_node3 x:MoveReplicaHDFSTest_coll_true_shard1_replica_n1] o.a.s.c.ZkShardTerms Successful update of terms at /collections/MoveReplicaHDFSTest_coll_true/terms/shard1 to Terms{values={core_node3=0, core_node5=0}, version=1}
   [junit4]   2> 2355842 INFO  (qtp173491121-25542) [n:127.0.0.1:52256_solr c:MoveReplicaHDFSTest_coll_true s:shard2 r:core_node7 x:MoveReplicaHDFSTest_coll_true_shard2_replica_n4] o.a.s.c.ShardLeaderElectionContext Enough replicas found to continue.
   [junit4]   2> 2355842 INFO  (qtp173491121-25542) [n:127.0.0.1:52256_solr c:MoveReplicaHDFSTest_coll_true s:shard2 r:core_node7 x:MoveReplicaHDFSTest_coll_true_shard2_replica_n4] o.a.s.c.ShardLeaderElectionContext I may be the new leader - try and sync
   [junit4]   2> 2355842 INFO  (qtp173491121-25542) [n:127.0.0.1:52256_solr c:MoveReplicaHDFSTest_coll_true s:shard2 r:core_node7 x:MoveReplicaHDFSTest_coll_true_shard2_replica_n4] o.a.s.c.SyncStrategy Sync replicas to http://127.0.0.1:52256/solr/MoveReplicaHDFSTest_coll_true_shard2_replica_n4/
   [junit4]   2> 2355843 INFO  (qtp173491121-25542) [n:127.0.0.1:52256_solr c:MoveReplicaHDFSTest_coll_true s:shard2 r:core_node7 x:MoveReplicaHDFSTest_coll_true_shard2_replica_n4] o.a.s.u.PeerSync PeerSync: core=MoveReplicaHDFSTest_coll_true_shard2_replica_n4 url=http://127.0.0.1:52256/solr START replicas=[http://127.0.0.1:36705/solr/MoveReplicaHDFSTest_coll_true_shard2_replica_n6/] nUpdates=100
   [junit4]   2> 2355843 INFO  (qtp173491121-25542) [n:127.0.0.1:52256_solr c:MoveReplicaHDFSTest_coll_true s:shard2 r:core_node7 x:MoveReplicaHDFSTest_coll_true_shard2_replica_n4] o.a.s.u.PeerSync PeerSync: core=MoveReplicaHDFSTest_coll_true_shard2_replica_n4 url=http://127.0.0.1:52256/solr DONE.  We have no versions.  sync failed.
   [junit4]   2> 2355845 INFO  (qtp1507862725-25526) [n:127.0.0.1:36705_solr c:MoveReplicaHDFSTest_coll_true s:shard2 r:core_node8 x:MoveReplicaHDFSTest_coll_true_shard2_replica_n6] o.a.s.c.S.Request [MoveReplicaHDFSTest_coll_true_shard2_replica_n6]  webapp=/solr path=/get params={distrib=false&qt=/get&fingerprint=false&getVersions=100&wt=javabin&version=2} status=0 QTime=1
   [junit4]   2> 2355846 INFO  (qtp173491121-25542) [n:127.0.0.1:52256_solr c:MoveReplicaHDFSTest_coll_true s:shard2 r:core_node7 x:MoveReplicaHDFSTest_coll_true_shard2_replica_n4] o.a.s.c.SyncStrategy Leader's attempt to sync with shard failed, moving to the next candidate
   [junit4]   2> 2355846 INFO  (qtp173491121-25542) [n:127.0.0.1:52256_solr c:MoveReplicaHDFSTest_coll_true s:shard2 r:core_node7 x:MoveReplicaHDFSTest_coll_true_shard2_replica_n4] o.a.s.c.ShardLeaderElectionContext We failed sync, but we have no versions - we can't sync in that case - we were active before, so become leader anyway
   [junit4]   2> 2355846 INFO  (qtp173491121-25542) [n:127.0.0.1:52256_solr c:MoveReplicaHDFSTest_coll_true s:shard2 r:core_node7 x:MoveReplicaHDFSTest_coll_true_shard2_replica_n4] o.a.s.c.ShardLeaderElectionContext Found all replicas participating in election, clear LIR
   [junit4]   2> 2355849 INFO  (qtp1910414195-25534) [n:127.0.0.1:51961_solr c:MoveReplicaHDFSTest_coll_true s:shard1 r:core_node5 x:MoveReplicaHDFSTest_coll_true_shard1_replica_n2] o.a.s.c.ShardLeaderElectionContext Enough replicas found to continue.
   [junit4]   2> 2355849 INFO  (qtp1910414195-25534) [n:127.0.0.1:51961_solr c:MoveReplicaHDFSTest_coll_true s:shard1 r:core_node5 x:MoveReplicaHDFSTest_coll_true_shard1_replica_n2] o.a.s.c.ShardLeaderElectionContext I may be the new leader - try and sync
   [junit4]   2> 2355849 INFO  (qtp1910414195-25534) [n:127.0.0.1:51961_solr c:MoveReplicaHDFSTest_coll_true s:shard1 r:core_node5 x:MoveReplicaHDFSTest_coll_true_shard1_replica_n2] o.a.s.c.SyncStrategy Sync replicas to http://127.0.0.1:51961/solr/MoveReplicaHDFSTest_coll_true_shard1_replica_n2/
   [junit4]   2> 2355850 INFO  (qtp1910414195-25534) [n:127.0.0.1:51961_solr c:MoveReplicaHDFSTest_coll_true s:shard1 r:core_node5 x:MoveReplicaHDFSTest_coll_true_shard1_replica_n2] o.a.s.u.PeerSync PeerSync: core=MoveReplicaHDFSTest_coll_true_shard1_replica_n2 url=http://127.0.0.1:51961/solr START replicas=[http://127.0.0.1:48937/solr/MoveReplicaHDFSTest_coll_true_shard1_replica_n1/] nUpdates=100
   [junit4]   2> 2355850 INFO  (qtp1910414195-25534) [n:127.0.0.1:51961_solr c:MoveReplicaHDFSTest_coll_true s:shard1 r:core_node5 x:MoveReplicaHDFSTest_coll_true_shard1_replica_n2] o.a.s.u.PeerSync PeerSync: core=MoveReplicaHDFSTest_coll_true_shard1_replica_n2 url=http://127.0.0.1:51961/solr DONE.  We have no versions.  sync failed.
   [junit4]   2> 2355852 INFO  (qtp71428778-25812) [n:127.0.0.1:48937_solr c:MoveReplicaHDFSTest_coll_true s:shard1 r:core_node3 x:MoveReplicaHDFSTest_coll_true_shard1_replica_n1] o.a.s.c.S.Request [MoveReplicaHDFSTest_col

[...truncated too long message...]

lover.disable:

ivy-configure:
[ivy:configure] :: Apache Ivy 2.4.0 - 20141213170938 :: http://ant.apache.org/ivy/ ::
[ivy:configure] :: loading settings :: file = /export/home/jenkins/workspace/Lucene-Solr-7.x-Solaris/lucene/top-level-ivy-settings.xml

install-junit4-taskdef:

ivy-availability-check:
[loadresource] Do not set property disallowed.ivy.jars.list as its length is 0.

-ivy-fail-disallowed-ivy-version:

ivy-fail:

resolve-groovy:
[ivy:cachepath] :: resolving dependencies :: org.codehaus.groovy#groovy-all-caller;working
[ivy:cachepath] 	confs: [default]
[ivy:cachepath] 	found org.codehaus.groovy#groovy-all;2.4.15 in public
[ivy:cachepath] :: resolution report :: resolve 17ms :: artifacts dl 0ms
	---------------------------------------------------------------------
	|                  |            modules            ||   artifacts   |
	|       conf       | number| search|dwnlded|evicted|| number|dwnlded|
	---------------------------------------------------------------------
	|      default     |   1   |   0   |   0   |   0   ||   1   |   0   |
	---------------------------------------------------------------------

-init-totals:

-test:
    [mkdir] Created dir: /export/home/jenkins/workspace/Lucene-Solr-7.x-Solaris/solr/build/solr-core/test
[junit4:pickseed] Seed property 'tests.seed' already defined: 227DD5EDF03DB896
    [mkdir] Created dir: /export/home/jenkins/workspace/Lucene-Solr-7.x-Solaris/solr/build/solr-core/test/temp
   [junit4] <JUnit4> says ahoj! Master seed: 227DD5EDF03DB896
   [junit4] Executing 5 suites with 2 JVMs.
   [junit4] 
   [junit4] Started J0 PID(23391@serv1-vm3).
   [junit4] Started J1 PID(23390@serv1-vm3).
   [junit4] Suite: org.apache.solr.cloud.MoveReplicaHDFSTest
   [junit4] OK      45.3s J0 | MoveReplicaHDFSTest.test
   [junit4] OK      21.3s J0 | MoveReplicaHDFSTest.testFailedMove
   [junit4] OK      18.8s J0 | MoveReplicaHDFSTest.testNormalFailedMove
   [junit4] OK      29.6s J0 | MoveReplicaHDFSTest.testNormalMove
   [junit4] Completed [1/5] on J0 in 144.23s, 4 tests
   [junit4] 
   [junit4] Suite: org.apache.solr.cloud.MoveReplicaHDFSTest
   [junit4] OK      46.1s J1 | MoveReplicaHDFSTest.test
   [junit4] OK      20.3s J1 | MoveReplicaHDFSTest.testFailedMove
   [junit4] OK      19.6s J1 | MoveReplicaHDFSTest.testNormalFailedMove
   [junit4] OK      34.3s J1 | MoveReplicaHDFSTest.testNormalMove
   [junit4] Completed [2/5] on J1 in 151.38s, 4 tests
   [junit4] 
   [junit4] Duplicate suite name used with XML reports: org.apache.solr.cloud.MoveReplicaHDFSTest. This may confuse tools that process XML reports. Set 'ignoreDuplicateSuites' to true to skip this message.
   [junit4] Suite: org.apache.solr.cloud.MoveReplicaHDFSTest
   [junit4] OK      34.7s J0 | MoveReplicaHDFSTest.test
   [junit4] OK      17.4s J0 | MoveReplicaHDFSTest.testFailedMove
   [junit4] OK      15.2s J0 | MoveReplicaHDFSTest.testNormalFailedMove
   [junit4] OK      27.5s J0 | MoveReplicaHDFSTest.testNormalMove
   [junit4] Completed [3/5] on J0 in 111.01s, 4 tests
   [junit4] 
   [junit4] Suite: org.apache.solr.cloud.MoveReplicaHDFSTest
   [junit4] OK      35.0s J1 | MoveReplicaHDFSTest.test
   [junit4] OK      13.7s J1 | MoveReplicaHDFSTest.testFailedMove
   [junit4] OK      14.9s J1 | MoveReplicaHDFSTest.testNormalFailedMove
   [junit4] OK      28.2s J1 | MoveReplicaHDFSTest.testNormalMove
   [junit4] Completed [4/5] on J1 in 106.38s, 4 tests
   [junit4] 
   [junit4] Suite: org.apache.solr.cloud.MoveReplicaHDFSTest
   [junit4] OK      36.5s J0 | MoveReplicaHDFSTest.test
   [junit4] OK      15.0s J0 | MoveReplicaHDFSTest.testFailedMove
   [junit4] OK      13.5s J0 | MoveReplicaHDFSTest.testNormalFailedMove
   [junit4] OK      29.8s J0 | MoveReplicaHDFSTest.testNormalMove
   [junit4] Completed [5/5] on J0 in 113.34s, 4 tests
   [junit4] 
   [junit4] JVM J0:     0.70 ..   370.84 =   370.14s
   [junit4] JVM J1:     0.70 ..   259.65 =   258.95s
   [junit4] Execution time total: 6 minutes 10 seconds
   [junit4] Tests summary: 5 suites, 20 tests
   [junit4] Could not remove temporary path: /export/home/jenkins/workspace/Lucene-Solr-7.x-Solaris/solr/build/solr-core/test/J0 (java.nio.file.DirectoryNotEmptyException: Remaining files: [/export/home/jenkins/workspace/Lucene-Solr-7.x-Solaris/solr/build/solr-core/test/J0/temp])
   [junit4] Could not remove temporary path: /export/home/jenkins/workspace/Lucene-Solr-7.x-Solaris/solr/build/solr-core/test/J1 (java.nio.file.DirectoryNotEmptyException: Remaining files: [/export/home/jenkins/workspace/Lucene-Solr-7.x-Solaris/solr/build/solr-core/test/J1/temp])
     [echo] 5 slowest tests:
[junit4:tophints] 176.82s | org.apache.solr.cloud.api.collections.CollectionsAPIDistributedZkTest
[junit4:tophints] 120.88s | org.apache.solr.cloud.MoveReplicaHDFSTest
[junit4:tophints] 116.80s | org.apache.solr.update.SoftAutoCommitTest
[junit4:tophints] 112.64s | org.apache.solr.cloud.ZkFailoverTest
[junit4:tophints] 109.52s | org.apache.solr.cloud.TestTlogReplica

-check-totals:

test-nocompile:

BUILD SUCCESSFUL
Total time: 6 minutes 14 seconds
[repro] Failures:
[repro]   0/5 failed: org.apache.solr.cloud.MoveReplicaHDFSTest
[repro] Exiting with code 0
+ mv lucene/build lucene/build.repro
+ mv solr/build solr/build.repro
+ mv lucene/build.orig lucene/build
+ mv solr/build.orig solr/build
Archiving artifacts
Setting ANT_1_8_2_HOME=/export/home/jenkins/tools/hudson.tasks.Ant_AntInstallation/ANT_1.8.2
java.lang.InterruptedException: no matches found within 10000
	at hudson.FilePath$ValidateAntFileMask.hasMatch(FilePath.java:2843)
	at hudson.FilePath$ValidateAntFileMask.invoke(FilePath.java:2722)
	at hudson.FilePath$ValidateAntFileMask.invoke(FilePath.java:2703)
	at hudson.FilePath$FileCallableWrapper.call(FilePath.java:3082)
Also:   hudson.remoting.Channel$CallSiteStackTrace: Remote call to Solaris VBOX
		at hudson.remoting.Channel.attachCallSiteStackTrace(Channel.java:1741)
		at hudson.remoting.UserRequest$ExceptionResponse.retrieve(UserRequest.java:357)
		at hudson.remoting.Channel.call(Channel.java:955)
		at hudson.FilePath.act(FilePath.java:1089)
		at hudson.FilePath.act(FilePath.java:1078)
		at hudson.FilePath.validateAntFileMask(FilePath.java:2701)
		at hudson.tasks.ArtifactArchiver.perform(ArtifactArchiver.java:243)
		at hudson.tasks.BuildStepCompatibilityLayer.perform(BuildStepCompatibilityLayer.java:81)
		at hudson.tasks.BuildStepMonitor$1.perform(BuildStepMonitor.java:20)
		at hudson.model.AbstractBuild$AbstractBuildExecution.perform(AbstractBuild.java:744)
		at hudson.model.AbstractBuild$AbstractBuildExecution.performAllBuildSteps(AbstractBuild.java:690)
		at hudson.model.Build$BuildExecution.post2(Build.java:186)
		at hudson.model.AbstractBuild$AbstractBuildExecution.post(AbstractBuild.java:635)
		at hudson.model.Run.execute(Run.java:1840)
		at hudson.model.FreeStyleBuild.run(FreeStyleBuild.java:43)
		at hudson.model.ResourceController.execute(ResourceController.java:97)
		at hudson.model.Executor.run(Executor.java:429)
Caused: hudson.FilePath$TunneledInterruptedException
	at hudson.FilePath$FileCallableWrapper.call(FilePath.java:3084)
	at hudson.remoting.UserRequest.perform(UserRequest.java:212)
	at hudson.remoting.UserRequest.perform(UserRequest.java:54)
	at hudson.remoting.Request$2.run(Request.java:369)
	at hudson.remoting.InterceptingExecutorService$1.call(InterceptingExecutorService.java:72)
	at java.util.concurrent.FutureTask.run(FutureTask.java:266)
	at java.util.concurrent.ThreadPoolExecutor.runWorker(ThreadPoolExecutor.java:1149)
	at java.util.concurrent.ThreadPoolExecutor$Worker.run(ThreadPoolExecutor.java:624)
	at java.lang.Thread.run(Thread.java:748)
Caused: java.lang.InterruptedException: java.lang.InterruptedException: no matches found within 10000
	at hudson.FilePath.act(FilePath.java:1091)
	at hudson.FilePath.act(FilePath.java:1078)
	at hudson.FilePath.validateAntFileMask(FilePath.java:2701)
	at hudson.tasks.ArtifactArchiver.perform(ArtifactArchiver.java:243)
	at hudson.tasks.BuildStepCompatibilityLayer.perform(BuildStepCompatibilityLayer.java:81)
	at hudson.tasks.BuildStepMonitor$1.perform(BuildStepMonitor.java:20)
	at hudson.model.AbstractBuild$AbstractBuildExecution.perform(AbstractBuild.java:744)
	at hudson.model.AbstractBuild$AbstractBuildExecution.performAllBuildSteps(AbstractBuild.java:690)
	at hudson.model.Build$BuildExecution.post2(Build.java:186)
	at hudson.model.AbstractBuild$AbstractBuildExecution.post(AbstractBuild.java:635)
	at hudson.model.Run.execute(Run.java:1840)
	at hudson.model.FreeStyleBuild.run(FreeStyleBuild.java:43)
	at hudson.model.ResourceController.execute(ResourceController.java:97)
	at hudson.model.Executor.run(Executor.java:429)
No artifacts found that match the file pattern "**/*.events,heapdumps/**,**/*_pid*.log". Configuration error?
[WARNINGS] Parsing warnings in console log with parser Java Compiler (javac)
Setting ANT_1_8_2_HOME=/export/home/jenkins/tools/hudson.tasks.Ant_AntInstallation/ANT_1.8.2
Setting ANT_1_8_2_HOME=/export/home/jenkins/tools/hudson.tasks.Ant_AntInstallation/ANT_1.8.2
<Git Blamer> Using GitBlamer to create author and commit information for all warnings.
<Git Blamer> GIT_COMMIT=937ae2c7b6a88aa080cd843ad3663937be61ee2f, workspace=/export/home/jenkins/workspace/Lucene-Solr-7.x-Solaris
[WARNINGS] Computing warning deltas based on reference build #714
Recording test results
Setting ANT_1_8_2_HOME=/export/home/jenkins/tools/hudson.tasks.Ant_AntInstallation/ANT_1.8.2
Build step 'Publish JUnit test result report' changed build result to UNSTABLE
Email was triggered for: Unstable (Test Failures)
Sending email for trigger: Unstable (Test Failures)
Setting ANT_1_8_2_HOME=/export/home/jenkins/tools/hudson.tasks.Ant_AntInstallation/ANT_1.8.2
Setting ANT_1_8_2_HOME=/export/home/jenkins/tools/hudson.tasks.Ant_AntInstallation/ANT_1.8.2
Setting ANT_1_8_2_HOME=/export/home/jenkins/tools/hudson.tasks.Ant_AntInstallation/ANT_1.8.2
Setting ANT_1_8_2_HOME=/export/home/jenkins/tools/hudson.tasks.Ant_AntInstallation/ANT_1.8.2

Mime
View raw message