lucene-dev mailing list archives

Site index · List index
Message view « Date » · « Thread »
Top « Date » · « Thread »
From Policeman Jenkins Server <jenk...@thetaphi.de>
Subject [JENKINS] Lucene-Solr-7.x-Linux (64bit/jdk-9.0.4) - Build # 2321 - Failure!
Date Sun, 15 Jul 2018 04:22:07 GMT
Build: https://jenkins.thetaphi.de/job/Lucene-Solr-7.x-Linux/2321/
Java: 64bit/jdk-9.0.4 -XX:-UseCompressedOops -XX:+UseParallelGC

2 tests failed.
FAILED:  org.apache.lucene.document.TestLatLonShape.testBasicIntersects

Error Message:
Java heap space

Stack Trace:
java.lang.OutOfMemoryError: Java heap space
	at __randomizedtesting.SeedInfo.seed([21B676D924FB8B85:16CB852C186C28FB]:0)
	at org.apache.lucene.util.bkd.HeapPointWriter.<init>(HeapPointWriter.java:52)
	at org.apache.lucene.util.bkd.BKDWriter.getPointWriter(BKDWriter.java:1870)
	at org.apache.lucene.util.bkd.BKDWriter.build(BKDWriter.java:1788)
	at org.apache.lucene.util.bkd.BKDWriter.build(BKDWriter.java:1805)
	at org.apache.lucene.util.bkd.BKDWriter.build(BKDWriter.java:1805)
	at org.apache.lucene.util.bkd.BKDWriter.build(BKDWriter.java:1818)
	at org.apache.lucene.util.bkd.BKDWriter.build(BKDWriter.java:1818)
	at org.apache.lucene.util.bkd.BKDWriter.build(BKDWriter.java:1805)
	at org.apache.lucene.util.bkd.BKDWriter.finish(BKDWriter.java:1008)
	at org.apache.lucene.index.RandomCodec$1$1.writeField(RandomCodec.java:141)
	at org.apache.lucene.codecs.asserting.AssertingPointsFormat$AssertingPointsWriter.writeField(AssertingPointsFormat.java:137)
	at org.apache.lucene.index.PointValuesWriter.flush(PointValuesWriter.java:183)
	at org.apache.lucene.index.DefaultIndexingChain.writePoints(DefaultIndexingChain.java:204)
	at org.apache.lucene.index.DefaultIndexingChain.flush(DefaultIndexingChain.java:139)
	at org.apache.lucene.index.DocumentsWriterPerThread.flush(DocumentsWriterPerThread.java:470)
	at org.apache.lucene.index.DocumentsWriter.doFlush(DocumentsWriter.java:554)
	at org.apache.lucene.index.DocumentsWriter.flushAllThreads(DocumentsWriter.java:719)
	at org.apache.lucene.index.IndexWriter.prepareCommitInternal(IndexWriter.java:3205)
	at org.apache.lucene.index.IndexWriter.commitInternal(IndexWriter.java:3450)
	at org.apache.lucene.index.IndexWriter.commit(IndexWriter.java:3415)
	at org.apache.lucene.index.RandomIndexWriter.getReader(RandomIndexWriter.java:403)
	at org.apache.lucene.index.RandomIndexWriter.getReader(RandomIndexWriter.java:332)
	at org.apache.lucene.document.TestLatLonShape.testBasicIntersects(TestLatLonShape.java:97)
	at java.base/jdk.internal.reflect.NativeMethodAccessorImpl.invoke0(Native Method)
	at java.base/jdk.internal.reflect.NativeMethodAccessorImpl.invoke(NativeMethodAccessorImpl.java:62)
	at java.base/jdk.internal.reflect.DelegatingMethodAccessorImpl.invoke(DelegatingMethodAccessorImpl.java:43)
	at java.base/java.lang.reflect.Method.invoke(Method.java:564)
	at com.carrotsearch.randomizedtesting.RandomizedRunner.invoke(RandomizedRunner.java:1737)
	at com.carrotsearch.randomizedtesting.RandomizedRunner$8.evaluate(RandomizedRunner.java:934)
	at com.carrotsearch.randomizedtesting.RandomizedRunner$9.evaluate(RandomizedRunner.java:970)
	at com.carrotsearch.randomizedtesting.RandomizedRunner$10.evaluate(RandomizedRunner.java:984)
	at org.apache.lucene.util.TestRuleSetupTeardownChained$1.evaluate(TestRuleSetupTeardownChained.java:49)


FAILED:  org.apache.lucene.document.TestLatLonShapeQueries.testRandomMedium

Error Message:
wrong hit (first of possibly more):  FAIL: id=11662 should match but did not   query=LatLonShapeBoundingBoxQuery:
field=shape:Rectangle(lat=0.0 TO 0.0 lon=8.381903171539307E-8 TO 113.60985006205738) docID=4712
  polygon=[-4.190951585769653E-8, 0.0] [89.99999995809048, 0.0] [89.99999995809048, 179.99999991618097]
[-4.190951585769653E-8, 0.0]    deleted?=false  rect=Rectangle(0.0 TO 0.0 lon=8.381903171539307E-8
TO 113.60985006205738)

Stack Trace:
java.lang.AssertionError: wrong hit (first of possibly more):

FAIL: id=11662 should match but did not
  query=LatLonShapeBoundingBoxQuery: field=shape:Rectangle(lat=0.0 TO 0.0 lon=8.381903171539307E-8
TO 113.60985006205738) docID=4712
  polygon=[-4.190951585769653E-8, 0.0] [89.99999995809048, 0.0] [89.99999995809048, 179.99999991618097]
[-4.190951585769653E-8, 0.0] 
  deleted?=false  rect=Rectangle(0.0 TO 0.0 lon=8.381903171539307E-8 TO 113.60985006205738)
	at __randomizedtesting.SeedInfo.seed([21B676D924FB8B85:9C684171659EE8E3]:0)
	at org.junit.Assert.fail(Assert.java:93)
	at org.apache.lucene.document.TestLatLonShapeQueries.verifyRandomBBoxes(TestLatLonShapeQueries.java:262)
	at org.apache.lucene.document.TestLatLonShapeQueries.verify(TestLatLonShapeQueries.java:133)
	at org.apache.lucene.document.TestLatLonShapeQueries.doTestRandom(TestLatLonShapeQueries.java:129)
	at org.apache.lucene.document.TestLatLonShapeQueries.testRandomMedium(TestLatLonShapeQueries.java:101)
	at java.base/jdk.internal.reflect.NativeMethodAccessorImpl.invoke0(Native Method)
	at java.base/jdk.internal.reflect.NativeMethodAccessorImpl.invoke(NativeMethodAccessorImpl.java:62)
	at java.base/jdk.internal.reflect.DelegatingMethodAccessorImpl.invoke(DelegatingMethodAccessorImpl.java:43)
	at java.base/java.lang.reflect.Method.invoke(Method.java:564)
	at com.carrotsearch.randomizedtesting.RandomizedRunner.invoke(RandomizedRunner.java:1737)
	at com.carrotsearch.randomizedtesting.RandomizedRunner$8.evaluate(RandomizedRunner.java:934)
	at com.carrotsearch.randomizedtesting.RandomizedRunner$9.evaluate(RandomizedRunner.java:970)
	at com.carrotsearch.randomizedtesting.RandomizedRunner$10.evaluate(RandomizedRunner.java:984)
	at org.apache.lucene.util.TestRuleSetupTeardownChained$1.evaluate(TestRuleSetupTeardownChained.java:49)
	at org.apache.lucene.util.AbstractBeforeAfterRule$1.evaluate(AbstractBeforeAfterRule.java:45)
	at org.apache.lucene.util.TestRuleThreadAndTestName$1.evaluate(TestRuleThreadAndTestName.java:48)
	at org.apache.lucene.util.TestRuleIgnoreAfterMaxFailures$1.evaluate(TestRuleIgnoreAfterMaxFailures.java:64)
	at org.apache.lucene.util.TestRuleMarkFailure$1.evaluate(TestRuleMarkFailure.java:47)
	at com.carrotsearch.randomizedtesting.rules.StatementAdapter.evaluate(StatementAdapter.java:36)
	at com.carrotsearch.randomizedtesting.ThreadLeakControl$StatementRunner.run(ThreadLeakControl.java:368)
	at com.carrotsearch.randomizedtesting.ThreadLeakControl.forkTimeoutingTask(ThreadLeakControl.java:817)
	at com.carrotsearch.randomizedtesting.ThreadLeakControl$3.evaluate(ThreadLeakControl.java:468)
	at com.carrotsearch.randomizedtesting.RandomizedRunner.runSingleTest(RandomizedRunner.java:943)
	at com.carrotsearch.randomizedtesting.RandomizedRunner$5.evaluate(RandomizedRunner.java:829)
	at com.carrotsearch.randomizedtesting.RandomizedRunner$6.evaluate(RandomizedRunner.java:879)
	at com.carrotsearch.randomizedtesting.RandomizedRunner$7.evaluate(RandomizedRunner.java:890)
	at org.apache.lucene.util.AbstractBeforeAfterRule$1.evaluate(AbstractBeforeAfterRule.java:45)
	at com.carrotsearch.randomizedtesting.rules.StatementAdapter.evaluate(StatementAdapter.java:36)
	at org.apache.lucene.util.TestRuleStoreClassName$1.evaluate(TestRuleStoreClassName.java:41)
	at com.carrotsearch.randomizedtesting.rules.NoShadowingOrOverridesOnMethodsRule$1.evaluate(NoShadowingOrOverridesOnMethodsRule.java:40)
	at com.carrotsearch.randomizedtesting.rules.NoShadowingOrOverridesOnMethodsRule$1.evaluate(NoShadowingOrOverridesOnMethodsRule.java:40)
	at com.carrotsearch.randomizedtesting.rules.StatementAdapter.evaluate(StatementAdapter.java:36)
	at com.carrotsearch.randomizedtesting.rules.StatementAdapter.evaluate(StatementAdapter.java:36)
	at org.apache.lucene.util.TestRuleAssertionsRequired$1.evaluate(TestRuleAssertionsRequired.java:53)
	at org.apache.lucene.util.TestRuleMarkFailure$1.evaluate(TestRuleMarkFailure.java:47)
	at org.apache.lucene.util.TestRuleIgnoreAfterMaxFailures$1.evaluate(TestRuleIgnoreAfterMaxFailures.java:64)
	at org.apache.lucene.util.TestRuleIgnoreTestSuites$1.evaluate(TestRuleIgnoreTestSuites.java:54)
	at com.carrotsearch.randomizedtesting.rules.StatementAdapter.evaluate(StatementAdapter.java:36)
	at com.carrotsearch.randomizedtesting.ThreadLeakControl$StatementRunner.run(ThreadLeakControl.java:368)
	at java.base/java.lang.Thread.run(Thread.java:844)




Build Log:
[...truncated 9571 lines...]
   [junit4] Suite: org.apache.lucene.document.TestLatLonShapeQueries
   [junit4] IGNOR/A 0.01s J0 | TestLatLonShapeQueries.testRandomBig
   [junit4]    > Assumption #1: 'nightly' test group is disabled (@Nightly())
   [junit4]   2> NOTE: reproduce with: ant test  -Dtestcase=TestLatLonShapeQueries -Dtests.method=testRandomMedium
-Dtests.seed=21B676D924FB8B85 -Dtests.multiplier=3 -Dtests.slow=true -Dtests.locale=ak -Dtests.timezone=EST5EDT
-Dtests.asserts=true -Dtests.file.encoding=UTF-8
   [junit4] FAILURE 24.7s J0 | TestLatLonShapeQueries.testRandomMedium <<<
   [junit4]    > Throwable #1: java.lang.AssertionError: wrong hit (first of possibly more):
   [junit4]    > FAIL: id=11662 should match but did not
   [junit4]    >   query=LatLonShapeBoundingBoxQuery: field=shape:Rectangle(lat=0.0 TO
0.0 lon=8.381903171539307E-8 TO 113.60985006205738) docID=4712
   [junit4]    >   polygon=[-4.190951585769653E-8, 0.0] [89.99999995809048, 0.0] [89.99999995809048,
179.99999991618097] [-4.190951585769653E-8, 0.0] 
   [junit4]    >   deleted?=false  rect=Rectangle(0.0 TO 0.0 lon=8.381903171539307E-8 TO
113.60985006205738)
   [junit4]    > 	at __randomizedtesting.SeedInfo.seed([21B676D924FB8B85:9C684171659EE8E3]:0)
   [junit4]    > 	at org.apache.lucene.document.TestLatLonShapeQueries.verifyRandomBBoxes(TestLatLonShapeQueries.java:262)
   [junit4]    > 	at org.apache.lucene.document.TestLatLonShapeQueries.verify(TestLatLonShapeQueries.java:133)
   [junit4]    > 	at org.apache.lucene.document.TestLatLonShapeQueries.doTestRandom(TestLatLonShapeQueries.java:129)
   [junit4]    > 	at org.apache.lucene.document.TestLatLonShapeQueries.testRandomMedium(TestLatLonShapeQueries.java:101)
   [junit4]    > 	at java.base/jdk.internal.reflect.NativeMethodAccessorImpl.invoke0(Native
Method)
   [junit4]    > 	at java.base/jdk.internal.reflect.NativeMethodAccessorImpl.invoke(NativeMethodAccessorImpl.java:62)
   [junit4]    > 	at java.base/jdk.internal.reflect.DelegatingMethodAccessorImpl.invoke(DelegatingMethodAccessorImpl.java:43)
   [junit4]    > 	at java.base/java.lang.reflect.Method.invoke(Method.java:564)
   [junit4]    > 	at java.base/java.lang.Thread.run(Thread.java:844)
   [junit4]   2> NOTE: leaving temporary files on disk at: /home/jenkins/workspace/Lucene-Solr-7.x-Linux/lucene/build/sandbox/test/J0/temp/lucene.document.TestLatLonShapeQueries_21B676D924FB8B85-001
   [junit4]   2> NOTE: test params are: codec=Asserting(Lucene70), sim=RandomSimilarity(queryNorm=true):
{}, locale=ak, timezone=EST5EDT
   [junit4]   2> NOTE: Linux 4.15.0-24-generic amd64/Oracle Corporation 9.0.4 (64-bit)/cpus=8,threads=1,free=331275944,total=502792192
   [junit4]   2> NOTE: All tests run in this JVM: [TestPayloadSpanUtil, TestLatLonShapeQueries]
   [junit4] Completed [6/24 (1!)] on J0 in 25.03s, 3 tests, 1 failure, 1 skipped <<<
FAILURES!

[...truncated 78 lines...]
   [junit4] Suite: org.apache.lucene.document.TestLatLonShape
   [junit4]   2> NOTE: reproduce with: ant test  -Dtestcase=TestLatLonShape -Dtests.method=testBasicIntersects
-Dtests.seed=21B676D924FB8B85 -Dtests.multiplier=3 -Dtests.slow=true -Dtests.locale=ar-IL
-Dtests.timezone=WET -Dtests.asserts=true -Dtests.file.encoding=UTF-8
   [junit4] ERROR   10.6s J1 | TestLatLonShape.testBasicIntersects <<<
   [junit4]    > Throwable #1: java.lang.OutOfMemoryError: Java heap space
   [junit4]    > 	at __randomizedtesting.SeedInfo.seed([21B676D924FB8B85:16CB852C186C28FB]:0)
   [junit4]    > 	at org.apache.lucene.util.bkd.HeapPointWriter.<init>(HeapPointWriter.java:52)
   [junit4]    > 	at org.apache.lucene.util.bkd.BKDWriter.getPointWriter(BKDWriter.java:1870)
   [junit4]    > 	at org.apache.lucene.util.bkd.BKDWriter.build(BKDWriter.java:1788)
   [junit4]    > 	at org.apache.lucene.util.bkd.BKDWriter.build(BKDWriter.java:1805)
   [junit4]    > 	at org.apache.lucene.util.bkd.BKDWriter.build(BKDWriter.java:1805)
   [junit4]    > 	at org.apache.lucene.util.bkd.BKDWriter.build(BKDWriter.java:1818)
   [junit4]    > 	at org.apache.lucene.util.bkd.BKDWriter.build(BKDWriter.java:1818)
   [junit4]    > 	at org.apache.lucene.util.bkd.BKDWriter.build(BKDWriter.java:1805)
   [junit4]    > 	at org.apache.lucene.util.bkd.BKDWriter.finish(BKDWriter.java:1008)
   [junit4]    > 	at org.apache.lucene.index.RandomCodec$1$1.writeField(RandomCodec.java:141)
   [junit4]    > 	at org.apache.lucene.codecs.asserting.AssertingPointsFormat$AssertingPointsWriter.writeField(AssertingPointsFormat.java:137)
   [junit4]    > 	at org.apache.lucene.index.PointValuesWriter.flush(PointValuesWriter.java:183)
   [junit4]    > 	at org.apache.lucene.index.DefaultIndexingChain.writePoints(DefaultIndexingChain.java:204)
   [junit4]    > 	at org.apache.lucene.index.DefaultIndexingChain.flush(DefaultIndexingChain.java:139)
   [junit4]    > 	at org.apache.lucene.index.DocumentsWriterPerThread.flush(DocumentsWriterPerThread.java:470)
   [junit4]    > 	at org.apache.lucene.index.DocumentsWriter.doFlush(DocumentsWriter.java:554)
   [junit4]    > 	at org.apache.lucene.index.DocumentsWriter.flushAllThreads(DocumentsWriter.java:719)
   [junit4]    > 	at org.apache.lucene.index.IndexWriter.prepareCommitInternal(IndexWriter.java:3205)
   [junit4]    > 	at org.apache.lucene.index.IndexWriter.commitInternal(IndexWriter.java:3450)
   [junit4]    > 	at org.apache.lucene.index.IndexWriter.commit(IndexWriter.java:3415)
   [junit4]    > 	at org.apache.lucene.index.RandomIndexWriter.getReader(RandomIndexWriter.java:403)
   [junit4]    > 	at org.apache.lucene.index.RandomIndexWriter.getReader(RandomIndexWriter.java:332)
   [junit4]    > 	at org.apache.lucene.document.TestLatLonShape.testBasicIntersects(TestLatLonShape.java:97)
   [junit4]    > 	at java.base/jdk.internal.reflect.NativeMethodAccessorImpl.invoke0(Native
Method)
   [junit4]    > 	at java.base/jdk.internal.reflect.NativeMethodAccessorImpl.invoke(NativeMethodAccessorImpl.java:62)
   [junit4]    > 	at java.base/jdk.internal.reflect.DelegatingMethodAccessorImpl.invoke(DelegatingMethodAccessorImpl.java:43)
   [junit4]    > 	at java.base/java.lang.reflect.Method.invoke(Method.java:564)
   [junit4]   2> NOTE: test params are: codec=Asserting(Lucene70): {}, docValues:{}, maxPointsInLeafNode=219,
maxMBSortInHeap=7.564312512846744, sim=RandomSimilarity(queryNorm=true): {}, locale=ar-IL,
timezone=WET
   [junit4]   2> NOTE: Linux 4.15.0-24-generic amd64/Oracle Corporation 9.0.4 (64-bit)/cpus=8,threads=1,free=315503008,total=332398592
   [junit4]   2> NOTE: All tests run in this JVM: [FuzzyLikeThisQueryTest, TestNearest,
TestLatLonDocValuesQueries, TestIntervalQuery, TestIDVersionPostingsFormat, TestBigIntegerPoint,
TestDoubleRangeField, TestFloatPointNearestNeighbor, TestHalfFloatPoint, TestLatLonDocValuesField,
TestLatLonPoint, TestLatLonPointDistanceSort, TestLatLonShape]
   [junit4] Completed [24/24 (2!)] on J1 in 10.62s, 2 tests, 1 error, 1 skipped <<<
FAILURES!

[...truncated 1 lines...]
   [junit4] JVM J1: stdout was not empty, see: /home/jenkins/workspace/Lucene-Solr-7.x-Linux/lucene/build/sandbox/test/temp/junit4-J1-20180715_033251_58316009802965077270967.sysout
   [junit4] >>> JVM J1 emitted unexpected output (verbatim) ----
   [junit4] java.lang.OutOfMemoryError: Java heap space
   [junit4] Dumping heap to /home/jenkins/workspace/Lucene-Solr-7.x-Linux/heapdumps/java_pid24323.hprof
...
   [junit4] Heap dump file created [422411635 bytes in 0.409 secs]
   [junit4] <<< JVM J1: EOF ----

[...truncated 14309 lines...]
BUILD FAILED
/home/jenkins/workspace/Lucene-Solr-7.x-Linux/build.xml:633: The following error occurred
while executing this line:
/home/jenkins/workspace/Lucene-Solr-7.x-Linux/build.xml:585: Some of the tests produced a
heap dump, but did not fail. Maybe a suppressed OutOfMemoryError? Dumps created:
* java_pid24323.hprof

Total time: 68 minutes 50 seconds
Build step 'Invoke Ant' marked build as failure
Archiving artifacts
Setting ANT_1_8_2_HOME=/var/lib/jenkins/tools/hudson.tasks.Ant_AntInstallation/ANT_1.8.2
[WARNINGS] Skipping publisher since build result is FAILURE
Recording test results
Setting ANT_1_8_2_HOME=/var/lib/jenkins/tools/hudson.tasks.Ant_AntInstallation/ANT_1.8.2
Email was triggered for: Failure - Any
Sending email for trigger: Failure - Any
Setting ANT_1_8_2_HOME=/var/lib/jenkins/tools/hudson.tasks.Ant_AntInstallation/ANT_1.8.2
Setting ANT_1_8_2_HOME=/var/lib/jenkins/tools/hudson.tasks.Ant_AntInstallation/ANT_1.8.2
Setting ANT_1_8_2_HOME=/var/lib/jenkins/tools/hudson.tasks.Ant_AntInstallation/ANT_1.8.2
Setting ANT_1_8_2_HOME=/var/lib/jenkins/tools/hudson.tasks.Ant_AntInstallation/ANT_1.8.2

Mime
View raw message