lucene-dev mailing list archives

Site index · List index
Message view « Date » · « Thread »
Top « Date » · « Thread »
From Policeman Jenkins Server <jenk...@thetaphi.de>
Subject [JENKINS] Lucene-Solr-BadApples-7.x-Linux (64bit/jdk-10) - Build # 62 - Failure!
Date Tue, 10 Jul 2018 14:39:05 GMT
Build: https://jenkins.thetaphi.de/job/Lucene-Solr-BadApples-7.x-Linux/62/
Java: 64bit/jdk-10 -XX:-UseCompressedOops -XX:+UseParallelGC

3 tests failed.
FAILED:  org.apache.solr.cloud.api.collections.ShardSplitTest.test

Error Message:
Wrong doc count on shard1_0. See SOLR-5309 expected:<325> but was:<328>

Stack Trace:
java.lang.AssertionError: Wrong doc count on shard1_0. See SOLR-5309 expected:<325> but was:<328>
	at __randomizedtesting.SeedInfo.seed([1B10D5F79AF46949:9344EA2D340804B1]:0)
	at org.junit.Assert.fail(Assert.java:93)
	at org.junit.Assert.failNotEquals(Assert.java:647)
	at org.junit.Assert.assertEquals(Assert.java:128)
	at org.junit.Assert.assertEquals(Assert.java:472)
	at org.apache.solr.cloud.api.collections.ShardSplitTest.checkDocCountsAndShardStates(ShardSplitTest.java:968)
	at org.apache.solr.cloud.api.collections.ShardSplitTest.splitByUniqueKeyTest(ShardSplitTest.java:751)
	at org.apache.solr.cloud.api.collections.ShardSplitTest.test(ShardSplitTest.java:105)
	at java.base/jdk.internal.reflect.NativeMethodAccessorImpl.invoke0(Native Method)
	at java.base/jdk.internal.reflect.NativeMethodAccessorImpl.invoke(NativeMethodAccessorImpl.java:62)
	at java.base/jdk.internal.reflect.DelegatingMethodAccessorImpl.invoke(DelegatingMethodAccessorImpl.java:43)
	at java.base/java.lang.reflect.Method.invoke(Method.java:564)
	at com.carrotsearch.randomizedtesting.RandomizedRunner.invoke(RandomizedRunner.java:1737)
	at com.carrotsearch.randomizedtesting.RandomizedRunner$8.evaluate(RandomizedRunner.java:934)
	at com.carrotsearch.randomizedtesting.RandomizedRunner$9.evaluate(RandomizedRunner.java:970)
	at com.carrotsearch.randomizedtesting.RandomizedRunner$10.evaluate(RandomizedRunner.java:984)
	at org.apache.solr.BaseDistributedSearchTestCase$ShardsRepeatRule$ShardsFixedStatement.callStatement(BaseDistributedSearchTestCase.java:1008)
	at org.apache.solr.BaseDistributedSearchTestCase$ShardsRepeatRule$ShardsStatement.evaluate(BaseDistributedSearchTestCase.java:983)
	at com.carrotsearch.randomizedtesting.rules.SystemPropertiesRestoreRule$1.evaluate(SystemPropertiesRestoreRule.java:57)
	at org.apache.lucene.util.TestRuleSetupTeardownChained$1.evaluate(TestRuleSetupTeardownChained.java:49)
	at org.apache.lucene.util.AbstractBeforeAfterRule$1.evaluate(AbstractBeforeAfterRule.java:45)
	at org.apache.lucene.util.TestRuleThreadAndTestName$1.evaluate(TestRuleThreadAndTestName.java:48)
	at org.apache.lucene.util.TestRuleIgnoreAfterMaxFailures$1.evaluate(TestRuleIgnoreAfterMaxFailures.java:64)
	at org.apache.lucene.util.TestRuleMarkFailure$1.evaluate(TestRuleMarkFailure.java:47)
	at com.carrotsearch.randomizedtesting.rules.StatementAdapter.evaluate(StatementAdapter.java:36)
	at com.carrotsearch.randomizedtesting.ThreadLeakControl$StatementRunner.run(ThreadLeakControl.java:368)
	at com.carrotsearch.randomizedtesting.ThreadLeakControl.forkTimeoutingTask(ThreadLeakControl.java:817)
	at com.carrotsearch.randomizedtesting.ThreadLeakControl$3.evaluate(ThreadLeakControl.java:468)
	at com.carrotsearch.randomizedtesting.RandomizedRunner.runSingleTest(RandomizedRunner.java:943)
	at com.carrotsearch.randomizedtesting.RandomizedRunner$5.evaluate(RandomizedRunner.java:829)
	at com.carrotsearch.randomizedtesting.RandomizedRunner$6.evaluate(RandomizedRunner.java:879)
	at com.carrotsearch.randomizedtesting.RandomizedRunner$7.evaluate(RandomizedRunner.java:890)
	at com.carrotsearch.randomizedtesting.rules.StatementAdapter.evaluate(StatementAdapter.java:36)
	at com.carrotsearch.randomizedtesting.rules.SystemPropertiesRestoreRule$1.evaluate(SystemPropertiesRestoreRule.java:57)
	at org.apache.lucene.util.AbstractBeforeAfterRule$1.evaluate(AbstractBeforeAfterRule.java:45)
	at com.carrotsearch.randomizedtesting.rules.StatementAdapter.evaluate(StatementAdapter.java:36)
	at org.apache.lucene.util.TestRuleStoreClassName$1.evaluate(TestRuleStoreClassName.java:41)
	at com.carrotsearch.randomizedtesting.rules.NoShadowingOrOverridesOnMethodsRule$1.evaluate(NoShadowingOrOverridesOnMethodsRule.java:40)
	at com.carrotsearch.randomizedtesting.rules.NoShadowingOrOverridesOnMethodsRule$1.evaluate(NoShadowingOrOverridesOnMethodsRule.java:40)
	at com.carrotsearch.randomizedtesting.rules.StatementAdapter.evaluate(StatementAdapter.java:36)
	at com.carrotsearch.randomizedtesting.rules.StatementAdapter.evaluate(StatementAdapter.java:36)
	at org.apache.lucene.util.TestRuleAssertionsRequired$1.evaluate(TestRuleAssertionsRequired.java:53)
	at org.apache.lucene.util.TestRuleMarkFailure$1.evaluate(TestRuleMarkFailure.java:47)
	at org.apache.lucene.util.TestRuleIgnoreAfterMaxFailures$1.evaluate(TestRuleIgnoreAfterMaxFailures.java:64)
	at org.apache.lucene.util.TestRuleIgnoreTestSuites$1.evaluate(TestRuleIgnoreTestSuites.java:54)
	at com.carrotsearch.randomizedtesting.rules.StatementAdapter.evaluate(StatementAdapter.java:36)
	at com.carrotsearch.randomizedtesting.ThreadLeakControl$StatementRunner.run(ThreadLeakControl.java:368)
	at java.base/java.lang.Thread.run(Thread.java:844)


FAILED:  org.apache.solr.cloud.api.collections.ShardSplitTest.testSplitWithChaosMonkey

Error Message:
We think that split was successful but sub-shard states were not updated even after 2 minutes.

Stack Trace:
java.lang.AssertionError: We think that split was successful but sub-shard states were not updated even after 2 minutes.
	at __randomizedtesting.SeedInfo.seed([1B10D5F79AF46949:90370626DBF2C2CD]:0)
	at org.junit.Assert.fail(Assert.java:93)
	at org.apache.solr.cloud.api.collections.ShardSplitTest.testSplitWithChaosMonkey(ShardSplitTest.java:555)
	at java.base/jdk.internal.reflect.NativeMethodAccessorImpl.invoke0(Native Method)
	at java.base/jdk.internal.reflect.NativeMethodAccessorImpl.invoke(NativeMethodAccessorImpl.java:62)
	at java.base/jdk.internal.reflect.DelegatingMethodAccessorImpl.invoke(DelegatingMethodAccessorImpl.java:43)
	at java.base/java.lang.reflect.Method.invoke(Method.java:564)
	at com.carrotsearch.randomizedtesting.RandomizedRunner.invoke(RandomizedRunner.java:1737)
	at com.carrotsearch.randomizedtesting.RandomizedRunner$8.evaluate(RandomizedRunner.java:934)
	at com.carrotsearch.randomizedtesting.RandomizedRunner$9.evaluate(RandomizedRunner.java:970)
	at com.carrotsearch.randomizedtesting.RandomizedRunner$10.evaluate(RandomizedRunner.java:984)
	at org.apache.solr.BaseDistributedSearchTestCase$ShardsRepeatRule$ShardsFixedStatement.callStatement(BaseDistributedSearchTestCase.java:1008)
	at org.apache.solr.BaseDistributedSearchTestCase$ShardsRepeatRule$ShardsStatement.evaluate(BaseDistributedSearchTestCase.java:983)
	at com.carrotsearch.randomizedtesting.rules.SystemPropertiesRestoreRule$1.evaluate(SystemPropertiesRestoreRule.java:57)
	at org.apache.lucene.util.TestRuleSetupTeardownChained$1.evaluate(TestRuleSetupTeardownChained.java:49)
	at org.apache.lucene.util.AbstractBeforeAfterRule$1.evaluate(AbstractBeforeAfterRule.java:45)
	at org.apache.lucene.util.TestRuleThreadAndTestName$1.evaluate(TestRuleThreadAndTestName.java:48)
	at org.apache.lucene.util.TestRuleIgnoreAfterMaxFailures$1.evaluate(TestRuleIgnoreAfterMaxFailures.java:64)
	at org.apache.lucene.util.TestRuleMarkFailure$1.evaluate(TestRuleMarkFailure.java:47)
	at com.carrotsearch.randomizedtesting.rules.StatementAdapter.evaluate(StatementAdapter.java:36)
	at com.carrotsearch.randomizedtesting.ThreadLeakControl$StatementRunner.run(ThreadLeakControl.java:368)
	at com.carrotsearch.randomizedtesting.ThreadLeakControl.forkTimeoutingTask(ThreadLeakControl.java:817)
	at com.carrotsearch.randomizedtesting.ThreadLeakControl$3.evaluate(ThreadLeakControl.java:468)
	at com.carrotsearch.randomizedtesting.RandomizedRunner.runSingleTest(RandomizedRunner.java:943)
	at com.carrotsearch.randomizedtesting.RandomizedRunner$5.evaluate(RandomizedRunner.java:829)
	at com.carrotsearch.randomizedtesting.RandomizedRunner$6.evaluate(RandomizedRunner.java:879)
	at com.carrotsearch.randomizedtesting.RandomizedRunner$7.evaluate(RandomizedRunner.java:890)
	at com.carrotsearch.randomizedtesting.rules.StatementAdapter.evaluate(StatementAdapter.java:36)
	at com.carrotsearch.randomizedtesting.rules.SystemPropertiesRestoreRule$1.evaluate(SystemPropertiesRestoreRule.java:57)
	at org.apache.lucene.util.AbstractBeforeAfterRule$1.evaluate(AbstractBeforeAfterRule.java:45)
	at com.carrotsearch.randomizedtesting.rules.StatementAdapter.evaluate(StatementAdapter.java:36)
	at org.apache.lucene.util.TestRuleStoreClassName$1.evaluate(TestRuleStoreClassName.java:41)
	at com.carrotsearch.randomizedtesting.rules.NoShadowingOrOverridesOnMethodsRule$1.evaluate(NoShadowingOrOverridesOnMethodsRule.java:40)
	at com.carrotsearch.randomizedtesting.rules.NoShadowingOrOverridesOnMethodsRule$1.evaluate(NoShadowingOrOverridesOnMethodsRule.java:40)
	at com.carrotsearch.randomizedtesting.rules.StatementAdapter.evaluate(StatementAdapter.java:36)
	at com.carrotsearch.randomizedtesting.rules.StatementAdapter.evaluate(StatementAdapter.java:36)
	at org.apache.lucene.util.TestRuleAssertionsRequired$1.evaluate(TestRuleAssertionsRequired.java:53)
	at org.apache.lucene.util.TestRuleMarkFailure$1.evaluate(TestRuleMarkFailure.java:47)
	at org.apache.lucene.util.TestRuleIgnoreAfterMaxFailures$1.evaluate(TestRuleIgnoreAfterMaxFailures.java:64)
	at org.apache.lucene.util.TestRuleIgnoreTestSuites$1.evaluate(TestRuleIgnoreTestSuites.java:54)
	at com.carrotsearch.randomizedtesting.rules.StatementAdapter.evaluate(StatementAdapter.java:36)
	at com.carrotsearch.randomizedtesting.ThreadLeakControl$StatementRunner.run(ThreadLeakControl.java:368)
	at java.base/java.lang.Thread.run(Thread.java:844)


FAILED:  org.apache.solr.handler.component.InfixSuggestersTest.testShutdownDuringBuild

Error Message:
junit.framework.AssertionFailedError: Unexpected wrapped exception type, expected CoreIsClosedException

Stack Trace:
java.util.concurrent.ExecutionException: junit.framework.AssertionFailedError: Unexpected wrapped exception type, expected CoreIsClosedException
	at __randomizedtesting.SeedInfo.seed([1B10D5F79AF46949:C49DB748A49D3C2B]:0)
	at java.base/java.util.concurrent.FutureTask.report(FutureTask.java:122)
	at java.base/java.util.concurrent.FutureTask.get(FutureTask.java:191)
	at org.apache.solr.handler.component.InfixSuggestersTest.testShutdownDuringBuild(InfixSuggestersTest.java:130)
	at java.base/jdk.internal.reflect.NativeMethodAccessorImpl.invoke0(Native Method)
	at java.base/jdk.internal.reflect.NativeMethodAccessorImpl.invoke(NativeMethodAccessorImpl.java:62)
	at java.base/jdk.internal.reflect.DelegatingMethodAccessorImpl.invoke(DelegatingMethodAccessorImpl.java:43)
	at java.base/java.lang.reflect.Method.invoke(Method.java:564)
	at com.carrotsearch.randomizedtesting.RandomizedRunner.invoke(RandomizedRunner.java:1737)
	at com.carrotsearch.randomizedtesting.RandomizedRunner$8.evaluate(RandomizedRunner.java:934)
	at com.carrotsearch.randomizedtesting.RandomizedRunner$9.evaluate(RandomizedRunner.java:970)
	at com.carrotsearch.randomizedtesting.RandomizedRunner$10.evaluate(RandomizedRunner.java:984)
	at com.carrotsearch.randomizedtesting.rules.SystemPropertiesRestoreRule$1.evaluate(SystemPropertiesRestoreRule.java:57)
	at org.apache.lucene.util.TestRuleSetupTeardownChained$1.evaluate(TestRuleSetupTeardownChained.java:49)
	at org.apache.lucene.util.AbstractBeforeAfterRule$1.evaluate(AbstractBeforeAfterRule.java:45)
	at org.apache.lucene.util.TestRuleThreadAndTestName$1.evaluate(TestRuleThreadAndTestName.java:48)
	at org.apache.lucene.util.TestRuleIgnoreAfterMaxFailures$1.evaluate(TestRuleIgnoreAfterMaxFailures.java:64)
	at org.apache.lucene.util.TestRuleMarkFailure$1.evaluate(TestRuleMarkFailure.java:47)
	at com.carrotsearch.randomizedtesting.rules.StatementAdapter.evaluate(StatementAdapter.java:36)
	at com.carrotsearch.randomizedtesting.ThreadLeakControl$StatementRunner.run(ThreadLeakControl.java:368)
	at com.carrotsearch.randomizedtesting.ThreadLeakControl.forkTimeoutingTask(ThreadLeakControl.java:817)
	at com.carrotsearch.randomizedtesting.ThreadLeakControl$3.evaluate(ThreadLeakControl.java:468)
	at com.carrotsearch.randomizedtesting.RandomizedRunner.runSingleTest(RandomizedRunner.java:943)
	at com.carrotsearch.randomizedtesting.RandomizedRunner$5.evaluate(RandomizedRunner.java:829)
	at com.carrotsearch.randomizedtesting.RandomizedRunner$6.evaluate(RandomizedRunner.java:879)
	at com.carrotsearch.randomizedtesting.RandomizedRunner$7.evaluate(RandomizedRunner.java:890)
	at com.carrotsearch.randomizedtesting.rules.StatementAdapter.evaluate(StatementAdapter.java:36)
	at com.carrotsearch.randomizedtesting.rules.SystemPropertiesRestoreRule$1.evaluate(SystemPropertiesRestoreRule.java:57)
	at org.apache.lucene.util.AbstractBeforeAfterRule$1.evaluate(AbstractBeforeAfterRule.java:45)
	at com.carrotsearch.randomizedtesting.rules.StatementAdapter.evaluate(StatementAdapter.java:36)
	at org.apache.lucene.util.TestRuleStoreClassName$1.evaluate(TestRuleStoreClassName.java:41)
	at com.carrotsearch.randomizedtesting.rules.NoShadowingOrOverridesOnMethodsRule$1.evaluate(NoShadowingOrOverridesOnMethodsRule.java:40)
	at com.carrotsearch.randomizedtesting.rules.NoShadowingOrOverridesOnMethodsRule$1.evaluate(NoShadowingOrOverridesOnMethodsRule.java:40)
	at com.carrotsearch.randomizedtesting.rules.StatementAdapter.evaluate(StatementAdapter.java:36)
	at com.carrotsearch.randomizedtesting.rules.StatementAdapter.evaluate(StatementAdapter.java:36)
	at org.apache.lucene.util.TestRuleAssertionsRequired$1.evaluate(TestRuleAssertionsRequired.java:53)
	at org.apache.lucene.util.TestRuleMarkFailure$1.evaluate(TestRuleMarkFailure.java:47)
	at org.apache.lucene.util.TestRuleIgnoreAfterMaxFailures$1.evaluate(TestRuleIgnoreAfterMaxFailures.java:64)
	at org.apache.lucene.util.TestRuleIgnoreTestSuites$1.evaluate(TestRuleIgnoreTestSuites.java:54)
	at com.carrotsearch.randomizedtesting.rules.StatementAdapter.evaluate(StatementAdapter.java:36)
	at com.carrotsearch.randomizedtesting.ThreadLeakControl$StatementRunner.run(ThreadLeakControl.java:368)
	at java.base/java.lang.Thread.run(Thread.java:844)
Caused by: junit.framework.AssertionFailedError: Unexpected wrapped exception type, expected CoreIsClosedException
	at org.apache.lucene.util.LuceneTestCase.expectThrows(LuceneTestCase.java:2704)
	at org.apache.solr.handler.component.InfixSuggestersTest.lambda$testShutdownDuringBuild$3(InfixSuggestersTest.java:121)
	at java.base/java.util.concurrent.FutureTask.run(FutureTask.java:264)
	at org.apache.solr.common.util.ExecutorUtil$MDCAwareThreadPoolExecutor.lambda$execute$0(ExecutorUtil.java:209)
	at java.base/java.util.concurrent.ThreadPoolExecutor.runWorker(ThreadPoolExecutor.java:1135)
	at java.base/java.util.concurrent.ThreadPoolExecutor$Worker.run(ThreadPoolExecutor.java:635)
	... 1 more
Caused by: java.lang.RuntimeException: Exception during query
	at org.apache.solr.SolrTestCaseJ4.assertQ(SolrTestCaseJ4.java:917)
	at org.apache.solr.SolrTestCaseJ4.assertQ(SolrTestCaseJ4.java:877)
	at org.apache.solr.handler.component.InfixSuggestersTest.lambda$testShutdownDuringBuild$2(InfixSuggestersTest.java:122)
	at org.apache.lucene.util.LuceneTestCase.expectThrows(LuceneTestCase.java:2696)
	... 6 more
Caused by: org.apache.solr.common.SolrException: SolrCoreState already closed.
	at org.apache.solr.update.DefaultSolrCoreState.lock(DefaultSolrCoreState.java:186)
	at org.apache.solr.update.DefaultSolrCoreState.getIndexWriter(DefaultSolrCoreState.java:121)
	at org.apache.solr.update.SolrCoreState.getTragicException(SolrCoreState.java:198)
	at org.apache.solr.core.CoreContainer.checkTragicException(CoreContainer.java:1805)
	at org.apache.solr.handler.RequestHandlerBase.handleRequest(RequestHandlerBase.java:212)
	at org.apache.solr.core.SolrCore.execute(SolrCore.java:2541)
	at org.apache.solr.util.TestHarness.query(TestHarness.java:337)
	at org.apache.solr.util.TestHarness.query(TestHarness.java:319)
	at org.apache.solr.SolrTestCaseJ4.assertQ(SolrTestCaseJ4.java:891)
	... 9 more




Build Log:
[...truncated 13066 lines...]
   [junit4] Suite: org.apache.solr.handler.component.InfixSuggestersTest
   [junit4]   2> Creating dataDir: /home/jenkins/workspace/Lucene-Solr-BadApples-7.x-Linux/solr/build/solr-core/test/J0/temp/solr.handler.component.InfixSuggestersTest_1B10D5F79AF46949-001/init-core-data-001
   [junit4]   2> 809725 INFO  (SUITE-InfixSuggestersTest-seed#[1B10D5F79AF46949]-worker) [    ] o.a.s.SolrTestCaseJ4 Using PointFields (NUMERIC_POINTS_SYSPROP=true) w/NUMERIC_DOCVALUES_SYSPROP=false
   [junit4]   2> 809726 INFO  (SUITE-InfixSuggestersTest-seed#[1B10D5F79AF46949]-worker) [    ] o.a.s.SolrTestCaseJ4 Randomized ssl (true) and clientAuth (false) via: @org.apache.solr.util.RandomizeSSL(reason="", ssl=0.0/0.0, value=0.0/0.0, clientAuth=0.0/0.0)
   [junit4]   2> 809726 INFO  (SUITE-InfixSuggestersTest-seed#[1B10D5F79AF46949]-worker) [    ] o.a.s.SolrTestCaseJ4 SecureRandom sanity checks: test.solr.allowed.securerandom=null & java.security.egd=file:/dev/./urandom
   [junit4]   2> 809726 INFO  (SUITE-InfixSuggestersTest-seed#[1B10D5F79AF46949]-worker) [    ] o.a.s.SolrTestCaseJ4 ####initCore
   [junit4]   2> 809731 INFO  (SUITE-InfixSuggestersTest-seed#[1B10D5F79AF46949]-worker) [    ] o.a.s.c.SolrResourceLoader [null] Added 2 libs to classloader, from paths: [/home/jenkins/workspace/Lucene-Solr-BadApples-7.x-Linux/solr/core/src/test-files/solr/collection1/lib, /home/jenkins/workspace/Lucene-Solr-BadApples-7.x-Linux/solr/core/src/test-files/solr/collection1/lib/classes]
   [junit4]   2> 809772 INFO  (SUITE-InfixSuggestersTest-seed#[1B10D5F79AF46949]-worker) [    ] o.a.s.c.SolrConfig Using Lucene MatchVersion: 7.5.0
   [junit4]   2> 809793 INFO  (SUITE-InfixSuggestersTest-seed#[1B10D5F79AF46949]-worker) [    ] o.a.s.s.IndexSchema [null] Schema name=test
   [junit4]   2> 809924 INFO  (SUITE-InfixSuggestersTest-seed#[1B10D5F79AF46949]-worker) [    ] o.a.s.s.IndexSchema Loaded schema test/1.0 with uniqueid field id
   [junit4]   2> 810203 INFO  (SUITE-InfixSuggestersTest-seed#[1B10D5F79AF46949]-worker) [    ] o.a.s.c.TransientSolrCoreCacheDefault Allocating transient cache for 2147483647 transient cores
   [junit4]   2> 810203 INFO  (SUITE-InfixSuggestersTest-seed#[1B10D5F79AF46949]-worker) [    ] o.a.s.h.a.MetricsHistoryHandler No .system collection, keeping metrics history in memory.
   [junit4]   2> 810215 INFO  (SUITE-InfixSuggestersTest-seed#[1B10D5F79AF46949]-worker) [    ] o.a.s.m.r.SolrJmxReporter JMX monitoring for 'solr.node' (registry 'solr.node') enabled at server: com.sun.jmx.mbeanserver.JmxMBeanServer@73ed318b
   [junit4]   2> 810223 INFO  (SUITE-InfixSuggestersTest-seed#[1B10D5F79AF46949]-worker) [    ] o.a.s.m.r.SolrJmxReporter JMX monitoring for 'solr.jvm' (registry 'solr.jvm') enabled at server: com.sun.jmx.mbeanserver.JmxMBeanServer@73ed318b
   [junit4]   2> 810223 INFO  (SUITE-InfixSuggestersTest-seed#[1B10D5F79AF46949]-worker) [    ] o.a.s.m.r.SolrJmxReporter JMX monitoring for 'solr.jetty' (registry 'solr.jetty') enabled at server: com.sun.jmx.mbeanserver.JmxMBeanServer@73ed318b
   [junit4]   2> 810225 INFO  (coreLoadExecutor-4856-thread-1) [    x:collection1] o.a.s.c.SolrResourceLoader [null] Added 2 libs to classloader, from paths: [/home/jenkins/workspace/Lucene-Solr-BadApples-7.x-Linux/solr/core/src/test-files/solr/collection1/lib, /home/jenkins/workspace/Lucene-Solr-BadApples-7.x-Linux/solr/core/src/test-files/solr/collection1/lib/classes]
   [junit4]   2> 810238 INFO  (coreLoadExecutor-4856-thread-1) [    x:collection1] o.a.s.c.SolrConfig Using Lucene MatchVersion: 7.5.0
   [junit4]   2> 810252 INFO  (coreLoadExecutor-4856-thread-1) [    x:collection1] o.a.s.s.IndexSchema [collection1] Schema name=test
   [junit4]   2> 810304 INFO  (coreLoadExecutor-4856-thread-1) [    x:collection1] o.a.s.s.IndexSchema Loaded schema test/1.0 with uniqueid field id
   [junit4]   2> 810308 INFO  (coreLoadExecutor-4856-thread-1) [    x:collection1] o.a.s.c.CoreContainer Creating SolrCore 'collection1' using configuration from instancedir /home/jenkins/workspace/Lucene-Solr-BadApples-7.x-Linux/solr/core/src/test-files/solr/collection1, trusted=true
   [junit4]   2> 810309 INFO  (coreLoadExecutor-4856-thread-1) [    x:collection1] o.a.s.m.r.SolrJmxReporter JMX monitoring for 'solr.core.collection1' (registry 'solr.core.collection1') enabled at server: com.sun.jmx.mbeanserver.JmxMBeanServer@73ed318b
   [junit4]   2> 810309 INFO  (coreLoadExecutor-4856-thread-1) [    x:collection1] o.a.s.c.SolrCore solr.RecoveryStrategy.Builder
   [junit4]   2> 810309 INFO  (coreLoadExecutor-4856-thread-1) [    x:collection1] o.a.s.c.SolrCore [[collection1] ] Opening new SolrCore at [/home/jenkins/workspace/Lucene-Solr-BadApples-7.x-Linux/solr/core/src/test-files/solr/collection1], dataDir=[/home/jenkins/workspace/Lucene-Solr-BadApples-7.x-Linux/solr/build/solr-core/test/J0/temp/solr.handler.component.InfixSuggestersTest_1B10D5F79AF46949-001/init-core-data-001/]
   [junit4]   2> 810310 INFO  (coreLoadExecutor-4856-thread-1) [    x:collection1] o.a.s.u.RandomMergePolicy RandomMergePolicy wrapping class org.apache.lucene.index.LogDocMergePolicy: [LogDocMergePolicy: minMergeSize=1000, mergeFactor=39, maxMergeSize=9223372036854775807, maxMergeSizeForForcedMerge=9223372036854775807, calibrateSizeByDeletes=false, maxMergeDocs=2147483647, maxCFSSegmentSizeMB=8.796093022207999E12, noCFSRatio=1.0]
   [junit4]   2> 810361 INFO  (coreLoadExecutor-4856-thread-1) [    x:collection1] o.a.s.u.CommitTracker Hard AutoCommit: disabled
   [junit4]   2> 810361 INFO  (coreLoadExecutor-4856-thread-1) [    x:collection1] o.a.s.u.CommitTracker Soft AutoCommit: disabled
   [junit4]   2> 810362 INFO  (coreLoadExecutor-4856-thread-1) [    x:collection1] o.a.s.u.RandomMergePolicy RandomMergePolicy wrapping class org.apache.lucene.index.AlcoholicMergePolicy: [AlcoholicMergePolicy: minMergeSize=0, mergeFactor=10, maxMergeSize=989997755, maxMergeSizeForForcedMerge=9223372036854775807, calibrateSizeByDeletes=true, maxMergeDocs=2147483647, maxCFSSegmentSizeMB=8.796093022207999E12, noCFSRatio=0.1]
   [junit4]   2> 810363 INFO  (coreLoadExecutor-4856-thread-1) [    x:collection1] o.a.s.s.SolrIndexSearcher Opening [Searcher@324f510a[collection1] main]
   [junit4]   2> 810363 WARN  (coreLoadExecutor-4856-thread-1) [    x:collection1] o.a.s.r.ManagedResourceStorage Cannot write to config directory /home/jenkins/workspace/Lucene-Solr-BadApples-7.x-Linux/solr/core/src/test-files/solr/collection1/conf; switching to use InMemory storage instead.
   [junit4]   2> 810363 INFO  (coreLoadExecutor-4856-thread-1) [    x:collection1] o.a.s.h.c.SuggestComponent Initializing SuggestComponent
   [junit4]   2> 810363 INFO  (coreLoadExecutor-4856-thread-1) [    x:collection1] o.a.s.s.s.SolrSuggester init: {name=shortRandomAnalyzingInfixSuggester,lookupImpl=AnalyzingInfixLookupFactory,dictionaryImpl=RandomTestDictionaryFactory,randDictMaxItems=100,indexPath=short_random_analyzing_infix_suggester,suggestAnalyzerFieldType=text,buildOnCommit=false,buildOnStartup=false}
   [junit4]   2> 810366 INFO  (coreLoadExecutor-4856-thread-1) [    x:collection1] o.a.s.s.s.SolrSuggester Dictionary loaded with params: {name=shortRandomAnalyzingInfixSuggester,lookupImpl=AnalyzingInfixLookupFactory,dictionaryImpl=RandomTestDictionaryFactory,randDictMaxItems=100,indexPath=short_random_analyzing_infix_suggester,suggestAnalyzerFieldType=text,buildOnCommit=false,buildOnStartup=false}
   [junit4]   2> 810367 INFO  (coreLoadExecutor-4856-thread-1) [    x:collection1] o.a.s.h.c.SuggestComponent Initializing SuggestComponent
   [junit4]   2> 810367 INFO  (coreLoadExecutor-4856-thread-1) [    x:collection1] o.a.s.s.s.SolrSuggester init: {name=longRandomAnalyzingInfixSuggester,lookupImpl=AnalyzingInfixLookupFactory,dictionaryImpl=RandomTestDictionaryFactory,randDictMaxItems=100000,indexPath=long_random_analyzing_infix_suggester,suggestAnalyzerFieldType=text,buildOnCommit=false,buildOnStartup=false}
   [junit4]   2> 810367 INFO  (coreLoadExecutor-4856-thread-1) [    x:collection1] o.a.s.s.s.SolrSuggester Dictionary loaded with params: {name=longRandomAnalyzingInfixSuggester,lookupImpl=AnalyzingInfixLookupFactory,dictionaryImpl=RandomTestDictionaryFactory,randDictMaxItems=100000,indexPath=long_random_analyzing_infix_suggester,suggestAnalyzerFieldType=text,buildOnCommit=false,buildOnStartup=false}
   [junit4]   2> 810367 INFO  (coreLoadExecutor-4856-thread-1) [    x:collection1] o.a.s.h.c.SuggestComponent Initializing SuggestComponent
   [junit4]   2> 810367 INFO  (coreLoadExecutor-4856-thread-1) [    x:collection1] o.a.s.s.s.SolrSuggester init: {name=shortRandomBlendedInfixSuggester,lookupImpl=BlendedInfixLookupFactory,dictionaryImpl=RandomTestDictionaryFactory,randDictMaxItems=100,blenderType=position_linear,suggestAnalyzerFieldType=text,indexPath=short_random_blended_infix_suggester,highlight=true,buildOnStartup=false,buildOnCommit=false}
   [junit4]   2> 810367 INFO  (coreLoadExecutor-4856-thread-1) [    x:collection1] o.a.s.s.s.SolrSuggester Dictionary loaded with params: {name=shortRandomBlendedInfixSuggester,lookupImpl=BlendedInfixLookupFactory,dictionaryImpl=RandomTestDictionaryFactory,randDictMaxItems=100,blenderType=position_linear,suggestAnalyzerFieldType=text,indexPath=short_random_blended_infix_suggester,highlight=true,buildOnStartup=false,buildOnCommit=false}
   [junit4]   2> 810367 INFO  (coreLoadExecutor-4856-thread-1) [    x:collection1] o.a.s.h.ReplicationHandler Commits will be reserved for 10000ms.
   [junit4]   2> 810368 INFO  (searcherExecutor-4857-thread-1-processing-x:collection1) [    x:collection1] o.a.s.c.SolrCore [collection1] Registered new searcher Searcher@324f510a[collection1] main{ExitableDirectoryReader(UninvertingDirectoryReader())}
   [junit4]   2> 810368 INFO  (SUITE-InfixSuggestersTest-seed#[1B10D5F79AF46949]-worker) [    ] o.a.s.SolrTestCaseJ4 ####initCore end
   [junit4]   2> 810369 INFO  (TEST-InfixSuggestersTest.testShutdownDuringBuild-seed#[1B10D5F79AF46949]) [    ] o.a.s.SolrTestCaseJ4 ###Starting testShutdownDuringBuild
   [junit4]   2> 810370 INFO  (AnalyzingInfixSuggesterTest-6894-thread-1) [    ] o.a.s.h.c.SuggestComponent SuggestComponent prepare with : qt=/suggest_analyzing_infix_long_dictionary&suggest=true&suggest.buildAll=true&wt=xml&indent=off
   [junit4]   2> 810370 INFO  (AnalyzingInfixSuggesterTest-6894-thread-1) [    ] o.a.s.s.s.SolrSuggester SolrSuggester.build(longRandomAnalyzingInfixSuggester)
   [junit4]   2> 810447 INFO  (AnalyzingInfixSuggesterTest-6894-thread-1) [    ] o.a.s.s.s.RandomTestDictionaryFactory org.apache.solr.spelling.suggest.RandomTestDictionaryFactory$RandomTestDictionary.enabled.longRandomAnalyzingInfixSuggester emitted 1000 items.
   [junit4]   2> 810470 INFO  (TEST-InfixSuggestersTest.testShutdownDuringBuild-seed#[1B10D5F79AF46949]) [    ] o.a.s.c.CoreContainer Shutting down CoreContainer instance=53429209
   [junit4]   2> 810470 INFO  (TEST-InfixSuggestersTest.testShutdownDuringBuild-seed#[1B10D5F79AF46949]) [    ] o.a.s.m.SolrMetricManager Closing metric reporters for registry=solr.node, tag=null
   [junit4]   2> 810470 INFO  (TEST-InfixSuggestersTest.testShutdownDuringBuild-seed#[1B10D5F79AF46949]) [    ] o.a.s.m.r.SolrJmxReporter Closing reporter [org.apache.solr.metrics.reporters.SolrJmxReporter@2f33ee7b: rootName = null, domain = solr.node, service url = null, agent id = null] for registry solr.node / com.codahale.metrics.MetricRegistry@7165daaf
   [junit4]   2> 810473 INFO  (TEST-InfixSuggestersTest.testShutdownDuringBuild-seed#[1B10D5F79AF46949]) [    ] o.a.s.m.SolrMetricManager Closing metric reporters for registry=solr.jvm, tag=null
   [junit4]   2> 810473 INFO  (TEST-InfixSuggestersTest.testShutdownDuringBuild-seed#[1B10D5F79AF46949]) [    ] o.a.s.m.r.SolrJmxReporter Closing reporter [org.apache.solr.metrics.reporters.SolrJmxReporter@2d9aac1c: rootName = null, domain = solr.jvm, service url = null, agent id = null] for registry solr.jvm / com.codahale.metrics.MetricRegistry@3cf4d53c
   [junit4]   2> 810475 INFO  (TEST-InfixSuggestersTest.testShutdownDuringBuild-seed#[1B10D5F79AF46949]) [    ] o.a.s.m.SolrMetricManager Closing metric reporters for registry=solr.jetty, tag=null
   [junit4]   2> 810475 INFO  (TEST-InfixSuggestersTest.testShutdownDuringBuild-seed#[1B10D5F79AF46949]) [    ] o.a.s.m.r.SolrJmxReporter Closing reporter [org.apache.solr.metrics.reporters.SolrJmxReporter@1c4557a1: rootName = null, domain = solr.jetty, service url = null, agent id = null] for registry solr.jetty / com.codahale.metrics.MetricRegistry@47cb5739
   [junit4]   2> 810476 INFO  (coreCloseExecutor-4861-thread-1) [    x:collection1] o.a.s.c.SolrCore [collection1]  CLOSING SolrCore org.apache.solr.core.SolrCore@7957574d
   [junit4]   2> 810476 INFO  (coreCloseExecutor-4861-thread-1) [    x:collection1] o.a.s.m.SolrMetricManager Closing metric reporters for registry=solr.core.collection1, tag=7957574d
   [junit4]   2> 810476 INFO  (coreCloseExecutor-4861-thread-1) [    x:collection1] o.a.s.m.r.SolrJmxReporter Closing reporter [org.apache.solr.metrics.reporters.SolrJmxReporter@393252be: rootName = null, domain = solr.core.collection1, service url = null, agent id = null] for registry solr.core.collection1 / com.codahale.metrics.MetricRegistry@63daeaf4
   [junit4]   2> 810554 ERROR (AnalyzingInfixSuggesterTest-6894-thread-1) [    ] o.a.s.SolrTestCaseJ4 REQUEST FAILED: qt=/suggest_analyzing_infix_long_dictionary&suggest.buildAll=true&wt=xml:org.apache.solr.common.SolrException: SolrCoreState already closed.
   [junit4]   2> 	at org.apache.solr.update.DefaultSolrCoreState.lock(DefaultSolrCoreState.java:186)
   [junit4]   2> 	at org.apache.solr.update.DefaultSolrCoreState.getIndexWriter(DefaultSolrCoreState.java:121)
   [junit4]   2> 	at org.apache.solr.update.SolrCoreState.getTragicException(SolrCoreState.java:198)
   [junit4]   2> 	at org.apache.solr.core.CoreContainer.checkTragicException(CoreContainer.java:1805)
   [junit4]   2> 	at org.apache.solr.handler.RequestHandlerBase.handleRequest(RequestHandlerBase.java:212)
   [junit4]   2> 	at org.apache.solr.core.SolrCore.execute(SolrCore.java:2541)
   [junit4]   2> 	at org.apache.solr.util.TestHarness.query(TestHarness.java:337)
   [junit4]   2> 	at org.apache.solr.util.TestHarness.query(TestHarness.java:319)
   [junit4]   2> 	at org.apache.solr.SolrTestCaseJ4.assertQ(SolrTestCaseJ4.java:891)
   [junit4]   2> 	at org.apache.solr.SolrTestCaseJ4.assertQ(SolrTestCaseJ4.java:877)
   [junit4]   2> 	at org.apache.solr.handler.component.InfixSuggestersTest.lambda$testShutdownDuringBuild$2(InfixSuggestersTest.java:122)
   [junit4]   2> 	at org.apache.lucene.util.LuceneTestCase.expectThrows(LuceneTestCase.java:2696)
   [junit4]   2> 	at org.apache.solr.handler.component.InfixSuggestersTest.lambda$testShutdownDuringBuild$3(InfixSuggestersTest.java:121)
   [junit4]   2> 	at java.base/java.util.concurrent.FutureTask.run(FutureTask.java:264)
   [junit4]   2> 	at org.apache.solr.common.util.ExecutorUtil$MDCAwareThreadPoolExecutor.lambda$execute$0(ExecutorUtil.java:209)
   [junit4]   2> 	at java.base/java.util.concurrent.ThreadPoolExecutor.runWorker(ThreadPoolExecutor.java:1135)
   [junit4]   2> 	at java.base/java.util.concurrent.ThreadPoolExecutor$Worker.run(ThreadPoolExecutor.java:635)
   [junit4]   2> 	at java.base/java.lang.Thread.run(Thread.java:844)
   [junit4]   2> 
   [junit4]   2> 810554 INFO  (TEST-InfixSuggestersTest.testShutdownDuringBuild-seed#[1B10D5F79AF46949]) [    ] o.a.s.SolrTestCaseJ4 ####initCore
   [junit4]   2> 810555 INFO  (TEST-InfixSuggestersTest.testShutdownDuringBuild-seed#[1B10D5F79AF46949]) [    ] o.a.s.c.SolrResourceLoader [null] Added 2 libs to classloader, from paths: [/home/jenkins/workspace/Lucene-Solr-BadApples-7.x-Linux/solr/core/src/test-files/solr/collection1/lib, /home/jenkins/workspace/Lucene-Solr-BadApples-7.x-Linux/solr/core/src/test-files/solr/collection1/lib/classes]
   [junit4]   2> 810568 INFO  (TEST-InfixSuggestersTest.testShutdownDuringBuild-seed#[1B10D5F79AF46949]) [    ] o.a.s.c.SolrConfig Using Lucene MatchVersion: 7.5.0
   [junit4]   2> 810576 INFO  (TEST-InfixSuggestersTest.testShutdownDuringBuild-seed#[1B10D5F79AF46949]) [    ] o.a.s.s.IndexSchema [null] Schema name=test
   [junit4]   2> 810657 INFO  (TEST-InfixSuggestersTest.testShutdownDuringBuild-seed#[1B10D5F79AF46949]) [    ] o.a.s.s.IndexSchema Loaded schema test/1.0 with uniqueid field id
   [junit4]   2> 810760 INFO  (TEST-InfixSuggestersTest.testShutdownDuringBuild-seed#[1B10D5F79AF46949]) [    ] o.a.s.c.TransientSolrCoreCacheDefault Allocating transient cache for 2147483647 transient cores
   [junit4]   2> 810760 INFO  (TEST-InfixSuggestersTest.testShutdownDuringBuild-seed#[1B10D5F79AF46949]) [    ] o.a.s.h.a.MetricsHistoryHandler No .system collection, keeping metrics history in memory.
   [junit4]   2> 810769 INFO  (TEST-InfixSuggestersTest.testShutdownDuringBuild-seed#[1B10D5F79AF46949]) [    ] o.a.s.m.r.SolrJmxReporter JMX monitoring for 'solr.node' (registry 'solr.node') enabled at server: com.sun.jmx.mbeanserver.JmxMBeanServer@73ed318b
   [junit4]   2> 810774 INFO  (TEST-InfixSuggestersTest.testShutdownDuringBuild-seed#[1B10D5F79AF46949]) [    ] o.a.s.m.r.SolrJmxReporter JMX monitoring for 'solr.jvm' (registry 'solr.jvm') enabled at server: com.sun.jmx.mbeanserver.JmxMBeanServer@73ed318b
   [junit4]   2> 810774 INFO  (TEST-InfixSuggestersTest.testShutdownDuringBuild-seed#[1B10D5F79AF46949]) [    ] o.a.s.m.r.SolrJmxReporter JMX monitoring for 'solr.jetty' (registry 'solr.jetty') enabled at server: com.sun.jmx.mbeanserver.JmxMBeanServer@73ed318b
   [junit4]   2> 810776 INFO  (coreLoadExecutor-4871-thread-1) [    x:collection1] o.a.s.c.SolrResourceLoader [null] Added 2 libs to classloader, from paths: [/home/jenkins/workspace/Lucene-Solr-BadApples-7.x-Linux/solr/core/src/test-files/solr/collection1/lib, /home/jenkins/workspace/Lucene-Solr-BadApples-7.x-Linux/solr/core/src/test-files/solr/collection1/lib/classes]
   [junit4]   2> 810786 INFO  (coreLoadExecutor-4871-thread-1) [    x:collection1] o.a.s.c.SolrConfig Using Lucene MatchVersion: 7.5.0
   [junit4]   2> 810801 INFO  (coreLoadExecutor-4871-thread-1) [    x:collection1] o.a.s.s.IndexSchema [collection1] Schema name=test
   [junit4]   2> 810863 INFO  (coreLoadExecutor-4871-thread-1) [    x:collection1] o.a.s.s.IndexSchema Loaded schema test/1.0 with uniqueid field id
   [junit4]   2> 810870 INFO  (coreLoadExecutor-4871-thread-1) [    x:collection1] o.a.s.c.CoreContainer Creating SolrCore 'collection1' using configuration from instancedir /home/jenkins/workspace/Lucene-Solr-BadApples-7.x-Linux/solr/core/src/test-files/solr/collection1, trusted=true
   [junit4]   2> 810870 INFO  (coreLoadExecutor-4871-thread-1) [    x:collection1] o.a.s.m.r.SolrJmxReporter JMX monitoring for 'solr.core.collection1' (registry 'solr.core.collection1') enabled at server: com.sun.jmx.mbeanserver.JmxMBeanServer@73ed318b
   [junit4]   2> 810870 INFO  (coreLoadExecutor-4871-thread-1) [    x:collection1] o.a.s.c.SolrCore solr.RecoveryStrategy.Builder
   [junit4]   2> 810870 INFO  (coreLoadExecutor-4871-thread-1) [    x:collection1] o.a.s.c.SolrCore [[collection1] ] Opening new SolrCore at [/home/jenkins/workspace/Lucene-Solr-BadApples-7.x-Linux/solr/core/src/test-files/solr/collection1], dataDir=[/home/jenkins/workspace/Lucene-Solr-BadApples-7.x-Linux/solr/build/solr-core/test/J0/temp/solr.handler.component.InfixSuggestersTest_1B10D5F79AF46949-001/init-core-data-001/]
   [junit4]   2> 810898 INFO  (coreLoadExecutor-4871-thread-1) [    x:collection1] o.a.s.u.CommitTracker Hard AutoCommit: disabled
   [junit4]   2> 810898 INFO  (coreLoadExecutor-4871-thread-1) [    x:collection1] o.a.s.u.CommitTracker Soft AutoCommit: disabled
   [junit4]   2> 810899 INFO  (coreLoadExecutor-4871-thread-1) [    x:collection1] o.a.s.u.RandomMergePolicy RandomMergePolicy wrapping class org.apache.lucene.index.LogDocMergePolicy: [LogDocMergePolicy: minMergeSize=1000, mergeFactor=39, maxMergeSize=9223372036854775807, maxMergeSizeForForcedMerge=9223372036854775807, calibrateSizeByDeletes=false, maxMergeDocs=2147483647, maxCFSSegmentSizeMB=8.796093022207999E12, noCFSRatio=1.0]
   [junit4]   2> 810899 INFO  (coreLoadExecutor-4871-thread-1) [    x:collection1] o.a.s.s.SolrIndexSearcher Opening [Searcher@5fe4e516[collection1] main]
   [junit4]   2> 810899 WARN  (coreLoadExecutor-4871-thread-1) [    x:collection1] o.a.s.r.ManagedResourceStorage Cannot write to config directory /home/jenkins/workspace/Lucene-Solr-BadApples-7.x-Linux/solr/core/src/test-files/solr/collection1/conf; switching to use InMemory storage instead.
   [junit4]   2> 810900 INFO  (coreLoadExecutor-4871-thread-1) [    x:collection1] o.a.s.h.c.SuggestComponent Initializing SuggestComponent
   [junit4]   2> 810900 INFO  (coreLoadExecutor-4871-thread-1) [    x:collection1] o.a.s.s.s.SolrSuggester init: {name=shortRandomAnalyzingInfixSuggester,lookupImpl=AnalyzingInfixLookupFactory,dictionaryImpl=RandomTestDictionaryFactory,randDictMaxItems=100,indexPath=short_random_analyzing_infix_suggester,suggestAnalyzerFieldType=text,buildOnCommit=false,buildOnStartup=false}
   [junit4]   2> 810900 INFO  (coreLoadExecutor-4871-thread-1) [    x:collection1] o.a.s.s.s.SolrSuggester Dictionary loaded with params: {name=shortRandomAnalyzingInfixSuggester,lookupImpl=AnalyzingInfixLookupFactory,dictionaryImpl=RandomTestDictionaryFactory,randDictMaxItems=100,indexPath=short_random_analyzing_infix_suggester,suggestAnalyzerFieldType=text,buildOnCommit=false,buildOnStartup=false}
   [junit4]   2> 810900 INFO  (coreLoadExecutor-4871-thread-1) [    x:collection1] o.a.s.h.c.SuggestComponent Initializing SuggestComponent
   [junit4]   2> 810900 INFO  (coreLoadExecutor-4871-thread-1) [    x:collection1] o.a.s.s.s.SolrSuggester init: {name=longRandomAnalyzingInfixSuggester,lookupImpl=AnalyzingInfixLookupFactory,dictionaryImpl=RandomTestDictionaryFactory,randDictMaxItems=100000,indexPath=long_random_analyzing_infix_suggester,suggestAnalyzerFieldType=text,buildOnCommit=false,buildOnStartup=false}
   [junit4]   2> 810901 INFO  (coreLoadExecutor-4871-thread-1) [    x:collection1] o.a.s.s.s.SolrSuggester Dictionary loaded with params: {name=longRandomAnalyzingInfixSuggester,lookupImpl=AnalyzingInfixLookupFactory,dictionaryImpl=RandomTestDictionaryFactory,randDictMaxItems=100000,indexPath=long_random_analyzing_infix_suggester,suggestAnalyzerFieldType=text,buildOnCommit=false,buildOnStartup=false}
   [junit4]   2> 810901 INFO  (coreLoadExecutor-4871-thread-1) [    x:collection1] o.a.s.h.c.SuggestComponent Initializing SuggestComponent
   [junit4]   2> 810901 INFO  (coreLoadExecutor-4871-thread-1) [    x:collection1] o.a.s.s.s.SolrSuggester init: {name=shortRandomBlendedInfixSuggester,lookupImpl=BlendedInfixLookupFactory,dictionaryImpl=RandomTestDictionaryFactory,randDictMaxItems=100,blenderType=position_linear,suggestAnalyzerFieldType=text,indexPath=short_random_blended_infix_suggester,highlight=true,buildOnStartup=false,buildOnCommit=false}
   [junit4]   2> 810901 INFO  (coreLoadExecutor-4871-thread-1) [    x:collection1] o.a.s.s.s.SolrSuggester Dictionary loaded with params: {name=shortRandomBlendedInfixSuggester,lookupImpl=BlendedInfixLookupFactory,dictionaryImpl=RandomTestDictionaryFactory,randDictMaxItems=100,blenderType=position_linear,suggestAnalyzerFieldType=text,indexPath=short_random_blended_infix_suggester,highlight=true,buildOnStartup=false,buildOnCommit=false}
   [junit4]   2> 810901 INFO  (coreLoadExecutor-4871-thread-1) [    x:collection1] o.a.s.h.ReplicationHandler Commits will be reserved for 10000ms.
   [junit4]   2> 810902 INFO  (searcherExecutor-4872-thread-1-processing-x:collection1) [    x:collection1] o.a.s.c.SolrCore [collection1] Registered new searcher Searcher@5fe4e516[collection1] main{ExitableDirectoryReader(UninvertingDirectoryReader())}
   [junit4]   2> 810902 INFO  (TEST-InfixSuggestersTest.testShutdownDuringBuild-seed#[1B10D5F79AF46949]) [    ] o.a.s.SolrTestCaseJ4 ####initCore end
   [junit4]   2> 810903 INFO  (TEST-InfixSuggestersTest.testShutdownDuringBuild-seed#[1B10D5F79AF46949]) [    ] o.a.s.SolrTestCaseJ4 ###Ending testShutdownDuringBuild
   [junit4]   2> NOTE: reproduce with: ant test  -Dtestcase=InfixSuggestersTest -Dtests.method=testShutdownDuringBuild -Dtests.seed=1B10D5F79AF46949 -Dtests.multiplier=3 -Dtests.slow=true -Dtests.badapples=true -Dtests.locale=mn -Dtests.timezone=America/Menominee -Dtests.asserts=true -Dtests.file.encoding=UTF-8
   [junit4] ERROR   0.54s J0 | InfixSuggestersTest.testShutdownDuringBuild <<<
   [junit4]    > Throwable #1: java.util.concurrent.ExecutionException: junit.framework.AssertionFailedError: Unexpected wrapped exception type, expected CoreIsClosedException
   [junit4]    > 	at __randomizedtesting.SeedInfo.seed([1B10D5F79AF46949:C49DB748A49D3C2B]:0)
   [junit4]    > 	at java.base/java.util.concurrent.FutureTask.report(FutureTask.java:122)
   [junit4]    > 	at java.base/java.util.concurrent.FutureTask.get(FutureTask.java:191)
   [junit4]    > 	at org.apache.solr.handler.component.InfixSuggestersTest.testShutdownDuringBuild(InfixSuggestersTest.java:130)
   [junit4]    > 	at java.base/jdk.internal.reflect.NativeMethodAccessorImpl.invoke0(Native Method)
   [junit4]    > 	at java.base/jdk.internal.reflect.NativeMethodAccessorImpl.invoke(NativeMethodAccessorImpl.java:62)
   [junit4]    > 	at java.base/jdk.internal.reflect.DelegatingMethodAccessorImpl.invoke(DelegatingMethodAccessorImpl.java:43)
   [junit4]    > 	at java.base/java.lang.reflect.Method.invoke(Method.java:564)
   [junit4]    > 	at java.base/java.lang.Thread.run(Thread.java:844)
   [junit4]    > Caused by: junit.framework.AssertionFailedError: Unexpected wrapped exception type, expected CoreIsClosedException
   [junit4]    > 	at org.apache.lucene.util.LuceneTestCase.expectThrows(LuceneTestCase.java:2704)
   [junit4]    > 	at org.apache.solr.handler.component.InfixSuggestersTest.lambda$testShutdownDuringBuild$3(InfixSuggestersTest.java:121)
   [junit4]    > 	at java.base/java.util.concurrent.FutureTask.run(FutureTask.java:264)
   [junit4]    > 	at org.apache.solr.common.util.ExecutorUtil$MDCAwareThreadPoolExecutor.lambda$execute$0(ExecutorUtil.java:209)
   [junit4]    > 	at java.base/java.util.concurrent.ThreadPoolExecutor.runWorker(ThreadPoolExecutor.java:1135)
   [junit4]    > 	at java.base/java.util.concurrent.ThreadPoolExecutor$Worker.run(ThreadPoolExecutor.java:635)
   [junit4]    > 	... 1 more
   [junit4]    > Caused by: java.lang.RuntimeException: Exception during query
   [junit4]    > 	at org.apache.solr.SolrTestCaseJ4.assertQ(SolrTestCaseJ4.java:917)
   [junit4]    > 	at org.apache.solr.SolrTestCaseJ4.assertQ(SolrTestCaseJ4.java:877)
   [junit4]    > 	at org.apache.solr.handler.component.InfixSuggestersTest.lambda$testShutdownDuringBuild$2(InfixSuggestersTest.java:122)
   [junit4]    > 	at org.apache.lucene.util.LuceneTestCase.expectThrows(LuceneTestCase.java:2696)
   [junit4]    > 	... 6 more
   [junit4]    > Caused by: org.apache.solr.common.SolrException: SolrCoreState already closed.
   [junit4]    > 	at org.apache.solr.update.DefaultSolrCoreState.lock(DefaultSolrCoreState.java:186)
   [junit4]    > 	at org.apache.solr.update.DefaultSolrCoreState.getIndexWriter(DefaultSolrCoreState.java:121)
   [junit4]    > 	at org.apache.solr.update.SolrCoreState.getTragicException(SolrCoreState.java:198)
   [junit4]    > 	at org.apache.solr.core.CoreContainer.checkTragicException(CoreContainer.java:1805)
   [junit4]    > 	at org.apache.solr.handler.RequestHandlerBase.handleRequest(RequestHandlerBase.java:212)
   [junit4]    > 	at org.apache.solr.core.SolrCore.execute(SolrCore.java:2541)
   [junit4]    > 	at org.apache.solr.util.TestHarness.query(TestHarness.java:337)
   [junit4]    > 	at org.apache.solr.util.TestHarness.query(TestHarness.java:319)
   [junit4]    > 	at org.apache.solr.SolrTestCaseJ4.assertQ(SolrTestCaseJ4.java:891)
   [junit4]    > 	... 9 more
   [junit4]   2> 810905 INFO  (TEST-InfixSuggestersTest.testReloadDuringBuild-seed#[1B10D5F79AF46949]) [    ] o.a.s.SolrTestCaseJ4 ###Starting testReloadDuringBuild
   [junit4]   2> 810910 ERROR (TEST-InfixSuggestersTest.testReloadDuringBuild-seed#[1B10D5F79AF46949]) [    ] o.a.s.c.CorePropertiesLocator Couldn't load core descriptor from /home/jenkins/workspace/Lucene-Solr-BadApples-7.x-Linux/solr/core/src/test-files/solr/collection1/core.properties:java.nio.file.NoSuchFileException: /home/jenkins/workspace/Lucene-Solr-BadApples-7.x-Linux/solr/core/src/test-files/solr/collection1/core.properties
   [junit4]   2> 810910 INFO  (AnalyzingInfixSuggesterTest-6897-thread-1) [    ] o.a.s.h.c.SuggestComponent SuggestComponent prepare with : qt=/suggest_analyzing_infix_long_dictionary&suggest=true&suggest.buildAll=true&wt=xml&indent=off
   [junit4]   2> 810910 INFO  (AnalyzingInfixSuggesterTest-6897-thread-1) [    ] o.a.s.s.s.SolrSuggester SolrSuggester.build(longRandomAnalyzingInfixSuggester)
   [junit4]   2> 810910 INFO  (TEST-InfixSuggestersTest.testReloadDuringBuild-seed#[1B10D5F79AF46949]) [    ] o.a.s.c.SolrResourceLoader [null] Added 2 libs to classloader, from paths: [/home/jenkins/workspace/Lucene-Solr-BadApples-7.x-Linux/solr/core/src/test-files/solr/collection1/lib, /home/jenkins/workspace/Lucene-Solr-BadApples-7.x-Linux/solr/core/src/test-files/solr/collection1/lib/classes]
   [junit4]   2> 810924 INFO  (TEST-InfixSuggestersTest.testReloadDuringBuild-seed#[1B10D5F79AF46949]) [    ] o.a.s.c.SolrConfig Using Lucene MatchVersion: 7.5.0
   [junit4]   2> 810932 INFO  (TEST-InfixSuggestersTest.testReloadDuringBuild-seed#[1B10D5F79AF46949]) [    ] o.a.s.s.IndexSchema [collection1] Schema name=test
   [junit4]   2> 810975 INFO  (AnalyzingInfixSuggesterTest-6897-thread-1) [    ] o.a.s.s.s.RandomTestDictionaryFactory org.apache.solr.spelling.suggest.RandomTestDictionaryFactory$RandomTestDictionary.enabled.longRandomAnalyzingInfixSuggester emitted 1000 items.
   [junit4]   2> 811012 INFO  (TEST-InfixSuggestersTest.testReloadDuringBuild-seed#[1B10D5F79AF46949]) [    ] o.a.s.s.IndexSchema Loaded schema test/1.0 with uniqueid field id
   [junit4]   2> 811016 INFO  (TEST-InfixSuggestersTest.testReloadDuringBuild-seed#[1B10D5F79AF46949]) [    ] o.a.s.c.CoreContainer Reloading SolrCore 'collection1' using configuration from instancedir /home/jenkins/workspace/Lucene-Solr-BadApples-7.x-Linux/solr/core/src/test-files/solr/collection1
   [junit4]   2> 811033 INFO  (TEST-InfixSuggestersTest.testReloadDuringBuild-seed#[1B10D5F79AF46949]) [    x:collection1] o.a.s.m.r.SolrJmxReporter JMX monitoring for 'solr.core.collection1' (registry 'solr.core.collection1') enabled at server: com.sun.jmx.mbeanserver.JmxMBeanServer@73ed318b
   [junit4]   2> 811033 INFO  (TEST-InfixSuggestersTest.testReloadDuringBuild-seed#[1B10D5F79AF46949]) [    x:collection1] o.a.s.c.SolrCore [[collection1] ] Opening new SolrCore at [/home/jenkins/workspace/Lucene-Solr-BadApples-7.x-Linux/solr/core/src/test-files/solr/collection1], dataDir=[/home/jenkins/workspace/Lucene-Solr-BadApples-7.x-Linux/solr/build/solr-core/test/J0/temp/solr.handler.component.InfixSuggestersTest_1B10D5F79AF46949-001/init-core-data-001/]
   [junit4]   2> 811035 INFO  (AnalyzingInfixSuggesterTest-6897-thread-1) [    ] o.a.s.s.s.RandomTestDictionaryFactory org.apache.solr.spelling.suggest.RandomTestDictionaryFactory$RandomTestDictionary.enabled.longRandomAnalyzingInfixSuggester emitted 2000 items.
   [junit4]   2> 811062 INFO  (TEST-InfixSuggestersTest.testReloadDuringBuild-seed#[1B10D5F79AF46949]) [    x:collection1] o.a.s.u.CommitTracker Hard AutoCommit: disabled
   [junit4]   2> 811062 INFO  (TEST-InfixSuggestersTest.testReloadDuringBuild-seed#[1B10D5F79AF46949]) [    x:collection1] o.a.s.u.CommitTracker Soft AutoCommit: disabled
   [junit4]   2> 811063 INFO  (TEST-InfixSuggestersTest.testReloadDuringBuild-seed#[1B10D5F79AF46949]) [    x:collection1] o.a.s.s.SolrIndexSearcher Opening [Searcher@4056c55b[collection1] main]
   [junit4]   2> 811063 WARN  (TEST-InfixSuggestersTest.testReloadDuringBuild-seed#[1B10D5F79AF46949]) [    x:collection1] o.a.s.r.ManagedResourceStorage Cannot write to config directory /home/jenkins/workspace/Lucene-Solr-BadApples-7.x-Linux/solr/core/src/test-files/solr/collection1/conf; switching to use InMemory storage instead.
   [junit4]   2> 811063 INFO  (TEST-InfixSuggestersTest.testReloadDuringBuild-seed#[1B10D5F79AF46949]) [    x:collection1] o.a.s.h.c.SuggestComponent Initializing SuggestComponent
   [junit4]   2> 811063 INFO  (TEST-InfixSuggestersTest.testReloadDuringBuild-seed#[1B10D5F79AF46949]) [    x:collection1] o.a.s.s.s.SolrSuggester init: {name=shortRandomAnalyzingInfixSuggester,lookupImpl=AnalyzingInfixLookupFactory,dictionaryImpl=RandomTestDictionaryFactory,randDictMaxItems=100,indexPath=short_random_analyzing_infix_suggester,suggestAnalyzerFieldType=text,buildOnCommit=false,buildOnStartup=false}
   [junit4]   2> 811064 INFO  (TEST-InfixSuggestersTest.testReloadDuringBuild-seed#[1B10D5F79AF46949]) [    x:collection1] o.a.s.s.s.SolrSuggester Dictionary loaded with params: {name=shortRandomAnalyzingInfixSuggester,lookupImpl=AnalyzingInfixLookupFactory,dictionaryImpl=RandomTestDictionaryFactory,randDictMaxItems=100,indexPath=short_random_analyzing_infix_suggester,suggestAnalyzerFieldType=text,buildOnCommit=false,buildOnStartup=false}
   [junit4]   2> 811064 INFO  (TEST-InfixSuggestersTest.testReloadDuringBuild-seed#[1B10D5F79AF46949]) [    x:collection1] o.a.s.h.c.SuggestComponent Initializing SuggestComponent
   [junit4]   2> 811064 INFO  (TEST-InfixSuggestersTest.testReloadDuringBuild-seed#[1B10D5F79AF46949]) [    x:collection1] o.a.s.s.s.SolrSuggester init: {name=longRandomAnalyzingInfixSuggester,lookupImpl=AnalyzingInfixLookupFactory,dictionaryImpl=RandomTestDictionaryFactory,randDictMaxItems=100000,indexPath=long_random_analyzing_infix_suggester,suggestAnalyzerFieldType=text,buildOnCommit=false,buildOnStartup=false}
   [junit4]   2> 811065 INFO  (TEST-InfixSuggestersTest.testReloadDuringBuild-seed#[1B10D5F79AF46949]) [    x:collection1] o.a.s.s.s.SolrSuggester Dictionary loaded with params: {name=longRandomAnalyzingInfixSuggester,lookupImpl=AnalyzingInfixLookupFactory,dictionaryImpl=RandomTestDictionaryFactory,randDictMaxItems=100000,indexPath=long_random_analyzing_infix_suggester,suggestAnalyzerFieldType=text,buildOnCommit=false,buildOnStartup=false}
   [junit4]   2> 811065 INFO  (TEST-InfixSuggestersTest.testReloadDuringBuild-seed#[1B10D5F79AF46949]) [    x:collection1] o.a.s.h.c.SuggestComponent Initializing SuggestComponent
   [junit4]   2> 811065 INFO  (TEST-InfixSuggestersTest.testReloadDuringBuild-seed#[1B10D5F79AF46949]) [    x:collection1] o.a.s.s.s.SolrSuggester init: {name=shortRandomBlendedInfixSuggester,lookupImpl=BlendedInfixLookupFactory,dictionaryImpl=RandomTestDictionaryFactory,randDictMaxItems=100,blenderType=position_linear,suggestAnalyzerFieldType=text,indexPath=short_random_blended_infix_suggester,highlight=true,buildOnStartup=false,buildOnCommit=false}
   [junit4]   2> 811065 INFO  (TEST-InfixSuggestersTest.testReloadDuringBuild-seed#[1B10D5F79AF46949]) [    x:collection1] o.a.s.s.s.SolrSuggester Dictionary loaded with params: {name=shortRandomBlendedInfixSuggester,lookupImpl=BlendedInfixLookupFactory,dictionaryImpl=RandomTestDictionaryFactory,randDictMaxItems=100,blenderType=position_linear,suggestAnalyzerFieldType=text,indexPath=short_random_blended_infix_suggester,highlight=true,buildOnStartup=false,buildOnCommit=false}
   [junit4]   2> 811065 INFO  (TEST-InfixSuggestersTest.testReloadDuringBuild-seed#[1B10D5F79AF46949]) [    x:collection1] o.a.s.h.ReplicationHandler Commits will be reserved for 10000ms.
   [junit4]   2> 811065 INFO  (TEST-InfixSuggestersTest.testReloadDuringBuild-seed#[1B10D5F79AF46949]) [    x:collection1] o.a.s.u.RandomMergePolicy RandomMergePolicy wrapping class org.apache.lucene.index.TieredMergePolicy: [TieredMergePolicy: maxMergeAtOnce=21, maxMergeAtOnceExplicit=15, maxMergedSegmentMB=20.39453125, floorSegmentMB=1.9140625, forceMergeDeletesPctAllowed=18.029898684055592, segmentsPerTier=17.0, maxCFSSegmentSizeMB=8.796093022207999E12, noCFSRatio=0.23304172466423045, reclaimDeletesWeight=1.8151555855767283
   [junit4]   2> 811066 INFO  (TEST-InfixSuggestersTest.testReloadDuringBuild-seed#[1B10D5F79AF46949]) [    x:collection1] o.a.s.u.DefaultSolrCoreState New IndexWriter is ready to be used.
   [junit4]   2> 811066 INFO  (searcherExecutor-4876-thread-1-processing-x:collection1) [    x:collection1] o.a.s.c.SolrCore [collection1] Registered new searcher Searcher@4056c55b[collection1] main{ExitableDirectoryReader(UninvertingDirectoryReader())}
   [junit4]   2> 811067 INFO  (TEST-InfixSuggestersTest.testReloadDuringBuild-seed#[1B10D5F79AF46949]) [    x:collection1] o.a.s.s.SolrIndexSearcher Opening [Searcher@2d88b10b[collection1] main]
   [junit4]   2> 811067 INFO  (TEST-InfixSuggestersTest.testReloadDuringBuild-seed#[1B10D5F79AF46949]) [    x:collection1] o.a.s.c.SolrCore [collection1]  CLOSING SolrCore org.apache.solr.core.SolrCore@518667da
   [junit4]   2> 811067 INFO  (TEST-InfixSuggestersTest.testReloadDuringBuild-seed#[1B10D5F79AF46949]) [    x:collection1] o.a.s.m.SolrMetricManager Closing metric reporters for registry=solr.core.collection1, tag=518667da
   [junit4]   2> 811067 INFO  (TEST-InfixSuggestersTest.testReloadDuringBuild-seed#[1B10D5F79AF46949]) [    x:collection1] o.a.s.m.r.SolrJmxReporter Closing reporter [org.apache.solr.metrics.reporters.SolrJmxReporter@4537df21: rootName = null, domain = solr.core.collection1, service url = null, agent id = null] for registry solr.core.collection1 / com.codahale.metrics.MetricRegistry@16193d0d
   [junit4]   2> 811068 INFO  (searcherExecutor-4876-thread-1-processing-x:collection1) [    x:collection1] o.a.s.c.SolrCore [collection1] Registered new searcher Searcher@2d88b10b[collection1] main{ExitableDirectoryReader(UninvertingDirectoryReader())}
   [junit4]   2> 811317 ERROR (AnalyzingInfixSuggesterTest-6897-thread-1) [    ] o.a.s.h.RequestHandlerBase org.apache.solr.update.SolrCoreState$CoreIsClosedException: Suggester build has been interrupted by a core reload or shutdown.
   [junit4]   2> 	at org.apache.solr.spelling.suggest.SolrSuggester.build(SolrSuggester.java:183)
   [junit4]   2> 	at org.apache.solr.handler.component.SuggestComponent.prepare(SuggestComponent.java:185)
   [junit4]   2> 	at org.apache.solr.handler.component.SearchHandler.handleRequestBody(SearchHandler.java:272)
   [junit4]   2> 	at org.apache.solr.handler.RequestHandlerBase.handleRequest(RequestHandlerBase.java:199)
   [junit4]   2> 	at org.apache.solr.core.SolrCore.execute(SolrCore.java:2541)
   [junit4]   2> 	at org.apache.solr.util.TestHarness.query(TestHarness.java:337)
   [junit4]   2> 	at org.apache.solr.util.TestHarness.query(TestHarness.java:319)
   [junit4]   2> 	at org.apache.solr.SolrTestCaseJ4.assertQ(SolrTestCaseJ4.java:891)
   [junit4]   2> 	at org.apache.solr.SolrTestCaseJ4.assertQ(SolrTestCaseJ4.java:877)
   [junit4]   2> 	at org.apache.solr.handler.component.InfixSuggestersTest.lambda$testReloadDuringBuild$0(InfixSuggestersTest.java:102)
   [junit4]   2> 	at org.apache.lucene.util.LuceneTestCase.expectThrows(LuceneTestCase.java:2696)
   [junit4]   2> 	at org.apache.solr.handler.component.InfixSuggestersTest.lambda$testReloadDuringBuild$1(InfixSuggestersTest.java:101)
   [junit4]   2> 	at java.base/java.util.concurrent.FutureTask.run(FutureTask.java:264)
   [junit4]   2> 	at org.apache.solr.common.util.ExecutorUtil$MDCAwareThreadPoolExecutor.lambda$execute$0(ExecutorUtil.java:209)
   [junit4]   2> 	at java.base/java.util.concurrent.ThreadPoolExecutor.runWorker(ThreadPoolExecutor.java:1135)
   [junit4]   2> 	at java.base/java.util.concurrent.ThreadPoolExecutor$Worker.run(ThreadPoolExecutor.java:635)
   [junit4]   2> 	at java.base/java.lang.Thread.run(Thread.java:844)
   [junit4]   2> Caused by: org.apache.lucene.store.AlreadyClosedException: this IndexWriter is closed
   [junit4]   2> 	at org.apache.lucene.index.IndexWriter.ensureOpen(IndexWriter.java:671)
   [junit4]   2> 	at org.apache.lucene.index.IndexWriter.ensureOpen(IndexWriter.java:685)
   [junit4]   2> 	at org.apache.lucene.index.IndexWriter.updateDocument(IndexWriter.java:1600)
   [junit4]   2> 	at org.apache.lucene.index.IndexWriter.addDocument(IndexWriter.java:1222)
   [junit4]   2> 	at org.apache.lucene.search.suggest.analyzing.AnalyzingInfixSuggester.add(AnalyzingInfixSuggester.java:396)
   [junit4]   2> 	at org.apache.lucene.search.suggest.analyzing.AnalyzingInfixSuggester.build(AnalyzingInfixSuggester.java:310)
   [junit4]   2> 	at org.apache.lucene.search.suggest.Lookup.build(Lookup.java:190)
   [junit4]   2> 	at org.apache.solr.spelling.suggest.SolrSuggester.build(SolrSuggester.java:181)
   [junit4]   2> 	... 16 more
   [junit4]   2> 
   [junit4]   2> 811318 INFO  (AnalyzingInfixSuggesterTest-6897-thread-1) [    ] o.a.s.c.S.Request [collection1]  webapp=null path=null params={qt=/suggest_analyzing_infix_long_dictionary&suggest.buildAll=true&wt=xml} status=500 QTime=407
   [junit4]   2> 811318 ERROR (AnalyzingInfixSuggesterTest-6897-thread-1) [    ] o.a.s.SolrTestCaseJ4 REQUEST FAILED: qt=/suggest_analyzing_infix_long_dictionary&suggest.buildAll=true&wt=xml:org.apache.solr.update.SolrCoreState$CoreIsClosedException: Suggester build has been interrupted by a core reload or shutdown.
   [junit4]   2> 	at org.apache.solr.spelling.suggest.SolrSuggester.build(SolrSuggester.java:183)
   [junit4]   2> 	at org.apache.solr.handler.component.SuggestComponent.prepare(SuggestComponent.java:185)
   [junit4]   2> 	at org.apache.solr.handler.component.SearchHandler.handleRequestBody(SearchHandler.java:272)
   [junit4]   2> 	at org.apache.solr.handler.RequestHandlerBase.handleRequest(RequestHandlerBase.java:199)
   [junit4]   2> 	at org.apache.solr.core.SolrCore.execute(SolrCore.java:2541)
   [junit4]   2> 	at org.apache.solr.util.TestHarness.query(TestHarness.java:337)
   [junit4]   2> 	at org.apache.solr.util.TestHarness.query(TestHarness.java:319)
   [junit4]   2> 	at org.apache.solr.SolrTestCaseJ4.assertQ(SolrTestCaseJ4.java:891)
   [junit4]   2> 	at org.apache.solr.SolrTestCaseJ4.assertQ(SolrTestCaseJ4.java:877)
   [junit4]   2> 	at org.apache.solr.handler.component.InfixSuggestersTest.lambda$testReloadDuringBuild$0(InfixSuggestersTest.java:102)
   [junit4]   2> 	at org.apache.lucene.util.LuceneTestCase.expectThrows(LuceneTestCase.java:2696)
   [junit4]   2> 	at org.apache.solr.handler.component.InfixSuggestersTest.lambda$testReloadDuringBuild$1(InfixSuggestersTest.java:101)
   [junit4]   2> 	at java.base/java.util.concurrent.FutureTask.run(FutureTask.java:264)
   [junit4]   2> 	at org.apache.solr.common.util.ExecutorUtil$MDCAwareThreadPoolExecutor.lambda$execute$0(ExecutorUtil.java:209)
   [junit4]   2> 	at java.base/java.util.concurrent.ThreadPoolExecutor.runWorker(ThreadPoolExecutor.java:1135)
   [junit4]   2> 	at java.base/java.util.concurrent.ThreadPoolExecutor$Worker.run(ThreadPoolExecutor.java:635)
   [junit4]   2> 	at java.base/java.lang.Thread.run(Thread.java:844)
   [junit4]   2> Caused by: org.apache.lucene.store.AlreadyClosedException: this IndexWriter is closed
   [junit4]   2> 	at org.apache.lucene.index.IndexWriter.ensureOpen(IndexWriter.java:671)
   [junit4]   2> 	at org.apache.lucene.index.IndexWriter.ensureOpen(IndexWriter.java:685)
   [junit4]   2> 	at org.apache.lucene.index.IndexWriter.updateDocument(IndexWriter.java:1600)
   [junit4]   2> 	at org.apache.lucene.index.IndexWriter.addDocument(IndexWriter.java:1222)
   [junit4]   2> 	at org.apache.lucene.search.suggest.analyzing.AnalyzingInfixSuggester.add(AnalyzingInfixSuggester.java:396)
   [junit4]   2> 	at org.apache.lucene.search.suggest.analyzing.AnalyzingInfixSuggester.build(AnalyzingInfixSuggester.java:310)
   [junit4]   2> 	at org.apache.lucene.search.suggest.Lookup.build(Lookup.java:190)
   [junit4]   2> 	at org.apache.solr.spelling.suggest.SolrSuggester.build(SolrSuggester.java:181)
   [junit4]   2> 	... 16 more
   [junit4]   2> 
   [junit4]   2> 811318 INFO  (TEST-InfixSuggestersTest.testReloadDuringBuild-seed#[1B10D5F79AF46949]) [    x:collection1] o.a.s.SolrTestCaseJ4 ###Ending testReloadDuringBuild
   [junit4]   2> 811320 INFO  (TEST-InfixSuggestersTest.testBlendedInfixSuggesterBuildThenReload-seed#[1B10D5F79AF46949]) [    x:collection1] o.a.s.SolrTestCaseJ4 ###Starting testBlendedInfixSuggesterBuildThenReload
   [junit4]   2> 811320 INFO  (TEST-InfixSuggestersTest.testBlendedInfixSuggesterBuildThenReload-seed#[1B10D5F79AF46949]) [    x:collection1] o.a.s.h.c.SuggestComponent SuggestComponent prepare with : qt=/suggest_blended_infix_short_dictionary&suggest.onlyMorePopular=true&indent=off&suggest.count=10&suggest=true&suggest.collate=true&suggest.buildAll=true&suggest.dictionary=shortRandomBlendedInfixSuggester&wt=xml
   [junit4]   2> 811320 INFO  (TEST-InfixSuggestersTest.testBlendedInfixSuggesterBuildThenReload-seed#[1B10D5F79AF46949]) [    x:collection1] o.a.s.s.s.SolrSuggester SolrSuggester.build(shortRandomBlendedInfixSuggester)
   [junit4]   2> 811340 INFO  (TEST-InfixSuggestersTest.testBlendedInfixSuggesterBuildThenReload-seed#[1B10D5F79AF46949]) [    x:collection1] o.a.s.s.s.RandomTestDictionaryFactory org.apache.solr.spelling.suggest.RandomTestDictionaryFactory$RandomTestDictionary.enabled.shortRandomBlendedInfixSuggester disabled after emitting 100 items.
   [junit4]   2> 811395 INFO  (TEST-InfixSuggestersTest.testBlendedInfixSuggesterBuildThenReload-seed#[1B10D5F79AF46949]) [    x:collection1] o.a.s.h.c.SuggestComponent SuggestComponent process with : qt=/suggest_blended_infix_short_dictionary&suggest.onlyMorePopular=true&indent=off&suggest.count=10&suggest=true&suggest.collate=true&suggest.buildAll=true&suggest.dictionary=shortRandomBlendedInfixSuggester&wt=xml
   [junit4]   2> 811395 INFO  (TEST-InfixSuggestersTest.testBlendedInfixSuggesterBuildThenReload-seed#[1B10D5F79AF46949]) [    x:collection1] o.a.s.c.S.Request [collection1]  webapp=null path=null params={qt=/suggest_blended_infix_short_dictionary&suggest.buildAll=true&wt=xml} status=0 QTime=75
   [junit4]   2> 811397 ERROR (TEST-InfixSuggestersTest.testBlendedInfixSuggesterBuildThenReload-seed#[1B10D5F79AF46949]) [    x:collection1] o.a.s.c.CorePropertiesLocator Couldn't load core descriptor from /home/jenkins/workspace/Lucene-Solr-BadApples-7.x-Linux/solr/core/src/test-files/solr/collection1/core.properties:java.nio.file.NoSuchFileException: /home/jenkins/workspace/Lucene-Solr-BadApples-7.x-Linux/solr/core/src/test-files/solr/collection1/core.properties
   [junit4]   2> 811397 INFO  (TEST-InfixSuggestersTest.testBlendedInfixSuggesterBuildThenReload-seed#[1B10D5F79AF46949]) [    x:collection1] o.a.s.c.SolrResourceLoader [null] Added 2 libs to classloader, from paths: [/home/jenkins/workspace/Lucene-Solr-BadApples-7.x-Linux/solr/core/src/test-files/solr/collection1/lib, /home/jenkins/workspace/Lucene-Solr-BadApples-7.x-Linux/solr/core/src/test-files/solr/collection1/lib/classes]
   [junit4]   2> 811433 INFO  (TEST-InfixSuggestersTest.testBlendedInfixSuggesterBuildThenReload-seed#[1B10D5F79AF46949]) [    x:collection1] o.a.s.c.SolrConfig Using Lucene MatchVersion: 7.5.0
   [junit4]   2> 811443 INFO  (TEST-InfixSuggestersTest.testBlendedInfixSuggesterBuildThenReload-seed#[1B10D5F79AF46949]) [    x:collection1] o.a.s.s.IndexSchema [collection1] Schema name=test
   [junit4]   2> 811529 INFO  (TEST-InfixSuggestersTest.testBlendedInfixSuggesterBuildThenReload-seed#[1B10D5F79AF46949]) [    x:collection1] o.a.s.s.IndexSchema Loaded schema test/1.0 with uniqueid field id
   [junit4]   2> 811537 INFO  (TEST-InfixSuggestersTest.testBlendedInfixSuggesterBuildThenReload-seed#[1B10D5F79AF46949]) [    x:collection1] o.a.s.c.CoreContainer Reloading SolrCore 'collection1' using configuration from instancedir /home/jenkins/workspace/Lucene-Solr-BadApples-7.x-Linux/solr/core/src/test-files/solr/collection1
   [junit4]   2> 811564 INFO  (TEST-InfixSuggestersTest.testBlendedInfixSuggesterBuildThenReload-seed#[1B10D5F79AF46949]) [    x:collection1] o.a.s.m.r.SolrJmxReporter JMX monitoring for 'solr.core.collection1' (registry 'solr.core.collection1') enabled at server: com.sun.jmx.mbeanserver.JmxMBeanServer@73ed318b
   [junit4]   2> 811564 INFO  (TEST-InfixSuggestersTest.testBlendedInfixSuggesterBuildThenReload-seed#[1B10D5F79AF46949]) [    x:collection1] o.a.s.c.SolrCore [[collection1] ] Opening new SolrCore at [/home/jenkins/workspace/Lucene-Solr-BadApples-7.x-Linux/solr/core/src/test-files/solr/collection1], dataDir=[/home/jenkins/workspace/Lucene-Solr-BadApples-7.x-Linux/solr/build/solr-core/test/J0/temp/solr.handler.component.InfixSuggestersTest_1B10D5F79AF46949-001/init-core-data-001/]
   [junit4]   2> 811614 INFO  (TEST-InfixSuggestersTest.testBlendedInfixSuggesterBuildThenReload-seed#[1B10D5F79AF46949]) [    x:collection1] o.a.s.u.CommitTracker Hard AutoCommit: disabled
   [junit4]   2> 811614 INFO  (TEST-InfixSuggestersTest.testBlendedInfixSuggesterBuildThenReload-seed#[1B10D5F79AF46949]) [    x:collection1] o.a.s.u.CommitTracker Soft AutoCommit: disabled
   [junit4]   2> 811615 INFO  (TEST-InfixSuggestersTest.testBlendedInfixSuggesterBuildThenReload-seed#[1B10D5F79AF46949]) [    x:collection1] o.a.s.s.SolrIndexSearcher Opening [Searcher@6a4a2a2b[collection1] main]
   [junit4]   2> 811616 WARN  (TEST-InfixSuggestersTest.testBlendedInfixSuggesterBuildThenReload-seed#[1B10D5F79AF46949]) [    x:collection1] o.a.s.r.ManagedResourceStorage Cannot write to config directory /home/jenkins/workspace/Lucene-Solr-BadApples-7.x-Linux/solr/core/src/test-files/solr/collection1/conf; switching to use InMemory storage instead.
   [junit4]   2> 811616 INFO  (TEST-InfixSuggestersTest.testBlendedInfixSuggesterBuildThenReload-seed#[1B10D5F79AF46949]) [    x:collection1] o.a.s.h.c.SuggestComponent Initializing SuggestComponent
   [junit4]   2> 811616 INFO  (TEST-InfixSuggestersTest.testBlendedInfixSuggesterBuildThenReload-seed#[1B10D5F79AF46949]) [    x:collection1] o.a.s.s.s.SolrSuggester init: {name=shortRandomAnalyzingInfixSuggester,lookupImpl=AnalyzingInfixLookupFactory,dictionaryImpl=RandomTestDictionaryFactory,randDictMaxItems=100,indexPath=short_random_analyzing_infix_suggester,suggestAnalyzerFieldType=text,buildOnCommit=false,buildOnStartup=false}
   [junit4]   2> 811616 INFO  (TEST-InfixSuggestersTest.testBlendedInfixSuggesterBuildThenReload-seed#[1B10D5F79AF46949]) [    x:collection1] o.a.s.s.s.SolrSuggester Dictionary loaded with params: {name=shortRandomAnalyzingInfixSuggester,lookupImpl=AnalyzingInfixLookupFactory,dictionaryImpl=RandomTestDictionaryFactory,randDictMaxItems=100,indexPath=short_random_analyzing_infix_suggester,suggestAnalyzerFieldType=text,buildOnCommit=false,buildOnStartup=false}
   [junit4]   2> 811616 INFO  (TEST-InfixSuggestersTest.testBlendedInfixSuggesterBuildThenReload-seed#[1B10D5F79AF46949]) [    x:collection1] o.a.s.h.c.SuggestComponent Initializing SuggestComponent
   [junit4]   2> 811616 INFO  (TEST-InfixSuggestersTest.testBlendedInfixSuggesterBuildThenReload-seed#[1B10D5F79AF46949]) [    x:collection1] o.a.s.s.s.SolrSuggester init: {name=longRandomAnalyzingInfixSuggester,lookupImpl=AnalyzingInfixLookupFactory,dictionaryImpl=RandomTestDictionaryFactory,randDictMaxItems=100000,indexPath=long_random_analyzing_infix_suggester,suggestAnalyzerFieldType=text,buildOnCommit=false,buildOnStartup=false}
   [junit4]   2> 811619 INFO  (TEST-InfixSuggestersTest.testBlendedInfixSuggesterBuildThenReload-seed#[1B10D5F79AF46949]) [    x:collection1] o.a.s.s.s.SolrSuggester Dictionary loaded with params: {name=longRandomAnalyzingInfixSuggester,lookupImpl=AnalyzingInfixLookupFactory,dictionaryImpl=RandomTestDictionaryFactory,randDictMaxItems=100000,indexPath=long_random_analyzing_infix_suggester,suggestAnalyzerFieldType=text,buildOnCommit=false,buildOnStartup=false}
   [junit4]   2> 811619 INFO  (TEST-InfixSuggestersTest.testBlendedInfixSuggesterBuildThenReload-seed#[1B10D5F79AF46949]) [    x:collection1] o.a.s.h.c.SuggestComponent Initializing SuggestComponent
   [junit4]   2> 811619 INFO  (TEST-InfixSuggestersTest.testBlendedInfixSuggesterBuildThenReload-seed#[1B10D5F79AF46949]) [    x:collection1] o.a.s.s.s.SolrSuggester init: {name=shortRandomBlendedInfixSuggester,lookupImpl=BlendedInfixLookupFactory,dictionaryImpl=RandomTestDictionaryFactory,randDictMaxItems=100,blenderType=position_linear,suggestAnalyzerFieldType=text,indexPath=short_random_blended_infix_suggester,highlight=true,buildOnStartup=false,buildOnCommit=false}
   [junit4]   2> 811620 INFO  (TEST-InfixSuggestersTest.testBlendedInfixSuggesterBuildThenReload-seed#[1B10D5F79AF46949]) [    x:collection1] o.a.s.s.s.SolrSuggester Dictionary loaded with params: {name=shortRandomBlendedInfixSuggester,lookupImpl=BlendedInfixLookupFactory,dictionaryImpl=RandomTestDictionaryFactory,randDictMaxItems=100,blenderType=position_linear,suggestAnalyzerFieldType=text,indexPath=short_random_blended_infix_suggester,highlight=true,buildOnStartup=false,buildOnCommit=false}
   [junit4]   2> 811620 INFO  (TEST-InfixSuggestersTest.testBlendedInfixSuggesterBuildThenReload-seed#[1B10D5F79AF46949]) [    x:collection1] o.a.s.h.ReplicationHandler Commits will be reserved for 10000ms.
   [junit4]   2> 811621 INFO  (TEST-InfixSuggestersTest.testBlendedInfixSuggesterBuildThenReload-seed#[1B10D5F79AF46949]) [    x:collection1] o.a.s.u.RandomMergePolicy RandomMergePolicy wrapping class org.apache.lucene.index.AlcoholicMergePolicy: [AlcoholicMergePolicy: minMergeSize=0, mergeFactor=10, maxMergeSize=1254654448, maxMergeSizeForForcedMerge=9223372036854775807, calibrateSizeByDeletes=true, maxMergeDocs=2147483647, maxCFSSegmentSizeMB=8.796093022207999E12, noCFSRatio=0.1]
   [junit4]   2> 811622 INFO  (TEST-InfixSuggestersTest.testBlendedInfixSuggesterBuildThenReload-seed#[1B10D5F79AF46949]) [    x:collection1] o.a.s.u.DefaultSolrCoreState New IndexWriter is ready to be used.
   [junit4]   2> 811622 INFO  (searcherExecutor-4880-thread-1-processing-x:collection1) [    x:collection1] o.a.s.c.SolrCore [collection1] Registered new searcher Searcher@6a4a2a2b[collection1] main{ExitableDirectoryReader(UninvertingDirectoryReader())}
   [junit4]   2> 811623 INFO  (TEST-InfixSuggestersTest.testBlendedInfixSuggesterBuildThenReload-seed#[1B10D5F79AF46949]) [    x:collection1] o.a.s.s.SolrIndexSearcher Opening [Searcher@4d31731[collection1] main]
   [junit4]   2> 811624 INFO  (TEST-InfixSuggestersTest.testBlendedInfixSuggesterBuildThenReload-seed#[1B10D5F79AF46949]) [    x:collection1] o.a.s.c.SolrCore [collection1]  CLOSING SolrCore org.apache.solr.core.SolrCore@214a692
   [junit4]   2> 811624 INFO  (TEST-InfixSuggestersTest.testBlendedInfixSuggesterBuildThenReload-seed#[1B10D5F79AF46949]) [    x:collection1] o.a.s.m.SolrMetricManager Closing metric reporters for registry=solr.core.collection1, tag=214a692
   [junit4]   2> 811624 INFO  (TEST-InfixSuggestersTest.testBlendedInfixSuggesterBuildThenReload-seed#[1B10D5F79AF46949]) [    x:collection1] o.a.s.m.r.SolrJmxReporter Closing reporter [org.apache.solr.metrics.reporters.SolrJmxReporter@69a06c42: rootName = null, domain = solr.core.collection1, service url = null, agent id = null] for registry solr.core.collection1 / com.codahale.metrics.MetricRegistry@16193d0d
   [junit4]   2> 811632 INFO  (searcherExecutor-4880-thread-1-processing-x:collection1) [    x:collection1] o.a.s.c.SolrCore [collection1] Registered new searcher Searcher@4d31731[collection1] main{ExitableDirectoryReader(UninvertingDirectoryReader())}
   [junit4]   2> 811634 INFO  (TEST-InfixSuggestersTest.testBlendedInfixSuggesterBuildThenReload-seed#[1B10D5F79AF46949]) [    x:collection1] o.a.s.SolrTestCaseJ4 ###Ending testBlendedInfixSuggesterBuildThenReload
   [junit4]   2> 811635 INFO  (TEST-InfixSuggestersTest.testBuildThen2xReload-seed#[1B10D5F79AF46949]) [    x:collection1] o.a.s.SolrTestCaseJ4 ###Starting testBuildThen2xReload
   [junit4]   2> 811635 INFO  (TEST-InfixSuggestersTest.testBuildThen2xReload-seed#[1B10D5F79AF46949]) [    x:collection1] o.a.s.h.c.SuggestComponent SuggestComponent prepare with : qt=/suggest_analyzing_infix_short_dictionary&suggest=true&suggest.buildAll=true&wt=xml&indent=off
   [junit4]   2> 811635 INFO  (TEST-InfixSuggestersTest.testBuildThen2xReload-seed#[1B10D5F79AF46949]) [    x:collection1] o.a.s.s.s.SolrSuggester SolrSuggester.build(shortRandomAnalyzingInfixSuggester)
   [junit4]   2> 811641 INFO  (TEST-InfixSuggestersTest.testBuildThen2xReload-seed#[1B10D5F79AF46949]) [    x:collection1] o.a.s.s.s.RandomTestDictionaryFactory org.apache.solr.spelling.suggest.RandomTestDictionaryFactory$RandomTestDictionary.enabled.shortRandomAnalyzingInfixSuggester disabled after emitting 100 items.
   [junit4]   2> 811687 INFO  (TEST-InfixSuggestersTest.testBuildThen2xReload-seed#[1B10D5F79AF46949]) [    x:collection1] o.a.s.h.c.SuggestComponent SuggestComponent process with : qt=/suggest_analyzing_infix_short_dictionary&suggest=true&suggest.buildAll=true&wt=xml&indent=off
   [junit4]   2> 811687 INFO  (TEST-InfixSuggestersTest.testBuildThen2xReload-seed#[1B10D5F79AF46949]) [    x:collection1] o.a.s.c.S.Request [collection1]  webapp=null path=null params={qt=/suggest_analyzing_infix_short_dictionary&suggest.buildAll=true&wt=xml} status=0 QTime=51
   [junit4]   2> 811687 ERROR (TEST-InfixSuggestersTest.testBuildThen2xReload-seed#[1B10D5F79AF46949]) [    x:collection1] o.a.s.c.CorePropertiesLocator Couldn't load core descriptor from /home/jenkins/workspace/Lucene-Solr-BadApples-7.x-Linux/solr/core/src/test-files/solr/collection1/core.properties:java.nio.file.NoSuchFileException: /home/jenkins/workspace/Lucene-Solr-BadApples-7.x-Linux/solr/core/src/test-files/solr/collection1/core.properties
   [junit4]   2> 811687 INFO  (TEST-InfixSuggestersTest.testBuildThen2xReload-seed#[1B10D5F79AF46949]) [    x:collection1] o.a.s.c.SolrResourceLoader [null] Added 2 libs to classloader, from paths: [/home/jenkins/workspace/Lucene-Solr-BadApples-7.x-Linux/solr/core/src/test-files/solr/collection1/lib, /home/jenkins/workspace/Lucene-Solr-BadApples-7.x-Linux/solr/core/src/test-files/solr/collection1/lib/classes]
   [junit4]   2> 811704 INFO  (TEST-InfixSuggestersTest.testBuildThen2xReload-seed#[1B10D5F79AF46949]) [    x:collection1] o.a.s.c.SolrConfig Using Lucene MatchVersion: 7.5.0
   [junit4]   2> 811712 INFO  (TEST-InfixSuggestersTest.testBuildThen2xReload-seed#[1B10D5F79AF46949]) [    x:collection1] o.a.s.s.IndexSchema [collection1] Schema name=test
   [junit4]   2> 811802 INFO  (TEST-InfixSuggestersTest.testBuildThen2xReload-seed#[1B10D5F79AF46949]) [    x:collection1] o.a.s.s.IndexSchema Loaded schema test/1.0 with uniqueid field id
   [junit4]   2> 811809 INFO  (TEST-InfixSuggestersTest.testBuildThen2xReload-seed#[1B10D5F79AF46949]) [    x:collection1] o.a.s.c.CoreContainer Reloading SolrCore 'collection1' using configuration from instancedir /home/jenkins/workspace/Lucene-Solr-BadApples-7.x-Linux/solr/core/src/test-files/solr/collection1
   [junit4]   2> 811834 INFO  (TEST-InfixSuggestersTest.testBuildThen2xReload-seed#[1B10D5F79AF46949]) [    x:collection1] o.a.s.m.r.SolrJmxReporter JMX monitoring for 'solr.core.collection1' (registry 'solr.core.collection1') enabled at server: com.sun.jmx.mbeanserver.JmxMBeanServer@73ed318b
   [junit4]   2> 811834 INFO  (TEST-InfixSuggestersTest.testBuildThen2xReload-seed#[1B10D5F79AF46949]) [    x:collection1] o.a.s.c.SolrCore [[collection1] ] Opening new SolrCore at [/home/jenkins/workspace/Lucene-Solr-BadApples-7.x-Linux/solr/core/src/test-files/solr/collection1], dataDir=[/home/jenkins/workspace/Lucene-Solr-BadApples-7.x-Linux/solr/build/solr-core/test/J0/temp/solr.handler.component.InfixSuggestersTest_1B10D5F79AF46949-001/init-core-data-001/]
   [junit4]   2> 811872 INFO  (TEST-InfixSuggestersTest.testBuildThen2xReload-seed#[1B10D5F79AF46949]) [    x:collection1] o.a.s.u.CommitTracker Hard AutoCommit: disabled
   [junit4]   2> 811872 INFO  (TEST-InfixSuggestersTest.testBuildThen2xReload-seed#[1B10D5F79AF46949]) [    x:collection1] o.a.s.u.CommitTracker Soft AutoCommit: disabled
   [junit4]   2> 811873 INFO  (TEST-InfixSuggestersTest.testBuildThen2xReload-seed#[1B10D5F79AF46949]) [    x:collection1] o.a.s.s.SolrIndexSearcher Opening [Searcher@7b6bd014[collection1] main]
   [junit4]   2> 811873 WARN  (TEST-InfixSuggestersTest.testBuildThen2xReload-seed#[1B10D5F79AF46949]) [    x:collection1] o.a.s.r.ManagedResourceStorage Cannot write to config directory /home/jenkins/workspace/Lucene-Solr-BadApples-7.x-Linux/solr/core/src/test-files/solr/collection1/conf; switching to use InMemory storage instead.
   [junit4]   2> 811874 INFO  (TEST-InfixSuggestersTest.testBuildThen2xReload-seed#[1B10D5F79AF46949]) [    x:collection1] o.a.s.h.c.SuggestComponent Initializing SuggestComponent
   [junit4]   2> 811874 INFO  (TEST-InfixSuggestersTest.testBuildThen2xReload-seed#[1B10D5F79AF46949]) [    x:collection1] o.a.s.s.s.SolrSuggester init: {name=shortRandomAnalyzingInfixSuggester,lookupImpl=AnalyzingInfixLookupFactory,dictionaryImpl=RandomTestDictionaryFactory,randDictMaxItems=100,indexPath=short_random_analyzing_infix_suggester,suggestAnalyzerFieldType=text,buildOnCommit=false,buildOnStartup=false}
   [junit4]   2> 811874 INFO  (TEST-InfixSuggestersTest.testBuildThen2xReload-seed#[1B10D5F79AF46949]) [    x:collection1] o.a.s.s.s.SolrSuggester Dictionary loaded with params: {name=shortRandomAnalyzingInfixSuggester,lookupImpl=AnalyzingInfixLookupFactory,dictionaryImpl=RandomTestDictionaryFactory,randDictMaxItems=100,indexPath=short_random_analyzing_infix_suggester,suggestAnalyzerFieldType=text,buildOnCommit=false,buildOnStartup=false}
   [junit4]   2> 811874 INFO  (TEST-InfixSuggestersTest.testBuildThen2xReload-seed#[1B10D5F79AF46949]) [    x:collection1] o.a.s.h.c.SuggestComponent Initializing SuggestComponent
   [junit4]   2> 811874 INFO  (TEST-InfixSuggestersTest.testBuildThen2xReload-seed#[1B10D5F79AF46949]) [    x:collection1] o.a.s.s.s.SolrSuggester init: {name=longRandomAnalyzingInfixSuggester,lookupImpl=AnalyzingInfixLookupFactory,dictionaryImpl=RandomTestDictionaryFactory,randDictMaxItems=100000,indexPath=long_random_analyzing_infix_suggester,suggestAnalyzerFieldType=text,buildOnCommit=false,buildOnStartup=false}
   [junit4]   2> 811876 INFO  (TEST-InfixSuggestersTest.testBuildThen2xReload-seed#[1B10D5F79AF46949]) [    x:collection1] o.a.s.s.s.SolrSuggester Dictionary loaded with params: {name=longRandomAnalyzingInfixSuggester,lookupImpl=AnalyzingInfixLookupFactory,dictionaryImpl=RandomTestDictionaryFactory,randDictMaxItems=100000,indexPath=long_random_analyzing_infix_suggester,suggestAnalyzerFieldType=text,buildOnCommit=false,buildOnStartup=false}
   [junit4]   2> 811876 INFO  (TEST-InfixSuggestersTest.testBuildThen2xReload-seed#[1B10D5F79AF46949]) [    x:collection1] o.a.s.h.c.SuggestComponent Initializing SuggestComponent
   [junit4]   2> 811876 INFO  (TEST-InfixSuggestersTest.testBuildThen2xReload-seed#[1B10D5F79AF46949]) [    x:collection1] o.a.s.s.s.SolrSuggester init: {name=shortRandomBlendedInfixSuggester,lookupImpl=BlendedInfixLookupFactory,dictionaryImpl=RandomTestDictionaryFactory,randDictMaxItems=100,blenderType=position_linear,suggestAnalyzerFieldType=text,indexPath=short_random_blended_infix_suggester,highlight=true,buildOnStartup=false,buildOnCommit=false}
   [junit4]   2> 811877 INFO  (TEST-InfixSuggestersTest.testBuildThen2xReload-seed#[1B10D5F79AF46949]) [    x:collection1] o.a.s.s.s.SolrSuggester Dictionary loaded with params: {name=shortRandomBlendedInfixSuggester,lookupImpl=BlendedInfixLookupFactory,dictionaryImpl=RandomTestDictionaryFactory,randDictMaxItems=100,blenderType=position_linear,suggestAnalyzerFieldType=text,indexPath=short_random_blended_infix_suggester,highlight=true,buildOnStartup=false,buildOnCommit=false}
   [junit4]   2> 811877 INFO  (TEST-InfixSuggestersTest.testBuildThen2xReload-seed#[1B10D5F79AF46949]) [    x:collection1] o.a.s.h.ReplicationHandler Commits will be reserved for 10000ms.
   [junit4]   2> 811878 INFO  (TEST-InfixSuggestersTest.testBuildThen2xReload-seed#[1B10D5F79AF46949]) [    x:collection1] o.a.s.u.RandomMergePolicy RandomMergePolicy wrapping class org.apache.lucene.index.LogByteSizeMergePolicy: [LogByteSizeMergePolicy: minMergeSize=1677721, mergeFactor=14, maxMergeSize=2147483648, maxMergeSizeForForcedMerge=9223372036854775807, calibrateSizeByDeletes=true, maxMergeDocs=2147483647, maxCFSSegmentSizeMB=8.796093022207999E12, noCFSRatio=1.0]
   [junit4]   2> 811878 INFO  (TEST-InfixSuggestersTest.testBuildThen2xReload-seed#[1B10D5F79AF46949]) [    x:collection1] o.a.s.u.DefaultSolrCoreState New IndexWriter is ready to be used.
   [junit4]   2> 811879 INFO  (searcherExecutor-4884-thread-1-processing-x:collection1) [    x:collection1] o.a.s.c.SolrCore [collection1] Registered new searcher Searcher@7b6bd014[collection1] main{ExitableDirectoryReader(UninvertingDirectoryReader())}
   [junit4]   2> 811879 INFO  (TEST-InfixSuggestersTest.testBuildThen2xReload-seed#[1B10D5F79AF46949]) [    x:collection1] o.a.s.s.SolrIndexSearcher Opening [Searcher@40e66685[collection1] main]
   [junit4]   2> 811879 INFO  (TEST-InfixSuggestersTest.testBuildThen2xReload-seed#[1B10D5F79AF46949]) [    x:collection1] o.a.s.c.SolrCore [collection1]  CLOSING SolrCore org.apache.solr.core.SolrCore@7422e56f
   [junit4]   2> 811879 INFO  (TEST-InfixSuggestersTest.testBuildThen2xReload-seed#[1B10D5F79AF46949]) [    x:collection1] o.a.s.m.SolrMetricManager Closing metric reporters for registry=solr.core.collection1, tag=7422e56f
   [junit4]   2> 811879 INFO  (TEST-InfixSuggestersTest.testBuildThen2xReload-seed#[1B10D5F79AF46949]) [    x:collection1] o.a.s.m.r.SolrJmxReporter Closing reporter [org.apache.solr.metrics.reporters.SolrJmxReporter@310b7393: rootName = null, domain = solr.core.collection1, service url = null, agent id = null] for registry solr.core.collection1 / com.codahale.metrics.MetricRegistry@16193d0d
   [junit4]   2> 811880 INFO  (searcherExecutor-4884-thread-1-processing-x:collection1) [    x:collection1] o.a.s.c.SolrCore [collection1] Registered new searcher Searcher@40e66685[collection1] main{ExitableDirectoryReader(UninvertingDirectoryReader())}
   [junit4]   2> 811886 ERROR (TEST-InfixSuggestersTest.testBuildThen2xReload-seed#[1B10D5F79AF46949]) [    x:collection1] o.a.s.c.CorePropertiesLocator Couldn't load core descriptor from /home/jenkins/workspace/Lucene-Solr-BadApples-7.x-Linux/solr/core/src/test-files/solr/collection1/core.properties:java.nio.file.NoSuchFileException: /home/jenkins/workspace/Lucene-Solr-BadApples-7.x-Linux/solr/core/src/test-files/solr/collection1/core.properties
   [junit4]   2> 811886 INFO  (TEST-InfixSuggestersTest.testBuildThen2xReload-seed#[1B10D5F79AF46949]) [    x:collection1] o.a.s.c.SolrResourceLoader [null] Added 2 libs to classloader, from paths: [/home/jenkins/workspace/Lucene-Solr-BadApples-7.x-Linux/solr/core/src/test-files/solr/collection1/lib, /home/jenkins/workspace/Lucene-Solr-BadApples-7.x-Linux/solr/core/src/test-files/solr/collection1/lib/classes]
   [junit4]   2> 811896 INFO  (TEST-InfixSuggestersTest.testBuildThen2xReload-seed#[1B10D5F79AF46949]) [    x:collection1] o.a.s.c.SolrConfig Using Lucene MatchVersion: 7.5.0
   [junit4]   2> 811904 INFO  (TEST-InfixSuggestersTest.testBuildThen2xReload-seed#[1B10D5F79AF46949]) [    x:collection1] o.a.s.s.IndexSchema [collection1] Schema name=test
   [junit4]   2> 811961 INFO  (TEST-InfixSuggestersTest.testBuildThen2xReload-seed#[1B10D5F79AF46949]) [    x:collection1] o.a.s.s.IndexSchema Loaded schema test/1.0 with uniqueid field id
   [junit4]   2> 811965 INFO  (TEST-InfixSuggestersTest.testBuildThen2xReload-seed#[1B10D5F79AF46949]) [    x:collection1] o.a.s.c.CoreContainer Reloading SolrCore 'collection1' using configuration from instancedir /home/jenkins/workspace/Lucene-Solr-BadApples-7.x-Linux/solr/core/src/test-files/solr/collection1
   [junit4]   2> 811981 INFO  (TEST-InfixSuggestersTest.testBuildThen2xReload-seed#[1B10D5F79AF46949]) [    x:collection1] o.a.s.m.r.SolrJmxReporter JMX monitoring for 'solr.core.collection1' (registry 'solr.core.collection1') enabled at server: com.sun.jmx.mbeanserver.JmxMBeanServer@73ed318b
   [junit4]   2> 811981 INFO  (TEST-InfixSuggestersTest.testBuildThen2xReload-seed#[1B10D5F79AF46949]) [    x:collection1] o.a.s.c.SolrCore [[collection1] ] Opening new SolrCore at [/home/jenkins/workspace/Lucene-Solr-BadApples-7.x-Linux/solr/core/src/test-files/solr/collection1], dataDir=[/home/jenkins/workspace/Lucene-Solr-BadApples-7.x-Linux/solr/build/solr-core/test/J0/temp/solr.handler.component.InfixSuggestersTest_1B10D5F79AF46949-001/init-core-data-001/]
   [junit4]   2> 812010 INFO  (TEST-InfixSuggestersTest.testBuildThen2xReload-seed#[1B10D5F79AF46949]) [    x:collection1] o.a.s.u.CommitTracker Hard AutoCommit: disabled
   [junit4]   2> 812010 INFO  (TEST-InfixSuggestersTest.testBuildThen2xReload-seed#[1B10D5F79AF46949]) [    x:collection1] o.a.s.u.CommitTracker Soft AutoCommit: disabled
   [junit4]   2> 812011 INFO  (TEST-InfixSuggestersTest.testBuildThen2xReload-seed#[1B10D5F79AF46949]) [    x:collection1] o.a.s.s.SolrIndexSearcher Opening [Searcher@48a3c782[collection1] main]
   [junit4]   2> 812011 WARN  (TEST-InfixSuggestersTest.testBuildThen2xReload-seed#[1B10D5F79AF46949]) [    x:collection1] o.a.s.r.ManagedResourceStorage Cannot write to config directory /home/jenkins/workspace/Lucene-Solr-BadApples-7.x-Linux/solr/core/src/test-files/solr/collection1/conf; switching to use InMemory storage instead.
   [junit4]   2> 812011 INFO  (TEST-InfixSuggestersTest.testBuildThen2xReload-seed#[1B10D5F79AF46949]) [    x:collection1] o.a.s.h.c.SuggestComponent Initializing SuggestComponent
   [junit4]   2> 812011 INFO  (TEST-InfixSuggestersTest.testBuildThen2xReload-seed#[1B10D5F79AF46949]) [    x:collection1] o.a.s.s.s.SolrSuggester init: {name=shortRandomAnalyzingInfixSuggester,lookupImpl=AnalyzingInfixLookupFactory,dictionaryImpl=RandomTestDictionaryFactory,randDictMaxItems=100,indexPath=short_random_analyzing_infix_suggester,suggestAnalyzerFieldType=text,buildOnCommit=false,buildOnStartup=false}
   [junit4]   2> 812012 INFO  (TEST-InfixSuggestersTest.testBuildThen2xReload-seed#[1B10D5F79AF46949]) [    x:collection1] o.a.s.s.s.SolrSuggester Dictionary loaded with params: {name=shortRandomAnalyzingInfixSuggester,lookupImpl=AnalyzingInfixLookupFactory,dictionaryImpl=RandomTestDictionaryFactory,randDictMaxItems=100,indexPath=short_random_analyzing_infix_suggester,suggestAnalyzerFieldType=text,buildOnCommit=false,buildOnStartup=false}
   [junit4]   2> 812012 INFO  (TEST-InfixSuggestersTest.testBuildThen2xReload-seed#[1B10D5F79AF46949]) [    x:collection1] o.a.s.h.c.SuggestComponent Initializing SuggestComponent
   [junit4]   2> 812012 INFO  (TEST-InfixSuggestersTest.testBuildThen2xReload-seed#[1B10D5F79AF46949]) [    x:collection1] o.a.s.s.s.SolrSuggester init: {name=longRandomAnalyzingInfixSuggester,lookupImpl=AnalyzingInfixLookupFactory,dictionaryImpl=RandomTestDictionaryFactory,randDictMaxItems=100000,indexPath=long_random_analyzing_infix_suggester,suggestAnalyzerFieldType=text,buildOnCommit=false,buildOnStartup=false}
   [junit4]   2> 812014 INFO  (TEST-InfixSuggestersTest.testBuildThen2xReload-seed#[1B10D5F79AF46949]) [    x:collection1] o.a.s.s.s.SolrSuggester Dictionary loaded with params: {name=longRandomAnalyzingInfixSuggester,lookupImpl=AnalyzingInfixLookupFactory,dictionaryImpl=RandomTestDictionaryFactory,randDictMaxItems=100000,indexPath=long_random_analyzing_infix_suggester,suggestAnalyzerFieldType=text,buildOnCommit=false,buildOnStartup=false}
   [junit4]   2> 812014 INFO  (TEST-InfixSuggestersTest.testBuildThen2xReload-seed#[1B10D5F79AF46949]) [    x:collection1] o.a.s.h.c.SuggestComponent Initializing SuggestComponent
   [junit4]   2> 812014 INFO  (TEST-InfixSuggestersTest.testBuildThen2xReload-seed#[1B10D5F79AF46949]) [    x:collection1] o.a.s.s.s.SolrSuggester init: {name=shortRandomBlendedInfixSuggester,lookupImpl=BlendedInfixLookupFactory,dictionaryImpl=RandomTestDictionaryFactory,randDictMaxItems=100,blenderType=position_linear,suggestAnalyzerFieldType=text,indexPath=short_random_blended_infix_suggester,highlight=true,buildOnStartup=false,buildOnCommit=false}
   [junit4]   2> 812015 INFO  (TEST-InfixSuggestersTest.testBuildThen2xReload-seed#[1B10D5F79AF46949]) [    x:collection1] o.a.s.s.s.SolrSuggester Dictionary loaded with params: {name=shortRandomBlendedInfixSuggester,lookupImpl=BlendedInfixLookupFactory,dictionaryImpl=RandomTestDictionaryFactory,randDictMaxItems=100,blenderType=position_linear,suggestAnalyzerFieldType=text,indexPath=short_random_blended_infix_suggester,highlight=true,buildOnStartup=false,buildOnCommit=false}
   [junit4]   2> 812015 INFO  (TEST-InfixSuggestersTest.testBuildThen2xReload-seed#[1B10D5F79AF46949]) [    x:collection1] o.a.s.h.ReplicationHandler Commits will be reserved for 10000ms.
   [junit4]   2> 812015 INFO  (TEST-InfixSuggestersTest.testBuildThen2xReload-seed#[1B10D5F79AF46949]) [    x:collection1] o.a.s.u.RandomMergePolicy RandomMergePolicy wrapping class org.apache.lucene.index.AlcoholicMergePolicy: [AlcoholicMergePolicy: minMergeSize=0, mergeFactor=10, maxMergeSize=850371794, maxMergeSizeForForcedMerge=9223372036854775807, calibrateSizeByDeletes=true, maxMergeDocs=2147483647, maxCFSSegmentSizeMB=8.796093022207999E12, noCFSRatio=0.1]
   [junit4]   2> 812016 INFO  (TEST-InfixSuggestersTest.testBuildThen2xReload-seed#[1B10D5F79AF46949]) [    x:collection1] o.a.s.u.DefaultSolrCoreState New IndexWriter is ready to be used.
   [junit4]   2> 812016 INFO  (searcherExecutor-4888-thread-1-processing-x:collection1) [    x:collection1] o.a.s.c.SolrCore [collection1] Registered new searcher Searcher@48a3c782[collection1] main{ExitableDirectoryReader(UninvertingDirectoryReader())}
   [junit4]   2> 812016 INFO  (TEST-InfixSuggestersTest.

[...truncated too long message...]

2> 1782311 WARN  (Thread-3224) [    ] o.a.s.c.ZkTestServer Watch limit violations: 
   [junit4]   2> Maximum concurrent create/delete watches above limit:
   [junit4]   2> 
   [junit4]   2> 	16	/solr/collections/collection1/terms/shard1
   [junit4]   2> 	14	/solr/aliases.json
   [junit4]   2> 	11	/solr/collections/collection1/terms/shard1_0
   [junit4]   2> 	11	/solr/collections/collection1/terms/shard2
   [junit4]   2> 	8	/solr/collections/collection1/terms/shard1_1
   [junit4]   2> 	6	/solr/security.json
   [junit4]   2> 	6	/solr/configs/conf1
   [junit4]   2> 	3	/solr/collections/control_collection/terms/shard1
   [junit4]   2> 
   [junit4]   2> Maximum concurrent data watches above limit:
   [junit4]   2> 
   [junit4]   2> 	82	/solr/collections/collection1/state.json
   [junit4]   2> 	14	/solr/clusterprops.json
   [junit4]   2> 	14	/solr/clusterstate.json
   [junit4]   2> 	4	/solr/autoscaling.json
   [junit4]   2> 	2	/solr/overseer_elect/election/72103505439424522-127.0.0.1:34125_do_-n_0000000001
   [junit4]   2> 
   [junit4]   2> Maximum concurrent children watches above limit:
   [junit4]   2> 
   [junit4]   2> 	14	/solr/live_nodes
   [junit4]   2> 	14	/solr/collections
   [junit4]   2> 	4	/solr/overseer/queue
   [junit4]   2> 	4	/solr/autoscaling/events/.scheduled_maintenance
   [junit4]   2> 	4	/solr/overseer/collection-queue-work
   [junit4]   2> 	4	/solr/overseer/queue-work
   [junit4]   2> 	3	/solr/autoscaling/events/.auto_add_replicas
   [junit4]   2> 
   [junit4]   2> NOTE: reproduce with: ant test  -Dtestcase=ShardSplitTest -Dtests.method=testSplitWithChaosMonkey -Dtests.seed=1B10D5F79AF46949 -Dtests.multiplier=3 -Dtests.slow=true -Dtests.badapples=true -Dtests.locale=ar-JO -Dtests.timezone=Africa/Lubumbashi -Dtests.asserts=true -Dtests.file.encoding=UTF-8
   [junit4] FAILURE  172s J0 | ShardSplitTest.testSplitWithChaosMonkey <<<
   [junit4]    > Throwable #1: java.lang.AssertionError: We think that split was successful but sub-shard states were not updated even after 2 minutes.
   [junit4]    > 	at __randomizedtesting.SeedInfo.seed([1B10D5F79AF46949:90370626DBF2C2CD]:0)
   [junit4]    > 	at org.apache.solr.cloud.api.collections.ShardSplitTest.testSplitWithChaosMonkey(ShardSplitTest.java:555)
   [junit4]    > 	at java.base/jdk.internal.reflect.NativeMethodAccessorImpl.invoke0(Native Method)
   [junit4]    > 	at java.base/jdk.internal.reflect.NativeMethodAccessorImpl.invoke(NativeMethodAccessorImpl.java:62)
   [junit4]    > 	at java.base/jdk.internal.reflect.DelegatingMethodAccessorImpl.invoke(DelegatingMethodAccessorImpl.java:43)
   [junit4]    > 	at java.base/java.lang.reflect.Method.invoke(Method.java:564)
   [junit4]    > 	at org.apache.solr.BaseDistributedSearchTestCase$ShardsRepeatRule$ShardsFixedStatement.callStatement(BaseDistributedSearchTestCase.java:1008)
   [junit4]    > 	at org.apache.solr.BaseDistributedSearchTestCase$ShardsRepeatRule$ShardsStatement.evaluate(BaseDistributedSearchTestCase.java:983)
   [junit4]    > 	at java.base/java.lang.Thread.run(Thread.java:844)
   [junit4]   2> NOTE: leaving temporary files on disk at: /home/jenkins/workspace/Lucene-Solr-BadApples-7.x-Linux/solr/build/solr-core/test/J0/temp/solr.cloud.api.collections.ShardSplitTest_1B10D5F79AF46949-001
   [junit4]   2> NOTE: test params are: codec=Asserting(Lucene70): {rnd_b=PostingsFormat(name=MockRandom), a_t=PostingsFormat(name=Direct), id=PostingsFormat(name=MockRandom)}, docValues:{rnd_b=DocValuesFormat(name=Memory), _version_=DocValuesFormat(name=Lucene70), n_ti=DocValuesFormat(name=Lucene70), a_t=DocValuesFormat(name=Lucene70), a_i=DocValuesFormat(name=Memory), id=DocValuesFormat(name=Memory)}, maxPointsInLeafNode=1610, maxMBSortInHeap=6.047419204934852, sim=RandomSimilarity(queryNorm=false): {}, locale=ar-JO, timezone=Africa/Lubumbashi
   [junit4]   2> NOTE: Linux 4.15.0-24-generic amd64/Oracle Corporation 10 (64-bit)/cpus=8,threads=1,free=89543776,total=529006592
   [junit4]   2> NOTE: All tests run in this JVM: [PeerSyncWithBufferUpdatesTest, TestBulkSchemaAPI, VMParamsZkACLAndCredentialsProvidersTest, TestMacroExpander, TestEmbeddedSolrServerConstructors, UtilsToolTest, JavabinLoaderTest, TestGroupingSearch, SolrRequestParserTest, MissingSegmentRecoveryTest, TestSerializedLuceneMatchVersion, TokenizerChainTest, TestManagedSchema, TestCollationField, TestSimpleTextCodec, AddSchemaFieldsUpdateProcessorFactoryTest, TestStressLiveNodes, TestPayloadScoreQParserPlugin, SmileWriterTest, TestLargeCluster, SearchRateTriggerIntegrationTest, HdfsDirectoryFactoryTest, TestPushWriter, TestOmitPositions, CopyFieldTest, SimplePostToolTest, TestMergePolicyConfig, TestManagedSynonymFilterFactory, TestReplicaProperties, TestFieldTypeCollectionResource, ParsingFieldUpdateProcessorsTest, ExplicitHLLTest, TestFileDictionaryLookup, TestValueSourceCache, DistributedQueryComponentOptimizationTest, TestHashPartitioner, TestConfigSetImmutable, ExecutePlanActionTest, DateRangeFieldTest, TestLegacyFieldCache, CoreMergeIndexesAdminHandlerTest, LeaderElectionIntegrationTest, LIROnShardRestartTest, TestDynamicFieldResource, TestFiltering, TestCollectionsAPIViaSolrCloudCluster, TestMaxScoreQueryParser, DocValuesTest, AnalysisAfterCoreReloadTest, HdfsLockFactoryTest, HdfsNNFailoverTest, WrapperMergePolicyFactoryTest, CoreAdminHandlerTest, TestRetrieveFieldsOptimizer, TestRestoreCore, TestDelegationWithHadoopAuth, TermsComponentTest, UpdateLogTest, TestSolrCloudWithSecureImpersonation, TestCodecSupport, ConcurrentCreateRoutedAliasTest, TestSkipOverseerOperations, TestStressRecovery, BadIndexSchemaTest, SSLMigrationTest, SolrCoreTest, TestDFRSimilarityFactory, TestQuerySenderNoQuery, TestExactStatsCache, SignificantTermsQParserPluginTest, BJQParserTest, MoveReplicaTest, XmlInterpolationTest, TestDefaultStatsCache, TestUseDocValuesAsStored2, RemoteQueryErrorTest, TestSolrConfigHandlerCloud, CollectionTooManyReplicasTest, TestDistributedMap, TestOrdValues, InfixSuggestersTest, TestCloudRecovery, TestAddFieldRealTimeGet, FieldAnalysisRequestHandlerTest, TestSchemalessBufferedUpdates, DistributedFacetSimpleRefinementLongTailTest, ChaosMonkeyNothingIsSafeTest, CdcrReplicationDistributedZkTest, SimpleFacetsTest, PeerSyncReplicationTest, TestSafeXMLParsing, ScheduledMaintenanceTriggerTest, IndexSchemaRuntimeFieldTest, TestCoreContainer, TestXIncludeConfig, ResponseLogComponentTest, NumberUtilsTest, TestHttpShardHandlerFactory, TestConfigReload, LukeRequestHandlerTest, PathHierarchyTokenizerFactoryTest, TestLuceneMatchVersion, TestSuggestSpellingConverter, FileBasedSpellCheckerTest, ZkSolrClientTest, TestSubQueryTransformer, OverseerStatusTest, TestJsonRequest, TestUninvertingReader, ZkFailoverTest, SegmentsInfoRequestHandlerTest, FullSolrCloudDistribCmdsTest, TestSegmentSorting, TestFieldCache, ShardSplitTest]
   [junit4] Completed [419/822 (2!)] on J0 in 523.17s, 7 tests, 2 failures <<< FAILURES!

[...truncated 21611 lines...]
check-licenses:
     [echo] License check under: /home/jenkins/workspace/Lucene-Solr-BadApples-7.x-Linux/solr
 [licenses] MISSING sha1 checksum file for: /home/jenkins/workspace/Lucene-Solr-BadApples-7.x-Linux/solr/contrib/uima/lib/AlchemyAPIAnnotator-2.3.1.jar
 [licenses] EXPECTED sha1 checksum file : /home/jenkins/workspace/Lucene-Solr-BadApples-7.x-Linux/solr/licenses/AlchemyAPIAnnotator-2.3.1.jar.sha1

 [licenses] MISSING sha1 checksum file for: /home/jenkins/workspace/Lucene-Solr-BadApples-7.x-Linux/solr/contrib/uima/lib/OpenCalaisAnnotator-2.3.1.jar
 [licenses] EXPECTED sha1 checksum file : /home/jenkins/workspace/Lucene-Solr-BadApples-7.x-Linux/solr/licenses/OpenCalaisAnnotator-2.3.1.jar.sha1
 [licenses] MISSING sha1 checksum file for: /home/jenkins/workspace/Lucene-Solr-BadApples-7.x-Linux/solr/contrib/uima/lib/Tagger-2.3.1.jar
 [licenses] EXPECTED sha1 checksum file : /home/jenkins/workspace/Lucene-Solr-BadApples-7.x-Linux/solr/licenses/Tagger-2.3.1.jar.sha1

 [licenses] MISSING sha1 checksum file for: /home/jenkins/workspace/Lucene-Solr-BadApples-7.x-Linux/solr/contrib/uima/lib/WhitespaceTokenizer-2.3.1.jar
 [licenses] EXPECTED sha1 checksum file : /home/jenkins/workspace/Lucene-Solr-BadApples-7.x-Linux/solr/licenses/WhitespaceTokenizer-2.3.1.jar.sha1
 [licenses] MISSING sha1 checksum file for: /home/jenkins/workspace/Lucene-Solr-BadApples-7.x-Linux/solr/contrib/uima/lib/commons-digester-2.1.jar
 [licenses] EXPECTED sha1 checksum file : /home/jenkins/workspace/Lucene-Solr-BadApples-7.x-Linux/solr/licenses/commons-digester-2.1.jar.sha1

[...truncated 3 lines...]
BUILD FAILED
/home/jenkins/workspace/Lucene-Solr-BadApples-7.x-Linux/build.xml:642: The following error occurred while executing this line:
/home/jenkins/workspace/Lucene-Solr-BadApples-7.x-Linux/build.xml:117: The following error occurred while executing this line:
/home/jenkins/workspace/Lucene-Solr-BadApples-7.x-Linux/solr/build.xml:364: The following error occurred while executing this line:
/home/jenkins/workspace/Lucene-Solr-BadApples-7.x-Linux/lucene/tools/custom-tasks.xml:62: License check failed. Check the logs.
If you recently modified ivy-versions.properties or any module's ivy.xml,
make sure you run "ant clean-jars jar-checksums" before running precommit.

Total time: 86 minutes 54 seconds
Build step 'Invoke Ant' marked build as failure
Archiving artifacts
Setting ANT_1_8_2_HOME=/var/lib/jenkins/tools/hudson.tasks.Ant_AntInstallation/ANT_1.8.2
[WARNINGS] Skipping publisher since build result is FAILURE
Recording test results
Setting ANT_1_8_2_HOME=/var/lib/jenkins/tools/hudson.tasks.Ant_AntInstallation/ANT_1.8.2
Email was triggered for: Failure - Any
Sending email for trigger: Failure - Any
Setting ANT_1_8_2_HOME=/var/lib/jenkins/tools/hudson.tasks.Ant_AntInstallation/ANT_1.8.2
Setting ANT_1_8_2_HOME=/var/lib/jenkins/tools/hudson.tasks.Ant_AntInstallation/ANT_1.8.2
Setting ANT_1_8_2_HOME=/var/lib/jenkins/tools/hudson.tasks.Ant_AntInstallation/ANT_1.8.2
Setting ANT_1_8_2_HOME=/var/lib/jenkins/tools/hudson.tasks.Ant_AntInstallation/ANT_1.8.2

Mime
View raw message