lucene-dev mailing list archives

Site index · List index
Message view « Date » · « Thread »
Top « Date » · « Thread »
From Policeman Jenkins Server <jenk...@thetaphi.de>
Subject [JENKINS] Lucene-Solr-7.x-Windows (64bit/jdk-9.0.4) - Build # 687 - Still Unstable!
Date Fri, 13 Jul 2018 05:34:28 GMT
Build: https://jenkins.thetaphi.de/job/Lucene-Solr-7.x-Windows/687/
Java: 64bit/jdk-9.0.4 -XX:-UseCompressedOops -XX:+UseParallelGC

5 tests failed.
FAILED:  org.apache.solr.cloud.LeaderTragicEventTest.testOtherReplicasAreNotActive

Error Message:
Jetty Connector is not open: -2

Stack Trace:
java.lang.IllegalStateException: Jetty Connector is not open: -2
	at __randomizedtesting.SeedInfo.seed([775803901D4DCD66:F2EC2FE721B274FE]:0)
	at org.apache.solr.client.solrj.embedded.JettySolrRunner.getBaseUrl(JettySolrRunner.java:499)
	at org.apache.solr.cloud.MiniSolrCloudCluster.getReplicaJetty(MiniSolrCloudCluster.java:539)
	at org.apache.solr.cloud.LeaderTragicEventTest.corruptLeader(LeaderTragicEventTest.java:100)
	at org.apache.solr.cloud.LeaderTragicEventTest.testOtherReplicasAreNotActive(LeaderTragicEventTest.java:150)
	at java.base/jdk.internal.reflect.NativeMethodAccessorImpl.invoke0(Native Method)
	at java.base/jdk.internal.reflect.NativeMethodAccessorImpl.invoke(NativeMethodAccessorImpl.java:62)
	at java.base/jdk.internal.reflect.DelegatingMethodAccessorImpl.invoke(DelegatingMethodAccessorImpl.java:43)
	at java.base/java.lang.reflect.Method.invoke(Method.java:564)
	at com.carrotsearch.randomizedtesting.RandomizedRunner.invoke(RandomizedRunner.java:1737)
	at com.carrotsearch.randomizedtesting.RandomizedRunner$8.evaluate(RandomizedRunner.java:934)
	at com.carrotsearch.randomizedtesting.RandomizedRunner$9.evaluate(RandomizedRunner.java:970)
	at com.carrotsearch.randomizedtesting.RandomizedRunner$10.evaluate(RandomizedRunner.java:984)
	at com.carrotsearch.randomizedtesting.rules.SystemPropertiesRestoreRule$1.evaluate(SystemPropertiesRestoreRule.java:57)
	at org.apache.lucene.util.TestRuleSetupTeardownChained$1.evaluate(TestRuleSetupTeardownChained.java:49)
	at org.apache.lucene.util.AbstractBeforeAfterRule$1.evaluate(AbstractBeforeAfterRule.java:45)
	at org.apache.lucene.util.TestRuleThreadAndTestName$1.evaluate(TestRuleThreadAndTestName.java:48)
	at org.apache.lucene.util.TestRuleIgnoreAfterMaxFailures$1.evaluate(TestRuleIgnoreAfterMaxFailures.java:64)
	at org.apache.lucene.util.TestRuleMarkFailure$1.evaluate(TestRuleMarkFailure.java:47)
	at com.carrotsearch.randomizedtesting.rules.StatementAdapter.evaluate(StatementAdapter.java:36)
	at com.carrotsearch.randomizedtesting.ThreadLeakControl$StatementRunner.run(ThreadLeakControl.java:368)
	at com.carrotsearch.randomizedtesting.ThreadLeakControl.forkTimeoutingTask(ThreadLeakControl.java:817)
	at com.carrotsearch.randomizedtesting.ThreadLeakControl$3.evaluate(ThreadLeakControl.java:468)
	at com.carrotsearch.randomizedtesting.RandomizedRunner.runSingleTest(RandomizedRunner.java:943)
	at com.carrotsearch.randomizedtesting.RandomizedRunner$5.evaluate(RandomizedRunner.java:829)
	at com.carrotsearch.randomizedtesting.RandomizedRunner$6.evaluate(RandomizedRunner.java:879)
	at com.carrotsearch.randomizedtesting.RandomizedRunner$7.evaluate(RandomizedRunner.java:890)
	at com.carrotsearch.randomizedtesting.rules.StatementAdapter.evaluate(StatementAdapter.java:36)
	at com.carrotsearch.randomizedtesting.rules.SystemPropertiesRestoreRule$1.evaluate(SystemPropertiesRestoreRule.java:57)
	at org.apache.lucene.util.AbstractBeforeAfterRule$1.evaluate(AbstractBeforeAfterRule.java:45)
	at com.carrotsearch.randomizedtesting.rules.StatementAdapter.evaluate(StatementAdapter.java:36)
	at org.apache.lucene.util.TestRuleStoreClassName$1.evaluate(TestRuleStoreClassName.java:41)
	at com.carrotsearch.randomizedtesting.rules.NoShadowingOrOverridesOnMethodsRule$1.evaluate(NoShadowingOrOverridesOnMethodsRule.java:40)
	at com.carrotsearch.randomizedtesting.rules.NoShadowingOrOverridesOnMethodsRule$1.evaluate(NoShadowingOrOverridesOnMethodsRule.java:40)
	at com.carrotsearch.randomizedtesting.rules.StatementAdapter.evaluate(StatementAdapter.java:36)
	at com.carrotsearch.randomizedtesting.rules.StatementAdapter.evaluate(StatementAdapter.java:36)
	at org.apache.lucene.util.TestRuleAssertionsRequired$1.evaluate(TestRuleAssertionsRequired.java:53)
	at org.apache.lucene.util.TestRuleMarkFailure$1.evaluate(TestRuleMarkFailure.java:47)
	at org.apache.lucene.util.TestRuleIgnoreAfterMaxFailures$1.evaluate(TestRuleIgnoreAfterMaxFailures.java:64)
	at org.apache.lucene.util.TestRuleIgnoreTestSuites$1.evaluate(TestRuleIgnoreTestSuites.java:54)
	at com.carrotsearch.randomizedtesting.rules.StatementAdapter.evaluate(StatementAdapter.java:36)
	at com.carrotsearch.randomizedtesting.ThreadLeakControl$StatementRunner.run(ThreadLeakControl.java:368)
	at java.base/java.lang.Thread.run(Thread.java:844)


FAILED:  org.apache.solr.cloud.LeaderTragicEventTest.test

Error Message:
Error from server at https://127.0.0.1:54483/solr: collection already exists: collection1

Stack Trace:
org.apache.solr.client.solrj.impl.HttpSolrClient$RemoteSolrException: Error from server at https://127.0.0.1:54483/solr: collection already exists: collection1
	at __randomizedtesting.SeedInfo.seed([775803901D4DCD66:FF0C3C4AB3B1A09E]:0)
	at org.apache.solr.client.solrj.impl.HttpSolrClient.executeMethod(HttpSolrClient.java:643)
	at org.apache.solr.client.solrj.impl.HttpSolrClient.request(HttpSolrClient.java:255)
	at org.apache.solr.client.solrj.impl.HttpSolrClient.request(HttpSolrClient.java:244)
	at org.apache.solr.client.solrj.impl.LBHttpSolrClient.doRequest(LBHttpSolrClient.java:483)
	at org.apache.solr.client.solrj.impl.LBHttpSolrClient.request(LBHttpSolrClient.java:413)
	at org.apache.solr.client.solrj.impl.CloudSolrClient.sendRequest(CloudSolrClient.java:1106)
	at org.apache.solr.client.solrj.impl.CloudSolrClient.requestWithRetryOnStaleState(CloudSolrClient.java:886)
	at org.apache.solr.client.solrj.impl.CloudSolrClient.request(CloudSolrClient.java:819)
	at org.apache.solr.client.solrj.SolrRequest.process(SolrRequest.java:194)
	at org.apache.solr.client.solrj.SolrRequest.process(SolrRequest.java:211)
	at org.apache.solr.cloud.LeaderTragicEventTest.test(LeaderTragicEventTest.java:70)
	at java.base/jdk.internal.reflect.NativeMethodAccessorImpl.invoke0(Native Method)
	at java.base/jdk.internal.reflect.NativeMethodAccessorImpl.invoke(NativeMethodAccessorImpl.java:62)
	at java.base/jdk.internal.reflect.DelegatingMethodAccessorImpl.invoke(DelegatingMethodAccessorImpl.java:43)
	at java.base/java.lang.reflect.Method.invoke(Method.java:564)
	at com.carrotsearch.randomizedtesting.RandomizedRunner.invoke(RandomizedRunner.java:1737)
	at com.carrotsearch.randomizedtesting.RandomizedRunner$8.evaluate(RandomizedRunner.java:934)
	at com.carrotsearch.randomizedtesting.RandomizedRunner$9.evaluate(RandomizedRunner.java:970)
	at com.carrotsearch.randomizedtesting.RandomizedRunner$10.evaluate(RandomizedRunner.java:984)
	at com.carrotsearch.randomizedtesting.rules.SystemPropertiesRestoreRule$1.evaluate(SystemPropertiesRestoreRule.java:57)
	at org.apache.lucene.util.TestRuleSetupTeardownChained$1.evaluate(TestRuleSetupTeardownChained.java:49)
	at org.apache.lucene.util.AbstractBeforeAfterRule$1.evaluate(AbstractBeforeAfterRule.java:45)
	at org.apache.lucene.util.TestRuleThreadAndTestName$1.evaluate(TestRuleThreadAndTestName.java:48)
	at org.apache.lucene.util.TestRuleIgnoreAfterMaxFailures$1.evaluate(TestRuleIgnoreAfterMaxFailures.java:64)
	at org.apache.lucene.util.TestRuleMarkFailure$1.evaluate(TestRuleMarkFailure.java:47)
	at com.carrotsearch.randomizedtesting.rules.StatementAdapter.evaluate(StatementAdapter.java:36)
	at com.carrotsearch.randomizedtesting.ThreadLeakControl$StatementRunner.run(ThreadLeakControl.java:368)
	at com.carrotsearch.randomizedtesting.ThreadLeakControl.forkTimeoutingTask(ThreadLeakControl.java:817)
	at com.carrotsearch.randomizedtesting.ThreadLeakControl$3.evaluate(ThreadLeakControl.java:468)
	at com.carrotsearch.randomizedtesting.RandomizedRunner.runSingleTest(RandomizedRunner.java:943)
	at com.carrotsearch.randomizedtesting.RandomizedRunner$5.evaluate(RandomizedRunner.java:829)
	at com.carrotsearch.randomizedtesting.RandomizedRunner$6.evaluate(RandomizedRunner.java:879)
	at com.carrotsearch.randomizedtesting.RandomizedRunner$7.evaluate(RandomizedRunner.java:890)
	at com.carrotsearch.randomizedtesting.rules.StatementAdapter.evaluate(StatementAdapter.java:36)
	at com.carrotsearch.randomizedtesting.rules.SystemPropertiesRestoreRule$1.evaluate(SystemPropertiesRestoreRule.java:57)
	at org.apache.lucene.util.AbstractBeforeAfterRule$1.evaluate(AbstractBeforeAfterRule.java:45)
	at com.carrotsearch.randomizedtesting.rules.StatementAdapter.evaluate(StatementAdapter.java:36)
	at org.apache.lucene.util.TestRuleStoreClassName$1.evaluate(TestRuleStoreClassName.java:41)
	at com.carrotsearch.randomizedtesting.rules.NoShadowingOrOverridesOnMethodsRule$1.evaluate(NoShadowingOrOverridesOnMethodsRule.java:40)
	at com.carrotsearch.randomizedtesting.rules.NoShadowingOrOverridesOnMethodsRule$1.evaluate(NoShadowingOrOverridesOnMethodsRule.java:40)
	at com.carrotsearch.randomizedtesting.rules.StatementAdapter.evaluate(StatementAdapter.java:36)
	at com.carrotsearch.randomizedtesting.rules.StatementAdapter.evaluate(StatementAdapter.java:36)
	at org.apache.lucene.util.TestRuleAssertionsRequired$1.evaluate(TestRuleAssertionsRequired.java:53)
	at org.apache.lucene.util.TestRuleMarkFailure$1.evaluate(TestRuleMarkFailure.java:47)
	at org.apache.lucene.util.TestRuleIgnoreAfterMaxFailures$1.evaluate(TestRuleIgnoreAfterMaxFailures.java:64)
	at org.apache.lucene.util.TestRuleIgnoreTestSuites$1.evaluate(TestRuleIgnoreTestSuites.java:54)
	at com.carrotsearch.randomizedtesting.rules.StatementAdapter.evaluate(StatementAdapter.java:36)
	at com.carrotsearch.randomizedtesting.ThreadLeakControl$StatementRunner.run(ThreadLeakControl.java:368)
	at java.base/java.lang.Thread.run(Thread.java:844)


FAILED:  org.apache.solr.cloud.LeaderTragicEventTest.testOtherReplicasAreNotActive

Error Message:
Jetty Connector is not open: -2

Stack Trace:
java.lang.IllegalStateException: Jetty Connector is not open: -2
	at __randomizedtesting.SeedInfo.seed([775803901D4DCD66:F2EC2FE721B274FE]:0)
	at org.apache.solr.client.solrj.embedded.JettySolrRunner.getBaseUrl(JettySolrRunner.java:499)
	at org.apache.solr.cloud.MiniSolrCloudCluster.getReplicaJetty(MiniSolrCloudCluster.java:539)
	at org.apache.solr.cloud.LeaderTragicEventTest.corruptLeader(LeaderTragicEventTest.java:100)
	at org.apache.solr.cloud.LeaderTragicEventTest.testOtherReplicasAreNotActive(LeaderTragicEventTest.java:150)
	at java.base/jdk.internal.reflect.NativeMethodAccessorImpl.invoke0(Native Method)
	at java.base/jdk.internal.reflect.NativeMethodAccessorImpl.invoke(NativeMethodAccessorImpl.java:62)
	at java.base/jdk.internal.reflect.DelegatingMethodAccessorImpl.invoke(DelegatingMethodAccessorImpl.java:43)
	at java.base/java.lang.reflect.Method.invoke(Method.java:564)
	at com.carrotsearch.randomizedtesting.RandomizedRunner.invoke(RandomizedRunner.java:1737)
	at com.carrotsearch.randomizedtesting.RandomizedRunner$8.evaluate(RandomizedRunner.java:934)
	at com.carrotsearch.randomizedtesting.RandomizedRunner$9.evaluate(RandomizedRunner.java:970)
	at com.carrotsearch.randomizedtesting.RandomizedRunner$10.evaluate(RandomizedRunner.java:984)
	at com.carrotsearch.randomizedtesting.rules.SystemPropertiesRestoreRule$1.evaluate(SystemPropertiesRestoreRule.java:57)
	at org.apache.lucene.util.TestRuleSetupTeardownChained$1.evaluate(TestRuleSetupTeardownChained.java:49)
	at org.apache.lucene.util.AbstractBeforeAfterRule$1.evaluate(AbstractBeforeAfterRule.java:45)
	at org.apache.lucene.util.TestRuleThreadAndTestName$1.evaluate(TestRuleThreadAndTestName.java:48)
	at org.apache.lucene.util.TestRuleIgnoreAfterMaxFailures$1.evaluate(TestRuleIgnoreAfterMaxFailures.java:64)
	at org.apache.lucene.util.TestRuleMarkFailure$1.evaluate(TestRuleMarkFailure.java:47)
	at com.carrotsearch.randomizedtesting.rules.StatementAdapter.evaluate(StatementAdapter.java:36)
	at com.carrotsearch.randomizedtesting.ThreadLeakControl$StatementRunner.run(ThreadLeakControl.java:368)
	at com.carrotsearch.randomizedtesting.ThreadLeakControl.forkTimeoutingTask(ThreadLeakControl.java:817)
	at com.carrotsearch.randomizedtesting.ThreadLeakControl$3.evaluate(ThreadLeakControl.java:468)
	at com.carrotsearch.randomizedtesting.RandomizedRunner.runSingleTest(RandomizedRunner.java:943)
	at com.carrotsearch.randomizedtesting.RandomizedRunner$5.evaluate(RandomizedRunner.java:829)
	at com.carrotsearch.randomizedtesting.RandomizedRunner$6.evaluate(RandomizedRunner.java:879)
	at com.carrotsearch.randomizedtesting.RandomizedRunner$7.evaluate(RandomizedRunner.java:890)
	at com.carrotsearch.randomizedtesting.rules.StatementAdapter.evaluate(StatementAdapter.java:36)
	at com.carrotsearch.randomizedtesting.rules.SystemPropertiesRestoreRule$1.evaluate(SystemPropertiesRestoreRule.java:57)
	at org.apache.lucene.util.AbstractBeforeAfterRule$1.evaluate(AbstractBeforeAfterRule.java:45)
	at com.carrotsearch.randomizedtesting.rules.StatementAdapter.evaluate(StatementAdapter.java:36)
	at org.apache.lucene.util.TestRuleStoreClassName$1.evaluate(TestRuleStoreClassName.java:41)
	at com.carrotsearch.randomizedtesting.rules.NoShadowingOrOverridesOnMethodsRule$1.evaluate(NoShadowingOrOverridesOnMethodsRule.java:40)
	at com.carrotsearch.randomizedtesting.rules.NoShadowingOrOverridesOnMethodsRule$1.evaluate(NoShadowingOrOverridesOnMethodsRule.java:40)
	at com.carrotsearch.randomizedtesting.rules.StatementAdapter.evaluate(StatementAdapter.java:36)
	at com.carrotsearch.randomizedtesting.rules.StatementAdapter.evaluate(StatementAdapter.java:36)
	at org.apache.lucene.util.TestRuleAssertionsRequired$1.evaluate(TestRuleAssertionsRequired.java:53)
	at org.apache.lucene.util.TestRuleMarkFailure$1.evaluate(TestRuleMarkFailure.java:47)
	at org.apache.lucene.util.TestRuleIgnoreAfterMaxFailures$1.evaluate(TestRuleIgnoreAfterMaxFailures.java:64)
	at org.apache.lucene.util.TestRuleIgnoreTestSuites$1.evaluate(TestRuleIgnoreTestSuites.java:54)
	at com.carrotsearch.randomizedtesting.rules.StatementAdapter.evaluate(StatementAdapter.java:36)
	at com.carrotsearch.randomizedtesting.ThreadLeakControl$StatementRunner.run(ThreadLeakControl.java:368)
	at java.base/java.lang.Thread.run(Thread.java:844)


FAILED:  org.apache.solr.cloud.LeaderTragicEventTest.test

Error Message:
Error from server at https://127.0.0.1:54592/solr: collection already exists: collection1

Stack Trace:
org.apache.solr.client.solrj.impl.HttpSolrClient$RemoteSolrException: Error from server at https://127.0.0.1:54592/solr: collection already exists: collection1
	at __randomizedtesting.SeedInfo.seed([775803901D4DCD66:FF0C3C4AB3B1A09E]:0)
	at org.apache.solr.client.solrj.impl.HttpSolrClient.executeMethod(HttpSolrClient.java:643)
	at org.apache.solr.client.solrj.impl.HttpSolrClient.request(HttpSolrClient.java:255)
	at org.apache.solr.client.solrj.impl.HttpSolrClient.request(HttpSolrClient.java:244)
	at org.apache.solr.client.solrj.impl.LBHttpSolrClient.doRequest(LBHttpSolrClient.java:483)
	at org.apache.solr.client.solrj.impl.LBHttpSolrClient.request(LBHttpSolrClient.java:413)
	at org.apache.solr.client.solrj.impl.CloudSolrClient.sendRequest(CloudSolrClient.java:1106)
	at org.apache.solr.client.solrj.impl.CloudSolrClient.requestWithRetryOnStaleState(CloudSolrClient.java:886)
	at org.apache.solr.client.solrj.impl.CloudSolrClient.request(CloudSolrClient.java:819)
	at org.apache.solr.client.solrj.SolrRequest.process(SolrRequest.java:194)
	at org.apache.solr.client.solrj.SolrRequest.process(SolrRequest.java:211)
	at org.apache.solr.cloud.LeaderTragicEventTest.test(LeaderTragicEventTest.java:70)
	at java.base/jdk.internal.reflect.NativeMethodAccessorImpl.invoke0(Native Method)
	at java.base/jdk.internal.reflect.NativeMethodAccessorImpl.invoke(NativeMethodAccessorImpl.java:62)
	at java.base/jdk.internal.reflect.DelegatingMethodAccessorImpl.invoke(DelegatingMethodAccessorImpl.java:43)
	at java.base/java.lang.reflect.Method.invoke(Method.java:564)
	at com.carrotsearch.randomizedtesting.RandomizedRunner.invoke(RandomizedRunner.java:1737)
	at com.carrotsearch.randomizedtesting.RandomizedRunner$8.evaluate(RandomizedRunner.java:934)
	at com.carrotsearch.randomizedtesting.RandomizedRunner$9.evaluate(RandomizedRunner.java:970)
	at com.carrotsearch.randomizedtesting.RandomizedRunner$10.evaluate(RandomizedRunner.java:984)
	at com.carrotsearch.randomizedtesting.rules.SystemPropertiesRestoreRule$1.evaluate(SystemPropertiesRestoreRule.java:57)
	at org.apache.lucene.util.TestRuleSetupTeardownChained$1.evaluate(TestRuleSetupTeardownChained.java:49)
	at org.apache.lucene.util.AbstractBeforeAfterRule$1.evaluate(AbstractBeforeAfterRule.java:45)
	at org.apache.lucene.util.TestRuleThreadAndTestName$1.evaluate(TestRuleThreadAndTestName.java:48)
	at org.apache.lucene.util.TestRuleIgnoreAfterMaxFailures$1.evaluate(TestRuleIgnoreAfterMaxFailures.java:64)
	at org.apache.lucene.util.TestRuleMarkFailure$1.evaluate(TestRuleMarkFailure.java:47)
	at com.carrotsearch.randomizedtesting.rules.StatementAdapter.evaluate(StatementAdapter.java:36)
	at com.carrotsearch.randomizedtesting.ThreadLeakControl$StatementRunner.run(ThreadLeakControl.java:368)
	at com.carrotsearch.randomizedtesting.ThreadLeakControl.forkTimeoutingTask(ThreadLeakControl.java:817)
	at com.carrotsearch.randomizedtesting.ThreadLeakControl$3.evaluate(ThreadLeakControl.java:468)
	at com.carrotsearch.randomizedtesting.RandomizedRunner.runSingleTest(RandomizedRunner.java:943)
	at com.carrotsearch.randomizedtesting.RandomizedRunner$5.evaluate(RandomizedRunner.java:829)
	at com.carrotsearch.randomizedtesting.RandomizedRunner$6.evaluate(RandomizedRunner.java:879)
	at com.carrotsearch.randomizedtesting.RandomizedRunner$7.evaluate(RandomizedRunner.java:890)
	at com.carrotsearch.randomizedtesting.rules.StatementAdapter.evaluate(StatementAdapter.java:36)
	at com.carrotsearch.randomizedtesting.rules.SystemPropertiesRestoreRule$1.evaluate(SystemPropertiesRestoreRule.java:57)
	at org.apache.lucene.util.AbstractBeforeAfterRule$1.evaluate(AbstractBeforeAfterRule.java:45)
	at com.carrotsearch.randomizedtesting.rules.StatementAdapter.evaluate(StatementAdapter.java:36)
	at org.apache.lucene.util.TestRuleStoreClassName$1.evaluate(TestRuleStoreClassName.java:41)
	at com.carrotsearch.randomizedtesting.rules.NoShadowingOrOverridesOnMethodsRule$1.evaluate(NoShadowingOrOverridesOnMethodsRule.java:40)
	at com.carrotsearch.randomizedtesting.rules.NoShadowingOrOverridesOnMethodsRule$1.evaluate(NoShadowingOrOverridesOnMethodsRule.java:40)
	at com.carrotsearch.randomizedtesting.rules.StatementAdapter.evaluate(StatementAdapter.java:36)
	at com.carrotsearch.randomizedtesting.rules.StatementAdapter.evaluate(StatementAdapter.java:36)
	at org.apache.lucene.util.TestRuleAssertionsRequired$1.evaluate(TestRuleAssertionsRequired.java:53)
	at org.apache.lucene.util.TestRuleMarkFailure$1.evaluate(TestRuleMarkFailure.java:47)
	at org.apache.lucene.util.TestRuleIgnoreAfterMaxFailures$1.evaluate(TestRuleIgnoreAfterMaxFailures.java:64)
	at org.apache.lucene.util.TestRuleIgnoreTestSuites$1.evaluate(TestRuleIgnoreTestSuites.java:54)
	at com.carrotsearch.randomizedtesting.rules.StatementAdapter.evaluate(StatementAdapter.java:36)
	at com.carrotsearch.randomizedtesting.ThreadLeakControl$StatementRunner.run(ThreadLeakControl.java:368)
	at java.base/java.lang.Thread.run(Thread.java:844)


FAILED:  org.apache.solr.cloud.LeaderTragicEventTest.test

Error Message:
Timeout waiting for new replica become leader null Live Nodes: [127.0.0.1:59506_solr, 127.0.0.1:59507_solr] Last available state: DocCollection(collection1//collections/collection1/state.json/5)={   "pullReplicas":"0",   "replicationFactor":"2",   "shards":{"shard1":{       "range":"80000000-7fffffff",       "state":"active",       "replicas":{         "core_node3":{           "core":"collection1_shard1_replica_n1",           "base_url":"https://127.0.0.1:59507/solr",           "node_name":"127.0.0.1:59507_solr",           "state":"active",           "type":"NRT",           "force_set_state":"false",           "leader":"true"},         "core_node4":{           "core":"collection1_shard1_replica_n2",           "base_url":"https://127.0.0.1:59506/solr",           "node_name":"127.0.0.1:59506_solr",           "state":"active",           "type":"NRT",           "force_set_state":"false"}}}},   "router":{"name":"compositeId"},   "maxShardsPerNode":"1",   "autoAddReplicas":"false",   "nrtReplicas":"2",   "tlogReplicas":"0"}

Stack Trace:
java.lang.AssertionError: Timeout waiting for new replica become leader
null
Live Nodes: [127.0.0.1:59506_solr, 127.0.0.1:59507_solr]
Last available state: DocCollection(collection1//collections/collection1/state.json/5)={
  "pullReplicas":"0",
  "replicationFactor":"2",
  "shards":{"shard1":{
      "range":"80000000-7fffffff",
      "state":"active",
      "replicas":{
        "core_node3":{
          "core":"collection1_shard1_replica_n1",
          "base_url":"https://127.0.0.1:59507/solr",
          "node_name":"127.0.0.1:59507_solr",
          "state":"active",
          "type":"NRT",
          "force_set_state":"false",
          "leader":"true"},
        "core_node4":{
          "core":"collection1_shard1_replica_n2",
          "base_url":"https://127.0.0.1:59506/solr",
          "node_name":"127.0.0.1:59506_solr",
          "state":"active",
          "type":"NRT",
          "force_set_state":"false"}}}},
  "router":{"name":"compositeId"},
  "maxShardsPerNode":"1",
  "autoAddReplicas":"false",
  "nrtReplicas":"2",
  "tlogReplicas":"0"}
	at __randomizedtesting.SeedInfo.seed([775803901D4DCD66:FF0C3C4AB3B1A09E]:0)
	at org.junit.Assert.fail(Assert.java:93)
	at org.apache.solr.cloud.SolrCloudTestCase.waitForState(SolrCloudTestCase.java:278)
	at org.apache.solr.cloud.LeaderTragicEventTest.test(LeaderTragicEventTest.java:76)
	at java.base/jdk.internal.reflect.NativeMethodAccessorImpl.invoke0(Native Method)
	at java.base/jdk.internal.reflect.NativeMethodAccessorImpl.invoke(NativeMethodAccessorImpl.java:62)
	at java.base/jdk.internal.reflect.DelegatingMethodAccessorImpl.invoke(DelegatingMethodAccessorImpl.java:43)
	at java.base/java.lang.reflect.Method.invoke(Method.java:564)
	at com.carrotsearch.randomizedtesting.RandomizedRunner.invoke(RandomizedRunner.java:1737)
	at com.carrotsearch.randomizedtesting.RandomizedRunner$8.evaluate(RandomizedRunner.java:934)
	at com.carrotsearch.randomizedtesting.RandomizedRunner$9.evaluate(RandomizedRunner.java:970)
	at com.carrotsearch.randomizedtesting.RandomizedRunner$10.evaluate(RandomizedRunner.java:984)
	at com.carrotsearch.randomizedtesting.rules.SystemPropertiesRestoreRule$1.evaluate(SystemPropertiesRestoreRule.java:57)
	at org.apache.lucene.util.TestRuleSetupTeardownChained$1.evaluate(TestRuleSetupTeardownChained.java:49)
	at org.apache.lucene.util.AbstractBeforeAfterRule$1.evaluate(AbstractBeforeAfterRule.java:45)
	at org.apache.lucene.util.TestRuleThreadAndTestName$1.evaluate(TestRuleThreadAndTestName.java:48)
	at org.apache.lucene.util.TestRuleIgnoreAfterMaxFailures$1.evaluate(TestRuleIgnoreAfterMaxFailures.java:64)
	at org.apache.lucene.util.TestRuleMarkFailure$1.evaluate(TestRuleMarkFailure.java:47)
	at com.carrotsearch.randomizedtesting.rules.StatementAdapter.evaluate(StatementAdapter.java:36)
	at com.carrotsearch.randomizedtesting.ThreadLeakControl$StatementRunner.run(ThreadLeakControl.java:368)
	at com.carrotsearch.randomizedtesting.ThreadLeakControl.forkTimeoutingTask(ThreadLeakControl.java:817)
	at com.carrotsearch.randomizedtesting.ThreadLeakControl$3.evaluate(ThreadLeakControl.java:468)
	at com.carrotsearch.randomizedtesting.RandomizedRunner.runSingleTest(RandomizedRunner.java:943)
	at com.carrotsearch.randomizedtesting.RandomizedRunner$5.evaluate(RandomizedRunner.java:829)
	at com.carrotsearch.randomizedtesting.RandomizedRunner$6.evaluate(RandomizedRunner.java:879)
	at com.carrotsearch.randomizedtesting.RandomizedRunner$7.evaluate(RandomizedRunner.java:890)
	at com.carrotsearch.randomizedtesting.rules.StatementAdapter.evaluate(StatementAdapter.java:36)
	at com.carrotsearch.randomizedtesting.rules.SystemPropertiesRestoreRule$1.evaluate(SystemPropertiesRestoreRule.java:57)
	at org.apache.lucene.util.AbstractBeforeAfterRule$1.evaluate(AbstractBeforeAfterRule.java:45)
	at com.carrotsearch.randomizedtesting.rules.StatementAdapter.evaluate(StatementAdapter.java:36)
	at org.apache.lucene.util.TestRuleStoreClassName$1.evaluate(TestRuleStoreClassName.java:41)
	at com.carrotsearch.randomizedtesting.rules.NoShadowingOrOverridesOnMethodsRule$1.evaluate(NoShadowingOrOverridesOnMethodsRule.java:40)
	at com.carrotsearch.randomizedtesting.rules.NoShadowingOrOverridesOnMethodsRule$1.evaluate(NoShadowingOrOverridesOnMethodsRule.java:40)
	at com.carrotsearch.randomizedtesting.rules.StatementAdapter.evaluate(StatementAdapter.java:36)
	at com.carrotsearch.randomizedtesting.rules.StatementAdapter.evaluate(StatementAdapter.java:36)
	at org.apache.lucene.util.TestRuleAssertionsRequired$1.evaluate(TestRuleAssertionsRequired.java:53)
	at org.apache.lucene.util.TestRuleMarkFailure$1.evaluate(TestRuleMarkFailure.java:47)
	at org.apache.lucene.util.TestRuleIgnoreAfterMaxFailures$1.evaluate(TestRuleIgnoreAfterMaxFailures.java:64)
	at org.apache.lucene.util.TestRuleIgnoreTestSuites$1.evaluate(TestRuleIgnoreTestSuites.java:54)
	at com.carrotsearch.randomizedtesting.rules.StatementAdapter.evaluate(StatementAdapter.java:36)
	at com.carrotsearch.randomizedtesting.ThreadLeakControl$StatementRunner.run(ThreadLeakControl.java:368)
	at java.base/java.lang.Thread.run(Thread.java:844)




Build Log:
[...truncated 13245 lines...]
   [junit4] Suite: org.apache.solr.cloud.LeaderTragicEventTest
   [junit4]   2> 1237252 INFO  (SUITE-LeaderTragicEventTest-seed#[775803901D4DCD66]-worker) [    ] o.a.s.SolrTestCaseJ4 SecureRandom sanity checks: test.solr.allowed.securerandom=null & java.security.egd=file:/dev/./urandom
   [junit4]   2> Creating dataDir: C:\Users\jenkins\workspace\Lucene-Solr-7.x-Windows\solr\build\solr-core\test\J0\temp\solr.cloud.LeaderTragicEventTest_775803901D4DCD66-001\init-core-data-001
   [junit4]   2> 1237254 WARN  (SUITE-LeaderTragicEventTest-seed#[775803901D4DCD66]-worker) [    ] o.a.s.SolrTestCaseJ4 startTrackingSearchers: numOpens=1 numCloses=1
   [junit4]   2> 1237254 INFO  (SUITE-LeaderTragicEventTest-seed#[775803901D4DCD66]-worker) [    ] o.a.s.SolrTestCaseJ4 Using PointFields (NUMERIC_POINTS_SYSPROP=true) w/NUMERIC_DOCVALUES_SYSPROP=true
   [junit4]   2> 1237255 INFO  (SUITE-LeaderTragicEventTest-seed#[775803901D4DCD66]-worker) [    ] o.a.s.SolrTestCaseJ4 Randomized ssl (true) and clientAuth (false) via: @org.apache.solr.util.RandomizeSSL(reason="", value=0.0/0.0, ssl=0.0/0.0, clientAuth=0.0/0.0)
   [junit4]   2> 1237256 INFO  (SUITE-LeaderTragicEventTest-seed#[775803901D4DCD66]-worker) [    ] o.a.s.c.MiniSolrCloudCluster Starting cluster of 2 servers in C:\Users\jenkins\workspace\Lucene-Solr-7.x-Windows\solr\build\solr-core\test\J0\temp\solr.cloud.LeaderTragicEventTest_775803901D4DCD66-001\tempDir-001
   [junit4]   2> 1237258 INFO  (SUITE-LeaderTragicEventTest-seed#[775803901D4DCD66]-worker) [    ] o.a.s.c.ZkTestServer STARTING ZK TEST SERVER
   [junit4]   2> 1237258 INFO  (Thread-2314) [    ] o.a.s.c.ZkTestServer client port:0.0.0.0/0.0.0.0:0
   [junit4]   2> 1237258 INFO  (Thread-2314) [    ] o.a.s.c.ZkTestServer Starting server
   [junit4]   2> 1237263 ERROR (Thread-2314) [    ] o.a.z.s.ZooKeeperServer ZKShutdownHandler is not registered, so ZooKeeper server won't take any action on ERROR or SHUTDOWN server state changes
   [junit4]   2> 1237358 INFO  (SUITE-LeaderTragicEventTest-seed#[775803901D4DCD66]-worker) [    ] o.a.s.c.ZkTestServer start zk server on port:59497
   [junit4]   2> 1237362 INFO  (zkConnectionManagerCallback-5813-thread-1) [    ] o.a.s.c.c.ConnectionManager zkClient has connected
   [junit4]   2> 1237370 INFO  (jetty-launcher-5810-thread-2) [    ] o.e.j.s.Server jetty-9.4.11.v20180605; built: 2018-06-05T18:24:03.829Z; git: d5fc0523cfa96bfebfbda19606cad384d772f04c; jvm 9.0.4+11
   [junit4]   2> 1237370 INFO  (jetty-launcher-5810-thread-1) [    ] o.e.j.s.Server jetty-9.4.11.v20180605; built: 2018-06-05T18:24:03.829Z; git: d5fc0523cfa96bfebfbda19606cad384d772f04c; jvm 9.0.4+11
   [junit4]   2> 1237371 INFO  (jetty-launcher-5810-thread-1) [    ] o.e.j.s.session DefaultSessionIdManager workerName=node0
   [junit4]   2> 1237371 INFO  (jetty-launcher-5810-thread-1) [    ] o.e.j.s.session No SessionScavenger set, using defaults
   [junit4]   2> 1237371 INFO  (jetty-launcher-5810-thread-1) [    ] o.e.j.s.session node0 Scavenging every 600000ms
   [junit4]   2> 1237371 INFO  (jetty-launcher-5810-thread-1) [    ] o.e.j.s.h.ContextHandler Started o.e.j.s.ServletContextHandler@5e1d5c56{/solr,null,AVAILABLE}
   [junit4]   2> 1237371 INFO  (jetty-launcher-5810-thread-2) [    ] o.e.j.s.session DefaultSessionIdManager workerName=node0
   [junit4]   2> 1237371 INFO  (jetty-launcher-5810-thread-2) [    ] o.e.j.s.session No SessionScavenger set, using defaults
   [junit4]   2> 1237371 INFO  (jetty-launcher-5810-thread-2) [    ] o.e.j.s.session node0 Scavenging every 600000ms
   [junit4]   2> 1237371 INFO  (jetty-launcher-5810-thread-2) [    ] o.e.j.s.h.ContextHandler Started o.e.j.s.ServletContextHandler@4c30fcef{/solr,null,AVAILABLE}
   [junit4]   2> 1237374 INFO  (jetty-launcher-5810-thread-1) [    ] o.e.j.s.AbstractConnector Started ServerConnector@33a18b73{SSL,[ssl, http/1.1]}{127.0.0.1:59506}
   [junit4]   2> 1237375 INFO  (jetty-launcher-5810-thread-1) [    ] o.e.j.s.Server Started @1237416ms
   [junit4]   2> 1237375 INFO  (jetty-launcher-5810-thread-2) [    ] o.e.j.s.AbstractConnector Started ServerConnector@61f14216{SSL,[ssl, http/1.1]}{127.0.0.1:59507}
   [junit4]   2> 1237375 INFO  (jetty-launcher-5810-thread-1) [    ] o.a.s.c.s.e.JettySolrRunner Jetty properties: {hostContext=/solr, hostPort=59506}
   [junit4]   2> 1237375 INFO  (jetty-launcher-5810-thread-2) [    ] o.e.j.s.Server Started @1237416ms
   [junit4]   2> 1237375 INFO  (jetty-launcher-5810-thread-2) [    ] o.a.s.c.s.e.JettySolrRunner Jetty properties: {hostContext=/solr, hostPort=59507}
   [junit4]   2> 1237375 ERROR (jetty-launcher-5810-thread-2) [    ] o.a.s.u.StartupLoggingUtils Missing Java Option solr.log.dir. Logging may be missing or incomplete.
   [junit4]   2> 1237375 ERROR (jetty-launcher-5810-thread-1) [    ] o.a.s.u.StartupLoggingUtils Missing Java Option solr.log.dir. Logging may be missing or incomplete.
   [junit4]   2> 1237375 INFO  (jetty-launcher-5810-thread-2) [    ] o.a.s.s.SolrDispatchFilter Using logger factory org.apache.logging.slf4j.Log4jLoggerFactory
   [junit4]   2> 1237375 INFO  (jetty-launcher-5810-thread-1) [    ] o.a.s.s.SolrDispatchFilter Using logger factory org.apache.logging.slf4j.Log4jLoggerFactory
   [junit4]   2> 1237375 INFO  (jetty-launcher-5810-thread-2) [    ] o.a.s.s.SolrDispatchFilter  ___      _       Welcome to Apache Solr™ version 7.5.0
   [junit4]   2> 1237375 INFO  (jetty-launcher-5810-thread-1) [    ] o.a.s.s.SolrDispatchFilter  ___      _       Welcome to Apache Solr™ version 7.5.0
   [junit4]   2> 1237375 INFO  (jetty-launcher-5810-thread-2) [    ] o.a.s.s.SolrDispatchFilter / __| ___| |_ _   Starting in cloud mode on port null
   [junit4]   2> 1237375 INFO  (jetty-launcher-5810-thread-1) [    ] o.a.s.s.SolrDispatchFilter / __| ___| |_ _   Starting in cloud mode on port null
   [junit4]   2> 1237375 INFO  (jetty-launcher-5810-thread-2) [    ] o.a.s.s.SolrDispatchFilter \__ \/ _ \ | '_|  Install dir: null
   [junit4]   2> 1237375 INFO  (jetty-launcher-5810-thread-1) [    ] o.a.s.s.SolrDispatchFilter \__ \/ _ \ | '_|  Install dir: null
   [junit4]   2> 1237375 INFO  (jetty-launcher-5810-thread-1) [    ] o.a.s.s.SolrDispatchFilter |___/\___/_|_|    Start time: 2018-07-13T04:38:12.115695900Z
   [junit4]   2> 1237375 INFO  (jetty-launcher-5810-thread-2) [    ] o.a.s.s.SolrDispatchFilter |___/\___/_|_|    Start time: 2018-07-13T04:38:12.115695900Z
   [junit4]   2> 1237378 INFO  (zkConnectionManagerCallback-5816-thread-1) [    ] o.a.s.c.c.ConnectionManager zkClient has connected
   [junit4]   2> 1237378 INFO  (zkConnectionManagerCallback-5817-thread-1) [    ] o.a.s.c.c.ConnectionManager zkClient has connected
   [junit4]   2> 1237378 INFO  (jetty-launcher-5810-thread-2) [    ] o.a.s.s.SolrDispatchFilter solr.xml found in ZooKeeper. Loading...
   [junit4]   2> 1237378 INFO  (jetty-launcher-5810-thread-1) [    ] o.a.s.s.SolrDispatchFilter solr.xml found in ZooKeeper. Loading...
   [junit4]   2> 1237384 WARN  (NIOServerCxn.Factory:0.0.0.0/0.0.0.0:0) [    ] o.a.z.s.NIOServerCnxn Unable to read additional data from client sessionid 0x1000be920bf0001, likely client has closed socket
   [junit4]   2> 1237574 INFO  (jetty-launcher-5810-thread-2) [    ] o.a.s.c.ZkContainer Zookeeper client=127.0.0.1:59497/solr
   [junit4]   2> 1237577 INFO  (zkConnectionManagerCallback-5821-thread-1) [    ] o.a.s.c.c.ConnectionManager zkClient has connected
   [junit4]   2> 1237580 INFO  (zkConnectionManagerCallback-5823-thread-1) [    ] o.a.s.c.c.ConnectionManager zkClient has connected
   [junit4]   2> 1237634 INFO  (jetty-launcher-5810-thread-1) [    ] o.a.s.c.ZkContainer Zookeeper client=127.0.0.1:59497/solr
   [junit4]   2> 1237636 INFO  (zkConnectionManagerCallback-5829-thread-1) [    ] o.a.s.c.c.ConnectionManager zkClient has connected
   [junit4]   2> 1237638 INFO  (zkConnectionManagerCallback-5831-thread-1) [    ] o.a.s.c.c.ConnectionManager zkClient has connected
   [junit4]   2> 1237647 INFO  (jetty-launcher-5810-thread-1) [n:127.0.0.1:59506_solr    ] o.a.s.c.Overseer Overseer (id=null) closing
   [junit4]   2> 1237647 INFO  (jetty-launcher-5810-thread-1) [n:127.0.0.1:59506_solr    ] o.a.s.c.OverseerElectionContext I am going to be the leader 127.0.0.1:59506_solr
   [junit4]   2> 1237648 INFO  (jetty-launcher-5810-thread-1) [n:127.0.0.1:59506_solr    ] o.a.s.c.Overseer Overseer (id=72070689942601734-127.0.0.1:59506_solr-n_0000000000) starting
   [junit4]   2> 1237657 INFO  (zkConnectionManagerCallback-5838-thread-1) [    ] o.a.s.c.c.ConnectionManager zkClient has connected
   [junit4]   2> 1237658 INFO  (jetty-launcher-5810-thread-1) [n:127.0.0.1:59506_solr    ] o.a.s.c.s.i.ZkClientClusterStateProvider Cluster at 127.0.0.1:59497/solr ready
   [junit4]   2> 1237659 INFO  (jetty-launcher-5810-thread-1) [n:127.0.0.1:59506_solr    ] o.a.s.c.ZkController Register node as live in ZooKeeper:/live_nodes/127.0.0.1:59506_solr
   [junit4]   2> 1237661 INFO  (OverseerStateUpdate-72070689942601734-127.0.0.1:59506_solr-n_0000000000) [    ] o.a.s.c.c.ZkStateReader Updated live nodes from ZooKeeper... (0) -> (1)
   [junit4]   2> 1237668 INFO  (zkCallback-5837-thread-1) [    ] o.a.s.c.c.ZkStateReader Updated live nodes from ZooKeeper... (0) -> (1)
   [junit4]   2> 1237682 INFO  (jetty-launcher-5810-thread-2) [n:127.0.0.1:59507_solr    ] o.a.s.c.c.ZkStateReader Updated live nodes from ZooKeeper... (0) -> (1)
   [junit4]   2> 1237685 INFO  (jetty-launcher-5810-thread-2) [n:127.0.0.1:59507_solr    ] o.a.s.c.Overseer Overseer (id=null) closing
   [junit4]   2> 1237686 INFO  (jetty-launcher-5810-thread-2) [n:127.0.0.1:59507_solr    ] o.a.s.c.TransientSolrCoreCacheDefault Allocating transient cache for 2147483647 transient cores
   [junit4]   2> 1237686 INFO  (jetty-launcher-5810-thread-2) [n:127.0.0.1:59507_solr    ] o.a.s.c.ZkController Register node as live in ZooKeeper:/live_nodes/127.0.0.1:59507_solr
   [junit4]   2> 1237698 INFO  (zkCallback-5822-thread-1) [    ] o.a.s.c.c.ZkStateReader Updated live nodes from ZooKeeper... (1) -> (2)
   [junit4]   2> 1237698 INFO  (zkCallback-5837-thread-1) [    ] o.a.s.c.c.ZkStateReader Updated live nodes from ZooKeeper... (1) -> (2)
   [junit4]   2> 1237698 INFO  (zkCallback-5830-thread-1) [    ] o.a.s.c.c.ZkStateReader Updated live nodes from ZooKeeper... (1) -> (2)
   [junit4]   2> 1237699 INFO  (jetty-launcher-5810-thread-1) [n:127.0.0.1:59506_solr    ] o.a.s.h.a.MetricsHistoryHandler No .system collection, keeping metrics history in memory.
   [junit4]   2> 1237714 INFO  (jetty-launcher-5810-thread-1) [n:127.0.0.1:59506_solr    ] o.a.s.m.r.SolrJmxReporter JMX monitoring for 'solr_59506.solr.node' (registry 'solr.node') enabled at server: com.sun.jmx.mbeanserver.JmxMBeanServer@5eb4865a
   [junit4]   2> 1237717 INFO  (zkConnectionManagerCallback-5844-thread-1) [    ] o.a.s.c.c.ConnectionManager zkClient has connected
   [junit4]   2> 1237718 INFO  (jetty-launcher-5810-thread-2) [n:127.0.0.1:59507_solr    ] o.a.s.c.c.ZkStateReader Updated live nodes from ZooKeeper... (0) -> (2)
   [junit4]   2> 1237719 INFO  (jetty-launcher-5810-thread-2) [n:127.0.0.1:59507_solr    ] o.a.s.c.s.i.ZkClientClusterStateProvider Cluster at 127.0.0.1:59497/solr ready
   [junit4]   2> 1237719 INFO  (jetty-launcher-5810-thread-2) [n:127.0.0.1:59507_solr    ] o.a.s.h.a.MetricsHistoryHandler No .system collection, keeping metrics history in memory.
   [junit4]   2> 1237722 INFO  (jetty-launcher-5810-thread-1) [n:127.0.0.1:59506_solr    ] o.a.s.m.r.SolrJmxReporter JMX monitoring for 'solr_59506.solr.jvm' (registry 'solr.jvm') enabled at server: com.sun.jmx.mbeanserver.JmxMBeanServer@5eb4865a
   [junit4]   2> 1237722 INFO  (jetty-launcher-5810-thread-1) [n:127.0.0.1:59506_solr    ] o.a.s.m.r.SolrJmxReporter JMX monitoring for 'solr_59506.solr.jetty' (registry 'solr.jetty') enabled at server: com.sun.jmx.mbeanserver.JmxMBeanServer@5eb4865a
   [junit4]   2> 1237723 INFO  (jetty-launcher-5810-thread-1) [n:127.0.0.1:59506_solr    ] o.a.s.c.CorePropertiesLocator Found 0 core definitions underneath C:\Users\jenkins\workspace\Lucene-Solr-7.x-Windows\solr\build\solr-core\test\J0\temp\solr.cloud.LeaderTragicEventTest_775803901D4DCD66-001\tempDir-001\node1\.
   [junit4]   2> 1237731 INFO  (jetty-launcher-5810-thread-2) [n:127.0.0.1:59507_solr    ] o.a.s.m.r.SolrJmxReporter JMX monitoring for 'solr_59507.solr.node' (registry 'solr.node') enabled at server: com.sun.jmx.mbeanserver.JmxMBeanServer@5eb4865a
   [junit4]   2> 1237737 INFO  (jetty-launcher-5810-thread-2) [n:127.0.0.1:59507_solr    ] o.a.s.m.r.SolrJmxReporter JMX monitoring for 'solr_59507.solr.jvm' (registry 'solr.jvm') enabled at server: com.sun.jmx.mbeanserver.JmxMBeanServer@5eb4865a
   [junit4]   2> 1237737 INFO  (jetty-launcher-5810-thread-2) [n:127.0.0.1:59507_solr    ] o.a.s.m.r.SolrJmxReporter JMX monitoring for 'solr_59507.solr.jetty' (registry 'solr.jetty') enabled at server: com.sun.jmx.mbeanserver.JmxMBeanServer@5eb4865a
   [junit4]   2> 1237738 INFO  (jetty-launcher-5810-thread-2) [n:127.0.0.1:59507_solr    ] o.a.s.c.CorePropertiesLocator Found 0 core definitions underneath C:\Users\jenkins\workspace\Lucene-Solr-7.x-Windows\solr\build\solr-core\test\J0\temp\solr.cloud.LeaderTragicEventTest_775803901D4DCD66-001\tempDir-001\node2\.
   [junit4]   2> 1237772 INFO  (zkConnectionManagerCallback-5847-thread-1) [    ] o.a.s.c.c.ConnectionManager zkClient has connected
   [junit4]   2> 1237782 INFO  (zkConnectionManagerCallback-5852-thread-1) [    ] o.a.s.c.c.ConnectionManager zkClient has connected
   [junit4]   2> 1237784 INFO  (SUITE-LeaderTragicEventTest-seed#[775803901D4DCD66]-worker) [    ] o.a.s.c.c.ZkStateReader Updated live nodes from ZooKeeper... (0) -> (2)
   [junit4]   2> 1237785 INFO  (SUITE-LeaderTragicEventTest-seed#[775803901D4DCD66]-worker) [    ] o.a.s.c.s.i.ZkClientClusterStateProvider Cluster at 127.0.0.1:59497/solr ready
   [junit4]   2> 1237807 INFO  (TEST-LeaderTragicEventTest.testOtherReplicasAreNotActive-seed#[775803901D4DCD66]) [    ] o.a.s.SolrTestCaseJ4 ###Starting testOtherReplicasAreNotActive
   [junit4]   2> 1237890 INFO  (qtp380627627-14276) [n:127.0.0.1:59506_solr    ] o.a.s.h.a.CollectionsHandler Invoked Collection Action :create with params collection.configName=config&name=collection1&nrtReplicas=2&action=CREATE&numShards=1&wt=javabin&version=2 and sendToOCPQueue=true
   [junit4]   2> 1237911 INFO  (OverseerThreadFactory-6032-thread-1) [    ] o.a.s.c.a.c.CreateCollectionCmd Create collection collection1
   [junit4]   2> 1238028 INFO  (OverseerStateUpdate-72070689942601734-127.0.0.1:59506_solr-n_0000000000) [    ] o.a.s.c.o.SliceMutator createReplica() {
   [junit4]   2>   "operation":"ADDREPLICA",
   [junit4]   2>   "collection":"collection1",
   [junit4]   2>   "shard":"shard1",
   [junit4]   2>   "core":"collection1_shard1_replica_n1",
   [junit4]   2>   "state":"down",
   [junit4]   2>   "base_url":"https://127.0.0.1:59507/solr",
   [junit4]   2>   "type":"NRT",
   [junit4]   2>   "waitForFinalState":"false"} 
   [junit4]   2> 1238029 INFO  (OverseerStateUpdate-72070689942601734-127.0.0.1:59506_solr-n_0000000000) [    ] o.a.s.c.o.SliceMutator createReplica() {
   [junit4]   2>   "operation":"ADDREPLICA",
   [junit4]   2>   "collection":"collection1",
   [junit4]   2>   "shard":"shard1",
   [junit4]   2>   "core":"collection1_shard1_replica_n2",
   [junit4]   2>   "state":"down",
   [junit4]   2>   "base_url":"https://127.0.0.1:59506/solr",
   [junit4]   2>   "type":"NRT",
   [junit4]   2>   "waitForFinalState":"false"} 
   [junit4]   2> 1238237 INFO  (qtp380627627-14278) [n:127.0.0.1:59506_solr    x:collection1_shard1_replica_n2] o.a.s.h.a.CoreAdminOperation core create command qt=/admin/cores&coreNodeName=core_node4&collection.configName=config&newCollection=true&name=collection1_shard1_replica_n2&action=CREATE&numShards=1&collection=collection1&shard=shard1&wt=javabin&version=2&replicaType=NRT
   [junit4]   2> 1238239 INFO  (qtp380627627-14278) [n:127.0.0.1:59506_solr    x:collection1_shard1_replica_n2] o.a.s.c.TransientSolrCoreCacheDefault Allocating transient cache for 2147483647 transient cores
   [junit4]   2> 1238253 INFO  (qtp1347754724-14271) [n:127.0.0.1:59507_solr    x:collection1_shard1_replica_n1] o.a.s.h.a.CoreAdminOperation core create command qt=/admin/cores&coreNodeName=core_node3&collection.configName=config&newCollection=true&name=collection1_shard1_replica_n1&action=CREATE&numShards=1&collection=collection1&shard=shard1&wt=javabin&version=2&replicaType=NRT
   [junit4]   2> 1239251 INFO  (qtp380627627-14278) [n:127.0.0.1:59506_solr c:collection1 s:shard1 r:core_node4 x:collection1_shard1_replica_n2] o.a.s.c.SolrConfig Using Lucene MatchVersion: 7.5.0
   [junit4]   2> 1239259 INFO  (qtp380627627-14278) [n:127.0.0.1:59506_solr c:collection1 s:shard1 r:core_node4 x:collection1_shard1_replica_n2] o.a.s.s.IndexSchema [collection1_shard1_replica_n2] Schema name=minimal
   [junit4]   2> 1239261 INFO  (qtp380627627-14278) [n:127.0.0.1:59506_solr c:collection1 s:shard1 r:core_node4 x:collection1_shard1_replica_n2] o.a.s.s.IndexSchema Loaded schema minimal/1.1 with uniqueid field id
   [junit4]   2> 1239261 INFO  (qtp380627627-14278) [n:127.0.0.1:59506_solr c:collection1 s:shard1 r:core_node4 x:collection1_shard1_replica_n2] o.a.s.c.CoreContainer Creating SolrCore 'collection1_shard1_replica_n2' using configuration from collection collection1, trusted=true
   [junit4]   2> 1239261 INFO  (qtp380627627-14278) [n:127.0.0.1:59506_solr c:collection1 s:shard1 r:core_node4 x:collection1_shard1_replica_n2] o.a.s.m.r.SolrJmxReporter JMX monitoring for 'solr_59506.solr.core.collection1.shard1.replica_n2' (registry 'solr.core.collection1.shard1.replica_n2') enabled at server: com.sun.jmx.mbeanserver.JmxMBeanServer@5eb4865a
   [junit4]   2> 1239261 INFO  (qtp380627627-14278) [n:127.0.0.1:59506_solr c:collection1 s:shard1 r:core_node4 x:collection1_shard1_replica_n2] o.a.s.c.SolrCore solr.RecoveryStrategy.Builder
   [junit4]   2> 1239261 INFO  (qtp380627627-14278) [n:127.0.0.1:59506_solr c:collection1 s:shard1 r:core_node4 x:collection1_shard1_replica_n2] o.a.s.c.SolrCore [[collection1_shard1_replica_n2] ] Opening new SolrCore at [C:\Users\jenkins\workspace\Lucene-Solr-7.x-Windows\solr\build\solr-core\test\J0\temp\solr.cloud.LeaderTragicEventTest_775803901D4DCD66-001\tempDir-001\node1\collection1_shard1_replica_n2], dataDir=[C:\Users\jenkins\workspace\Lucene-Solr-7.x-Windows\solr\build\solr-core\test\J0\temp\solr.cloud.LeaderTragicEventTest_775803901D4DCD66-001\tempDir-001\node1\.\collection1_shard1_replica_n2\data\]
   [junit4]   2> 1239271 INFO  (qtp1347754724-14271) [n:127.0.0.1:59507_solr c:collection1 s:shard1 r:core_node3 x:collection1_shard1_replica_n1] o.a.s.c.SolrConfig Using Lucene MatchVersion: 7.5.0
   [junit4]   2> 1239291 INFO  (qtp1347754724-14271) [n:127.0.0.1:59507_solr c:collection1 s:shard1 r:core_node3 x:collection1_shard1_replica_n1] o.a.s.s.IndexSchema [collection1_shard1_replica_n1] Schema name=minimal
   [junit4]   2> 1239293 INFO  (qtp1347754724-14271) [n:127.0.0.1:59507_solr c:collection1 s:shard1 r:core_node3 x:collection1_shard1_replica_n1] o.a.s.s.IndexSchema Loaded schema minimal/1.1 with uniqueid field id
   [junit4]   2> 1239293 INFO  (qtp1347754724-14271) [n:127.0.0.1:59507_solr c:collection1 s:shard1 r:core_node3 x:collection1_shard1_replica_n1] o.a.s.c.CoreContainer Creating SolrCore 'collection1_shard1_replica_n1' using configuration from collection collection1, trusted=true
   [junit4]   2> 1239294 INFO  (qtp1347754724-14271) [n:127.0.0.1:59507_solr c:collection1 s:shard1 r:core_node3 x:collection1_shard1_replica_n1] o.a.s.m.r.SolrJmxReporter JMX monitoring for 'solr_59507.solr.core.collection1.shard1.replica_n1' (registry 'solr.core.collection1.shard1.replica_n1') enabled at server: com.sun.jmx.mbeanserver.JmxMBeanServer@5eb4865a
   [junit4]   2> 1239294 INFO  (qtp1347754724-14271) [n:127.0.0.1:59507_solr c:collection1 s:shard1 r:core_node3 x:collection1_shard1_replica_n1] o.a.s.c.SolrCore solr.RecoveryStrategy.Builder
   [junit4]   2> 1239294 INFO  (qtp1347754724-14271) [n:127.0.0.1:59507_solr c:collection1 s:shard1 r:core_node3 x:collection1_shard1_replica_n1] o.a.s.c.SolrCore [[collection1_shard1_replica_n1] ] Opening new SolrCore at [C:\Users\jenkins\workspace\Lucene-Solr-7.x-Windows\solr\build\solr-core\test\J0\temp\solr.cloud.LeaderTragicEventTest_775803901D4DCD66-001\tempDir-001\node2\collection1_shard1_replica_n1], dataDir=[C:\Users\jenkins\workspace\Lucene-Solr-7.x-Windows\solr\build\solr-core\test\J0\temp\solr.cloud.LeaderTragicEventTest_775803901D4DCD66-001\tempDir-001\node2\.\collection1_shard1_replica_n1\data\]
   [junit4]   2> 1239370 INFO  (qtp380627627-14278) [n:127.0.0.1:59506_solr c:collection1 s:shard1 r:core_node4 x:collection1_shard1_replica_n2] o.a.s.u.UpdateHandler Using UpdateLog implementation: org.apache.solr.update.UpdateLog
   [junit4]   2> 1239370 INFO  (qtp380627627-14278) [n:127.0.0.1:59506_solr c:collection1 s:shard1 r:core_node4 x:collection1_shard1_replica_n2] o.a.s.u.UpdateLog Initializing UpdateLog: dataDir=null defaultSyncLevel=FLUSH numRecordsToKeep=100 maxNumLogsToKeep=10 numVersionBuckets=65536
   [junit4]   2> 1239374 INFO  (qtp380627627-14278) [n:127.0.0.1:59506_solr c:collection1 s:shard1 r:core_node4 x:collection1_shard1_replica_n2] o.a.s.u.CommitTracker Hard AutoCommit: disabled
   [junit4]   2> 1239374 INFO  (qtp380627627-14278) [n:127.0.0.1:59506_solr c:collection1 s:shard1 r:core_node4 x:collection1_shard1_replica_n2] o.a.s.u.CommitTracker Soft AutoCommit: disabled
   [junit4]   2> 1239375 INFO  (qtp380627627-14278) [n:127.0.0.1:59506_solr c:collection1 s:shard1 r:core_node4 x:collection1_shard1_replica_n2] o.a.s.s.SolrIndexSearcher Opening [Searcher@67f9613b[collection1_shard1_replica_n2] main]
   [junit4]   2> 1239376 INFO  (qtp380627627-14278) [n:127.0.0.1:59506_solr c:collection1 s:shard1 r:core_node4 x:collection1_shard1_replica_n2] o.a.s.r.ManagedResourceStorage Configured ZooKeeperStorageIO with znodeBase: /configs/config
   [junit4]   2> 1239377 INFO  (qtp380627627-14278) [n:127.0.0.1:59506_solr c:collection1 s:shard1 r:core_node4 x:collection1_shard1_replica_n2] o.a.s.r.ManagedResourceStorage Loaded null at path _rest_managed.json using ZooKeeperStorageIO:path=/configs/config
   [junit4]   2> 1239377 INFO  (qtp380627627-14278) [n:127.0.0.1:59506_solr c:collection1 s:shard1 r:core_node4 x:collection1_shard1_replica_n2] o.a.s.h.ReplicationHandler Commits will be reserved for 10000ms.
   [junit4]   2> 1239377 INFO  (qtp380627627-14278) [n:127.0.0.1:59506_solr c:collection1 s:shard1 r:core_node4 x:collection1_shard1_replica_n2] o.a.s.u.UpdateLog Could not find max version in index or recent updates, using new clock 1605848734490427392
   [junit4]   2> 1239378 INFO  (searcherExecutor-6041-thread-1-processing-n:127.0.0.1:59506_solr x:collection1_shard1_replica_n2 c:collection1 s:shard1 r:core_node4) [n:127.0.0.1:59506_solr c:collection1 s:shard1 r:core_node4 x:collection1_shard1_replica_n2] o.a.s.c.SolrCore [collection1_shard1_replica_n2] Registered new searcher Searcher@67f9613b[collection1_shard1_replica_n2] main{ExitableDirectoryReader(UninvertingDirectoryReader())}
   [junit4]   2> 1239381 INFO  (qtp1347754724-14271) [n:127.0.0.1:59507_solr c:collection1 s:shard1 r:core_node3 x:collection1_shard1_replica_n1] o.a.s.u.UpdateHandler Using UpdateLog implementation: org.apache.solr.update.UpdateLog
   [junit4]   2> 1239382 INFO  (qtp1347754724-14271) [n:127.0.0.1:59507_solr c:collection1 s:shard1 r:core_node3 x:collection1_shard1_replica_n1] o.a.s.u.UpdateLog Initializing UpdateLog: dataDir=null defaultSyncLevel=FLUSH numRecordsToKeep=100 maxNumLogsToKeep=10 numVersionBuckets=65536
   [junit4]   2> 1239384 INFO  (qtp380627627-14278) [n:127.0.0.1:59506_solr c:collection1 s:shard1 r:core_node4 x:collection1_shard1_replica_n2] o.a.s.c.ZkShardTerms Successful update of terms at /collections/collection1/terms/shard1 to Terms{values={core_node4=0}, version=0}
   [junit4]   2> 1239386 INFO  (qtp1347754724-14271) [n:127.0.0.1:59507_solr c:collection1 s:shard1 r:core_node3 x:collection1_shard1_replica_n1] o.a.s.u.CommitTracker Hard AutoCommit: disabled
   [junit4]   2> 1239386 INFO  (qtp1347754724-14271) [n:127.0.0.1:59507_solr c:collection1 s:shard1 r:core_node3 x:collection1_shard1_replica_n1] o.a.s.u.CommitTracker Soft AutoCommit: disabled
   [junit4]   2> 1239387 INFO  (qtp1347754724-14271) [n:127.0.0.1:59507_solr c:collection1 s:shard1 r:core_node3 x:collection1_shard1_replica_n1] o.a.s.s.SolrIndexSearcher Opening [Searcher@2dec83e4[collection1_shard1_replica_n1] main]
   [junit4]   2> 1239388 INFO  (qtp380627627-14278) [n:127.0.0.1:59506_solr c:collection1 s:shard1 r:core_node4 x:collection1_shard1_replica_n2] o.a.s.c.ShardLeaderElectionContext Waiting until we see more replicas up for shard shard1: total=2 found=1 timeoutin=9999ms
   [junit4]   2> 1239388 INFO  (qtp1347754724-14271) [n:127.0.0.1:59507_solr c:collection1 s:shard1 r:core_node3 x:collection1_shard1_replica_n1] o.a.s.r.ManagedResourceStorage Configured ZooKeeperStorageIO with znodeBase: /configs/config
   [junit4]   2> 1239389 INFO  (qtp1347754724-14271) [n:127.0.0.1:59507_solr c:collection1 s:shard1 r:core_node3 x:collection1_shard1_replica_n1] o.a.s.r.ManagedResourceStorage Loaded null at path _rest_managed.json using ZooKeeperStorageIO:path=/configs/config
   [junit4]   2> 1239389 INFO  (qtp1347754724-14271) [n:127.0.0.1:59507_solr c:collection1 s:shard1 r:core_node3 x:collection1_shard1_replica_n1] o.a.s.h.ReplicationHandler Commits will be reserved for 10000ms.
   [junit4]   2> 1239390 INFO  (searcherExecutor-6042-thread-1-processing-n:127.0.0.1:59507_solr x:collection1_shard1_replica_n1 c:collection1 s:shard1 r:core_node3) [n:127.0.0.1:59507_solr c:collection1 s:shard1 r:core_node3 x:collection1_shard1_replica_n1] o.a.s.c.SolrCore [collection1_shard1_replica_n1] Registered new searcher Searcher@2dec83e4[collection1_shard1_replica_n1] main{ExitableDirectoryReader(UninvertingDirectoryReader())}
   [junit4]   2> 1239390 INFO  (qtp1347754724-14271) [n:127.0.0.1:59507_solr c:collection1 s:shard1 r:core_node3 x:collection1_shard1_replica_n1] o.a.s.u.UpdateLog Could not find max version in index or recent updates, using new clock 1605848734504058880
   [junit4]   2> 1239395 INFO  (qtp1347754724-14271) [n:127.0.0.1:59507_solr c:collection1 s:shard1 r:core_node3 x:collection1_shard1_replica_n1] o.a.s.c.ZkShardTerms Successful update of terms at /collections/collection1/terms/shard1 to Terms{values={core_node3=0, core_node4=0}, version=1}
   [junit4]   2> 1239889 INFO  (qtp380627627-14278) [n:127.0.0.1:59506_solr c:collection1 s:shard1 r:core_node4 x:collection1_shard1_replica_n2] o.a.s.c.ShardLeaderElectionContext Enough replicas found to continue.
   [junit4]   2> 1239889 INFO  (qtp380627627-14278) [n:127.0.0.1:59506_solr c:collection1 s:shard1 r:core_node4 x:collection1_shard1_replica_n2] o.a.s.c.ShardLeaderElectionContext I may be the new leader - try and sync
   [junit4]   2> 1239889 INFO  (qtp380627627-14278) [n:127.0.0.1:59506_solr c:collection1 s:shard1 r:core_node4 x:collection1_shard1_replica_n2] o.a.s.c.SyncStrategy Sync replicas to https://127.0.0.1:59506/solr/collection1_shard1_replica_n2/
   [junit4]   2> 1239890 INFO  (qtp380627627-14278) [n:127.0.0.1:59506_solr c:collection1 s:shard1 r:core_node4 x:collection1_shard1_replica_n2] o.a.s.u.PeerSync PeerSync: core=collection1_shard1_replica_n2 url=https://127.0.0.1:59506/solr START replicas=[https://127.0.0.1:59507/solr/collection1_shard1_replica_n1/] nUpdates=100
   [junit4]   2> 1239890 INFO  (qtp380627627-14278) [n:127.0.0.1:59506_solr c:collection1 s:shard1 r:core_node4 x:collection1_shard1_replica_n2] o.a.s.u.PeerSync PeerSync: core=collection1_shard1_replica_n2 url=https://127.0.0.1:59506/solr DONE.  We have no versions.  sync failed.
   [junit4]   2> 1239897 INFO  (qtp1347754724-14270) [n:127.0.0.1:59507_solr c:collection1 s:shard1 r:core_node3 x:collection1_shard1_replica_n1] o.a.s.c.S.Request [collection1_shard1_replica_n1]  webapp=/solr path=/get params={distrib=false&qt=/get&fingerprint=false&getVersions=100&wt=javabin&version=2} status=0 QTime=0
   [junit4]   2> 1239898 INFO  (qtp380627627-14278) [n:127.0.0.1:59506_solr c:collection1 s:shard1 r:core_node4 x:collection1_shard1_replica_n2] o.a.s.c.SyncStrategy Leader's attempt to sync with shard failed, moving to the next candidate
   [junit4]   2> 1239898 INFO  (qtp380627627-14278) [n:127.0.0.1:59506_solr c:collection1 s:shard1 r:core_node4 x:collection1_shard1_replica_n2] o.a.s.c.ShardLeaderElectionContext We failed sync, but we have no versions - we can't sync in that case - we were active before, so become leader anyway
   [junit4]   2> 1239898 INFO  (qtp380627627-14278) [n:127.0.0.1:59506_solr c:collection1 s:shard1 r:core_node4 x:collection1_shard1_replica_n2] o.a.s.c.ShardLeaderElectionContext Found all replicas participating in election, clear LIR
   [junit4]   2> 1239902 INFO  (qtp380627627-14278) [n:127.0.0.1:59506_solr c:collection1 s:shard1 r:core_node4 x:collection1_shard1_replica_n2] o.a.s.c.ShardLeaderElectionContext I am the new leader: https://127.0.0.1:59506/solr/collection1_shard1_replica_n2/ shard1
   [junit4]   2> 1240058 INFO  (qtp380627627-14278) [n:127.0.0.1:59506_solr c:collection1 s:shard1 r:core_node4 x:collection1_shard1_replica_n2] o.a.s.c.ZkController I am the leader, no recovery necessary
   [junit4]   2> 1240060 INFO  (qtp380627627-14278) [n:127.0.0.1:59506_solr c:collection1 s:shard1 r:core_node4 x:collection1_shard1_replica_n2] o.a.s.s.HttpSolrCall [admin] webapp=null path=/admin/cores params={qt=/admin/cores&coreNodeName=core_node4&collection.configName=config&newCollection=true&name=collection1_shard1_replica_n2&action=CREATE&numShards=1&collection=collection1&shard=shard1&wt=javabin&version=2&replicaType=NRT} status=0 QTime=1821
   [junit4]   2> 1240162 INFO  (zkCallback-5830-thread-1) [    ] o.a.s.c.c.ZkStateReader A cluster state change: [WatchedEvent state:SyncConnected type:NodeDataChanged path:/collections/collection1/state.json] for collection [collection1] has occurred - updating... (live nodes size: [2])
   [junit4]   2> 1240400 INFO  (qtp1347754724-14271) [n:127.0.0.1:59507_solr c:collection1 s:shard1 r:core_node3 x:collection1_shard1_replica_n1] o.a.s.s.HttpSolrCall [admin] webapp=null path=/admin/cores params={qt=/admin/cores&coreNodeName=core_node3&collection.configName=config&newCollection=true&name=collection1_shard1_replica_n1&action=CREATE&numShards=1&collection=collection1&shard=shard1&wt=javabin&version=2&replicaType=NRT} status=0 QTime=2146
   [junit4]   2> 1240402 INFO  (qtp380627627-14276) [n:127.0.0.1:59506_solr    ] o.a.s.h.a.CollectionsHandler Wait for new collection to be active for at most 30 seconds. Check all shard replicas
   [junit4]   2> 1240501 INFO  (zkCallback-5830-thread-2) [    ] o.a.s.c.c.ZkStateReader A cluster state change: [WatchedEvent state:SyncConnected type:NodeDataChanged path:/collections/collection1/state.json] for collection [collection1] has occurred - updating... (live nodes size: [2])
   [junit4]   2> 1240501 INFO  (zkCallback-5822-thread-1) [    ] o.a.s.c.c.ZkStateReader A cluster state change: [WatchedEvent state:SyncConnected type:NodeDataChanged path:/collections/collection1/state.json] for collection [collection1] has occurred - updating... (live nodes size: [2])
   [junit4]   2> 1241402 INFO  (qtp380627627-14276) [n:127.0.0.1:59506_solr    ] o.a.s.s.HttpSolrCall [admin] webapp=null path=/admin/collections params={collection.configName=config&name=collection1&nrtReplicas=2&action=CREATE&numShards=1&wt=javabin&version=2} status=0 QTime=3511
   [junit4]   2> 1241409 INFO  (TEST-LeaderTragicEventTest.testOtherReplicasAreNotActive-seed#[775803901D4DCD66]) [    ] o.e.j.s.AbstractConnector Stopped ServerConnector@61f14216{SSL,[ssl, http/1.1]}{127.0.0.1:0}
   [junit4]   2> 1241410 INFO  (TEST-LeaderTragicEventTest.testOtherReplicasAreNotActive-seed#[775803901D4DCD66]) [    ] o.a.s.c.CoreContainer Shutting down CoreContainer instance=1941367018
   [junit4]   2> 1241410 INFO  (TEST-LeaderTragicEventTest.testOtherReplicasAreNotActive-seed#[775803901D4DCD66]) [    ] o.a.s.m.SolrMetricManager Closing metric reporters for registry=solr.node, tag=null
   [junit4]   2> 1241410 INFO  (TEST-LeaderTragicEventTest.testOtherReplicasAreNotActive-seed#[775803901D4DCD66]) [    ] o.a.s.m.r.SolrJmxReporter Closing reporter [org.apache.solr.metrics.reporters.SolrJmxReporter@78530567: rootName = solr_59507, domain = solr.node, service url = null, agent id = null] for registry solr.node / com.codahale.metrics.MetricRegistry@7944def9
   [junit4]   2> 1241416 INFO  (TEST-LeaderTragicEventTest.testOtherReplicasAreNotActive-seed#[775803901D4DCD66]) [    ] o.a.s.m.SolrMetricManager Closing metric reporters for registry=solr.jvm, tag=null
   [junit4]   2> 1241416 INFO  (TEST-LeaderTragicEventTest.testOtherReplicasAreNotActive-seed#[775803901D4DCD66]) [    ] o.a.s.m.r.SolrJmxReporter Closing reporter [org.apache.solr.metrics.reporters.SolrJmxReporter@565dda80: rootName = solr_59507, domain = solr.jvm, service url = null, agent id = null] for registry solr.jvm / com.codahale.metrics.MetricRegistry@26592781
   [junit4]   2> 1241420 INFO  (TEST-LeaderTragicEventTest.testOtherReplicasAreNotActive-seed#[775803901D4DCD66]) [    ] o.a.s.m.SolrMetricManager Closing metric reporters for registry=solr.jetty, tag=null
   [junit4]   2> 1241420 INFO  (TEST-LeaderTragicEventTest.testOtherReplicasAreNotActive-seed#[775803901D4DCD66]) [    ] o.a.s.m.r.SolrJmxReporter Closing reporter [org.apache.solr.metrics.reporters.SolrJmxReporter@1d9167ce: rootName = solr_59507, domain = solr.jetty, service url = null, agent id = null] for registry solr.jetty / com.codahale.metrics.MetricRegistry@1514268e
   [junit4]   2> 1241422 INFO  (TEST-LeaderTragicEventTest.testOtherReplicasAreNotActive-seed#[775803901D4DCD66]) [    ] o.a.s.c.ZkController Remove node as live in ZooKeeper:/live_nodes/127.0.0.1:59507_solr
   [junit4]   2> 1241423 INFO  (TEST-LeaderTragicEventTest.testOtherReplicasAreNotActive-seed#[775803901D4DCD66]) [    ] o.a.s.m.SolrMetricManager Closing metric reporters for registry=solr.cluster, tag=null
   [junit4]   2> 1241425 INFO  (zkCallback-5822-thread-1) [    ] o.a.s.c.c.ZkStateReader Updated live nodes from ZooKeeper... (2) -> (1)
   [junit4]   2> 1241425 INFO  (zkCallback-5851-thread-1) [    ] o.a.s.c.c.ZkStateReader Updated live nodes from ZooKeeper... (2) -> (1)
   [junit4]   2> 1241425 INFO  (zkCallback-5843-thread-1) [    ] o.a.s.c.c.ZkStateReader Updated live nodes from ZooKeeper... (2) -> (1)
   [junit4]   2> 1241425 INFO  (zkCallback-5830-thread-2) [    ] o.a.s.c.c.ZkStateReader Updated live nodes from ZooKeeper... (2) -> (1)
   [junit4]   2> 1241425 INFO  (zkCallback-5837-thread-1) [    ] o.a.s.c.c.ZkStateReader Updated live nodes from ZooKeeper... (2) -> (1)
   [junit4]   2> 1241426 INFO  (coreCloseExecutor-6051-thread-1) [n:127.0.0.1:59507_solr c:collection1 s:shard1 r:core_node3 x:collection1_shard1_replica_n1] o.a.s.c.SolrCore [collection1_shard1_replica_n1]  CLOSING SolrCore org.apache.solr.core.SolrCore@5f5774a
   [junit4]   2> 1241426 INFO  (coreCloseExecutor-6051-thread-1) [n:127.0.0.1:59507_solr c:collection1 s:shard1 r:core_node3 x:collection1_shard1_replica_n1] o.a.s.m.SolrMetricManager Closing metric reporters for registry=solr.core.collection1.shard1.replica_n1, tag=5f5774a
   [junit4]   2> 1241426 INFO  (coreCloseExecutor-6051-thread-1) [n:127.0.0.1:59507_solr c:collection1 s:shard1 r:core_node3 x:collection1_shard1_replica_n1] o.a.s.m.r.SolrJmxReporter Closing reporter [org.apache.solr.metrics.reporters.SolrJmxReporter@4bbbe91f: rootName = solr_59507, domain = solr.core.collection1.shard1.replica_n1, service url = null, agent id = null] for registry solr.core.collection1.shard1.replica_n1 / com.codahale.metrics.MetricRegistry@413a7970
   [junit4]   2> 1241433 INFO  (coreCloseExecutor-6051-thread-1) [n:127.0.0.1:59507_solr c:collection1 s:shard1 r:core_node3 x:collection1_shard1_replica_n1] o.a.s.m.SolrMetricManager Closing metric reporters for registry=solr.collection.collection1.shard1.leader, tag=5f5774a
   [junit4]   2> 1241436 WARN  (NIOServerCxn.Factory:0.0.0.0/0.0.0.0:0) [    ] o.a.z.s.NIOServerCnxn Unable to read additional data from client sessionid 0x1000be920bf0008, likely client has closed socket
   [junit4]   2> 1241438 WARN  (NIOServerCxn.Factory:0.0.0.0/0.0.0.0:0) [    ] o.a.z.s.NIOServerCnxn Unable to read additional data from client sessionid 0x1000be920bf0004, likely client has closed socket
   [junit4]   2> 1241438 INFO  (TEST-LeaderTragicEventTest.testOtherReplicasAreNotActive-seed#[775803901D4DCD66]) [    ] o.e.j.s.h.ContextHandler Stopped o.e.j.s.ServletContextHandler@4c30fcef{/solr,null,UNAVAILABLE}
   [junit4]   2> 1241439 INFO  (TEST-LeaderTragicEventTest.testOtherReplicasAreNotActive-seed#[775803901D4DCD66]) [    ] o.e.j.s.session node0 Stopped scavenging
   [junit4]   2> 1241527 INFO  (zkCallback-5830-thread-2) [    ] o.a.s.c.c.ZkStateReader A cluster state change: [WatchedEvent state:SyncConnected type:NodeDataChanged path:/collections/collection1/state.json] for collection [collection1] has occurred - updating... (live nodes size: [1])
   [junit4]   2> 1241527 INFO  (zkCallback-5851-thread-1) [    ] o.a.s.c.c.ZkStateReader A cluster state change: [WatchedEvent state:SyncConnected type:NodeDataChanged path:/collections/collection1/state.json] for collection [collection1] has occurred - updating... (live nodes size: [1])
   [junit4]   2> 1241534 INFO  (qtp380627627-14278) [n:127.0.0.1:59506_solr c:collection1 s:shard1 r:core_node4 x:collection1_shard1_replica_n2] o.a.s.c.ZkShardTerms Successful update of terms at /collections/collection1/terms/shard1 to Terms{values={core_node3=0, core_node4=1}, version=2}
   [junit4]   2> 1241534 INFO  (qtp380627627-14278) [n:127.0.0.1:59506_solr c:collection1 s:shard1 r:core_node4 x:collection1_shard1_replica_n2] o.a.s.u.p.LogUpdateProcessorFactory [collection1_shard1_replica_n2]  webapp=/solr path=/update params={wt=javabin&version=2}{add=[0 (1605848736751157248)]} 0 2
   [junit4]   2> 1241535 INFO  (qtp380627627-14278) [n:127.0.0.1:59506_solr c:collection1 s:shard1 r:core_node4 x:collection1_shard1_replica_n2] o.a.s.u.DirectUpdateHandler2 start commit{_version_=1605848736753254400,optimize=false,openSearcher=true,waitSearcher=true,expungeDeletes=false,softCommit=false,prepareCommit=false}
   [junit4]   2> 1241535 INFO  (qtp380627627-14278) [n:127.0.0.1:59506_solr c:collection1 s:shard1 r:core_node4 x:collection1_shard1_replica_n2] o.a.s.u.SolrIndexWriter Calling setCommitData with IW:org.apache.solr.update.SolrIndexWriter@14f3dfbd commitCommandVersion:1605848736753254400
   [junit4]   2> 1241539 INFO  (qtp380627627-14278) [n:127.0.0.1:59506_solr c:collection1 s:shard1 r:core_node4 x:collection1_shard1_replica_n2] o.a.s.s.SolrIndexSearcher Opening [Searcher@2bf0863b[collection1_shard1_replica_n2] main]
   [junit4]   2> 1241540 INFO  (searcherExecutor-6041-thread-1-processing-n:127.0.0.1:59506_solr x:collection1_shard1_replica_n2 c:collection1 s:shard1 r:core_node4) [n:127.0.0.1:59506_solr c:collection1 s:shard1 r:core_node4 x:collection1_shard1_replica_n2] o.a.s.c.SolrCore [collection1_shard1_replica_n2] Registered new searcher Searcher@2bf0863b[collection1_shard1_replica_n2] main{ExitableDirectoryReader(UninvertingDirectoryReader(Uninverting(_0(7.5.0):C1)))}
   [junit4]   2> 1241541 INFO  (qtp380627627-14278) [n:127.0.0.1:59506_solr c:collection1 s:shard1 r:core_node4 x:collection1_shard1_replica_n2] o.a.s.u.DirectUpdateHandler2 end_commit_flush
   [junit4]   2> 1241541 INFO  (qtp380627627-14278) [n:127.0.0.1:59506_solr c:collection1 s:shard1 r:core_node4 x:collection1_shard1_replica_n2] o.a.s.u.p.LogUpdateProcessorFactory [collection1_shard1_replica_n2]  webapp=/solr path=/update params={waitSearcher=true&commit=true&softCommit=false&wt=javabin&version=2}{commit=} 0 6
   [junit4]   2> 1241544 INFO  (qtp380627627-14279) [n:127.0.0.1:59506_solr c:collection1 s:shard1 r:core_node4 x:collection1_shard1_replica_n2] o.a.s.u.p.LogUpdateProcessorFactory [collection1_shard1_replica_n2]  webapp=/solr path=/update params={wt=javabin&version=2}{add=[1 (1605848736760594432)]} 0 1
   [junit4]   2> 1241545 INFO  (qtp380627627-14278) [n:127.0.0.1:59506_solr c:collection1 s:shard1 r:core_node4 x:collection1_shard1_replica_n2] o.a.s.u.DirectUpdateHandler2 start commit{_version_=1605848736763740160,optimize=false,openSearcher=true,waitSearcher=true,expungeDeletes=false,softCommit=false,prepareCommit=false}
   [junit4]   2> 1241545 INFO  (qtp380627627-14278) [n:127.0.0.1:59506_solr c:collection1 s:shard1 r:core_node4 x:collection1_shard1_replica_n2] o.a.s.u.SolrIndexWriter Calling setCommitData with IW:org.apache.solr.update.SolrIndexWriter@14f3dfbd commitCommandVersion:1605848736763740160
   [junit4]   2> 1241547 INFO  (qtp380627627-14278) [n:127.0.0.1:59506_solr c:collection1 s:shard1 r:core_node4 x:collection1_shard1_replica_n2] o.a.s.s.SolrIndexSearcher Opening [Searcher@69cc4f22[collection1_shard1_replica_n2] main]
   [junit4]   2> 1241551 INFO  (searcherExecutor-6041-thread-1-processing-n:127.0.0.1:59506_solr x:collection1_shard1_replica_n2 c:collection1 s:shard1 r:core_node4) [n:127.0.0.1:59506_solr c:collection1 s:shard1 r:core_node4 x:collection1_shard1_replica_n2] o.a.s.c.SolrCore [collection1_shard1_replica_n2] Registered new searcher Searcher@69cc4f22[collection1_shard1_replica_n2] main{ExitableDirectoryReader(UninvertingDirectoryReader(Uninverting(_0(7.5.0):C1) Uninverting(_1(7.5.0):C1)))}
   [junit4]   2> 1241551 INFO  (qtp380627627-14278) [n:127.0.0.1:59506_solr c:collection1 s:shard1 r:core_node4 x:collection1_shard1_replica_n2] o.a.s.u.DirectUpdateHandler2 end_commit_flush
   [junit4]   2> 1241551 INFO  (qtp380627627-14278) [n:127.0.0.1:59506_solr c:collection1 s:shard1 r:core_node4 x:collection1_shard1_replica_n2] o.a.s.u.p.LogUpdateProcessorFactory [collection1_shard1_replica_n2]  webapp=/solr path=/update params={waitSearcher=true&commit=true&softCommit=false&wt=javabin&version=2}{commit=} 0 5
   [junit4]   2> 1241573 INFO  (qtp380627627-14279) [n:127.0.0.1:59506_solr c:collection1 s:shard1 r:core_node4 x:collection1_shard1_replica_n2] o.a.s.u.p.LogUpdateProcessorFactory [collection1_shard1_replica_n2]  webapp=/solr path=/update params={wt=javabin&version=2}{add=[2 (1605848736791003136)]} 0 2
   [junit4]   2> 1241574 INFO  (qtp380627627-14278) [n:127.0.0.1:59506_solr c:collection1 s:shard1 r:core_node4 x:collection1_shard1_replica_n2] o.a.s.u.DirectUpdateHandler2 start commit{_version_=1605848736794148864,optimize=false,openSearcher=true,waitSearcher=true,expungeDeletes=false,softCommit=false,prepareCommit=false}
   [junit4]   2> 1241574 INFO  (qtp380627627-14278) [n:127.0.0.1:59506_solr c:collection1 s:shard1 r:core_node4 x:collection1_shard1_replica_n2] o.a.s.u.SolrIndexWriter Calling setCommitData with IW:org.apache.solr.update.SolrIndexWriter@14f3dfbd commitCommandVersion:1605848736794148864
   [junit4]   2> 1241584 INFO  (qtp380627627-14278) [n:127.0.0.1:59506_solr c:collection1 s:shard1 r:core_node4 x:collection1_shard1_replica_n2] o.a.s.s.SolrIndexSearcher Opening [Searcher@6d57eb4c[collection1_shard1_replica_n2] main]
   [junit4]   2> 1241585 INFO  (searcherExecutor-6041-thread-1-processing-n:127.0.0.1:59506_solr x:collection1_shard1_replica_n2 c:collection1 s:shard1 r:core_node4) [n:127.0.0.1:59506_solr c:collection1 s:shard1 r:core_node4 x:collection1_shard1_replica_n2] o.a.s.c.SolrCore [collection1_shard1_replica_n2] Registered new searcher Searcher@6d57eb4c[collection1_shard1_replica_n2] main{ExitableDirectoryReader(UninvertingDirectoryReader(Uninverting(_0(7.5.0):C1) Uninverting(_1(7.5.0):C1) Uninverting(_2(7.5.0):C1)))}
   [junit4]   2> 1241586 INFO  (qtp380627627-14278) [n:127.0.0.1:59506_solr c:collection1 s:shard1 r:core_node4 x:collection1_shard1_replica_n2] o.a.s.u.DirectUpdateHandler2 end_commit_flush
   [junit4]   2> 1241586 INFO  (qtp380627627-14278) [n:127.0.0.1:59506_solr c:collection1 s:shard1 r:core_node4 x:collection1_shard1_replica_n2] o.a.s.u.p.LogUpdateProcessorFactory [collection1_shard1_replica_n2]  webapp=/solr path=/update params={waitSearcher=true&commit=true&softCommit=false&wt=javabin&version=2}{commit=} 0 11
   [junit4]   2> 1241588 INFO  (qtp380627627-14279) [n:127.0.0.1:59506_solr c:collection1 s:shard1 r:core_node4 x:collection1_shard1_replica_n2] o.a.s.u.p.LogUpdateProcessorFactory [collection1_shard1_replica_n2]  webapp=/solr path=/update params={wt=javabin&version=2}{add=[3 (1605848736807780352)]} 0 1
   [junit4]   2> 1241589 INFO  (qtp380627627-14278) [n:127.0.0.1:59506_solr c:collection1 s:shard1 r:core_node4 x:collection1_shard1_replica_n2] o.a.s.u.DirectUpdateHandler2 start commit{_version_=1605848736809877504,optimize=false,openSearcher=true,waitSearcher=true,expungeDeletes=false,softCommit=false,prepareCommit=false}
   [junit4]   2> 1241589 INFO  (qtp380627627-14278) [n:127.0.0.1:59506_solr c:collection1 s:shard1 r:core_node4 x:collection1_shard1_replica_n2] o.a.s.u.SolrIndexWriter Calling setCommitData with IW:org.apache.solr.update.SolrIndexWriter@14f3dfbd commitCommandVersion:1605848736809877504
   [junit4]   2> 1241591 INFO  (qtp380627627-14278) [n:127.0.0.1:59506_solr c:collection1 s:shard1 r:core_node4 x:collection1_shard1_replica_n2] o.a.s.s.SolrIndexSearcher Opening [Searcher@60be8b86[collection1_shard1_replica_n2] main]
   [junit4]   2> 1241592 INFO  (searcherExecutor-6041-thread-1-processing-n:127.0.0.1:59506_solr x:collection1_shard1_replica_n2 c:collection1 s:shard1 r:core_node4) [n:127.0.0.1:59506_solr c:collection1 s:shard1 r:core_node4 x:collection1_shard1_replica_n2] o.a.s.c.SolrCore [collection1_shard1_replica_n2] Registered new searcher Searcher@60be8b86[collection1_shard1_replica_n2] main{ExitableDirectoryReader(UninvertingDirectoryReader(Uninverting(_0(7.5.0):C1) Uninverting(_1(7.5.0):C1) Uninverting(_2(7.5.0):C1) Uninverting(_3(7.5.0):C1)))}
   [junit4]   2> 1241593 INFO  (qtp380627627-14278) [n:127.0.0.1:59506_solr c:collection1 s:shard1 r:core_node4 x:collection1_shard1_replica_n2] o.a.s.u.DirectUpdateHandler2 end_commit_flush
   [junit4]   2> 1241593 INFO  (qtp380627627-14278) [n:127.0.0.1:59506_solr c:collection1 s:shard1 r:core_node4 x:collection1_shard1_replica_n2] o.a.s.u.p.LogUpdateProcessorFactory [collection1_shard1_replica_n2]  webapp=/solr path=/update params={waitSearcher=true&commit=true&softCommit=false&wt=javabin&version=2}{commit=} 0 4
   [junit4]   2> 1241595 INFO  (qtp380627627-14279) [n:127.0.0.1:59506_solr c:collection1 s:shard1 r:core_node4 x:collection1_shard1_replica_n2] o.a.s.u.p.LogUpdateProcessorFactory [collection1_shard1_replica_n2]  webapp=/solr path=/update params={wt=javabin&version=2}{add=[4 (1605848736815120384)]} 0 1
   [junit4]   2> 1241597 INFO  (qtp380627627-14279) [n:127.0.0.1:59506_solr c:collection1 s:shard1 r:core_node4 x:collection1_shard1_replica_n2] o.a.s.u.DirectUpdateHandler2 start commit{_version_=1605848736818266112,optimize=false,openSearcher=true,waitSearcher=true,expungeDeletes=false,softCommit=false,prepareCommit=false}
   [junit4]   2> 1241597 INFO  (qtp380627627-14279) [n:127.0.0.1:59506_solr c:collection1 s:shard1 r:core_node4 x:collection1_shard1_replica_n2] o.a.s.u.SolrIndexWriter Calling setCommitData with IW:org.apache.solr.update.SolrIndexWriter@14f3dfbd commitCommandVersion:1605848736818266112
   [junit4]   2> 1241599 INFO  (qtp380627627-14279) [n:127.0.0.1:59506_solr c:collection1 s:shard1 r:core_node4 x:collection1_shard1_replica_n2] o.a.s.s.SolrIndexSearcher Opening [Searcher@508df3ba[collection1_shard1_replica_n2] main]
   [junit4]   2> 1241601 INFO  (searcherExecutor-6041-thread-1-processing-n:127.0.0.1:59506_solr x:collection1_shard1_replica_n2 c:collection1 s:shard1 r:core_node4) [n:127.0.0.1:59506_solr c:collection1 s:shard1 r:core_node4 x:collection1_shard1_replica_n2] o.a.s.c.SolrCore [collection1_shard1_replica_n2] Registered new searcher Searcher@508df3ba[collection1_shard1_replica_n2] main{ExitableDirectoryReader(UninvertingDirectoryReader(Uninverting(_0(7.5.0):C1) Uninverting(_1(7.5.0):C1) Uninverting(_2(7.5.0):C1) Uninverting(_3(7.5.0):C1) Uninverting(_4(7.5.0):C1)))}
   [junit4]   2> 1241601 INFO  (qtp380627627-14279) [n:127.0.0.1:59506_solr c:collection1 s:shard1 r:core_node4 x:collection1_shard1_replica_n2] o.a.s.u.DirectUpdateHandler2 end_commit_flush
   [junit4]   2> 1241601 INFO  (qtp380627627-14279) [n:127.0.0.1:59506_solr c:collection1 s:shard1 r:core_node4 x:collection1_shard1_replica_n2] o.a.s.u.p.LogUpdateProcessorFactory [collection1_shard1_replica_n2]  webapp=/solr path=/update params={waitSearcher=true&commit=true&softCommit=false&wt=javabin&version=2}{commit=} 0 4
   [junit4]   2> 1241620 INFO  (qtp380627627-14278) [n:127.0.0.1:59506_solr c:collection1 s:shard1 r:core_node4 x:collection1_shard1_replica_n2] o.a.s.u.p.LogUpdateProcessorFactory [collection1_shard1_replica_n2]  webapp=/solr path=/update params={wt=javabin&version=2}{add=[5 (1605848736823508992)]} 0 17
   [junit4]   2> 1241621 INFO  (qtp380627627-14278) [n:127.0.0.1:59506_solr c:collection1 s:shard1 r:core_node4 x:collection1_shard1_replica_n2] o.a.s.u.DirectUpdateHandler2 start commit{_version_=1605848736843431936,optimize=false,openSearcher=true,waitSearcher=true,expungeDeletes=false,softCommit=false,prepareCommit=false}
   [junit4]   2> 1241621 INFO  (qtp380627627-14278) [n:127.0.0.1:59506_solr c:collection1 s:shard1 r:core_node4 x:collection1_shard1_replica_n2] o.a.s.u.SolrIndexWriter Calling setCommitData with IW:org.apache.solr.update.SolrIndexWriter@14f3dfbd commitCommandVersion:1605848736843431936
   [junit4]   2> 1241632 INFO  (qtp380627627-14278) [n:127.0.0.1:59506_solr c:collection1 s:shard1 r:core_node4 x:collection1_shard1_replica_n2] o.a.s.s.SolrIndexSearcher Opening [Searcher@4d95c7c[collection1_shard1_replica_n2] main]
   [junit4]   2> 1241633 INFO  (searcherExecutor-6041-thread-1-processing-n:127.0.0.1:59506_solr x:collection1_shard1_replica_n2 c:collection1 s:shard1 r:core_node4) [n:127.0.0.1:59506_solr c:collection1 s:shard1 r:core_node4 x:collection1_shard1_replica_n2] o.a.s.c.SolrCore [collection1_shard1_replica_n2] Registered new searcher Searcher@4d95c7c[collection1_shard1_replica_n2] main{ExitableDirectoryReader(UninvertingDirectoryReader(Uninverting(_0(7.5.0):C1) Uninverting(_1(7.5.0):C1) Uninverting(_2(7.5.0):C1) Uninverting(_3(7.5.0):C1) Uninverting(_4(7.5.0):C1) Uninverting(_5(7.5.0):C1)))}
   [junit4]   2> 1241633 INFO  (qtp380627627-14278) [n:127.0.0.1:59506_solr c:collection1 s:shard1 r:core_node4 x:collection1_shard1_replica_n2] o.a.s.u.DirectUpdateHandler2 end_commit_flush
   [junit4]   2> 1241634 INFO  (qtp380627627-14278) [n:127.0.0.1:59506_solr c:collection1 s:shard1 r:core_node4 x:collection1_shard1_replica_n2] o.a.s.u.p.LogUpdateProcessorFactory [collection1_shard1_replica_n2]  webapp=/solr path=/update params={waitSearcher=true&commit=true&softCommit=false&wt=javabin&version=2}{commit=} 0 13
   [junit4]   2> 1241637 INFO  (qtp380627627-14279) [n:127.0.0.1:59506_solr c:collection1 s:shard1 r:core_node4 x:collection1_shard1_replica_n2] o.a.s.u.p.LogUpdateProcessorFactory [collection1_shard1_replica_n2]  webapp=/solr path=/update params={wt=javabin&version=2}{add=[6 (1605848736858112000)]} 0 2
   [junit4]   2> 1241638 INFO  (qtp380627627-14279) [n:127.0.0.1:59506_solr c:collection1 s:shard1 r:core_node4 x:collection1_shard1_replica_n2] o.a.s.u.DirectUpdateHandler2 start commit{_version_=1605848736861257728,optimize=false,openSearcher=true,waitSearcher=true,expungeDeletes=false,softCommit=false,prepareCommit=false}
   [junit4]   2> 1241638 INFO  (qtp380627627-14279) [n:127.0.0.1:59506_solr c:collection1 s:shard1 r:core_node4 x:collection1_shard1_replica_n2] o.a.s.u.SolrIndexWriter Calling setCommitData with IW:org.apache.solr.update.SolrIndexWriter@14f3dfbd commitCommandVersion:1605848736861257728
   [junit4]   2> 1241641 INFO  (qtp380627627-14279) [n:127.0.0.1:59506_solr c:collection1 s:shard1 r:core_node4 x:collection1_shard1_replica_n2] o.a.s.s.SolrIndexSearcher Opening [Searcher@38b3249c[collection1_shard1_replica_n2] main]
   [junit4]   2> 1241642 INFO  (qtp380627627-14279) [n:127.0.0.1:59506_solr c:collection1 s:shard1 r:core_node4 x:collection1_shard1_replica_n2] o.a.s.u.DirectUpdateHandler2 end_commit_flush
   [junit4]   2> 1241642 INFO  (searcherExecutor-6041-thread-1-processing-n:127.0.0.1:59506_solr x:collection1_shard1_replica_n2 c:collection1 s:shard1 r:core_node4) [n:127.0.0.1:59506_solr c:collection1 s:shard1 r:core_node4 x:collection1_shard1_replica_n2] o.a.s.c.SolrCore [collection1_shard1_replica_n2] Registered new searcher Searcher@38b3249c[collection1_shard1_replica_n2] main{ExitableDirectoryReader(UninvertingDirectoryReader(Uninverting(_0(7.5.0):C1) Uninverting(_1(7.5.0):C1) Uninverting(_2(7.5.0):C1) Uninverting(_3(7.5.0):C1) Uninverting(_4(7.5.0):C1) Uninverting(_5(7.5.0):C1) Uninverting(_6(7.5.0):C1)))}
   [junit4]   2> 1241643 INFO  (qtp380627627-14279) [n:127.0.0.1:59506_solr c:collection1 s:shard1 r:core_node4 x:collection1_shard1_replica_n2] o.a.s.u.p.LogUpdateProcessorFactory [collection1_shard1_replica_n2]  webapp=/solr path=/update params={waitSearcher=true&commit=true&softCommit=false&wt=javabin&version=2}{commit=} 0 5
   [junit4]   2> 1241645 INFO  (qtp380627627-14278) [n:127.0.0.1:59506_solr c:collection1 s:shard1 r:core_node4 x:collection1_shard1_replica_n2] o.a.s.u.p.LogUpdateProcessorFactory [collection1_shard1_replica_n2]  webapp=/solr path=/update params={wt=javabin&version=2}{add=[7 (1605848736867549184)]} 0 1
   [junit4]   2> 1241646 INFO  (qtp380627627-14279) [n:127.0.0.1:59506_solr c:collection1 s:shard1 r:core_node4 x:collection1_shard1_replica_n2] o.a.s.u.DirectUpdateHandler2 start commit{_version_=1605848736869646336,optimize=false,openSearcher=true,waitSearcher=true,expungeDeletes=false,softCommit=false,prepareCommit=false}
   [junit4]   2> 1241646 INFO  (qtp380627627-14279) [n:127.0.0.1:59506_solr c:collection1 s:shard1 r:core_node4 x:collection1_shard1_replica_n2] o.a.s.u.SolrIndexWriter Calling setCommitData with IW:org.apache.solr.update.SolrIndexWriter@14f3dfbd commitCommandVersion:1605848736869646336
   [junit4]   2> 1241649 INFO  (qtp380627627-14279) [n:127.0.0.1:59506_solr c:collection1 s:shard1 r:core_node4 x:collection1_shard1_replica_n2] o.a.s.s.SolrIndexSearcher Opening [Searcher@9df83a4[collection1_shard1_replica_n2] main]
   [junit4]   2> 1241650 INFO  (qtp380627627-14279) [n:127.0.0.1:59506_solr c:collection1 s:shard1 r:core_node4 x:collection1_shard1_replica_n2] o.a.s.u.DirectUpdateHandler2 end_commit_flush
   [junit4]   2> 1241651 INFO  (searcherExecutor-6041-thread-1-processing-n:127.0.0.1:59506_solr x:collection1_shard1_replica_n2 c:collection1 s:shard1 r:core_node4) [n:127.0.0.1:59506_solr c:collection1 s:shard1 r:core_node4 x:collection1_shard1_replica_n2] o.a.s.c.SolrCore [collection1_shard1_replica_n2] Registered new searcher Searcher@9df83a4[collection1_shard1_replica_n2] main{ExitableDirectoryReader(UninvertingDirectoryReader(Uninverting(_0(7.5.0):C1) Uninverting(_1(7.5.0):C1) Uninverting(_2(7.5.0):C1) Uninverting(_3(7.5.0):C1) Uninverting(_4(7.5.0):C1) Uninverting(_5(7.5.0):C1) Uninverting(_6(7.5.0):C1) Uninverting(_7(7.5.0):C1)))}
   [junit4]   2> 1241651 INFO  (qtp380627627-14279) [n:127.0.0.1:59506_solr c:collection1 s:shard1 r:core_node4 x:collection1_shard1_replica_n2] o.a.s.u.p.LogUpdateProcessorFactory [collection1_shard1_replica_n2]  webapp=/solr path=/update params={waitSearcher=true&commit=true&softCommit=false&wt=javabin&version=2}{commit=} 0 4
   [junit4]   2> 1241654 INFO  (qtp380627627-14278) [n:127.0.0.1:59506_solr c:collection1 s:shard1 r:core_node4 x:collection1_shard1_replica_n2] o.a.s.u.p.LogUpdateProcessorFactory [collection1_shard1_replica_n2]  webapp=/solr path=/update params={wt=javabin&version=2}{add=[8 (1605848736876986368)]} 0 1
   [junit4]   2> 1241655 INFO  (qtp380627627-14279) [n:127.0.0.1:59506_solr c:collection1 s:shard1 r:core_node4 x:collection1_shard1_replica_n2] o.a.s.u.DirectUpdateHandler2 start commit{_version_=1605848736879083520,optimize=false,openSearcher=true,waitSearcher=true,expungeDeletes=false,softCommit=false,prepareCommit=false}
   [junit4]   2> 1241655 INFO  (qtp380627627-14279) [n:127.0.0.1:59506_solr c:collection1 s:shard1 r:core_node4 x:collection1_shard1_replica_n2] o.a.s.u.SolrIndexWriter Calling setCommitData with IW:org.apache.solr.update.SolrIndexWriter@14f3dfbd commitCommandVersion:1605848736879083520
   [junit4]   2> 1241658 INFO  (qtp380627627-14279) [n:127.0.0.1:59506_solr c:collection1 s:shard1 r:core_node4 x:collection1_shard1_replica_n2] o.a.s.s.SolrIndexSearcher Opening [Searcher@d620681[collection1_shard1_replica_n2] main]
   [junit4]   2> 1241659 INFO  (searcherExecutor-6041-thread-1-processing-n:127.0.0.1:59506_solr x:collection1_shard1_replica_n2 c:collection1 s:shard1 r:core_node4) [n:127.0.0.1:59506_solr c:collection1 s:shard1 r:core_node4 x:collection1_shard1_replica_n2] o.a.s.c.SolrCore [collection1_shard1_replica_n2] Registered new searcher Searcher@d620681[collection1_shard1_replica_n2] main{ExitableDirectoryReader(UninvertingDirectoryReader(Uninverting(_0(7.5.0):C1) Uninverting(_1(7.5.0):C1) Uninverting(_2(7.5.0):C1) Uninverting(_3(7.5.0):C1) Uninverting(_4(7.5.0):C1) Uninverting(_5(7.5.0):C1) Uninverting(_6(7.5.0):C1) Uninverting(_7(7.5.0):C1) Uninverting(_8(7.5.0):C1)))}
   [junit4]   2> 1241659 INFO  (qtp380627627-14279) [n:127.0.0.1:59506_solr c:collection1 s:shard1 r:core_node4 x:collection1_shard1_replica_n2] o.a.s.u.DirectUpdateHandler2 end_commit_flush
   [junit4]   2> 1241659 INFO  (qtp380627627-14279) [n:127.0.0.1:59506_solr c:collection1 s:shard1 r:core_node4 x:collection1_shard1_replica_n2] o.a.s.u.p.LogUpdateProcessorFactory [collection1_shard1_replica_n2]  webapp=/solr path=/update params={waitSearcher=true&commit=true&softCommit=false&wt=javabin&version=2}{commit=} 0 4
   [junit4]   2> 1241662 INFO  (qtp380627627-14278) [n:127.0.0.1:59506_solr c:collection1 s:shard1 r:core_node4 x:collection1_shard1_replica_n2] o.a.s.u.p.LogUpdateProcessorFactory [collection1_shard1_replica_n2]  webapp=/solr path=/update params={wt=javabin&version=2}{add=[9 (1605848736885374976)]} 0 1
   [junit4]   2> 1241663 INFO  (qtp380627627-14279) [n:127.0.0.1:59506_solr c:collection1 s:shard1 r:core_node4 x:collection1_shard1_replica_n2] o.a.s.u.DirectUpdateHandler2 start commit{_version_=1605848736887472128,optimize=false,openSearcher=true,waitSearcher=true,expungeDeletes=false,softCommit=false,prepareCommit=false}
   [junit4]   2> 1241663 INFO  (qtp380627627-14279) [n:127.0.0.1:59506_solr c:collection1 s:shard1 r:core_node4 x:collection1_shard1_replica_n2] o.a.s.u.SolrIndexWriter Calling setCommitData with IW:org.apache.solr.update.SolrIndexWriter@14f3dfbd commitCommandVersion:1605848736887472128
   [junit4]   2> 1241666 INFO  (qtp380627627-14279) [n:127.0.0.1:59506_solr c:collection1 s:shard1 r:core_node4 x:collection1_shard1_replica_n2] o.a.s.s.SolrIndexSearcher Opening [Searcher@4ceccadd[collection1_shard1_replica_n2] main]
   [junit4]   2> 1241666 INFO  (qtp380627627-14279) [n:127.0.0.1:59506_solr c:collection1 s:shard1 r:core_node4 x:collection1_shard1_replica_n2] o.a.s.u.DirectUpdateHandler2 end_commit_flush
   [junit4]   2> 1241667 INFO  (searcherExecutor-6041-thread-1-processing-n:127.0.0.1:59506_solr x:collection1_shard1_replica_n2 c:collection1 s:shard1 r:core_node4) [n:127.0.0.1:59506_solr c:collection1 s:shard1 r:core_node4 x:collection1_shard1_replica_n2] o.a.s.c.SolrCore [collection1_shard1_replica_n2] Registered new searcher Searcher@4ceccadd[collection1_shard1_replica_n2] main{ExitableDirectoryReader(UninvertingDirectoryReader(Uninverting(_0(7.5.0):C1) Uninverting(_1(7.5.0):C1) Uninverting(_2(7.5.0):C1) Uninverting(_3(7.5.0):C1) Uninverting(_4(7.5.0):C1) Uninverting(_5(7.5.0):C1) Uninverting(_6(7.5.0):C1) Uninverting(_7(7.5.0):C1) Uninverting(_8(7.5.0):C1) Uninverting(_9(7.5.0):C1)))}
   [junit4]   2> 1241667 INFO  (qtp380627627-14279) [n:127.0.0.1:59506_solr c:collection1 s:shard1 r:core_node4 x:collection1_shard1_replica_n2] o.a.s.u.p.LogUpdateProcessorFactory [collection1_shard1_replica_n2]  webapp=/solr path=/update params={waitSearcher=true&commit=true&softCommit=false&wt=javabin&version=2}{commit=} 0 4
   [junit4]   2> 1241671 INFO  (qtp380627627-14278) [n:127.0.0.1:59506_solr c:collection1 s:shard1 r:core_node4 x:collection1_shard1_replica_n2] o.a.s.u.p.LogUpdateProcessorFactory [collection1_shard1_replica_n2]  webapp=/solr path=/update params={wt=javabin&version=2}{add=[10 (1605848736893763584)]} 0 1
   [junit4]   2> 1241673 INFO  (qtp380627627-14279) [n:127.0.0.1:59506_solr c:collection1 s:shard1 r:core_node4 x:collection1_shard1_replica_n2] o.a.s.u.DirectUpdateHandler2 start commit{_version_=1605848736897957888,optimize=false,openSearcher=true,waitSearcher=true,expungeDeletes=false,softCommit=false,prepareCommit=false}
   [junit4]   2> 1241673 INFO  (qtp380627627-14279) [n:127.0.0.1:59506_solr c:collection1 s:shard1 r:core_node4 x:collection1_shard1_replica_n2] o.a.s.u.SolrIndexWriter Calling setCommitData with IW:org.apache.solr.update.SolrIndexWriter@14f3dfbd commitCommandVersion:1605848736897957888
   [junit4]   2> 1241693 INFO  (qtp380627627-14279) [n:127.0.0.1:59506_solr c:collection1 s:shard1 r:core_node4 x:collection1_shard1_replica_n2] o.a.s.s.SolrIndexSearcher Opening [Searcher@75dff16d[collection1_shard1_replica_n2] main]
   [junit4]   2> 1241694 INFO  (qtp380627627-14279) [n:127.0.0.1:59506_solr c:collection1 s:shard1 r:core_node4 x:collection1_shard1_replica_n2] o.a.s.u.DirectUpdateHandler2 end_commit_flush
   [junit4]   2> 1241695 INFO  (searcherExecutor-6041-thread-1-processing-n:127.0.0.1:59506_solr x:collection1_shard1_replica_n2 c:collection1 s:shard1 r:core_node4) [n:127.0.0.1:59506_solr c:collection1 s:shard1 r:core_node4 x:collection1_shard1_replica_n2] o.a.s.c.SolrCore [collection1_shard1_replica_n2] Registered new searcher Searcher@75dff16d[collection1_shard1_replica_n2] main{ExitableDirectoryReader(UninvertingDirectoryReader(Uninverting(_0(7.5.0):C1) Uninverting(_1(7.5.0):C1) Uninverting(_2(7.5.0):C1) Uninverting(_3(7.5.0):C1) Uninverting(_4(7.5.0):C1) Uninverting(_5(7.5.0):C1) Uninverting(_6(7.5.0):C1) Uninverting(_7(7.5.0):C1) Uninverting(_8(7.5.0):C1) Uninverting(_9(7.5.0):C1) Uninverting(_a(7.5.0):C1)))}
   [junit4]   2> 1241695 INFO  (qtp380627627-14279) [n:127.0.0.1:59506_solr c:collection1 s:shard1 r:core_node4 x:collection1_shard1_replica_n2] o.a.s.u.p.LogUpdateProcessorFactory [collection1_shard1_replica_n2]  webapp=/solr path=/update params={waitSearcher=true&commit=true&softCommit=false&wt=javabin&version=2}{commit=} 0 23
   [junit4]   2> 1241713 INFO  (qtp380627627-14278) [n:127.0.0.1:59506_solr c:collection1 s:shard1 r:core_node4 x:collection1_shard1_replica_n2] o.a.s.u.p.LogUpdateProcessorFactory [collection1_shard1_replica_n2]  webapp=/solr path=/update params={wt=javabin&version=2}{add=[11 (1605848736938852352)]} 0 1
   [junit4]   2> 1241714 INFO  (qtp380627627-14278) [n:127.0.0.1:59506_solr c:collection1 s:shard1 r:core_node4 x:collection1_shard1_replica_n2] o.a.s.u.DirectUpdateHandler2 start commit{_version_=1605848736940949504,optimize=false,openSearcher=true,waitSearcher=true,expungeDeletes=false,softCommit=false,prepareCommit=false}
   [junit4]   2> 1241714 INFO  (qtp380627627-14278) [n:127.0.0.1:59506_solr c:collection1 s:shard1 r:core_node4 x:collection1_shard1_replica_n2] o.a.s.u.SolrIndexWriter Calling setCommitData with IW:org.apache.solr.update.SolrIndexWriter@14f3dfbd commitCommandVersion:1605848736940949504
   [junit4]   2> 1241717 INFO  (qtp380627627-14278) [n:127.0.0.1:59506_solr c:collection1 s:shard1 r:core_node4 x:collection1_shard1_replica_n2] o.a.s.u.p.LogUpdateProcessorFactory [collection1_shard1_replica_n2]  webapp=/solr path=/update params={waitSearcher=true&commit=true&softCommit=false&wt=javabin&version=2}{} 0 3
   [junit4]   2> 1241717 WARN  (Lucene Merge Thread #0) [    ] o.a.s.c.Moc

[...truncated too long message...]

va:211)
   [junit4]    > 	at org.apache.solr.cloud.LeaderTragicEventTest.test(LeaderTragicEventTest.java:70)
   [junit4]    > 	at java.base/jdk.internal.reflect.NativeMethodAccessorImpl.invoke0(Native Method)
   [junit4]    > 	at java.base/jdk.internal.reflect.NativeMethodAccessorImpl.invoke(NativeMethodAccessorImpl.java:62)
   [junit4]    > 	at java.base/jdk.internal.reflect.DelegatingMethodAccessorImpl.invoke(DelegatingMethodAccessorImpl.java:43)
   [junit4]    > 	at java.base/java.lang.reflect.Method.invoke(Method.java:564)
   [junit4]    > 	at java.base/java.lang.Thread.run(Thread.java:844)
   [junit4]   2> 61674 INFO  (jetty-closer-106-thread-2) [    ] o.e.j.s.AbstractConnector Stopped ServerConnector@7aeb23b7{SSL,[ssl, http/1.1]}{127.0.0.1:0}
   [junit4]   2> 61684 INFO  (jetty-closer-106-thread-2) [    ] o.a.s.c.CoreContainer Shutting down CoreContainer instance=1137889932
   [junit4]   2> 61685 INFO  (jetty-closer-106-thread-2) [    ] o.a.s.m.SolrMetricManager Closing metric reporters for registry=solr.node, tag=null
   [junit4]   2> 61685 INFO  (jetty-closer-106-thread-2) [    ] o.a.s.m.r.SolrJmxReporter Closing reporter [org.apache.solr.metrics.reporters.SolrJmxReporter@10f9a1a0: rootName = solr_54592, domain = solr.node, service url = null, agent id = null] for registry solr.node / com.codahale.metrics.MetricRegistry@69ec6f0f
   [junit4]   2> 61693 INFO  (jetty-closer-106-thread-2) [    ] o.a.s.m.SolrMetricManager Closing metric reporters for registry=solr.jvm, tag=null
   [junit4]   2> 61693 INFO  (jetty-closer-106-thread-2) [    ] o.a.s.m.r.SolrJmxReporter Closing reporter [org.apache.solr.metrics.reporters.SolrJmxReporter@2586293e: rootName = solr_54592, domain = solr.jvm, service url = null, agent id = null] for registry solr.jvm / com.codahale.metrics.MetricRegistry@2ed305fe
   [junit4]   2> 61698 INFO  (jetty-closer-106-thread-2) [    ] o.a.s.m.SolrMetricManager Closing metric reporters for registry=solr.jetty, tag=null
   [junit4]   2> 61698 INFO  (jetty-closer-106-thread-2) [    ] o.a.s.m.r.SolrJmxReporter Closing reporter [org.apache.solr.metrics.reporters.SolrJmxReporter@78a6203a: rootName = solr_54592, domain = solr.jetty, service url = null, agent id = null] for registry solr.jetty / com.codahale.metrics.MetricRegistry@522e921c
   [junit4]   2> 61718 INFO  (jetty-closer-106-thread-2) [    ] o.a.s.c.ZkController Remove node as live in ZooKeeper:/live_nodes/127.0.0.1:54592_solr
   [junit4]   2> 61726 INFO  (jetty-closer-106-thread-2) [    ] o.a.s.m.SolrMetricManager Closing metric reporters for registry=solr.cluster, tag=null
   [junit4]   2> 61727 INFO  (zkCallback-117-thread-1) [    ] o.a.s.c.c.ZkStateReader Updated live nodes from ZooKeeper... (1) -> (0)
   [junit4]   2> 61729 INFO  (zkCallback-132-thread-1) [    ] o.a.s.c.c.ZkStateReader Updated live nodes from ZooKeeper... (1) -> (0)
   [junit4]   2> 61731 INFO  (coreCloseExecutor-141-thread-1) [n:127.0.0.1:54592_solr c:collection1 s:shard1 r:core_node3 x:collection1_shard1_replica_n1] o.a.s.c.SolrCore [collection1_shard1_replica_n1]  CLOSING SolrCore org.apache.solr.core.SolrCore@1d98f959
   [junit4]   2> 61731 INFO  (coreCloseExecutor-141-thread-1) [n:127.0.0.1:54592_solr c:collection1 s:shard1 r:core_node3 x:collection1_shard1_replica_n1] o.a.s.m.SolrMetricManager Closing metric reporters for registry=solr.core.collection1.shard1.replica_n1, tag=1d98f959
   [junit4]   2> 61731 INFO  (coreCloseExecutor-141-thread-1) [n:127.0.0.1:54592_solr c:collection1 s:shard1 r:core_node3 x:collection1_shard1_replica_n1] o.a.s.m.r.SolrJmxReporter Closing reporter [org.apache.solr.metrics.reporters.SolrJmxReporter@273f6199: rootName = solr_54592, domain = solr.core.collection1.shard1.replica_n1, service url = null, agent id = null] for registry solr.core.collection1.shard1.replica_n1 / com.codahale.metrics.MetricRegistry@58392db0
   [junit4]   2> 61742 INFO  (coreCloseExecutor-141-thread-1) [n:127.0.0.1:54592_solr c:collection1 s:shard1 r:core_node3 x:collection1_shard1_replica_n1] o.a.s.m.SolrMetricManager Closing metric reporters for registry=solr.collection.collection1.shard1.leader, tag=1d98f959
   [junit4]   2> 61836 INFO  (zkCallback-117-thread-1) [    ] o.a.s.c.c.ZkStateReader A cluster state change: [WatchedEvent state:SyncConnected type:NodeDataChanged path:/collections/collection1/state.json] for collection [collection1] has occurred - updating... (live nodes size: [0])
   [junit4]   2> 61844 INFO  (jetty-closer-106-thread-2) [    ] o.a.s.c.Overseer Overseer (id=72070899052773380-127.0.0.1:54592_solr-n_0000000000) closing
   [junit4]   2> 61844 INFO  (OverseerStateUpdate-72070899052773380-127.0.0.1:54592_solr-n_0000000000) [    ] o.a.s.c.Overseer Overseer Loop exiting : 127.0.0.1:54592_solr
   [junit4]   2> 61849 WARN  (OverseerAutoScalingTriggerThread-72070899052773380-127.0.0.1:54592_solr-n_0000000000) [    ] o.a.s.c.a.OverseerTriggerThread OverseerTriggerThread woken up but we are closed, exiting.
   [junit4]   2> 61868 INFO  (jetty-closer-106-thread-2) [    ] o.e.j.s.h.ContextHandler Stopped o.e.j.s.ServletContextHandler@76b68e56{/solr,null,UNAVAILABLE}
   [junit4]   2> 61875 INFO  (jetty-closer-106-thread-2) [    ] o.e.j.s.session node0 Stopped scavenging
   [junit4]   2> 61875 ERROR (SUITE-LeaderTragicEventTest-seed#[775803901D4DCD66]-worker) [    ] o.a.z.s.ZooKeeperServer ZKShutdownHandler is not registered, so ZooKeeper server won't take any action on ERROR or SHUTDOWN server state changes
   [junit4]   2> 61875 INFO  (SUITE-LeaderTragicEventTest-seed#[775803901D4DCD66]-worker) [    ] o.a.s.c.ZkTestServer connecting to 127.0.0.1:54573 54573
   [junit4]   2> 61875 INFO  (Thread-62) [    ] o.a.s.c.ZkTestServer connecting to 127.0.0.1:54573 54573
   [junit4]   2> 61879 WARN  (Thread-62) [    ] o.a.s.c.ZkTestServer Watch limit violations: 
   [junit4]   2> Maximum concurrent create/delete watches above limit:
   [junit4]   2> 
   [junit4]   2> 	5	/solr/aliases.json
   [junit4]   2> 	5	/solr/collections/collection1/terms/shard1
   [junit4]   2> 	2	/solr/security.json
   [junit4]   2> 	2	/solr/configs/config
   [junit4]   2> 
   [junit4]   2> Maximum concurrent data watches above limit:
   [junit4]   2> 
   [junit4]   2> 	5	/solr/clusterstate.json
   [junit4]   2> 	5	/solr/clusterprops.json
   [junit4]   2> 	3	/solr/collections/collection1/state.json
   [junit4]   2> 
   [junit4]   2> Maximum concurrent children watches above limit:
   [junit4]   2> 
   [junit4]   2> 	5	/solr/live_nodes
   [junit4]   2> 	5	/solr/collections
   [junit4]   2> 
   [junit4]   2> NOTE: leaving temporary files on disk at: C:\Users\jenkins\workspace\Lucene-Solr-7.x-Windows\solr\build\solr-core\test\J1\temp\solr.cloud.LeaderTragicEventTest_775803901D4DCD66-002
   [junit4]   2> Jul 13, 2018 5:31:29 AM com.carrotsearch.randomizedtesting.ThreadLeakControl checkThreadLeaks
   [junit4]   2> WARNING: Will linger awaiting termination of 3 leaked thread(s).
   [junit4]   2> NOTE: test params are: codec=Asserting(Lucene70): {}, docValues:{}, maxPointsInLeafNode=1573, maxMBSortInHeap=7.9712679611833455, sim=RandomSimilarity(queryNorm=false): {}, locale=de-AT, timezone=America/Curacao
   [junit4]   2> NOTE: Windows 10 10.0 amd64/Oracle Corporation 9.0.4 (64-bit)/cpus=3,threads=1,free=183365680,total=261095424
   [junit4]   2> NOTE: All tests run in this JVM: [LeaderTragicEventTest, LeaderTragicEventTest, LeaderTragicEventTest]
   [junit4] Completed [4/5 (2!)] on J1 in 6.75s, 2 tests, 2 errors <<< FAILURES!

[...truncated 18 lines...]
BUILD FAILED
C:\Users\jenkins\workspace\Lucene-Solr-7.x-Windows\lucene\common-build.xml:1568: The following error occurred while executing this line:
C:\Users\jenkins\workspace\Lucene-Solr-7.x-Windows\lucene\common-build.xml:1092: There were test failures: 5 suites, 10 tests, 4 errors [seed: 775803901D4DCD66]

Total time: 1 minute 27 seconds

[repro] Setting last failure code to 1

[repro] Failures:
[repro]   2/5 failed: org.apache.solr.cloud.LeaderTragicEventTest
[repro] Exiting with code 1

C:\Users\jenkins\workspace\Lucene-Solr-7.x-Windows>IF EXIST lucene\build move /y lucene\build lucene\build.repro 
        1 dir(s) moved.

C:\Users\jenkins\workspace\Lucene-Solr-7.x-Windows>IF EXIST solr\build move /y solr\build solr\build.repro 
        1 dir(s) moved.

C:\Users\jenkins\workspace\Lucene-Solr-7.x-Windows>IF EXIST lucene\build.orig move /y lucene\build.orig lucene\build 
        1 dir(s) moved.

C:\Users\jenkins\workspace\Lucene-Solr-7.x-Windows>IF EXIST solr\build.orig move /y solr\build.orig solr\build 
        1 dir(s) moved.

C:\Users\jenkins\workspace\Lucene-Solr-7.x-Windows>exit 0 
Archiving artifacts
Setting ANT_1_8_2_HOME=C:\Users\jenkins\tools\hudson.tasks.Ant_AntInstallation\ANT_1.8.2
[WARNINGS] Parsing warnings in console log with parser Java Compiler (javac)
Setting ANT_1_8_2_HOME=C:\Users\jenkins\tools\hudson.tasks.Ant_AntInstallation\ANT_1.8.2
Setting ANT_1_8_2_HOME=C:\Users\jenkins\tools\hudson.tasks.Ant_AntInstallation\ANT_1.8.2
<Git Blamer> Using GitBlamer to create author and commit information for all warnings.
<Git Blamer> GIT_COMMIT=f4c5380137b498079f203c865c6611a99f5765d0, workspace=C:\Users\jenkins\workspace\Lucene-Solr-7.x-Windows
[WARNINGS] Computing warning deltas based on reference build #686
Recording test results
Setting ANT_1_8_2_HOME=C:\Users\jenkins\tools\hudson.tasks.Ant_AntInstallation\ANT_1.8.2
Build step 'Publish JUnit test result report' changed build result to UNSTABLE
Email was triggered for: Unstable (Test Failures)
Sending email for trigger: Unstable (Test Failures)
Setting ANT_1_8_2_HOME=C:\Users\jenkins\tools\hudson.tasks.Ant_AntInstallation\ANT_1.8.2
Setting ANT_1_8_2_HOME=C:\Users\jenkins\tools\hudson.tasks.Ant_AntInstallation\ANT_1.8.2
Setting ANT_1_8_2_HOME=C:\Users\jenkins\tools\hudson.tasks.Ant_AntInstallation\ANT_1.8.2
Setting ANT_1_8_2_HOME=C:\Users\jenkins\tools\hudson.tasks.Ant_AntInstallation\ANT_1.8.2

Mime
View raw message