lucene-dev mailing list archives

Site index · List index
Message view « Date » · « Thread »
Top « Date » · « Thread »
From Apache Jenkins Server <jenk...@builds.apache.org>
Subject [JENKINS] Lucene-Solr-BadApples-Tests-master - Build # 91 - Still Unstable
Date Fri, 06 Jul 2018 07:28:54 GMT
Build: https://builds.apache.org/job/Lucene-Solr-BadApples-Tests-master/91/

4 tests failed.
FAILED:  org.apache.solr.cloud.TestAuthenticationFramework.testBasics

Error Message:
Error from server at http://127.0.0.1:59685/solr/testcollection_shard1_replica_n2: Expected mime type application/octet-stream but got text/html. <html> <head> <meta http-equiv="Content-Type" content="text/html;charset=utf-8"/> <title>Error 404 Can not find: /solr/testcollection_shard1_replica_n2/update</title> </head> <body><h2>HTTP ERROR 404</h2> <p>Problem accessing /solr/testcollection_shard1_replica_n2/update. Reason: <pre>    Can not find: /solr/testcollection_shard1_replica_n2/update</pre></p><hr><a href="http://eclipse.org/jetty">Powered by Jetty:// 9.4.11.v20180605</a><hr/>  </body> </html> 

Stack Trace:
org.apache.solr.client.solrj.impl.CloudSolrClient$RouteException: Error from server at http://127.0.0.1:59685/solr/testcollection_shard1_replica_n2: Expected mime type application/octet-stream but got text/html. <html>
<head>
<meta http-equiv="Content-Type" content="text/html;charset=utf-8"/>
<title>Error 404 Can not find: /solr/testcollection_shard1_replica_n2/update</title>
</head>
<body><h2>HTTP ERROR 404</h2>
<p>Problem accessing /solr/testcollection_shard1_replica_n2/update. Reason:
<pre>    Can not find: /solr/testcollection_shard1_replica_n2/update</pre></p><hr><a href="http://eclipse.org/jetty">Powered by Jetty:// 9.4.11.v20180605</a><hr/>

</body>
</html>

	at __randomizedtesting.SeedInfo.seed([EC0E8466C13A747D:D1D62A4AF9D42A0D]:0)
	at org.apache.solr.client.solrj.impl.CloudSolrClient.directUpdate(CloudSolrClient.java:551)
	at org.apache.solr.client.solrj.impl.CloudSolrClient.sendRequest(CloudSolrClient.java:1015)
	at org.apache.solr.client.solrj.impl.CloudSolrClient.requestWithRetryOnStaleState(CloudSolrClient.java:886)
	at org.apache.solr.client.solrj.impl.CloudSolrClient.requestWithRetryOnStaleState(CloudSolrClient.java:948)
	at org.apache.solr.client.solrj.impl.CloudSolrClient.requestWithRetryOnStaleState(CloudSolrClient.java:948)
	at org.apache.solr.client.solrj.impl.CloudSolrClient.requestWithRetryOnStaleState(CloudSolrClient.java:948)
	at org.apache.solr.client.solrj.impl.CloudSolrClient.requestWithRetryOnStaleState(CloudSolrClient.java:948)
	at org.apache.solr.client.solrj.impl.CloudSolrClient.requestWithRetryOnStaleState(CloudSolrClient.java:948)
	at org.apache.solr.client.solrj.impl.CloudSolrClient.request(CloudSolrClient.java:819)
	at org.apache.solr.client.solrj.SolrRequest.process(SolrRequest.java:194)
	at org.apache.solr.client.solrj.request.UpdateRequest.commit(UpdateRequest.java:233)
	at org.apache.solr.cloud.TestAuthenticationFramework.collectionCreateSearchDeleteTwice(TestAuthenticationFramework.java:127)
	at org.apache.solr.cloud.TestAuthenticationFramework.testBasics(TestAuthenticationFramework.java:75)
	at sun.reflect.NativeMethodAccessorImpl.invoke0(Native Method)
	at sun.reflect.NativeMethodAccessorImpl.invoke(NativeMethodAccessorImpl.java:62)
	at sun.reflect.DelegatingMethodAccessorImpl.invoke(DelegatingMethodAccessorImpl.java:43)
	at java.lang.reflect.Method.invoke(Method.java:498)
	at com.carrotsearch.randomizedtesting.RandomizedRunner.invoke(RandomizedRunner.java:1737)
	at com.carrotsearch.randomizedtesting.RandomizedRunner$8.evaluate(RandomizedRunner.java:934)
	at com.carrotsearch.randomizedtesting.RandomizedRunner$9.evaluate(RandomizedRunner.java:970)
	at com.carrotsearch.randomizedtesting.RandomizedRunner$10.evaluate(RandomizedRunner.java:984)
	at com.carrotsearch.randomizedtesting.rules.SystemPropertiesRestoreRule$1.evaluate(SystemPropertiesRestoreRule.java:57)
	at org.apache.lucene.util.TestRuleSetupTeardownChained$1.evaluate(TestRuleSetupTeardownChained.java:49)
	at org.apache.lucene.util.AbstractBeforeAfterRule$1.evaluate(AbstractBeforeAfterRule.java:45)
	at org.apache.lucene.util.TestRuleThreadAndTestName$1.evaluate(TestRuleThreadAndTestName.java:48)
	at org.apache.lucene.util.TestRuleIgnoreAfterMaxFailures$1.evaluate(TestRuleIgnoreAfterMaxFailures.java:64)
	at org.apache.lucene.util.TestRuleMarkFailure$1.evaluate(TestRuleMarkFailure.java:47)
	at com.carrotsearch.randomizedtesting.rules.StatementAdapter.evaluate(StatementAdapter.java:36)
	at com.carrotsearch.randomizedtesting.ThreadLeakControl$StatementRunner.run(ThreadLeakControl.java:368)
	at com.carrotsearch.randomizedtesting.ThreadLeakControl.forkTimeoutingTask(ThreadLeakControl.java:817)
	at com.carrotsearch.randomizedtesting.ThreadLeakControl$3.evaluate(ThreadLeakControl.java:468)
	at com.carrotsearch.randomizedtesting.RandomizedRunner.runSingleTest(RandomizedRunner.java:943)
	at com.carrotsearch.randomizedtesting.RandomizedRunner$5.evaluate(RandomizedRunner.java:829)
	at com.carrotsearch.randomizedtesting.RandomizedRunner$6.evaluate(RandomizedRunner.java:879)
	at com.carrotsearch.randomizedtesting.RandomizedRunner$7.evaluate(RandomizedRunner.java:890)
	at com.carrotsearch.randomizedtesting.rules.StatementAdapter.evaluate(StatementAdapter.java:36)
	at com.carrotsearch.randomizedtesting.rules.SystemPropertiesRestoreRule$1.evaluate(SystemPropertiesRestoreRule.java:57)
	at org.apache.lucene.util.AbstractBeforeAfterRule$1.evaluate(AbstractBeforeAfterRule.java:45)
	at com.carrotsearch.randomizedtesting.rules.StatementAdapter.evaluate(StatementAdapter.java:36)
	at org.apache.lucene.util.TestRuleStoreClassName$1.evaluate(TestRuleStoreClassName.java:41)
	at com.carrotsearch.randomizedtesting.rules.NoShadowingOrOverridesOnMethodsRule$1.evaluate(NoShadowingOrOverridesOnMethodsRule.java:40)
	at com.carrotsearch.randomizedtesting.rules.NoShadowingOrOverridesOnMethodsRule$1.evaluate(NoShadowingOrOverridesOnMethodsRule.java:40)
	at com.carrotsearch.randomizedtesting.rules.StatementAdapter.evaluate(StatementAdapter.java:36)
	at com.carrotsearch.randomizedtesting.rules.StatementAdapter.evaluate(StatementAdapter.java:36)
	at com.carrotsearch.randomizedtesting.rules.StatementAdapter.evaluate(StatementAdapter.java:36)
	at org.apache.lucene.util.TestRuleAssertionsRequired$1.evaluate(TestRuleAssertionsRequired.java:53)
	at org.apache.lucene.util.TestRuleMarkFailure$1.evaluate(TestRuleMarkFailure.java:47)
	at org.apache.lucene.util.TestRuleIgnoreAfterMaxFailures$1.evaluate(TestRuleIgnoreAfterMaxFailures.java:64)
	at org.apache.lucene.util.TestRuleIgnoreTestSuites$1.evaluate(TestRuleIgnoreTestSuites.java:54)
	at com.carrotsearch.randomizedtesting.rules.StatementAdapter.evaluate(StatementAdapter.java:36)
	at com.carrotsearch.randomizedtesting.ThreadLeakControl$StatementRunner.run(ThreadLeakControl.java:368)
	at java.lang.Thread.run(Thread.java:748)
Caused by: org.apache.solr.client.solrj.impl.HttpSolrClient$RemoteSolrException: Error from server at http://127.0.0.1:59685/solr/testcollection_shard1_replica_n2: Expected mime type application/octet-stream but got text/html. <html>
<head>
<meta http-equiv="Content-Type" content="text/html;charset=utf-8"/>
<title>Error 404 Can not find: /solr/testcollection_shard1_replica_n2/update</title>
</head>
<body><h2>HTTP ERROR 404</h2>
<p>Problem accessing /solr/testcollection_shard1_replica_n2/update. Reason:
<pre>    Can not find: /solr/testcollection_shard1_replica_n2/update</pre></p><hr><a href="http://eclipse.org/jetty">Powered by Jetty:// 9.4.11.v20180605</a><hr/>

</body>
</html>

	at org.apache.solr.client.solrj.impl.HttpSolrClient.executeMethod(HttpSolrClient.java:607)
	at org.apache.solr.client.solrj.impl.HttpSolrClient.request(HttpSolrClient.java:255)
	at org.apache.solr.client.solrj.impl.HttpSolrClient.request(HttpSolrClient.java:244)
	at org.apache.solr.client.solrj.impl.LBHttpSolrClient.doRequest(LBHttpSolrClient.java:483)
	at org.apache.solr.client.solrj.impl.LBHttpSolrClient.request(LBHttpSolrClient.java:413)
	at org.apache.solr.client.solrj.impl.CloudSolrClient.lambda$directUpdate$0(CloudSolrClient.java:528)
	at java.util.concurrent.FutureTask.run(FutureTask.java:266)
	at org.apache.solr.common.util.ExecutorUtil$MDCAwareThreadPoolExecutor.lambda$execute$0(ExecutorUtil.java:209)
	at java.util.concurrent.ThreadPoolExecutor.runWorker(ThreadPoolExecutor.java:1149)
	at java.util.concurrent.ThreadPoolExecutor$Worker.run(ThreadPoolExecutor.java:624)
	... 1 more


FAILED:  org.apache.solr.cloud.autoscaling.IndexSizeTriggerTest.testTrigger

Error Message:
number of ops expected:<2> but was:<1>

Stack Trace:
java.lang.AssertionError: number of ops expected:<2> but was:<1>
	at __randomizedtesting.SeedInfo.seed([EC0E8466C13A747D:8FC5B2E458F50750]:0)
	at org.junit.Assert.fail(Assert.java:93)
	at org.junit.Assert.failNotEquals(Assert.java:647)
	at org.junit.Assert.assertEquals(Assert.java:128)
	at org.junit.Assert.assertEquals(Assert.java:472)
	at org.apache.solr.cloud.autoscaling.IndexSizeTriggerTest.testTrigger(IndexSizeTriggerTest.java:189)
	at sun.reflect.NativeMethodAccessorImpl.invoke0(Native Method)
	at sun.reflect.NativeMethodAccessorImpl.invoke(NativeMethodAccessorImpl.java:62)
	at sun.reflect.DelegatingMethodAccessorImpl.invoke(DelegatingMethodAccessorImpl.java:43)
	at java.lang.reflect.Method.invoke(Method.java:498)
	at com.carrotsearch.randomizedtesting.RandomizedRunner.invoke(RandomizedRunner.java:1737)
	at com.carrotsearch.randomizedtesting.RandomizedRunner$8.evaluate(RandomizedRunner.java:934)
	at com.carrotsearch.randomizedtesting.RandomizedRunner$9.evaluate(RandomizedRunner.java:970)
	at com.carrotsearch.randomizedtesting.RandomizedRunner$10.evaluate(RandomizedRunner.java:984)
	at com.carrotsearch.randomizedtesting.rules.SystemPropertiesRestoreRule$1.evaluate(SystemPropertiesRestoreRule.java:57)
	at org.apache.lucene.util.TestRuleSetupTeardownChained$1.evaluate(TestRuleSetupTeardownChained.java:49)
	at org.apache.lucene.util.AbstractBeforeAfterRule$1.evaluate(AbstractBeforeAfterRule.java:45)
	at org.apache.lucene.util.TestRuleThreadAndTestName$1.evaluate(TestRuleThreadAndTestName.java:48)
	at org.apache.lucene.util.TestRuleIgnoreAfterMaxFailures$1.evaluate(TestRuleIgnoreAfterMaxFailures.java:64)
	at org.apache.lucene.util.TestRuleMarkFailure$1.evaluate(TestRuleMarkFailure.java:47)
	at com.carrotsearch.randomizedtesting.rules.StatementAdapter.evaluate(StatementAdapter.java:36)
	at com.carrotsearch.randomizedtesting.ThreadLeakControl$StatementRunner.run(ThreadLeakControl.java:368)
	at com.carrotsearch.randomizedtesting.ThreadLeakControl.forkTimeoutingTask(ThreadLeakControl.java:817)
	at com.carrotsearch.randomizedtesting.ThreadLeakControl$3.evaluate(ThreadLeakControl.java:468)
	at com.carrotsearch.randomizedtesting.RandomizedRunner.runSingleTest(RandomizedRunner.java:943)
	at com.carrotsearch.randomizedtesting.RandomizedRunner$5.evaluate(RandomizedRunner.java:829)
	at com.carrotsearch.randomizedtesting.RandomizedRunner$6.evaluate(RandomizedRunner.java:879)
	at com.carrotsearch.randomizedtesting.RandomizedRunner$7.evaluate(RandomizedRunner.java:890)
	at com.carrotsearch.randomizedtesting.rules.StatementAdapter.evaluate(StatementAdapter.java:36)
	at com.carrotsearch.randomizedtesting.rules.SystemPropertiesRestoreRule$1.evaluate(SystemPropertiesRestoreRule.java:57)
	at org.apache.lucene.util.AbstractBeforeAfterRule$1.evaluate(AbstractBeforeAfterRule.java:45)
	at com.carrotsearch.randomizedtesting.rules.StatementAdapter.evaluate(StatementAdapter.java:36)
	at org.apache.lucene.util.TestRuleStoreClassName$1.evaluate(TestRuleStoreClassName.java:41)
	at com.carrotsearch.randomizedtesting.rules.NoShadowingOrOverridesOnMethodsRule$1.evaluate(NoShadowingOrOverridesOnMethodsRule.java:40)
	at com.carrotsearch.randomizedtesting.rules.NoShadowingOrOverridesOnMethodsRule$1.evaluate(NoShadowingOrOverridesOnMethodsRule.java:40)
	at com.carrotsearch.randomizedtesting.rules.StatementAdapter.evaluate(StatementAdapter.java:36)
	at com.carrotsearch.randomizedtesting.rules.StatementAdapter.evaluate(StatementAdapter.java:36)
	at com.carrotsearch.randomizedtesting.rules.StatementAdapter.evaluate(StatementAdapter.java:36)
	at org.apache.lucene.util.TestRuleAssertionsRequired$1.evaluate(TestRuleAssertionsRequired.java:53)
	at org.apache.lucene.util.TestRuleMarkFailure$1.evaluate(TestRuleMarkFailure.java:47)
	at org.apache.lucene.util.TestRuleIgnoreAfterMaxFailures$1.evaluate(TestRuleIgnoreAfterMaxFailures.java:64)
	at org.apache.lucene.util.TestRuleIgnoreTestSuites$1.evaluate(TestRuleIgnoreTestSuites.java:54)
	at com.carrotsearch.randomizedtesting.rules.StatementAdapter.evaluate(StatementAdapter.java:36)
	at com.carrotsearch.randomizedtesting.ThreadLeakControl$StatementRunner.run(ThreadLeakControl.java:368)
	at java.lang.Thread.run(Thread.java:748)


FAILED:  org.apache.solr.cloud.api.collections.TestCollectionsAPIViaSolrCloudCluster.testCollectionCreateSearchDelete

Error Message:
Error from server at http://127.0.0.1:59980/solr/testcollection_shard1_replica_n2: Expected mime type application/octet-stream but got text/html. <html> <head> <meta http-equiv="Content-Type" content="text/html;charset=utf-8"/> <title>Error 404 Can not find: /solr/testcollection_shard1_replica_n2/update</title> </head> <body><h2>HTTP ERROR 404</h2> <p>Problem accessing /solr/testcollection_shard1_replica_n2/update. Reason: <pre>    Can not find: /solr/testcollection_shard1_replica_n2/update</pre></p><hr><a href="http://eclipse.org/jetty">Powered by Jetty:// 9.4.11.v20180605</a><hr/>  </body> </html> 

Stack Trace:
org.apache.solr.client.solrj.impl.CloudSolrClient$RouteException: Error from server at http://127.0.0.1:59980/solr/testcollection_shard1_replica_n2: Expected mime type application/octet-stream but got text/html. <html>
<head>
<meta http-equiv="Content-Type" content="text/html;charset=utf-8"/>
<title>Error 404 Can not find: /solr/testcollection_shard1_replica_n2/update</title>
</head>
<body><h2>HTTP ERROR 404</h2>
<p>Problem accessing /solr/testcollection_shard1_replica_n2/update. Reason:
<pre>    Can not find: /solr/testcollection_shard1_replica_n2/update</pre></p><hr><a href="http://eclipse.org/jetty">Powered by Jetty:// 9.4.11.v20180605</a><hr/>

</body>
</html>

	at __randomizedtesting.SeedInfo.seed([EC0E8466C13A747D:4FF42AC346D29ED8]:0)
	at org.apache.solr.client.solrj.impl.CloudSolrClient.directUpdate(CloudSolrClient.java:551)
	at org.apache.solr.client.solrj.impl.CloudSolrClient.sendRequest(CloudSolrClient.java:1015)
	at org.apache.solr.client.solrj.impl.CloudSolrClient.requestWithRetryOnStaleState(CloudSolrClient.java:886)
	at org.apache.solr.client.solrj.impl.CloudSolrClient.requestWithRetryOnStaleState(CloudSolrClient.java:948)
	at org.apache.solr.client.solrj.impl.CloudSolrClient.requestWithRetryOnStaleState(CloudSolrClient.java:948)
	at org.apache.solr.client.solrj.impl.CloudSolrClient.requestWithRetryOnStaleState(CloudSolrClient.java:948)
	at org.apache.solr.client.solrj.impl.CloudSolrClient.requestWithRetryOnStaleState(CloudSolrClient.java:948)
	at org.apache.solr.client.solrj.impl.CloudSolrClient.requestWithRetryOnStaleState(CloudSolrClient.java:948)
	at org.apache.solr.client.solrj.impl.CloudSolrClient.request(CloudSolrClient.java:819)
	at org.apache.solr.client.solrj.SolrRequest.process(SolrRequest.java:194)
	at org.apache.solr.client.solrj.request.UpdateRequest.commit(UpdateRequest.java:233)
	at org.apache.solr.cloud.api.collections.TestCollectionsAPIViaSolrCloudCluster.testCollectionCreateSearchDelete(TestCollectionsAPIViaSolrCloudCluster.java:170)
	at sun.reflect.NativeMethodAccessorImpl.invoke0(Native Method)
	at sun.reflect.NativeMethodAccessorImpl.invoke(NativeMethodAccessorImpl.java:62)
	at sun.reflect.DelegatingMethodAccessorImpl.invoke(DelegatingMethodAccessorImpl.java:43)
	at java.lang.reflect.Method.invoke(Method.java:498)
	at com.carrotsearch.randomizedtesting.RandomizedRunner.invoke(RandomizedRunner.java:1737)
	at com.carrotsearch.randomizedtesting.RandomizedRunner$8.evaluate(RandomizedRunner.java:934)
	at com.carrotsearch.randomizedtesting.RandomizedRunner$9.evaluate(RandomizedRunner.java:970)
	at com.carrotsearch.randomizedtesting.RandomizedRunner$10.evaluate(RandomizedRunner.java:984)
	at com.carrotsearch.randomizedtesting.rules.SystemPropertiesRestoreRule$1.evaluate(SystemPropertiesRestoreRule.java:57)
	at org.apache.lucene.util.TestRuleSetupTeardownChained$1.evaluate(TestRuleSetupTeardownChained.java:49)
	at org.apache.lucene.util.AbstractBeforeAfterRule$1.evaluate(AbstractBeforeAfterRule.java:45)
	at org.apache.lucene.util.TestRuleThreadAndTestName$1.evaluate(TestRuleThreadAndTestName.java:48)
	at org.apache.lucene.util.TestRuleIgnoreAfterMaxFailures$1.evaluate(TestRuleIgnoreAfterMaxFailures.java:64)
	at org.apache.lucene.util.TestRuleMarkFailure$1.evaluate(TestRuleMarkFailure.java:47)
	at com.carrotsearch.randomizedtesting.rules.StatementAdapter.evaluate(StatementAdapter.java:36)
	at com.carrotsearch.randomizedtesting.ThreadLeakControl$StatementRunner.run(ThreadLeakControl.java:368)
	at com.carrotsearch.randomizedtesting.ThreadLeakControl.forkTimeoutingTask(ThreadLeakControl.java:817)
	at com.carrotsearch.randomizedtesting.ThreadLeakControl$3.evaluate(ThreadLeakControl.java:468)
	at com.carrotsearch.randomizedtesting.RandomizedRunner.runSingleTest(RandomizedRunner.java:943)
	at com.carrotsearch.randomizedtesting.RandomizedRunner$5.evaluate(RandomizedRunner.java:829)
	at com.carrotsearch.randomizedtesting.RandomizedRunner$6.evaluate(RandomizedRunner.java:879)
	at com.carrotsearch.randomizedtesting.RandomizedRunner$7.evaluate(RandomizedRunner.java:890)
	at com.carrotsearch.randomizedtesting.rules.StatementAdapter.evaluate(StatementAdapter.java:36)
	at com.carrotsearch.randomizedtesting.rules.SystemPropertiesRestoreRule$1.evaluate(SystemPropertiesRestoreRule.java:57)
	at org.apache.lucene.util.AbstractBeforeAfterRule$1.evaluate(AbstractBeforeAfterRule.java:45)
	at com.carrotsearch.randomizedtesting.rules.StatementAdapter.evaluate(StatementAdapter.java:36)
	at org.apache.lucene.util.TestRuleStoreClassName$1.evaluate(TestRuleStoreClassName.java:41)
	at com.carrotsearch.randomizedtesting.rules.NoShadowingOrOverridesOnMethodsRule$1.evaluate(NoShadowingOrOverridesOnMethodsRule.java:40)
	at com.carrotsearch.randomizedtesting.rules.NoShadowingOrOverridesOnMethodsRule$1.evaluate(NoShadowingOrOverridesOnMethodsRule.java:40)
	at com.carrotsearch.randomizedtesting.rules.StatementAdapter.evaluate(StatementAdapter.java:36)
	at com.carrotsearch.randomizedtesting.rules.StatementAdapter.evaluate(StatementAdapter.java:36)
	at com.carrotsearch.randomizedtesting.rules.StatementAdapter.evaluate(StatementAdapter.java:36)
	at org.apache.lucene.util.TestRuleAssertionsRequired$1.evaluate(TestRuleAssertionsRequired.java:53)
	at org.apache.lucene.util.TestRuleMarkFailure$1.evaluate(TestRuleMarkFailure.java:47)
	at org.apache.lucene.util.TestRuleIgnoreAfterMaxFailures$1.evaluate(TestRuleIgnoreAfterMaxFailures.java:64)
	at org.apache.lucene.util.TestRuleIgnoreTestSuites$1.evaluate(TestRuleIgnoreTestSuites.java:54)
	at com.carrotsearch.randomizedtesting.rules.StatementAdapter.evaluate(StatementAdapter.java:36)
	at com.carrotsearch.randomizedtesting.ThreadLeakControl$StatementRunner.run(ThreadLeakControl.java:368)
	at java.lang.Thread.run(Thread.java:748)
Caused by: org.apache.solr.client.solrj.impl.HttpSolrClient$RemoteSolrException: Error from server at http://127.0.0.1:59980/solr/testcollection_shard1_replica_n2: Expected mime type application/octet-stream but got text/html. <html>
<head>
<meta http-equiv="Content-Type" content="text/html;charset=utf-8"/>
<title>Error 404 Can not find: /solr/testcollection_shard1_replica_n2/update</title>
</head>
<body><h2>HTTP ERROR 404</h2>
<p>Problem accessing /solr/testcollection_shard1_replica_n2/update. Reason:
<pre>    Can not find: /solr/testcollection_shard1_replica_n2/update</pre></p><hr><a href="http://eclipse.org/jetty">Powered by Jetty:// 9.4.11.v20180605</a><hr/>

</body>
</html>

	at org.apache.solr.client.solrj.impl.HttpSolrClient.executeMethod(HttpSolrClient.java:607)
	at org.apache.solr.client.solrj.impl.HttpSolrClient.request(HttpSolrClient.java:255)
	at org.apache.solr.client.solrj.impl.HttpSolrClient.request(HttpSolrClient.java:244)
	at org.apache.solr.client.solrj.impl.LBHttpSolrClient.doRequest(LBHttpSolrClient.java:483)
	at org.apache.solr.client.solrj.impl.LBHttpSolrClient.request(LBHttpSolrClient.java:413)
	at org.apache.solr.client.solrj.impl.CloudSolrClient.lambda$directUpdate$0(CloudSolrClient.java:528)
	at java.util.concurrent.FutureTask.run(FutureTask.java:266)
	at org.apache.solr.common.util.ExecutorUtil$MDCAwareThreadPoolExecutor.lambda$execute$0(ExecutorUtil.java:209)
	at java.util.concurrent.ThreadPoolExecutor.runWorker(ThreadPoolExecutor.java:1149)
	at java.util.concurrent.ThreadPoolExecutor$Worker.run(ThreadPoolExecutor.java:624)
	... 1 more


FAILED:  org.apache.solr.cloud.autoscaling.sim.TestLargeCluster.testAddNode

Error Message:
trigger did not fire

Stack Trace:
java.lang.AssertionError: trigger did not fire
	at __randomizedtesting.SeedInfo.seed([EC0E8466C13A747D:4BE199C50E77FB65]:0)
	at org.junit.Assert.fail(Assert.java:93)
	at org.junit.Assert.assertTrue(Assert.java:43)
	at org.apache.solr.cloud.autoscaling.sim.TestLargeCluster.testAddNode(TestLargeCluster.java:309)
	at sun.reflect.NativeMethodAccessorImpl.invoke0(Native Method)
	at sun.reflect.NativeMethodAccessorImpl.invoke(NativeMethodAccessorImpl.java:62)
	at sun.reflect.DelegatingMethodAccessorImpl.invoke(DelegatingMethodAccessorImpl.java:43)
	at java.lang.reflect.Method.invoke(Method.java:498)
	at com.carrotsearch.randomizedtesting.RandomizedRunner.invoke(RandomizedRunner.java:1737)
	at com.carrotsearch.randomizedtesting.RandomizedRunner$8.evaluate(RandomizedRunner.java:934)
	at com.carrotsearch.randomizedtesting.RandomizedRunner$9.evaluate(RandomizedRunner.java:970)
	at com.carrotsearch.randomizedtesting.RandomizedRunner$10.evaluate(RandomizedRunner.java:984)
	at com.carrotsearch.randomizedtesting.rules.SystemPropertiesRestoreRule$1.evaluate(SystemPropertiesRestoreRule.java:57)
	at org.apache.lucene.util.TestRuleSetupTeardownChained$1.evaluate(TestRuleSetupTeardownChained.java:49)
	at org.apache.lucene.util.AbstractBeforeAfterRule$1.evaluate(AbstractBeforeAfterRule.java:45)
	at org.apache.lucene.util.TestRuleThreadAndTestName$1.evaluate(TestRuleThreadAndTestName.java:48)
	at org.apache.lucene.util.TestRuleIgnoreAfterMaxFailures$1.evaluate(TestRuleIgnoreAfterMaxFailures.java:64)
	at org.apache.lucene.util.TestRuleMarkFailure$1.evaluate(TestRuleMarkFailure.java:47)
	at com.carrotsearch.randomizedtesting.rules.StatementAdapter.evaluate(StatementAdapter.java:36)
	at com.carrotsearch.randomizedtesting.ThreadLeakControl$StatementRunner.run(ThreadLeakControl.java:368)
	at com.carrotsearch.randomizedtesting.ThreadLeakControl.forkTimeoutingTask(ThreadLeakControl.java:817)
	at com.carrotsearch.randomizedtesting.ThreadLeakControl$3.evaluate(ThreadLeakControl.java:468)
	at com.carrotsearch.randomizedtesting.RandomizedRunner.runSingleTest(RandomizedRunner.java:943)
	at com.carrotsearch.randomizedtesting.RandomizedRunner$5.evaluate(RandomizedRunner.java:829)
	at com.carrotsearch.randomizedtesting.RandomizedRunner$6.evaluate(RandomizedRunner.java:879)
	at com.carrotsearch.randomizedtesting.RandomizedRunner$7.evaluate(RandomizedRunner.java:890)
	at com.carrotsearch.randomizedtesting.rules.StatementAdapter.evaluate(StatementAdapter.java:36)
	at com.carrotsearch.randomizedtesting.rules.SystemPropertiesRestoreRule$1.evaluate(SystemPropertiesRestoreRule.java:57)
	at org.apache.lucene.util.AbstractBeforeAfterRule$1.evaluate(AbstractBeforeAfterRule.java:45)
	at com.carrotsearch.randomizedtesting.rules.StatementAdapter.evaluate(StatementAdapter.java:36)
	at org.apache.lucene.util.TestRuleStoreClassName$1.evaluate(TestRuleStoreClassName.java:41)
	at com.carrotsearch.randomizedtesting.rules.NoShadowingOrOverridesOnMethodsRule$1.evaluate(NoShadowingOrOverridesOnMethodsRule.java:40)
	at com.carrotsearch.randomizedtesting.rules.NoShadowingOrOverridesOnMethodsRule$1.evaluate(NoShadowingOrOverridesOnMethodsRule.java:40)
	at com.carrotsearch.randomizedtesting.rules.StatementAdapter.evaluate(StatementAdapter.java:36)
	at com.carrotsearch.randomizedtesting.rules.StatementAdapter.evaluate(StatementAdapter.java:36)
	at com.carrotsearch.randomizedtesting.rules.StatementAdapter.evaluate(StatementAdapter.java:36)
	at org.apache.lucene.util.TestRuleAssertionsRequired$1.evaluate(TestRuleAssertionsRequired.java:53)
	at org.apache.lucene.util.TestRuleMarkFailure$1.evaluate(TestRuleMarkFailure.java:47)
	at org.apache.lucene.util.TestRuleIgnoreAfterMaxFailures$1.evaluate(TestRuleIgnoreAfterMaxFailures.java:64)
	at org.apache.lucene.util.TestRuleIgnoreTestSuites$1.evaluate(TestRuleIgnoreTestSuites.java:54)
	at com.carrotsearch.randomizedtesting.rules.StatementAdapter.evaluate(StatementAdapter.java:36)
	at com.carrotsearch.randomizedtesting.ThreadLeakControl$StatementRunner.run(ThreadLeakControl.java:368)
	at java.lang.Thread.run(Thread.java:748)




Build Log:
[...truncated 13824 lines...]
   [junit4] Suite: org.apache.solr.cloud.TestAuthenticationFramework
   [junit4]   2> Creating dataDir: /x1/jenkins/jenkins-slave/workspace/Lucene-Solr-BadApples-Tests-master/solr/build/solr-core/test/J1/temp/solr.cloud.TestAuthenticationFramework_EC0E8466C13A747D-001/init-core-data-001
   [junit4]   2> 2842735 WARN  (SUITE-TestAuthenticationFramework-seed#[EC0E8466C13A747D]-worker) [    ] o.a.s.SolrTestCaseJ4 startTrackingSearchers: numOpens=25 numCloses=25
   [junit4]   2> 2842735 INFO  (SUITE-TestAuthenticationFramework-seed#[EC0E8466C13A747D]-worker) [    ] o.a.s.SolrTestCaseJ4 Using PointFields (NUMERIC_POINTS_SYSPROP=true) w/NUMERIC_DOCVALUES_SYSPROP=true
   [junit4]   2> 2842737 INFO  (SUITE-TestAuthenticationFramework-seed#[EC0E8466C13A747D]-worker) [    ] o.a.s.SolrTestCaseJ4 Randomized ssl (false) and clientAuth (false) via: @org.apache.solr.util.RandomizeSSL(reason=, value=NaN, ssl=NaN, clientAuth=NaN)
   [junit4]   2> 2842737 INFO  (SUITE-TestAuthenticationFramework-seed#[EC0E8466C13A747D]-worker) [    ] o.a.s.SolrTestCaseJ4 SecureRandom sanity checks: test.solr.allowed.securerandom=null & java.security.egd=file:/dev/./urandom
   [junit4]   2> 2842739 INFO  (TEST-TestAuthenticationFramework.testBasics-seed#[EC0E8466C13A747D]) [    ] o.a.s.c.MiniSolrCloudCluster Starting cluster of 2 servers in /x1/jenkins/jenkins-slave/workspace/Lucene-Solr-BadApples-Tests-master/solr/build/solr-core/test/J1/temp/solr.cloud.TestAuthenticationFramework_EC0E8466C13A747D-001/tempDir-001
   [junit4]   2> 2842739 INFO  (TEST-TestAuthenticationFramework.testBasics-seed#[EC0E8466C13A747D]) [    ] o.a.s.c.ZkTestServer STARTING ZK TEST SERVER
   [junit4]   2> 2842740 INFO  (Thread-5824) [    ] o.a.s.c.ZkTestServer client port:0.0.0.0/0.0.0.0:0
   [junit4]   2> 2842740 INFO  (Thread-5824) [    ] o.a.s.c.ZkTestServer Starting server
   [junit4]   2> 2842742 ERROR (Thread-5824) [    ] o.a.z.s.ZooKeeperServer ZKShutdownHandler is not registered, so ZooKeeper server won't take any action on ERROR or SHUTDOWN server state changes
   [junit4]   2> 2842840 INFO  (TEST-TestAuthenticationFramework.testBasics-seed#[EC0E8466C13A747D]) [    ] o.a.s.c.ZkTestServer start zk server on port:37962
   [junit4]   2> 2842842 INFO  (zkConnectionManagerCallback-4844-thread-1) [    ] o.a.s.c.c.ConnectionManager zkClient has connected
   [junit4]   2> 2842853 WARN  (NIOServerCxn.Factory:0.0.0.0/0.0.0.0:0) [    ] o.a.z.s.NIOServerCnxn Unable to read additional data from client sessionid 0x1073e50b7e50000, likely client has closed socket
   [junit4]   2> 2842854 INFO  (jetty-launcher-4841-thread-1) [    ] o.e.j.s.Server jetty-9.4.11.v20180605; built: 2018-06-05T18:24:03.829Z; git: d5fc0523cfa96bfebfbda19606cad384d772f04c; jvm 1.8.0_172-b11
   [junit4]   2> 2842855 INFO  (jetty-launcher-4841-thread-2) [    ] o.e.j.s.Server jetty-9.4.11.v20180605; built: 2018-06-05T18:24:03.829Z; git: d5fc0523cfa96bfebfbda19606cad384d772f04c; jvm 1.8.0_172-b11
   [junit4]   2> 2842856 INFO  (jetty-launcher-4841-thread-1) [    ] o.e.j.s.session DefaultSessionIdManager workerName=node0
   [junit4]   2> 2842857 INFO  (jetty-launcher-4841-thread-1) [    ] o.e.j.s.session No SessionScavenger set, using defaults
   [junit4]   2> 2842857 INFO  (jetty-launcher-4841-thread-1) [    ] o.e.j.s.session node0 Scavenging every 660000ms
   [junit4]   2> 2842857 INFO  (jetty-launcher-4841-thread-2) [    ] o.e.j.s.session DefaultSessionIdManager workerName=node0
   [junit4]   2> 2842857 INFO  (jetty-launcher-4841-thread-2) [    ] o.e.j.s.session No SessionScavenger set, using defaults
   [junit4]   2> 2842857 INFO  (jetty-launcher-4841-thread-2) [    ] o.e.j.s.session node0 Scavenging every 660000ms
   [junit4]   2> 2842857 INFO  (jetty-launcher-4841-thread-1) [    ] o.e.j.s.h.ContextHandler Started o.e.j.s.ServletContextHandler@3e030d49{/solr,null,AVAILABLE}
   [junit4]   2> 2842857 INFO  (jetty-launcher-4841-thread-2) [    ] o.e.j.s.h.ContextHandler Started o.e.j.s.ServletContextHandler@15bb59e2{/solr,null,AVAILABLE}
   [junit4]   2> 2842858 INFO  (jetty-launcher-4841-thread-2) [    ] o.e.j.s.AbstractConnector Started ServerConnector@239c7431{HTTP/1.1,[http/1.1]}{127.0.0.1:52721}
   [junit4]   2> 2842858 INFO  (jetty-launcher-4841-thread-1) [    ] o.e.j.s.AbstractConnector Started ServerConnector@51e483b6{HTTP/1.1,[http/1.1]}{127.0.0.1:59685}
   [junit4]   2> 2842858 INFO  (jetty-launcher-4841-thread-2) [    ] o.e.j.s.Server Started @2843079ms
   [junit4]   2> 2842858 INFO  (jetty-launcher-4841-thread-1) [    ] o.e.j.s.Server Started @2843079ms
   [junit4]   2> 2842858 INFO  (jetty-launcher-4841-thread-2) [    ] o.a.s.c.s.e.JettySolrRunner Jetty properties: {hostContext=/solr, hostPort=52721}
   [junit4]   2> 2842858 INFO  (jetty-launcher-4841-thread-1) [    ] o.a.s.c.s.e.JettySolrRunner Jetty properties: {hostContext=/solr, hostPort=59685}
   [junit4]   2> 2842859 ERROR (jetty-launcher-4841-thread-1) [    ] o.a.s.u.StartupLoggingUtils Missing Java Option solr.log.dir. Logging may be missing or incomplete.
   [junit4]   2> 2842859 ERROR (jetty-launcher-4841-thread-2) [    ] o.a.s.u.StartupLoggingUtils Missing Java Option solr.log.dir. Logging may be missing or incomplete.
   [junit4]   2> 2842859 INFO  (jetty-launcher-4841-thread-1) [    ] o.a.s.s.SolrDispatchFilter Using logger factory org.apache.logging.slf4j.Log4jLoggerFactory
   [junit4]   2> 2842859 INFO  (jetty-launcher-4841-thread-2) [    ] o.a.s.s.SolrDispatchFilter Using logger factory org.apache.logging.slf4j.Log4jLoggerFactory
   [junit4]   2> 2842859 INFO  (jetty-launcher-4841-thread-1) [    ] o.a.s.s.SolrDispatchFilter  ___      _       Welcome to Apache Solr™ version 8.0.0
   [junit4]   2> 2842859 INFO  (jetty-launcher-4841-thread-1) [    ] o.a.s.s.SolrDispatchFilter / __| ___| |_ _   Starting in cloud mode on port null
   [junit4]   2> 2842859 INFO  (jetty-launcher-4841-thread-1) [    ] o.a.s.s.SolrDispatchFilter \__ \/ _ \ | '_|  Install dir: null
   [junit4]   2> 2842859 INFO  (jetty-launcher-4841-thread-1) [    ] o.a.s.s.SolrDispatchFilter |___/\___/_|_|    Start time: 2018-07-06T06:25:51.498Z
   [junit4]   2> 2842864 INFO  (jetty-launcher-4841-thread-2) [    ] o.a.s.s.SolrDispatchFilter  ___      _       Welcome to Apache Solr™ version 8.0.0
   [junit4]   2> 2842864 INFO  (jetty-launcher-4841-thread-2) [    ] o.a.s.s.SolrDispatchFilter / __| ___| |_ _   Starting in cloud mode on port null
   [junit4]   2> 2842864 INFO  (jetty-launcher-4841-thread-2) [    ] o.a.s.s.SolrDispatchFilter \__ \/ _ \ | '_|  Install dir: null
   [junit4]   2> 2842864 INFO  (jetty-launcher-4841-thread-2) [    ] o.a.s.s.SolrDispatchFilter |___/\___/_|_|    Start time: 2018-07-06T06:25:51.503Z
   [junit4]   2> 2842872 INFO  (zkConnectionManagerCallback-4846-thread-1) [    ] o.a.s.c.c.ConnectionManager zkClient has connected
   [junit4]   2> 2842876 INFO  (zkConnectionManagerCallback-4848-thread-1) [    ] o.a.s.c.c.ConnectionManager zkClient has connected
   [junit4]   2> 2842876 INFO  (jetty-launcher-4841-thread-1) [    ] o.a.s.s.SolrDispatchFilter solr.xml found in ZooKeeper. Loading...
   [junit4]   2> 2842877 INFO  (jetty-launcher-4841-thread-2) [    ] o.a.s.s.SolrDispatchFilter solr.xml found in ZooKeeper. Loading...
   [junit4]   2> 2843162 INFO  (jetty-launcher-4841-thread-1) [    ] o.a.s.c.ZkContainer Zookeeper client=127.0.0.1:37962/solr
   [junit4]   2> 2843163 INFO  (zkConnectionManagerCallback-4852-thread-1) [    ] o.a.s.c.c.ConnectionManager zkClient has connected
   [junit4]   2> 2843165 INFO  (zkConnectionManagerCallback-4854-thread-1) [    ] o.a.s.c.c.ConnectionManager zkClient has connected
   [junit4]   2> 2843211 INFO  (jetty-launcher-4841-thread-2) [    ] o.a.s.c.ZkContainer Zookeeper client=127.0.0.1:37962/solr
   [junit4]   2> 2843213 INFO  (zkConnectionManagerCallback-4860-thread-1) [    ] o.a.s.c.c.ConnectionManager zkClient has connected
   [junit4]   2> 2843216 INFO  (zkConnectionManagerCallback-4862-thread-1) [    ] o.a.s.c.c.ConnectionManager zkClient has connected
   [junit4]   2> 2843257 INFO  (jetty-launcher-4841-thread-2) [n:127.0.0.1:52721_solr    ] o.a.s.c.Overseer Overseer (id=null) closing
   [junit4]   2> 2843258 INFO  (jetty-launcher-4841-thread-2) [n:127.0.0.1:52721_solr    ] o.a.s.c.OverseerElectionContext I am going to be the leader 127.0.0.1:52721_solr
   [junit4]   2> 2843260 INFO  (jetty-launcher-4841-thread-2) [n:127.0.0.1:52721_solr    ] o.a.s.c.Overseer Overseer (id=74096435278446598-127.0.0.1:52721_solr-n_0000000000) starting
   [junit4]   2> 2843273 INFO  (zkConnectionManagerCallback-4869-thread-1) [    ] o.a.s.c.c.ConnectionManager zkClient has connected
   [junit4]   2> 2843276 INFO  (jetty-launcher-4841-thread-2) [n:127.0.0.1:52721_solr    ] o.a.s.c.s.i.ZkClientClusterStateProvider Cluster at 127.0.0.1:37962/solr ready
   [junit4]   2> 2843287 INFO  (jetty-launcher-4841-thread-1) [n:127.0.0.1:59685_solr    ] o.a.s.c.Overseer Overseer (id=null) closing
   [junit4]   2> 2843288 INFO  (jetty-launcher-4841-thread-2) [n:127.0.0.1:52721_solr    ] o.a.s.c.ZkController Register node as live in ZooKeeper:/live_nodes/127.0.0.1:52721_solr
   [junit4]   2> 2843288 INFO  (jetty-launcher-4841-thread-1) [n:127.0.0.1:59685_solr    ] o.a.s.c.ZkController Register node as live in ZooKeeper:/live_nodes/127.0.0.1:59685_solr
   [junit4]   2> 2843289 INFO  (jetty-launcher-4841-thread-2) [n:127.0.0.1:52721_solr    ] o.a.s.c.CoreContainer Initializing authentication plugin: org.apache.solr.cloud.TestAuthenticationFramework$MockAuthenticationPlugin
   [junit4]   2> 2843292 INFO  (jetty-launcher-4841-thread-1) [n:127.0.0.1:59685_solr    ] o.a.s.c.CoreContainer Initializing authentication plugin: org.apache.solr.cloud.TestAuthenticationFramework$MockAuthenticationPlugin
   [junit4]   2> 2843311 INFO  (zkCallback-4861-thread-1) [    ] o.a.s.c.c.ZkStateReader Updated live nodes from ZooKeeper... (0) -> (2)
   [junit4]   2> 2843321 INFO  (zkCallback-4853-thread-1) [    ] o.a.s.c.c.ZkStateReader Updated live nodes from ZooKeeper... (0) -> (2)
   [junit4]   2> 2843325 INFO  (zkCallback-4868-thread-1) [    ] o.a.s.c.c.ZkStateReader Updated live nodes from ZooKeeper... (0) -> (2)
   [junit4]   2> 2843330 INFO  (jetty-launcher-4841-thread-2) [n:127.0.0.1:52721_solr    ] o.a.s.h.a.MetricsHistoryHandler No .system collection, keeping metrics history in memory.
   [junit4]   2> 2843354 INFO  (zkConnectionManagerCallback-4875-thread-1) [    ] o.a.s.c.c.ConnectionManager zkClient has connected
   [junit4]   2> 2843356 INFO  (jetty-launcher-4841-thread-1) [n:127.0.0.1:59685_solr    ] o.a.s.c.c.ZkStateReader Updated live nodes from ZooKeeper... (0) -> (2)
   [junit4]   2> 2843357 INFO  (jetty-launcher-4841-thread-1) [n:127.0.0.1:59685_solr    ] o.a.s.c.s.i.ZkClientClusterStateProvider Cluster at 127.0.0.1:37962/solr ready
   [junit4]   2> 2843363 INFO  (jetty-launcher-4841-thread-1) [n:127.0.0.1:59685_solr    ] o.a.s.h.a.MetricsHistoryHandler No .system collection, keeping metrics history in memory.
   [junit4]   2> 2843378 INFO  (jetty-launcher-4841-thread-2) [n:127.0.0.1:52721_solr    ] o.a.s.m.r.SolrJmxReporter JMX monitoring for 'solr_52721.solr.node' (registry 'solr.node') enabled at server: com.sun.jmx.mbeanserver.JmxMBeanServer@fdddafd
   [junit4]   2> 2843397 INFO  (jetty-launcher-4841-thread-2) [n:127.0.0.1:52721_solr    ] o.a.s.m.r.SolrJmxReporter JMX monitoring for 'solr_52721.solr.jvm' (registry 'solr.jvm') enabled at server: com.sun.jmx.mbeanserver.JmxMBeanServer@fdddafd
   [junit4]   2> 2843397 INFO  (jetty-launcher-4841-thread-2) [n:127.0.0.1:52721_solr    ] o.a.s.m.r.SolrJmxReporter JMX monitoring for 'solr_52721.solr.jetty' (registry 'solr.jetty') enabled at server: com.sun.jmx.mbeanserver.JmxMBeanServer@fdddafd
   [junit4]   2> 2843399 INFO  (jetty-launcher-4841-thread-2) [n:127.0.0.1:52721_solr    ] o.a.s.c.CorePropertiesLocator Found 0 core definitions underneath /x1/jenkins/jenkins-slave/workspace/Lucene-Solr-BadApples-Tests-master/solr/build/solr-core/test/J1/temp/solr.cloud.TestAuthenticationFramework_EC0E8466C13A747D-001/tempDir-001/node2/.
   [junit4]   2> 2843409 INFO  (jetty-launcher-4841-thread-1) [n:127.0.0.1:59685_solr    ] o.a.s.m.r.SolrJmxReporter JMX monitoring for 'solr_59685.solr.node' (registry 'solr.node') enabled at server: com.sun.jmx.mbeanserver.JmxMBeanServer@fdddafd
   [junit4]   2> 2843454 INFO  (jetty-launcher-4841-thread-1) [n:127.0.0.1:59685_solr    ] o.a.s.m.r.SolrJmxReporter JMX monitoring for 'solr_59685.solr.jvm' (registry 'solr.jvm') enabled at server: com.sun.jmx.mbeanserver.JmxMBeanServer@fdddafd
   [junit4]   2> 2843454 INFO  (jetty-launcher-4841-thread-1) [n:127.0.0.1:59685_solr    ] o.a.s.m.r.SolrJmxReporter JMX monitoring for 'solr_59685.solr.jetty' (registry 'solr.jetty') enabled at server: com.sun.jmx.mbeanserver.JmxMBeanServer@fdddafd
   [junit4]   2> 2843456 INFO  (jetty-launcher-4841-thread-1) [n:127.0.0.1:59685_solr    ] o.a.s.c.CorePropertiesLocator Found 0 core definitions underneath /x1/jenkins/jenkins-slave/workspace/Lucene-Solr-BadApples-Tests-master/solr/build/solr-core/test/J1/temp/solr.cloud.TestAuthenticationFramework_EC0E8466C13A747D-001/tempDir-001/node1/.
   [junit4]   2> 2843507 INFO  (zkConnectionManagerCallback-4878-thread-1) [    ] o.a.s.c.c.ConnectionManager zkClient has connected
   [junit4]   2> 2843511 INFO  (zkConnectionManagerCallback-4883-thread-1) [    ] o.a.s.c.c.ConnectionManager zkClient has connected
   [junit4]   2> 2843513 INFO  (TEST-TestAuthenticationFramework.testBasics-seed#[EC0E8466C13A747D]) [    ] o.a.s.c.c.ZkStateReader Updated live nodes from ZooKeeper... (0) -> (2)
   [junit4]   2> 2843514 INFO  (TEST-TestAuthenticationFramework.testBasics-seed#[EC0E8466C13A747D]) [    ] o.a.s.c.s.i.ZkClientClusterStateProvider Cluster at 127.0.0.1:37962/solr ready
   [junit4]   2> 2843517 INFO  (TEST-TestAuthenticationFramework.testBasics-seed#[EC0E8466C13A747D]) [    ] o.a.s.SolrTestCaseJ4 ###Starting testBasics
   [junit4]   2> 2843519 INFO  (qtp1514045924-19850) [n:127.0.0.1:59685_solr    ] o.a.s.h.a.CollectionsHandler Invoked Collection Action :create with params async=0a2874e6-04e3-4691-b1dd-586c6490b5e6&collection.configName=solrCloudCollectionConfig&maxShardsPerNode=2&name=testcollection&nrtReplicas=2&action=CREATE&numShards=2&wt=javabin&version=2 and sendToOCPQueue=true
   [junit4]   2> 2843523 INFO  (qtp1514045924-19850) [n:127.0.0.1:59685_solr    ] o.a.s.s.HttpSolrCall [admin] webapp=null path=/admin/collections params={async=0a2874e6-04e3-4691-b1dd-586c6490b5e6&collection.configName=solrCloudCollectionConfig&maxShardsPerNode=2&name=testcollection&nrtReplicas=2&action=CREATE&numShards=2&wt=javabin&version=2} status=0 QTime=3
   [junit4]   2> 2843536 INFO  (qtp1514045924-19842) [n:127.0.0.1:59685_solr    ] o.a.s.h.a.CollectionsHandler Invoked Collection Action :requeststatus with params requestid=0a2874e6-04e3-4691-b1dd-586c6490b5e6&action=REQUESTSTATUS&wt=javabin&version=2 and sendToOCPQueue=true
   [junit4]   2> 2843537 INFO  (qtp1514045924-19842) [n:127.0.0.1:59685_solr    ] o.a.s.s.HttpSolrCall [admin] webapp=null path=/admin/collections params={requestid=0a2874e6-04e3-4691-b1dd-586c6490b5e6&action=REQUESTSTATUS&wt=javabin&version=2} status=0 QTime=1
   [junit4]   2> 2843544 INFO  (OverseerThreadFactory-7017-thread-1) [    ] o.a.s.c.a.c.CreateCollectionCmd Create collection testcollection
   [junit4]   2> 2843656 INFO  (OverseerStateUpdate-74096435278446598-127.0.0.1:52721_solr-n_0000000000) [    ] o.a.s.c.o.SliceMutator createReplica() {
   [junit4]   2>   "operation":"ADDREPLICA",
   [junit4]   2>   "collection":"testcollection",
   [junit4]   2>   "shard":"shard1",
   [junit4]   2>   "core":"testcollection_shard1_replica_n1",
   [junit4]   2>   "state":"down",
   [junit4]   2>   "base_url":"http://127.0.0.1:52721/solr",
   [junit4]   2>   "type":"NRT",
   [junit4]   2>   "waitForFinalState":"false"} 
   [junit4]   2> 2843659 INFO  (OverseerStateUpdate-74096435278446598-127.0.0.1:52721_solr-n_0000000000) [    ] o.a.s.c.o.SliceMutator createReplica() {
   [junit4]   2>   "operation":"ADDREPLICA",
   [junit4]   2>   "collection":"testcollection",
   [junit4]   2>   "shard":"shard1",
   [junit4]   2>   "core":"testcollection_shard1_replica_n2",
   [junit4]   2>   "state":"down",
   [junit4]   2>   "base_url":"http://127.0.0.1:59685/solr",
   [junit4]   2>   "type":"NRT",
   [junit4]   2>   "waitForFinalState":"false"} 
   [junit4]   2> 2843662 INFO  (OverseerStateUpdate-74096435278446598-127.0.0.1:52721_solr-n_0000000000) [    ] o.a.s.c.o.SliceMutator createReplica() {
   [junit4]   2>   "operation":"ADDREPLICA",
   [junit4]   2>   "collection":"testcollection",
   [junit4]   2>   "shard":"shard2",
   [junit4]   2>   "core":"testcollection_shard2_replica_n4",
   [junit4]   2>   "state":"down",
   [junit4]   2>   "base_url":"http://127.0.0.1:52721/solr",
   [junit4]   2>   "type":"NRT",
   [junit4]   2>   "waitForFinalState":"false"} 
   [junit4]   2> 2843666 INFO  (OverseerStateUpdate-74096435278446598-127.0.0.1:52721_solr-n_0000000000) [    ] o.a.s.c.o.SliceMutator createReplica() {
   [junit4]   2>   "operation":"ADDREPLICA",
   [junit4]   2>   "collection":"testcollection",
   [junit4]   2>   "shard":"shard2",
   [junit4]   2>   "core":"testcollection_shard2_replica_n6",
   [junit4]   2>   "state":"down",
   [junit4]   2>   "base_url":"http://127.0.0.1:59685/solr",
   [junit4]   2>   "type":"NRT",
   [junit4]   2>   "waitForFinalState":"false"} 
   [junit4]   2> 2843888 INFO  (qtp1514045924-19848) [n:127.0.0.1:59685_solr    x:testcollection_shard2_replica_n6] o.a.s.s.HttpSolrCall [admin] webapp=null path=/admin/cores params={qt=/admin/cores&collection.configName=solrCloudCollectionConfig&newCollection=true&collection=testcollection&version=2&replicaType=NRT&async=0a2874e6-04e3-4691-b1dd-586c6490b5e631110249345115649&coreNodeName=core_node8&name=testcollection_shard2_replica_n6&action=CREATE&numShards=2&shard=shard2&wt=javabin} status=0 QTime=0
   [junit4]   2> 2843889 INFO  (parallelCoreAdminExecutor-7019-thread-2-processing-n:127.0.0.1:59685_solr x:testcollection_shard2_replica_n6 0a2874e6-04e3-4691-b1dd-586c6490b5e631110249345115649 CREATE) [n:127.0.0.1:59685_solr    x:testcollection_shard2_replica_n6] o.a.s.h.a.CoreAdminOperation core create command qt=/admin/cores&collection.configName=solrCloudCollectionConfig&newCollection=true&collection=testcollection&version=2&replicaType=NRT&async=0a2874e6-04e3-4691-b1dd-586c6490b5e631110249345115649&coreNodeName=core_node8&name=testcollection_shard2_replica_n6&action=CREATE&numShards=2&shard=shard2&wt=javabin
   [junit4]   2> 2843889 INFO  (parallelCoreAdminExecutor-7019-thread-2-processing-n:127.0.0.1:59685_solr x:testcollection_shard2_replica_n6 0a2874e6-04e3-4691-b1dd-586c6490b5e631110249345115649 CREATE) [n:127.0.0.1:59685_solr    x:testcollection_shard2_replica_n6] o.a.s.c.TransientSolrCoreCacheDefault Allocating transient cache for 2147483647 transient cores
   [junit4]   2> 2843891 INFO  (qtp1514045924-19841) [n:127.0.0.1:59685_solr    x:testcollection_shard1_replica_n2] o.a.s.s.HttpSolrCall [admin] webapp=null path=/admin/cores params={qt=/admin/cores&collection.configName=solrCloudCollectionConfig&newCollection=true&collection=testcollection&version=2&replicaType=NRT&async=0a2874e6-04e3-4691-b1dd-586c6490b5e631110249338878288&coreNodeName=core_node5&name=testcollection_shard1_replica_n2&action=CREATE&numShards=2&shard=shard1&wt=javabin} status=0 QTime=4
   [junit4]   2> 2843891 INFO  (parallelCoreAdminExecutor-7019-thread-1-processing-n:127.0.0.1:59685_solr x:testcollection_shard1_replica_n2 0a2874e6-04e3-4691-b1dd-586c6490b5e631110249338878288 CREATE) [n:127.0.0.1:59685_solr    x:testcollection_shard1_replica_n2] o.a.s.h.a.CoreAdminOperation core create command qt=/admin/cores&collection.configName=solrCloudCollectionConfig&newCollection=true&collection=testcollection&version=2&replicaType=NRT&async=0a2874e6-04e3-4691-b1dd-586c6490b5e631110249338878288&coreNodeName=core_node5&name=testcollection_shard1_replica_n2&action=CREATE&numShards=2&shard=shard1&wt=javabin
   [junit4]   2> 2843891 INFO  (qtp1795113159-19845) [n:127.0.0.1:52721_solr    x:testcollection_shard1_replica_n1] o.a.s.s.HttpSolrCall [admin] webapp=null path=/admin/cores params={qt=/admin/cores&collection.configName=solrCloudCollectionConfig&newCollection=true&collection=testcollection&version=2&replicaType=NRT&async=0a2874e6-04e3-4691-b1dd-586c6490b5e631110249334178897&coreNodeName=core_node3&name=testcollection_shard1_replica_n1&action=CREATE&numShards=2&shard=shard1&wt=javabin} status=0 QTime=3
   [junit4]   2> 2843892 INFO  (parallelCoreAdminExecutor-7018-thread-1-processing-n:127.0.0.1:52721_solr x:testcollection_shard1_replica_n1 0a2874e6-04e3-4691-b1dd-586c6490b5e631110249334178897 CREATE) [n:127.0.0.1:52721_solr    x:testcollection_shard1_replica_n1] o.a.s.h.a.CoreAdminOperation core create command qt=/admin/cores&collection.configName=solrCloudCollectionConfig&newCollection=true&collection=testcollection&version=2&replicaType=NRT&async=0a2874e6-04e3-4691-b1dd-586c6490b5e631110249334178897&coreNodeName=core_node3&name=testcollection_shard1_replica_n1&action=CREATE&numShards=2&shard=shard1&wt=javabin
   [junit4]   2> 2843892 INFO  (qtp1795113159-19845) [n:127.0.0.1:52721_solr    x:testcollection_shard2_replica_n4] o.a.s.s.HttpSolrCall [admin] webapp=null path=/admin/cores params={qt=/admin/cores&collection.configName=solrCloudCollectionConfig&newCollection=true&collection=testcollection&version=2&replicaType=NRT&async=0a2874e6-04e3-4691-b1dd-586c6490b5e631110249342038157&coreNodeName=core_node7&name=testcollection_shard2_replica_n4&action=CREATE&numShards=2&shard=shard2&wt=javabin} status=0 QTime=0
   [junit4]   2> 2843892 INFO  (parallelCoreAdminExecutor-7018-thread-1-processing-n:127.0.0.1:52721_solr x:testcollection_shard1_replica_n1 0a2874e6-04e3-4691-b1dd-586c6490b5e631110249334178897 CREATE) [n:127.0.0.1:52721_solr    x:testcollection_shard1_replica_n1] o.a.s.c.TransientSolrCoreCacheDefault Allocating transient cache for 2147483647 transient cores
   [junit4]   2> 2843896 INFO  (qtp1514045924-19852) [n:127.0.0.1:59685_solr    ] o.a.s.h.a.CoreAdminOperation Checking request status for : 0a2874e6-04e3-4691-b1dd-586c6490b5e631110249345115649
   [junit4]   2> 2843896 INFO  (qtp1514045924-19852) [n:127.0.0.1:59685_solr    ] o.a.s.s.HttpSolrCall [admin] webapp=null path=/admin/cores params={qt=/admin/cores&requestid=0a2874e6-04e3-4691-b1dd-586c6490b5e631110249345115649&action=REQUESTSTATUS&wt=javabin&version=2} status=0 QTime=0
   [junit4]   2> 2843897 INFO  (parallelCoreAdminExecutor-7018-thread-2-processing-n:127.0.0.1:52721_solr x:testcollection_shard2_replica_n4 0a2874e6-04e3-4691-b1dd-586c6490b5e631110249342038157 CREATE) [n:127.0.0.1:52721_solr    x:testcollection_shard2_replica_n4] o.a.s.h.a.CoreAdminOperation core create command qt=/admin/cores&collection.configName=solrCloudCollectionConfig&newCollection=true&collection=testcollection&version=2&replicaType=NRT&async=0a2874e6-04e3-4691-b1dd-586c6490b5e631110249342038157&coreNodeName=core_node7&name=testcollection_shard2_replica_n4&action=CREATE&numShards=2&shard=shard2&wt=javabin
   [junit4]   2> 2844538 INFO  (qtp1514045924-19846) [n:127.0.0.1:59685_solr    ] o.a.s.h.a.CollectionsHandler Invoked Collection Action :requeststatus with params requestid=0a2874e6-04e3-4691-b1dd-586c6490b5e6&action=REQUESTSTATUS&wt=javabin&version=2 and sendToOCPQueue=true
   [junit4]   2> 2844539 INFO  (qtp1514045924-19846) [n:127.0.0.1:59685_solr    ] o.a.s.s.HttpSolrCall [admin] webapp=null path=/admin/collections params={requestid=0a2874e6-04e3-4691-b1dd-586c6490b5e6&action=REQUESTSTATUS&wt=javabin&version=2} status=0 QTime=1
   [junit4]   2> 2844898 INFO  (qtp1514045924-19852) [n:127.0.0.1:59685_solr    ] o.a.s.h.a.CoreAdminOperation Checking request status for : 0a2874e6-04e3-4691-b1dd-586c6490b5e631110249345115649
   [junit4]   2> 2844898 INFO  (qtp1514045924-19852) [n:127.0.0.1:59685_solr    ] o.a.s.s.HttpSolrCall [admin] webapp=null path=/admin/cores params={qt=/admin/cores&requestid=0a2874e6-04e3-4691-b1dd-586c6490b5e631110249345115649&action=REQUESTSTATUS&wt=javabin&version=2} status=0 QTime=0
   [junit4]   2> 2844916 INFO  (parallelCoreAdminExecutor-7019-thread-1-processing-n:127.0.0.1:59685_solr x:testcollection_shard1_replica_n2 0a2874e6-04e3-4691-b1dd-586c6490b5e631110249338878288 CREATE) [n:127.0.0.1:59685_solr c:testcollection s:shard1 r:core_node5 x:testcollection_shard1_replica_n2] o.a.s.c.SolrConfig Using Lucene MatchVersion: 8.0.0
   [junit4]   2> 2844920 INFO  (parallelCoreAdminExecutor-7018-thread-1-processing-n:127.0.0.1:52721_solr x:testcollection_shard1_replica_n1 0a2874e6-04e3-4691-b1dd-586c6490b5e631110249334178897 CREATE) [n:127.0.0.1:52721_solr c:testcollection s:shard1 r:core_node3 x:testcollection_shard1_replica_n1] o.a.s.c.SolrConfig Using Lucene MatchVersion: 8.0.0
   [junit4]   2> 2844922 INFO  (parallelCoreAdminExecutor-7018-thread-2-processing-n:127.0.0.1:52721_solr x:testcollection_shard2_replica_n4 0a2874e6-04e3-4691-b1dd-586c6490b5e631110249342038157 CREATE) [n:127.0.0.1:52721_solr c:testcollection s:shard2 r:core_node7 x:testcollection_shard2_replica_n4] o.a.s.c.SolrConfig Using Lucene MatchVersion: 8.0.0
   [junit4]   2> 2844928 INFO  (parallelCoreAdminExecutor-7019-thread-2-processing-n:127.0.0.1:59685_solr x:testcollection_shard2_replica_n6 0a2874e6-04e3-4691-b1dd-586c6490b5e631110249345115649 CREATE) [n:127.0.0.1:59685_solr c:testcollection s:shard2 r:core_node8 x:testcollection_shard2_replica_n6] o.a.s.c.SolrConfig Using Lucene MatchVersion: 8.0.0
   [junit4]   2> 2844933 INFO  (parallelCoreAdminExecutor-7018-thread-1-processing-n:127.0.0.1:52721_solr x:testcollection_shard1_replica_n1 0a2874e6-04e3-4691-b1dd-586c6490b5e631110249334178897 CREATE) [n:127.0.0.1:52721_solr c:testcollection s:shard1 r:core_node3 x:testcollection_shard1_replica_n1] o.a.s.s.IndexSchema [testcollection_shard1_replica_n1] Schema name=minimal
   [junit4]   2> 2844937 INFO  (parallelCoreAdminExecutor-7018-thread-1-processing-n:127.0.0.1:52721_solr x:testcollection_shard1_replica_n1 0a2874e6-04e3-4691-b1dd-586c6490b5e631110249334178897 CREATE) [n:127.0.0.1:52721_solr c:testcollection s:shard1 r:core_node3 x:testcollection_shard1_replica_n1] o.a.s.s.IndexSchema Loaded schema minimal/1.1 with uniqueid field id
   [junit4]   2> 2844937 INFO  (parallelCoreAdminExecutor-7018-thread-1-processing-n:127.0.0.1:52721_solr x:testcollection_shard1_replica_n1 0a2874e6-04e3-4691-b1dd-586c6490b5e631110249334178897 CREATE) [n:127.0.0.1:52721_solr c:testcollection s:shard1 r:core_node3 x:testcollection_shard1_replica_n1] o.a.s.c.CoreContainer Creating SolrCore 'testcollection_shard1_replica_n1' using configuration from collection testcollection, trusted=true
   [junit4]   2> 2844937 INFO  (parallelCoreAdminExecutor-7018-thread-1-processing-n:127.0.0.1:52721_solr x:testcollection_shard1_replica_n1 0a2874e6-04e3-4691-b1dd-586c6490b5e631110249334178897 CREATE) [n:127.0.0.1:52721_solr c:testcollection s:shard1 r:core_node3 x:testcollection_shard1_replica_n1] o.a.s.m.r.SolrJmxReporter JMX monitoring for 'solr_52721.solr.core.testcollection.shard1.replica_n1' (registry 'solr.core.testcollection.shard1.replica_n1') enabled at server: com.sun.jmx.mbeanserver.JmxMBeanServer@fdddafd
   [junit4]   2> 2844937 INFO  (parallelCoreAdminExecutor-7018-thread-1-processing-n:127.0.0.1:52721_solr x:testcollection_shard1_replica_n1 0a2874e6-04e3-4691-b1dd-586c6490b5e631110249334178897 CREATE) [n:127.0.0.1:52721_solr c:testcollection s:shard1 r:core_node3 x:testcollection_shard1_replica_n1] o.a.s.c.SolrCore solr.RecoveryStrategy.Builder
   [junit4]   2> 2844938 INFO  (parallelCoreAdminExecutor-7018-thread-1-processing-n:127.0.0.1:52721_solr x:testcollection_shard1_replica_n1 0a2874e6-04e3-4691-b1dd-586c6490b5e631110249334178897 CREATE) [n:127.0.0.1:52721_solr c:testcollection s:shard1 r:core_node3 x:testcollection_shard1_replica_n1] o.a.s.c.SolrCore [[testcollection_shard1_replica_n1] ] Opening new SolrCore at [/x1/jenkins/jenkins-slave/workspace/Lucene-Solr-BadApples-Tests-master/solr/build/solr-core/test/J1/temp/solr.cloud.TestAuthenticationFramework_EC0E8466C13A747D-001/tempDir-001/node2/testcollection_shard1_replica_n1], dataDir=[/x1/jenkins/jenkins-slave/workspace/Lucene-Solr-BadApples-Tests-master/solr/build/solr-core/test/J1/temp/solr.cloud.TestAuthenticationFramework_EC0E8466C13A747D-001/tempDir-001/node2/./testcollection_shard1_replica_n1/data/]
   [junit4]   2> 2844941 INFO  (parallelCoreAdminExecutor-7019-thread-1-processing-n:127.0.0.1:59685_solr x:testcollection_shard1_replica_n2 0a2874e6-04e3-4691-b1dd-586c6490b5e631110249338878288 CREATE) [n:127.0.0.1:59685_solr c:testcollection s:shard1 r:core_node5 x:testcollection_shard1_replica_n2] o.a.s.s.IndexSchema [testcollection_shard1_replica_n2] Schema name=minimal
   [junit4]   2> 2844942 INFO  (parallelCoreAdminExecutor-7018-thread-2-processing-n:127.0.0.1:52721_solr x:testcollection_shard2_replica_n4 0a2874e6-04e3-4691-b1dd-586c6490b5e631110249342038157 CREATE) [n:127.0.0.1:52721_solr c:testcollection s:shard2 r:core_node7 x:testcollection_shard2_replica_n4] o.a.s.s.IndexSchema [testcollection_shard2_replica_n4] Schema name=minimal
   [junit4]   2> 2844944 INFO  (parallelCoreAdminExecutor-7019-thread-1-processing-n:127.0.0.1:59685_solr x:testcollection_shard1_replica_n2 0a2874e6-04e3-4691-b1dd-586c6490b5e631110249338878288 CREATE) [n:127.0.0.1:59685_solr c:testcollection s:shard1 r:core_node5 x:testcollection_shard1_replica_n2] o.a.s.s.IndexSchema Loaded schema minimal/1.1 with uniqueid field id
   [junit4]   2> 2844944 INFO  (parallelCoreAdminExecutor-7019-thread-1-processing-n:127.0.0.1:59685_solr x:testcollection_shard1_replica_n2 0a2874e6-04e3-4691-b1dd-586c6490b5e631110249338878288 CREATE) [n:127.0.0.1:59685_solr c:testcollection s:shard1 r:core_node5 x:testcollection_shard1_replica_n2] o.a.s.c.CoreContainer Creating SolrCore 'testcollection_shard1_replica_n2' using configuration from collection testcollection, trusted=true
   [junit4]   2> 2844944 INFO  (parallelCoreAdminExecutor-7019-thread-1-processing-n:127.0.0.1:59685_solr x:testcollection_shard1_replica_n2 0a2874e6-04e3-4691-b1dd-586c6490b5e631110249338878288 CREATE) [n:127.0.0.1:59685_solr c:testcollection s:shard1 r:core_node5 x:testcollection_shard1_replica_n2] o.a.s.m.r.SolrJmxReporter JMX monitoring for 'solr_59685.solr.core.testcollection.shard1.replica_n2' (registry 'solr.core.testcollection.shard1.replica_n2') enabled at server: com.sun.jmx.mbeanserver.JmxMBeanServer@fdddafd
   [junit4]   2> 2844945 INFO  (parallelCoreAdminExecutor-7019-thread-1-processing-n:127.0.0.1:59685_solr x:testcollection_shard1_replica_n2 0a2874e6-04e3-4691-b1dd-586c6490b5e631110249338878288 CREATE) [n:127.0.0.1:59685_solr c:testcollection s:shard1 r:core_node5 x:testcollection_shard1_replica_n2] o.a.s.c.SolrCore solr.RecoveryStrategy.Builder
   [junit4]   2> 2844945 INFO  (parallelCoreAdminExecutor-7019-thread-1-processing-n:127.0.0.1:59685_solr x:testcollection_shard1_replica_n2 0a2874e6-04e3-4691-b1dd-586c6490b5e631110249338878288 CREATE) [n:127.0.0.1:59685_solr c:testcollection s:shard1 r:core_node5 x:testcollection_shard1_replica_n2] o.a.s.c.SolrCore [[testcollection_shard1_replica_n2] ] Opening new SolrCore at [/x1/jenkins/jenkins-slave/workspace/Lucene-Solr-BadApples-Tests-master/solr/build/solr-core/test/J1/temp/solr.cloud.TestAuthenticationFramework_EC0E8466C13A747D-001/tempDir-001/node1/testcollection_shard1_replica_n2], dataDir=[/x1/jenkins/jenkins-slave/workspace/Lucene-Solr-BadApples-Tests-master/solr/build/solr-core/test/J1/temp/solr.cloud.TestAuthenticationFramework_EC0E8466C13A747D-001/tempDir-001/node1/./testcollection_shard1_replica_n2/data/]
   [junit4]   2> 2844946 INFO  (parallelCoreAdminExecutor-7019-thread-2-processing-n:127.0.0.1:59685_solr x:testcollection_shard2_replica_n6 0a2874e6-04e3-4691-b1dd-586c6490b5e631110249345115649 CREATE) [n:127.0.0.1:59685_solr c:testcollection s:shard2 r:core_node8 x:testcollection_shard2_replica_n6] o.a.s.s.IndexSchema [testcollection_shard2_replica_n6] Schema name=minimal
   [junit4]   2> 2844982 INFO  (parallelCoreAdminExecutor-7019-thread-2-processing-n:127.0.0.1:59685_solr x:testcollection_shard2_replica_n6 0a2874e6-04e3-4691-b1dd-586c6490b5e631110249345115649 CREATE) [n:127.0.0.1:59685_solr c:testcollection s:shard2 r:core_node8 x:testcollection_shard2_replica_n6] o.a.s.s.IndexSchema Loaded schema minimal/1.1 with uniqueid field id
   [junit4]   2> 2844982 INFO  (parallelCoreAdminExecutor-7019-thread-2-processing-n:127.0.0.1:59685_solr x:testcollection_shard2_replica_n6 0a2874e6-04e3-4691-b1dd-586c6490b5e631110249345115649 CREATE) [n:127.0.0.1:59685_solr c:testcollection s:shard2 r:core_node8 x:testcollection_shard2_replica_n6] o.a.s.c.CoreContainer Creating SolrCore 'testcollection_shard2_replica_n6' using configuration from collection testcollection, trusted=true
   [junit4]   2> 2845016 INFO  (parallelCoreAdminExecutor-7018-thread-2-processing-n:127.0.0.1:52721_solr x:testcollection_shard2_replica_n4 0a2874e6-04e3-4691-b1dd-586c6490b5e631110249342038157 CREATE) [n:127.0.0.1:52721_solr c:testcollection s:shard2 r:core_node7 x:testcollection_shard2_replica_n4] o.a.s.s.IndexSchema Loaded schema minimal/1.1 with uniqueid field id
   [junit4]   2> 2845016 INFO  (parallelCoreAdminExecutor-7018-thread-2-processing-n:127.0.0.1:52721_solr x:testcollection_shard2_replica_n4 0a2874e6-04e3-4691-b1dd-586c6490b5e631110249342038157 CREATE) [n:127.0.0.1:52721_solr c:testcollection s:shard2 r:core_node7 x:testcollection_shard2_replica_n4] o.a.s.c.CoreContainer Creating SolrCore 'testcollection_shard2_replica_n4' using configuration from collection testcollection, trusted=true
   [junit4]   2> 2845016 INFO  (parallelCoreAdminExecutor-7019-thread-2-processing-n:127.0.0.1:59685_solr x:testcollection_shard2_replica_n6 0a2874e6-04e3-4691-b1dd-586c6490b5e631110249345115649 CREATE) [n:127.0.0.1:59685_solr c:testcollection s:shard2 r:core_node8 x:testcollection_shard2_replica_n6] o.a.s.m.r.SolrJmxReporter JMX monitoring for 'solr_59685.solr.core.testcollection.shard2.replica_n6' (registry 'solr.core.testcollection.shard2.replica_n6') enabled at server: com.sun.jmx.mbeanserver.JmxMBeanServer@fdddafd
   [junit4]   2> 2845016 INFO  (parallelCoreAdminExecutor-7019-thread-2-processing-n:127.0.0.1:59685_solr x:testcollection_shard2_replica_n6 0a2874e6-04e3-4691-b1dd-586c6490b5e631110249345115649 CREATE) [n:127.0.0.1:59685_solr c:testcollection s:shard2 r:core_node8 x:testcollection_shard2_replica_n6] o.a.s.c.SolrCore solr.RecoveryStrategy.Builder
   [junit4]   2> 2845016 INFO  (parallelCoreAdminExecutor-7019-thread-2-processing-n:127.0.0.1:59685_solr x:testcollection_shard2_replica_n6 0a2874e6-04e3-4691-b1dd-586c6490b5e631110249345115649 CREATE) [n:127.0.0.1:59685_solr c:testcollection s:shard2 r:core_node8 x:testcollection_shard2_replica_n6] o.a.s.c.SolrCore [[testcollection_shard2_replica_n6] ] Opening new SolrCore at [/x1/jenkins/jenkins-slave/workspace/Lucene-Solr-BadApples-Tests-master/solr/build/solr-core/test/J1/temp/solr.cloud.TestAuthenticationFramework_EC0E8466C13A747D-001/tempDir-001/node1/testcollection_shard2_replica_n6], dataDir=[/x1/jenkins/jenkins-slave/workspace/Lucene-Solr-BadApples-Tests-master/solr/build/solr-core/test/J1/temp/solr.cloud.TestAuthenticationFramework_EC0E8466C13A747D-001/tempDir-001/node1/./testcollection_shard2_replica_n6/data/]
   [junit4]   2> 2845016 INFO  (parallelCoreAdminExecutor-7018-thread-2-processing-n:127.0.0.1:52721_solr x:testcollection_shard2_replica_n4 0a2874e6-04e3-4691-b1dd-586c6490b5e631110249342038157 CREATE) [n:127.0.0.1:52721_solr c:testcollection s:shard2 r:core_node7 x:testcollection_shard2_replica_n4] o.a.s.m.r.SolrJmxReporter JMX monitoring for 'solr_52721.solr.core.testcollection.shard2.replica_n4' (registry 'solr.core.testcollection.shard2.replica_n4') enabled at server: com.sun.jmx.mbeanserver.JmxMBeanServer@fdddafd
   [junit4]   2> 2845016 INFO  (parallelCoreAdminExecutor-7018-thread-2-processing-n:127.0.0.1:52721_solr x:testcollection_shard2_replica_n4 0a2874e6-04e3-4691-b1dd-586c6490b5e631110249342038157 CREATE) [n:127.0.0.1:52721_solr c:testcollection s:shard2 r:core_node7 x:testcollection_shard2_replica_n4] o.a.s.c.SolrCore solr.RecoveryStrategy.Builder
   [junit4]   2> 2845016 INFO  (parallelCoreAdminExecutor-7018-thread-2-processing-n:127.0.0.1:52721_solr x:testcollection_shard2_replica_n4 0a2874e6-04e3-4691-b1dd-586c6490b5e631110249342038157 CREATE) [n:127.0.0.1:52721_solr c:testcollection s:shard2 r:core_node7 x:testcollection_shard2_replica_n4] o.a.s.c.SolrCore [[testcollection_shard2_replica_n4] ] Opening new SolrCore at [/x1/jenkins/jenkins-slave/workspace/Lucene-Solr-BadApples-Tests-master/solr/build/solr-core/test/J1/temp/solr.cloud.TestAuthenticationFramework_EC0E8466C13A747D-001/tempDir-001/node2/testcollection_shard2_replica_n4], dataDir=[/x1/jenkins/jenkins-slave/workspace/Lucene-Solr-BadApples-Tests-master/solr/build/solr-core/test/J1/temp/solr.cloud.TestAuthenticationFramework_EC0E8466C13A747D-001/tempDir-001/node2/./testcollection_shard2_replica_n4/data/]
   [junit4]   2> 2845176 INFO  (parallelCoreAdminExecutor-7018-thread-1-processing-n:127.0.0.1:52721_solr x:testcollection_shard1_replica_n1 0a2874e6-04e3-4691-b1dd-586c6490b5e631110249334178897 CREATE) [n:127.0.0.1:52721_solr c:testcollection s:shard1 r:core_node3 x:testcollection_shard1_replica_n1] o.a.s.u.UpdateHandler Using UpdateLog implementation: org.apache.solr.update.UpdateLog
   [junit4]   2> 2845176 INFO  (parallelCoreAdminExecutor-7018-thread-1-processing-n:127.0.0.1:52721_solr x:testcollection_shard1_replica_n1 0a2874e6-04e3-4691-b1dd-586c6490b5e631110249334178897 CREATE) [n:127.0.0.1:52721_solr c:testcollection s:shard1 r:core_node3 x:testcollection_shard1_replica_n1] o.a.s.u.UpdateLog Initializing UpdateLog: dataDir=null defaultSyncLevel=FLUSH numRecordsToKeep=100 maxNumLogsToKeep=10 numVersionBuckets=65536
   [junit4]   2> 2845177 INFO  (parallelCoreAdminExecutor-7018-thread-1-processing-n:127.0.0.1:52721_solr x:testcollection_shard1_replica_n1 0a2874e6-04e3-4691-b1dd-586c6490b5e631110249334178897 CREATE) [n:127.0.0.1:52721_solr c:testcollection s:shard1 r:core_node3 x:testcollection_shard1_replica_n1] o.a.s.u.CommitTracker Hard AutoCommit: disabled
   [junit4]   2> 2845178 INFO  (parallelCoreAdminExecutor-7018-thread-1-processing-n:127.0.0.1:52721_solr x:testcollection_shard1_replica_n1 0a2874e6-04e3-4691-b1dd-586c6490b5e631110249334178897 CREATE) [n:127.0.0.1:52721_solr c:testcollection s:shard1 r:core_node3 x:testcollection_shard1_replica_n1] o.a.s.u.CommitTracker Soft AutoCommit: disabled
   [junit4]   2> 2845179 INFO  (parallelCoreAdminExecutor-7018-thread-1-processing-n:127.0.0.1:52721_solr x:testcollection_shard1_replica_n1 0a2874e6-04e3-4691-b1dd-586c6490b5e631110249334178897 CREATE) [n:127.0.0.1:52721_solr c:testcollection s:shard1 r:core_node3 x:testcollection_shard1_replica_n1] o.a.s.s.SolrIndexSearcher Opening [Searcher@bc406a[testcollection_shard1_replica_n1] main]
   [junit4]   2> 2845181 INFO  (parallelCoreAdminExecutor-7018-thread-1-processing-n:127.0.0.1:52721_solr x:testcollection_shard1_replica_n1 0a2874e6-04e3-4691-b1dd-586c6490b5e631110249334178897 CREATE) [n:127.0.0.1:52721_solr c:testcollection s:shard1 r:core_node3 x:testcollection_shard1_replica_n1] o.a.s.r.ManagedResourceStorage Configured ZooKeeperStorageIO with znodeBase: /configs/solrCloudCollectionConfig
   [junit4]   2> 2845181 INFO  (parallelCoreAdminExecutor-7018-thread-1-processing-n:127.0.0.1:52721_solr x:testcollection_shard1_replica_n1 0a2874e6-04e3-4691-b1dd-586c6490b5e631110249334178897 CREATE) [n:127.0.0.1:52721_solr c:testcollection s:shard1 r:core_node3 x:testcollection_shard1_replica_n1] o.a.s.r.ManagedResourceStorage Loaded null at path _rest_managed.json using ZooKeeperStorageIO:path=/configs/solrCloudCollectionConfig
   [junit4]   2> 2845181 INFO  (parallelCoreAdminExecutor-7019-thread-1-processing-n:127.0.0.1:59685_solr x:testcollection_shard1_replica_n2 0a2874e6-04e3-4691-b1dd-586c6490b5e631110249338878288 CREATE) [n:127.0.0.1:59685_solr c:testcollection s:shard1 r:core_node5 x:testcollection_shard1_replica_n2] o.a.s.u.UpdateHandler Using UpdateLog implementation: org.apache.solr.update.UpdateLog
   [junit4]   2> 2845181 INFO  (parallelCoreAdminExecutor-7019-thread-1-processing-n:127.0.0.1:59685_solr x:testcollection_shard1_replica_n2 0a2874e6-04e3-4691-b1dd-586c6490b5e631110249338878288 CREATE) [n:127.0.0.1:59685_solr c:testcollection s:shard1 r:core_node5 x:testcollection_shard1_replica_n2] o.a.s.u.UpdateLog Initializing UpdateLog: dataDir=null defaultSyncLevel=FLUSH numRecordsToKeep=100 maxNumLogsToKeep=10 numVersionBuckets=65536
   [junit4]   2> 2845182 INFO  (parallelCoreAdminExecutor-7018-thread-1-processing-n:127.0.0.1:52721_solr x:testcollection_shard1_replica_n1 0a2874e6-04e3-4691-b1dd-586c6490b5e631110249334178897 CREATE) [n:127.0.0.1:52721_solr c:testcollection s:shard1 r:core_node3 x:testcollection_shard1_replica_n1] o.a.s.h.ReplicationHandler Commits will be reserved for 10000ms.
   [junit4]   2> 2845182 INFO  (parallelCoreAdminExecutor-7019-thread-1-processing-n:127.0.0.1:59685_solr x:testcollection_shard1_replica_n2 0a2874e6-04e3-4691-b1dd-586c6490b5e631110249338878288 CREATE) [n:127.0.0.1:59685_solr c:testcollection s:shard1 r:core_node5 x:testcollection_shard1_replica_n2] o.a.s.u.CommitTracker Hard AutoCommit: disabled
   [junit4]   2> 2845182 INFO  (parallelCoreAdminExecutor-7019-thread-1-processing-n:127.0.0.1:59685_solr x:testcollection_shard1_replica_n2 0a2874e6-04e3-4691-b1dd-586c6490b5e631110249338878288 CREATE) [n:127.0.0.1:59685_solr c:testcollection s:shard1 r:core_node5 x:testcollection_shard1_replica_n2] o.a.s.u.CommitTracker Soft AutoCommit: disabled
   [junit4]   2> 2845188 INFO  (parallelCoreAdminExecutor-7019-thread-1-processing-n:127.0.0.1:59685_solr x:testcollection_shard1_replica_n2 0a2874e6-04e3-4691-b1dd-586c6490b5e631110249338878288 CREATE) [n:127.0.0.1:59685_solr c:testcollection s:shard1 r:core_node5 x:testcollection_shard1_replica_n2] o.a.s.s.SolrIndexSearcher Opening [Searcher@6d423e51[testcollection_shard1_replica_n2] main]
   [junit4]   2> 2845190 INFO  (parallelCoreAdminExecutor-7019-thread-1-processing-n:127.0.0.1:59685_solr x:testcollection_shard1_replica_n2 0a2874e6-04e3-4691-b1dd-586c6490b5e631110249338878288 CREATE) [n:127.0.0.1:59685_solr c:testcollection s:shard1 r:core_node5 x:testcollection_shard1_replica_n2] o.a.s.r.ManagedResourceStorage Configured ZooKeeperStorageIO with znodeBase: /configs/solrCloudCollectionConfig
   [junit4]   2> 2845190 INFO  (parallelCoreAdminExecutor-7019-thread-1-processing-n:127.0.0.1:59685_solr x:testcollection_shard1_replica_n2 0a2874e6-04e3-4691-b1dd-586c6490b5e631110249338878288 CREATE) [n:127.0.0.1:59685_solr c:testcollection s:shard1 r:core_node5 x:testcollection_shard1_replica_n2] o.a.s.r.ManagedResourceStorage Loaded null at path _rest_managed.json using ZooKeeperStorageIO:path=/configs/solrCloudCollectionConfig
   [junit4]   2> 2845191 INFO  (parallelCoreAdminExecutor-7019-thread-1-processing-n:127.0.0.1:59685_solr x:testcollection_shard1_replica_n2 0a2874e6-04e3-4691-b1dd-586c6490b5e631110249338878288 CREATE) [n:127.0.0.1:59685_solr c:testcollection s:shard1 r:core_node5 x:testcollection_shard1_replica_n2] o.a.s.h.ReplicationHandler Commits will be reserved for 10000ms.
   [junit4]   2> 2845191 INFO  (parallelCoreAdminExecutor-7018-thread-2-processing-n:127.0.0.1:52721_solr x:testcollection_shard2_replica_n4 0a2874e6-04e3-4691-b1dd-586c6490b5e631110249342038157 CREATE) [n:127.0.0.1:52721_solr c:testcollection s:shard2 r:core_node7 x:testcollection_shard2_replica_n4] o.a.s.u.UpdateHandler Using UpdateLog implementation: org.apache.solr.update.UpdateLog
   [junit4]   2> 2845191 INFO  (parallelCoreAdminExecutor-7018-thread-2-processing-n:127.0.0.1:52721_solr x:testcollection_shard2_replica_n4 0a2874e6-04e3-4691-b1dd-586c6490b5e631110249342038157 CREATE) [n:127.0.0.1:52721_solr c:testcollection s:shard2 r:core_node7 x:testcollection_shard2_replica_n4] o.a.s.u.UpdateLog Initializing UpdateLog: dataDir=null defaultSyncLevel=FLUSH numRecordsToKeep=100 maxNumLogsToKeep=10 numVersionBuckets=65536
   [junit4]   2> 2845193 INFO  (parallelCoreAdminExecutor-7018-thread-2-processing-n:127.0.0.1:52721_solr x:testcollection_shard2_replica_n4 0a2874e6-04e3-4691-b1dd-586c6490b5e631110249342038157 CREATE) [n:127.0.0.1:52721_solr c:testcollection s:shard2 r:core_node7 x:testcollection_shard2_replica_n4] o.a.s.u.CommitTracker Hard AutoCommit: disabled
   [junit4]   2> 2845193 INFO  (parallelCoreAdminExecutor-7018-thread-2-processing-n:127.0.0.1:52721_solr x:testcollection_shard2_replica_n4 0a2874e6-04e3-4691-b1dd-586c6490b5e631110249342038157 CREATE) [n:127.0.0.1:52721_solr c:testcollection s:shard2 r:core_node7 x:testcollection_shard2_replica_n4] o.a.s.u.CommitTracker Soft AutoCommit: disabled
   [junit4]   2> 2845194 INFO  (parallelCoreAdminExecutor-7018-thread-2-processing-n:127.0.0.1:52721_solr x:testcollection_shard2_replica_n4 0a2874e6-04e3-4691-b1dd-586c6490b5e631110249342038157 CREATE) [n:127.0.0.1:52721_solr c:testcollection s:shard2 r:core_node7 x:testcollection_shard2_replica_n4] o.a.s.s.SolrIndexSearcher Opening [Searcher@34e97194[testcollection_shard2_replica_n4] main]
   [junit4]   2> 2845196 INFO  (parallelCoreAdminExecutor-7018-thread-2-processing-n:127.0.0.1:52721_solr x:testcollection_shard2_replica_n4 0a2874e6-04e3-4691-b1dd-586c6490b5e631110249342038157 CREATE) [n:127.0.0.1:52721_solr c:testcollection s:shard2 r:core_node7 x:testcollection_shard2_replica_n4] o.a.s.r.ManagedResourceStorage Configured ZooKeeperStorageIO with znodeBase: /configs/solrCloudCollectionConfig
   [junit4]   2> 2845199 INFO  (parallelCoreAdminExecutor-7018-thread-2-processing-n:127.0.0.1:52721_solr x:testcollection_shard2_replica_n4 0a2874e6-04e3-4691-b1dd-586c6490b5e631110249342038157 CREATE) [n:127.0.0.1:52721_solr c:testcollection s:shard2 r:core_node7 x:testcollection_shard2_replica_n4] o.a.s.r.ManagedResourceStorage Loaded null at path _rest_managed.json using ZooKeeperStorageIO:path=/configs/solrCloudCollectionConfig
   [junit4]   2> 2845200 INFO  (parallelCoreAdminExecutor-7018-thread-2-processing-n:127.0.0.1:52721_solr x:testcollection_shard2_replica_n4 0a2874e6-04e3-4691-b1dd-586c6490b5e631110249342038157 CREATE) [n:127.0.0.1:52721_solr c:testcollection s:shard2 r:core_node7 x:testcollection_shard2_replica_n4] o.a.s.h.ReplicationHandler Commits will be reserved for 10000ms.
   [junit4]   2> 2845200 INFO  (parallelCoreAdminExecutor-7018-thread-2-processing-n:127.0.0.1:52721_solr x:testcollection_shard2_replica_n4 0a2874e6-04e3-4691-b1dd-586c6490b5e631110249342038157 CREATE) [n:127.0.0.1:52721_solr c:testcollection s:shard2 r:core_node7 x:testcollection_shard2_replica_n4] o.a.s.u.UpdateLog Could not find max version in index or recent updates, using new clock 1605221329235083264
   [junit4]   2> 2845208 INFO  (parallelCoreAdminExecutor-7018-thread-2-processing-n:127.0.0.1:52721_solr x:testcollection_shard2_replica_n4 0a2874e6-04e3-4691-b1dd-586c6490b5e631110249342038157 CREATE) [n:127.0.0.1:52721_solr c:testcollection s:shard2 r:core_node7 x:testcollection_shard2_replica_n4] o.a.s.c.ZkShardTerms Successful update of terms at /collections/testcollection/terms/shard2 to Terms{values={core_node7=0}, version=0}
   [junit4]   2> 2845218 INFO  (parallelCoreAdminExecutor-7018-thread-2-processing-n:127.0.0.1:52721_solr x:testcollection_shard2_replica_n4 0a2874e6-04e3-4691-b1dd-586c6490b5e631110249342038157 CREATE) [n:127.0.0.1:52721_solr c:testcollection s:shard2 r:core_node7 x:testcollection_shard2_replica_n4] o.a.s.c.ShardLeaderElectionContext Waiting until we see more replicas up for shard shard2: total=2 found=1 timeoutin=9999ms
   [junit4]   2> 2845219 INFO  (parallelCoreAdminExecutor-7019-thread-1-processing-n:127.0.0.1:59685_solr x:testcollection_shard1_replica_n2 0a2874e6-04e3-4691-b1dd-586c6490b5e631110249338878288 CREATE) [n:127.0.0.1:59685_solr c:testcollection s:shard1 r:core_node5 x:testcollection_shard1_replica_n2] o.a.s.u.UpdateLog Could not find max version in index or recent updates, using new clock 1605221329255006208
   [junit4]   2> 2845219 INFO  (searcherExecutor-7027-thread-1-processing-x:testcollection_shard1_replica_n2 0a2874e6-04e3-4691-b1dd-586c6490b5e631110249338878288 r:core_node5 CREATE n:127.0.0.1:59685_solr c:testcollection s:shard1) [n:127.0.0.1:59685_solr c:testcollection s:shard1 r:core_node5 x:testcollection_shard1_replica_n2] o.a.s.c.SolrCore [testcollection_shard1_replica_n2] Registered new searcher Searcher@6d423e51[testcollection_shard1_replica_n2] main{ExitableDirectoryReader(UninvertingDirectoryReader())}
   [junit4]   2> 2845225 INFO  (searcherExecutor-7029-thread-1-processing-x:testcollection_shard2_replica_n4 0a2874e6-04e3-4691-b1dd-586c6490b5e631110249342038157 r:core_node7 CREATE n:127.0.0.1:52721_solr c:testcollection s:shard2) [n:127.0.0.1:52721_solr c:testcollection s:shard2 r:core_node7 x:testcollection_shard2_replica_n4] o.a.s.c.SolrCore [testcollection_shard2_replica_n4] Registered new searcher Searcher@34e97194[testcollection_shard2_replica_n4] main{ExitableDirectoryReader(UninvertingDirectoryReader())}
   [junit4]   2> 2845229 INFO  (parallelCoreAdminExecutor-7019-thread-1-processing-n:127.0.0.1:59685_solr x:testcollection_shard1_replica_n2 0a2874e6-04e3-4691-b1dd-586c6490b5e631110249338878288 CREATE) [n:127.0.0.1:59685_solr c:testcollection s:shard1 r:core_node5 x:testcollection_shard1_replica_n2] o.a.s.c.ZkShardTerms Successful update of terms at /collections/testcollection/terms/shard1 to Terms{values={core_node5=0}, version=0}
   [junit4]   2> 2845234 INFO  (parallelCoreAdminExecutor-7019-thread-1-processing-n:127.0.0.1:59685_solr x:testcollection_shard1_replica_n2 0a2874e6-04e3-4691-b1dd-586c6490b5e631110249338878288 CREATE) [n:127.0.0.1:59685_solr c:testcollection s:shard1 r:core_node5 x:testcollection_shard1_replica_n2] o.a.s.c.ShardLeaderElectionContext Waiting until we see more replicas up for shard shard1: total=2 found=1 timeoutin=9999ms
   [junit4]   2> 2845234 INFO  (parallelCoreAdminExecutor-7018-thread-1-processing-n:127.0.0.1:52721_solr x:testcollection_shard1_replica_n1 0a2874e6-04e3-4691-b1dd-586c6490b5e631110249334178897 CREATE) [n:127.0.0.1:52721_solr c:testcollection s:shard1 r:core_node3 x:testcollection_shard1_replica_n1] o.a.s.u.UpdateLog Could not find max version in index or recent updates, using new clock 1605221329270734848
   [junit4]   2> 2845235 INFO  (parallelCoreAdminExecutor-7019-thread-2-processing-n:127.0.0.1:59685_solr x:testcollection_shard2_replica_n6 0a2874e6-04e3-4691-b1dd-586c6490b5e631110249345115649 CREATE) [n:127.0.0.1:59685_solr c:testcollection s:shard2 r:core_node8 x:testcollection_shard2_replica_n6] o.a.s.u.UpdateHandler Using UpdateLog implementation: org.apache.solr.update.UpdateLog
   [junit4]   2> 2845235 INFO  (parallelCoreAdminExecutor-7019-thread-2-processing-n:127.0.0.1:59685_solr x:testcollection_shard2_replica_n6 0a2874e6-04e3-4691-b1dd-586c6490b5e631110249345115649 CREATE) [n:127.0.0.1:59685_solr c:testcollection s:shard2 r:core_node8 x:testcollection_shard2_replica_n6] o.a.s.u.UpdateLog Initializing UpdateLog: dataDir=null defaultSyncLevel=FLUSH numRecordsToKeep=100 maxNumLogsToKeep=10 numVersionBuckets=65536
   [junit4]   2> 2845236 INFO  (parallelCoreAdminExecutor-7019-thread-2-processing-n:127.0.0.1:59685_solr x:testcollection_shard2_replica_n6 0a2874e6-04e3-4691-b1dd-586c6490b5e631110249345115649 CREATE) [n:127.0.0.1:59685_solr c:testcollection s:shard2 r:core_node8 x:testcollection_shard2_replica_n6] o.a.s.u.CommitTracker Hard AutoCommit: disabled
   [junit4]   2> 2845236 INFO  (parallelCoreAdminExecutor-7019-thread-2-processing-n:127.0.0.1:59685_solr x:testcollection_shard2_replica_n6 0a2874e6-04e3-4691-b1dd-586c6490b5e631110249345115649 CREATE) [n:127.0.0.1:59685_solr c:testcollection s:shard2 r:core_node8 x:testcollection_shard2_replica_n6] o.a.s.u.CommitTracker Soft AutoCommit: disabled
   [junit4]   2> 2845237 INFO  (searcherExecutor-7026-thread-1-processing-x:testcollection_shard1_replica_n1 0a2874e6-04e3-4691-b1dd-586c6490b5e631110249334178897 r:core_node3 CREATE n:127.0.0.1:52721_solr c:testcollection s:shard1) [n:127.0.0.1:52721_solr c:testcollection s:shard1 r:core_node3 x:testcollection_shard1_replica_n1] o.a.s.c.SolrCore [testcollection_shard1_replica_n1] Registered new searcher Searcher@bc406a[testcollection_shard1_replica_n1] main{ExitableDirectoryReader(UninvertingDirectoryReader())}
   [junit4]   2> 2845238 INFO  (parallelCoreAdminExecutor-7019-thread-2-processing-n:127.0.0.1:59685_solr x:testcollection_shard2_replica_n6 0a2874e6-04e3-4691-b1dd-586c6490b5e631110249345115649 CREATE) [n:127.0.0.1:59685_solr c:testcollection s:shard2 r:core_node8 x:testcollection_shard2_replica_n6] o.a.s.s.SolrIndexSearcher Opening [Searcher@48c116b5[testcollection_shard2_replica_n6] main]
   [junit4]   2> 2845240 INFO  (parallelCoreAdminExecutor-7018-thread-1-processing-n:127.0.0.1:52721_solr x:testcollection_shard1_replica_n1 0a2874e6-04e3-4691-b1dd-586c6490b5e631110249334178897 CREATE) [n:127.0.0.1:52721_solr c:testcollection s:shard1 r:core_node3 x:testcollection_shard1_replica_n1] o.a.s.c.ZkShardTerms Successful update of terms at /collections/testcollection/terms/shard1 to Terms{values={core_node3=0, core_node5=0}, version=1}
   [junit4]   2> 2845240 INFO  (parallelCoreAdminExecutor-7019-thread-2-processing-n:127.0.0.1:59685_solr x:testcollection_shard2_replica_n6 0a2874e6-04e3-4691-b1dd-586c6490b5e631110249345115649 CREATE) [n:127.0.0.1:59685_solr c:testcollection s:shard2 r:core_node8 x:testcollection_shard2_replica_n6] o.a.s.r.ManagedResourceStorage Configured ZooKeeperStorageIO with znodeBase: /configs/solrCloudCollectionConfig
   [junit4]   2> 2845241 INFO  (parallelCoreAdminExecutor-7019-thread-2-processing-n:127.0.0.1:59685_solr x:testcollection_shard2_replica_n6 0a2874e6-04e3-4691-b1dd-586c6490b5e631110249345115649 CREATE) [n:127.0.0.1:59685_solr c:testcollection s:shard2 r:core_node8 x:testcollection_shard2_replica_n6] o.a.s.r.ManagedResourceStorage Loaded null at path _rest_managed.json using ZooKeeperStorageIO:path=/configs/solrCloudCollectionConfig
   [junit4]   2> 2845242 INFO  (parallelCoreAdminExecutor-7019-thread-2-processing-n:127.0.0.1:59685_solr x:testcollection_shard2_replica_n6 0a2874e6-04e3-4691-b1dd-586c6490b5e631110249345115649 CREATE) [n:127.0.0.1:59685_solr c:testcollection s:shard2 r:core_node8 x:testcollection_shard2_replica_n6] o.a.s.h.ReplicationHandler Commits will be reserved for 10000ms.
   [junit4]   2> 2845242 INFO  (parallelCoreAdminExecutor-7019-thread-2-processing-n:127.0.0.1:59685_solr x:testcollection_shard2_replica_n6 0a2874e6-04e3-4691-b1dd-586c6490b5e631110249345115649 CREATE) [n:127.0.0.1:59685_solr c:testcollection s:shard2 r:core_node8 x:testcollection_shard2_replica_n6] o.a.s.u.UpdateLog Could not find max version in index or recent updates, using new clock 1605221329279123456
   [junit4]   2> 2845247 INFO  (parallelCoreAdminExecutor-7019-thread-2-processing-n:127.0.0.1:59685_solr x:testcollection_shard2_replica_n6 0a2874e6-04e3-4691-b1dd-586c6490b5e631110249345115649 CREATE) [n:127.0.0.1:59685_solr c:testcollection s:shard2 r:core_node8 x:testcollection_shard2_replica_n6] o.a.s.c.ZkShardTerms Successful update of terms at /collections/testcollection/terms/shard2 to Terms{values={core_node7=0, core_node8=0}, version=1}
   [junit4]   2> 2845249 INFO  (searcherExecutor-7028-thread-1-processing-x:testcollection_shard2_replica_n6 0a2874e6-04e3-4691-b1dd-586c6490b5e631110249345115649 r:core_node8 CREATE n:127.0.0.1:59685_solr c:testcollection s:shard2) [n:127.0.0.1:59685_solr c:testcollection s:shard2 r:core_node8 x:testcollection_shard2_replica_n6] o.a.s.c.SolrCore [testcollection_shard2_replica_n6] Registered new searcher Searcher@48c116b5[testcollection_shard2_replica_n6] main{ExitableDirectoryReader(UninvertingDirectoryReader())}
   [junit4]   2> 2845540 INFO  (qtp1514045924-19848) [n:127.0.0.1:59685_solr    ] o.a.s.h.a.CollectionsHandler Invoked Collection Action :requeststatus with params requestid=0a2874e6-04e3-4691-b1dd-586c6490b5e6&action=REQUESTSTATUS&wt=javabin&version=2 and sendToOCPQueue=true
   [junit4]   2> 2845541 INFO  (qtp1514045924-19848) [n:127.0.0.1:59685_solr    ] o.a.s.s.HttpSolrCall [admin] webapp=null path=/admin/collections params={requestid=0a2874e6-04e3-4691-b1dd-586c6490b5e6&action=REQUESTSTATUS&wt=javabin&version=2} status=0 QTime=0
   [junit4]   2> 2845719 INFO  (parallelCoreAdminExecutor-7018-thread-2-processing-n:127.0.0.1:52721_solr x:testcollection_shard2_replica_n4 0a2874e6-04e3-4691-b1dd-586c6490b5e631110249342038157 CREATE) [n:127.0.0.1:52721_solr c:testcollection s:shard2 r:core_node7 x:testcollection_shard2_replica_n4] o.a.s.c.ShardLeaderElectionContext Enough replicas found to continue.
   [junit4]   2> 2845720 INFO  (parallelCoreAdminExecutor-7018-thread-2-processing-n:127.0.0.1:52721_solr x:testcollection_shard2_replica_n4 0a2874e6-04e3-4691-b1dd-586c6490b5e631110249342038157 CREATE) [n:127.0.0.1:52721_solr c:testcollection s:shard2 r:core_node7 x:testcollection_shard2_replica_n4] o.a.s.c.ShardLeaderElectionContext I may be the new leader - try and sync
   [junit4]   2> 2845720 INFO  (parallelCoreAdminExecutor-7018-thread-2-processing-n:127.0.0.1:52721_solr x:testcollection_shard2_replica_n4 0a2874e6-04e3-4691-b1dd-586c6490b5e631110249342038157 CREATE) [n:127.0.0.1:52721_solr c:testcollection s:shard2 r:core_node7 x:testcollection_shard2_replica_n4] o.a.s.c.SyncStrategy Sync replicas to http://127.0.0.1:52721/solr/testcollection_shard2_replica_n4/
   [junit4]   2> 2845720 INFO  (parallelCoreAdminExecutor-7018-thread-2-processing-n:127.0.0.1:52721_solr x:testcollection_shard2_replica_n4 0a2874e6-04e3-4691-b1dd-586c6490b5e631110249342038157 CREATE) [n:127.0.0.1:52721_solr c:testcollection s:shard2 r:core_node7 x:testcollection_shard2_replica_n4] o.a.s.u.PeerSync PeerSync: core=testcollection_shard2_replica_n4 url=http://127.0.0.1:52721/solr START replicas=[http://127.0.0.1:59685/solr/testcollection_shard2_replica_n6/] nUpdates=100
   [junit4]   2> 2845721 INFO  (parallelCoreAdminExecutor-7018-thread-2-processing-n:127.0.0.1:52721_solr x:testcollection_shard2_replica_n4 0a2874e6-04e3-4691-b1dd-586c6490b5e631110249342038157 CREATE) [n:127.0.0.1:52721_solr c:testcollection s:shard2 r:core_node7 x:testcollection_shard2_replica_n4] o.a.s.u.PeerSync PeerSync: core=testcollection_shard2_replica_n4 url=http://127.0.0.1:52721/solr DONE.  We have no versions.  sync failed.
   [junit4]   2> 2845723 INFO  (qtp1514045924-19852) [n:127.0.0.1:59685_solr c:testcollection s:shard2 r:core_node8 x:testcollection_shard2_replica_n6] o.a.s.c.S.Request [testcollection_shard2_replica_n6]  webapp=/solr path=/get params={distrib=false&qt=/get&fingerprint=false&getVersions=100&wt=javabin&version=2} status=0 QTime=0
   [junit4]   2> 2845723 INFO  (parallelCoreAdminExecutor-7018-thread-2-processing-n:127.0.0.1:52721_solr x:testcollection_shard2_replica_n4 0a2874e6-04e3-4691-b1dd-586c6490b5e631110249342038157 CREATE) [n:127.0.0.1:52721_solr c:testcollection s:shard2 r:core_node7 x:testcollection_shard2_replica_n4] o.a.s.c.SyncStrategy Leader's attempt to sync with shard failed, moving to the next candidate
   [junit4]   2> 2845723 INFO  (parallelCoreAdminExecutor-7018-thread-2-processing-n:127.0.0.1:52721_solr x:testcollection_shard2_replica_n4 0a2874e6-04e3-4691-b1dd-586c6490b5e631110249342038157 CREATE) [n:127.0.0.1:52721_solr c:testcollection s:shard2 r:core_node7 x:testcollection_shard2_replica_n4] o.a.s.c.ShardLeaderElectionContext We failed sync, but we have no versions - we can't sync in that case - we were active before, so become leader anyway
   [junit4]   2> 2845723 INFO  (parallelCoreAdminExecutor-7018-thread-2-processing-n:127.0.0.1:52721_solr x:testcollection_shard2_replica_n4 0a2874e6-04e3-4691-b1dd-586c6490b5e631110249342038157 CREATE) [n:127.0.0.1:52721_solr c:testcollection s:shard2 r:core_node7 x:testcollection_shard2_replica_n4] o.a.s.c.ShardLeaderElectionContext Found all replicas participating in election, clear LIR
   [junit4]   2> 2845727 INFO  (parallelCoreAdminExecutor-7018-thread-2-processing-n:127.0.0.1:52721_solr x:testcollection_shard2_replica_n4 0a2874e6-04e3-4691-b1dd-586c6490b5e631110249342038157 CREATE) [n:127.0.0.1:52721_solr c:testcollection s:shard2 r:core_node7 x:testcollection_shard2_replica_n4] o.a.s.c.ShardLeaderElectionContext I am the new leader: http://127.0.0.1:52721/solr/testcollection_shard2_replica_n4/ shard2
   [junit4]   2> 2845735 INFO  (parallelCoreAdminExecutor-7019-thread-1-processing-n:127.0.0.1:59685_solr x:testcollection_shard1_replica_n2 0a2874e6-04e3-4691-b1dd-586c6490b5e631110249338878288 CREATE) [n:127.0.0.1:59685_solr c:testcollection s:shard1 r:core_node5 x:testcollection_shard1_replica_n2] o.a.s.c.ShardLeaderElectionContext Enough replicas found to continue.
   [junit4]   2> 2845735 INFO  (parallelCoreAdminExecutor-7019-thread-1-processing-n:127.0.0.1:59685_solr x:testcollection_shard1_replica_n2 0a2874e6-04e3-4691-b1dd-586c6490b5e631110249338878288 CREATE) [n:127.0.0.1:59685_solr c:testcollection s:shard1 r:core_node5 x:testcollection_shard1_replica_n2] o.a.s.c.ShardLeaderElectionContext I may be the new leader - try and sync
   [junit4]   2> 2845735 INFO  (parallelCoreAdminExecutor-7019-thread-1-processing-n:127.0.0.1:59685_solr x:testcollection_shard1_replica_n2 0a2874e6-04e3-4691-b1dd-586c6490b5e631110249338878288 CREATE) [n:127.0.0.1:59685_solr c:testcollection s:shard1 r:core_node5 x:testcollection_shard1_replica_n2] o.a.s.c.SyncStrategy Sync replicas to http://127.0.0.1:59685/solr/testcollection_shard1_replica_n2/
   [junit4]   2> 2845736 INFO  (parallelCoreAdminExecutor-7019-thread-1-processing-n:127.0.0.1:59685_solr x:testcollection_shard1_replica_n2 0a2874e6-04e3-4691-b1dd-586c6490b5e631110249338878288 CREATE) [n:127.0.0.1:59685_solr c:testcollection s:shard1 r:core_node5 x:testcollection_shard1_replica_n2] o.a.s.u.PeerSync PeerSync: core=testcollection_shard1_replica_n2 url=http://127.0.0.1:59685/solr START replicas=[http://127.0.0.1:52721/solr/testcollection_shard1_replica_n1/] nUpdates=100
   [junit4]   2> 2845740 INFO  (parallelCoreAdminExecutor-7019-thread-1-processing-n:127.0.0.1:59685_solr x:testcollection_shard1_replica_n2 0a2874e6-04e3-4691-b1dd-586c6490b5e631110249338878288 CREATE) [n:127.0.0.1:59685_solr c:testcollection s:shard1 r:core_node5 x:testcollection_shard1_replica_n2] o.a.s.u.PeerSync PeerSync: core=testcollection_shard1_replica_n2 url=http://127.0.0.1:59685/solr DONE.  We have no versions.  sync failed.
   [junit4]   2> 2845742 INFO  (qtp1795113159-19849) [n:127.0.0.1:52721_solr c:testcollection s:shard1 r:core_node3 x:testcollection_shard1_replica_n1] o.a.s.c.S.Request [testcollection_shard1_replica_n1]  webapp=/solr path=/get params={distrib=false&qt=/get&fingerprint=false&getVersions=100&wt=javabin&version=2} status=0 QTime=0
   [junit4]   2> 2845743 INFO  (parallelCoreAdminExecutor-7019-thread-1-processing-n:127.0.0.1:59685_solr x:testcollection_shard1_replica_n2 0a2874e6-04e3-4691-b1dd-586c6490b5e631110249338878288 CREATE) [n:127.0.0.1:59685_solr c:testcollection s:shard1 r:core_node5 x:testcollection_shard1_replica_n2] o.a.s.c.SyncStrategy Leader's attempt to sync with shard failed, moving to the next candidate
   [junit4]   2> 2845743 INFO  (parallelCoreAdminExecutor-7019-thread-1-processing-n:127.0.0.1:59685_solr x:testcollection_shard1_replica_n2 0a2874e6-04e3-4691-b1dd-586c6490b5e631110249338878288 CREATE) [n:127.0.0.1:59685_solr c:testcollection s:shard1 r:core_node5 x:testcollection_shard1_replica_n2] o.a.s.c.ShardLeaderElectionContext We failed sync, but we have no versions - we can't sync in that case - we were active before, so become leader anyway
   [junit4]   2> 2845743 INFO  (parallelCoreAdminExecutor-7019-thread-1-processing-n:127.0.0.1:59685_solr x:testcollection_shard1_replica_n2 0a2874e6-04e3-4691-b1dd-586c6490b5e631110249338878288 CREATE) [n:127.0.0.1:59685_solr c:testcollection s:shard1 r:core_node5 x:testcollection_shard1_replica_n2] o.a.s.c.ShardLeaderElectionContext Found all replicas participating in election, clear LIR
   [junit4]   2> 2845753 INFO  (parallelCoreAdminExecutor-7019-thread-1-processing-n:127.0.0.1:59685_solr x:testcollection_shard1_replica_n2 0a2874e6-04e3-4691-b1dd-586c6490b5e631110249338878288 CREATE) [n:127.0.0.1:59685_solr c:testcollection s:shard1 r:core_node5 x:testcollection_shard1_replica_n2] o.a.s.c.ShardLeaderElectionContext I am the new leader: http://127.0.0.1:59685/solr/testcollection_shard1_replica_n2/ shard1
   [junit4]   2> 2845855 INFO  (parallelCoreAdminExecutor-7019-thread-1-processing-n:127.0.0.1:59685_solr x:testcollection_shard1_replica_n2 0a2874e6-04e3-4691-b1dd-586c6490b5e6311102493388782

[...truncated too long message...]

workspace/Lucene-Solr-BadApples-Tests-master/lucene/top-level-ivy-settings.xml

resolve:

ivy-availability-check:
[loadresource] Do not set property disallowed.ivy.jars.list as its length is 0.

-ivy-fail-disallowed-ivy-version:

ivy-fail:

ivy-fail:

ivy-configure:
[ivy:configure] :: loading settings :: file = /x1/jenkins/jenkins-slave/workspace/Lucene-Solr-BadApples-Tests-master/lucene/top-level-ivy-settings.xml

resolve:

ivy-availability-check:
[loadresource] Do not set property disallowed.ivy.jars.list as its length is 0.

-ivy-fail-disallowed-ivy-version:

ivy-fail:

ivy-configure:
[ivy:configure] :: loading settings :: file = /x1/jenkins/jenkins-slave/workspace/Lucene-Solr-BadApples-Tests-master/lucene/top-level-ivy-settings.xml

resolve:

ivy-availability-check:
[loadresource] Do not set property disallowed.ivy.jars.list as its length is 0.

-ivy-fail-disallowed-ivy-version:

ivy-fail:

ivy-fail:

ivy-configure:
[ivy:configure] :: loading settings :: file = /x1/jenkins/jenkins-slave/workspace/Lucene-Solr-BadApples-Tests-master/lucene/top-level-ivy-settings.xml

resolve:

ivy-availability-check:
[loadresource] Do not set property disallowed.ivy.jars.list as its length is 0.

-ivy-fail-disallowed-ivy-version:

ivy-fail:

ivy-fail:

ivy-configure:
[ivy:configure] :: loading settings :: file = /x1/jenkins/jenkins-slave/workspace/Lucene-Solr-BadApples-Tests-master/lucene/top-level-ivy-settings.xml

resolve:

ivy-availability-check:
[loadresource] Do not set property disallowed.ivy.jars.list as its length is 0.

-ivy-fail-disallowed-ivy-version:

ivy-fail:

ivy-fail:

ivy-configure:
[ivy:configure] :: loading settings :: file = /x1/jenkins/jenkins-slave/workspace/Lucene-Solr-BadApples-Tests-master/lucene/top-level-ivy-settings.xml

resolve:

ivy-availability-check:
[loadresource] Do not set property disallowed.ivy.jars.list as its length is 0.

-ivy-fail-disallowed-ivy-version:

ivy-fail:

ivy-fail:

ivy-configure:
[ivy:configure] :: loading settings :: file = /x1/jenkins/jenkins-slave/workspace/Lucene-Solr-BadApples-Tests-master/lucene/top-level-ivy-settings.xml

resolve:

ivy-availability-check:
[loadresource] Do not set property disallowed.ivy.jars.list as its length is 0.

-ivy-fail-disallowed-ivy-version:

ivy-fail:

ivy-fail:

ivy-configure:
[ivy:configure] :: loading settings :: file = /x1/jenkins/jenkins-slave/workspace/Lucene-Solr-BadApples-Tests-master/lucene/top-level-ivy-settings.xml

resolve:

ivy-availability-check:
[loadresource] Do not set property disallowed.ivy.jars.list as its length is 0.

-ivy-fail-disallowed-ivy-version:

ivy-fail:

ivy-fail:

ivy-configure:
[ivy:configure] :: loading settings :: file = /x1/jenkins/jenkins-slave/workspace/Lucene-Solr-BadApples-Tests-master/lucene/top-level-ivy-settings.xml

resolve:

ivy-availability-check:
[loadresource] Do not set property disallowed.ivy.jars.list as its length is 0.

-ivy-fail-disallowed-ivy-version:

ivy-fail:

ivy-fail:

ivy-configure:
[ivy:configure] :: loading settings :: file = /x1/jenkins/jenkins-slave/workspace/Lucene-Solr-BadApples-Tests-master/lucene/top-level-ivy-settings.xml

resolve:

ivy-availability-check:
[loadresource] Do not set property disallowed.ivy.jars.list as its length is 0.

-ivy-fail-disallowed-ivy-version:

ivy-fail:

ivy-fail:

ivy-configure:
[ivy:configure] :: loading settings :: file = /x1/jenkins/jenkins-slave/workspace/Lucene-Solr-BadApples-Tests-master/lucene/top-level-ivy-settings.xml

resolve:

ivy-availability-check:
[loadresource] Do not set property disallowed.ivy.jars.list as its length is 0.

-ivy-fail-disallowed-ivy-version:

ivy-fail:

ivy-fail:

ivy-configure:
[ivy:configure] :: loading settings :: file = /x1/jenkins/jenkins-slave/workspace/Lucene-Solr-BadApples-Tests-master/lucene/top-level-ivy-settings.xml

resolve:

ivy-availability-check:
[loadresource] Do not set property disallowed.ivy.jars.list as its length is 0.

-ivy-fail-disallowed-ivy-version:

ivy-fail:

ivy-fail:

ivy-configure:
[ivy:configure] :: loading settings :: file = /x1/jenkins/jenkins-slave/workspace/Lucene-Solr-BadApples-Tests-master/lucene/top-level-ivy-settings.xml

resolve:

ivy-availability-check:
[loadresource] Do not set property disallowed.ivy.jars.list as its length is 0.

-ivy-fail-disallowed-ivy-version:

ivy-fail:

ivy-fail:

ivy-configure:
[ivy:configure] :: loading settings :: file = /x1/jenkins/jenkins-slave/workspace/Lucene-Solr-BadApples-Tests-master/lucene/top-level-ivy-settings.xml

resolve:

jar-checksums:
    [mkdir] Created dir: /x1/jenkins/jenkins-slave/workspace/Lucene-Solr-BadApples-Tests-master/solr/null831816451
     [copy] Copying 247 files to /x1/jenkins/jenkins-slave/workspace/Lucene-Solr-BadApples-Tests-master/solr/null831816451
   [delete] Deleting directory /x1/jenkins/jenkins-slave/workspace/Lucene-Solr-BadApples-Tests-master/solr/null831816451

check-working-copy:
[ivy:cachepath] :: resolving dependencies :: org.eclipse.jgit#org.eclipse.jgit-caller;working
[ivy:cachepath] 	confs: [default]
[ivy:cachepath] 	found org.eclipse.jgit#org.eclipse.jgit;4.6.0.201612231935-r in public
[ivy:cachepath] 	found com.jcraft#jsch;0.1.53 in public
[ivy:cachepath] 	found com.googlecode.javaewah#JavaEWAH;1.1.6 in public
[ivy:cachepath] 	found org.apache.httpcomponents#httpclient;4.3.6 in public
[ivy:cachepath] 	found org.apache.httpcomponents#httpcore;4.3.3 in public
[ivy:cachepath] 	found commons-logging#commons-logging;1.1.3 in public
[ivy:cachepath] 	found commons-codec#commons-codec;1.6 in public
[ivy:cachepath] 	found org.slf4j#slf4j-api;1.7.2 in public
[ivy:cachepath] :: resolution report :: resolve 99ms :: artifacts dl 9ms
	---------------------------------------------------------------------
	|                  |            modules            ||   artifacts   |
	|       conf       | number| search|dwnlded|evicted|| number|dwnlded|
	---------------------------------------------------------------------
	|      default     |   8   |   0   |   0   |   0   ||   8   |   0   |
	---------------------------------------------------------------------
[wc-checker] Initializing working copy...
[wc-checker] SLF4J: Failed to load class "org.slf4j.impl.StaticLoggerBinder".
[wc-checker] SLF4J: Defaulting to no-operation (NOP) logger implementation
[wc-checker] SLF4J: See http://www.slf4j.org/codes.html#StaticLoggerBinder for further details.
[wc-checker] Checking working copy status...

-jenkins-base:

BUILD SUCCESSFUL
Total time: 177 minutes 48 seconds
Archiving artifacts
java.lang.InterruptedException: no matches found within 10000
	at hudson.FilePath$34.hasMatch(FilePath.java:2678)
	at hudson.FilePath$34.invoke(FilePath.java:2557)
	at hudson.FilePath$34.invoke(FilePath.java:2547)
	at hudson.FilePath$FileCallableWrapper.call(FilePath.java:2918)
Also:   hudson.remoting.Channel$CallSiteStackTrace: Remote call to lucene
		at hudson.remoting.Channel.attachCallSiteStackTrace(Channel.java:1741)
		at hudson.remoting.UserRequest$ExceptionResponse.retrieve(UserRequest.java:357)
		at hudson.remoting.Channel.call(Channel.java:955)
		at hudson.FilePath.act(FilePath.java:1036)
		at hudson.FilePath.act(FilePath.java:1025)
		at hudson.FilePath.validateAntFileMask(FilePath.java:2547)
		at hudson.tasks.ArtifactArchiver.perform(ArtifactArchiver.java:243)
		at hudson.tasks.BuildStepCompatibilityLayer.perform(BuildStepCompatibilityLayer.java:81)
		at hudson.tasks.BuildStepMonitor$1.perform(BuildStepMonitor.java:20)
		at hudson.model.AbstractBuild$AbstractBuildExecution.perform(AbstractBuild.java:744)
		at hudson.model.AbstractBuild$AbstractBuildExecution.performAllBuildSteps(AbstractBuild.java:690)
		at hudson.model.Build$BuildExecution.post2(Build.java:186)
		at hudson.model.AbstractBuild$AbstractBuildExecution.post(AbstractBuild.java:635)
		at hudson.model.Run.execute(Run.java:1819)
		at hudson.model.FreeStyleBuild.run(FreeStyleBuild.java:43)
		at hudson.model.ResourceController.execute(ResourceController.java:97)
		at hudson.model.Executor.run(Executor.java:429)
Caused: hudson.FilePath$TunneledInterruptedException
	at hudson.FilePath$FileCallableWrapper.call(FilePath.java:2920)
	at hudson.remoting.UserRequest.perform(UserRequest.java:212)
	at hudson.remoting.UserRequest.perform(UserRequest.java:54)
	at hudson.remoting.Request$2.run(Request.java:369)
	at hudson.remoting.InterceptingExecutorService$1.call(InterceptingExecutorService.java:72)
	at java.util.concurrent.FutureTask.run(FutureTask.java:266)
	at java.util.concurrent.ThreadPoolExecutor.runWorker(ThreadPoolExecutor.java:1142)
	at java.util.concurrent.ThreadPoolExecutor$Worker.run(ThreadPoolExecutor.java:617)
	at java.lang.Thread.run(Thread.java:748)
Caused: java.lang.InterruptedException: java.lang.InterruptedException: no matches found within 10000
	at hudson.FilePath.act(FilePath.java:1038)
	at hudson.FilePath.act(FilePath.java:1025)
	at hudson.FilePath.validateAntFileMask(FilePath.java:2547)
	at hudson.tasks.ArtifactArchiver.perform(ArtifactArchiver.java:243)
	at hudson.tasks.BuildStepCompatibilityLayer.perform(BuildStepCompatibilityLayer.java:81)
	at hudson.tasks.BuildStepMonitor$1.perform(BuildStepMonitor.java:20)
	at hudson.model.AbstractBuild$AbstractBuildExecution.perform(AbstractBuild.java:744)
	at hudson.model.AbstractBuild$AbstractBuildExecution.performAllBuildSteps(AbstractBuild.java:690)
	at hudson.model.Build$BuildExecution.post2(Build.java:186)
	at hudson.model.AbstractBuild$AbstractBuildExecution.post(AbstractBuild.java:635)
	at hudson.model.Run.execute(Run.java:1819)
	at hudson.model.FreeStyleBuild.run(FreeStyleBuild.java:43)
	at hudson.model.ResourceController.execute(ResourceController.java:97)
	at hudson.model.Executor.run(Executor.java:429)
No artifacts found that match the file pattern "**/*.events,heapdumps/**,**/hs_err_pid*". Configuration error?
Recording test results
Build step 'Publish JUnit test result report' changed build result to UNSTABLE
Email was triggered for: Unstable (Test Failures)
Sending email for trigger: Unstable (Test Failures)

Mime
View raw message