lucene-dev mailing list archives

Site index · List index
Message view « Date » · « Thread »
Top « Date » · « Thread »
From Policeman Jenkins Server <jenk...@thetaphi.de>
Subject [JENKINS] Lucene-Solr-master-Linux (64bit/jdk-9.0.4) - Build # 22461 - Still Unstable!
Date Mon, 16 Jul 2018 07:46:50 GMT
Build: https://jenkins.thetaphi.de/job/Lucene-Solr-master-Linux/22461/
Java: 64bit/jdk-9.0.4 -XX:+UseCompressedOops -XX:+UseSerialGC

1 tests failed.
FAILED:  org.apache.solr.handler.component.InfixSuggestersTest.testShutdownDuringBuild

Error Message:
junit.framework.AssertionFailedError: Unexpected wrapped exception type, expected CoreIsClosedException

Stack Trace:
java.util.concurrent.ExecutionException: junit.framework.AssertionFailedError: Unexpected wrapped exception type, expected CoreIsClosedException
	at __randomizedtesting.SeedInfo.seed([5389734890D56900:8C0411F7AEBC3C62]:0)
	at java.base/java.util.concurrent.FutureTask.report(FutureTask.java:122)
	at java.base/java.util.concurrent.FutureTask.get(FutureTask.java:191)
	at org.apache.solr.handler.component.InfixSuggestersTest.testShutdownDuringBuild(InfixSuggestersTest.java:130)
	at java.base/jdk.internal.reflect.NativeMethodAccessorImpl.invoke0(Native Method)
	at java.base/jdk.internal.reflect.NativeMethodAccessorImpl.invoke(NativeMethodAccessorImpl.java:62)
	at java.base/jdk.internal.reflect.DelegatingMethodAccessorImpl.invoke(DelegatingMethodAccessorImpl.java:43)
	at java.base/java.lang.reflect.Method.invoke(Method.java:564)
	at com.carrotsearch.randomizedtesting.RandomizedRunner.invoke(RandomizedRunner.java:1737)
	at com.carrotsearch.randomizedtesting.RandomizedRunner$8.evaluate(RandomizedRunner.java:934)
	at com.carrotsearch.randomizedtesting.RandomizedRunner$9.evaluate(RandomizedRunner.java:970)
	at com.carrotsearch.randomizedtesting.RandomizedRunner$10.evaluate(RandomizedRunner.java:984)
	at com.carrotsearch.randomizedtesting.rules.SystemPropertiesRestoreRule$1.evaluate(SystemPropertiesRestoreRule.java:57)
	at org.apache.lucene.util.TestRuleSetupTeardownChained$1.evaluate(TestRuleSetupTeardownChained.java:49)
	at org.apache.lucene.util.AbstractBeforeAfterRule$1.evaluate(AbstractBeforeAfterRule.java:45)
	at org.apache.lucene.util.TestRuleThreadAndTestName$1.evaluate(TestRuleThreadAndTestName.java:48)
	at org.apache.lucene.util.TestRuleIgnoreAfterMaxFailures$1.evaluate(TestRuleIgnoreAfterMaxFailures.java:64)
	at org.apache.lucene.util.TestRuleMarkFailure$1.evaluate(TestRuleMarkFailure.java:47)
	at com.carrotsearch.randomizedtesting.rules.StatementAdapter.evaluate(StatementAdapter.java:36)
	at com.carrotsearch.randomizedtesting.ThreadLeakControl$StatementRunner.run(ThreadLeakControl.java:368)
	at com.carrotsearch.randomizedtesting.ThreadLeakControl.forkTimeoutingTask(ThreadLeakControl.java:817)
	at com.carrotsearch.randomizedtesting.ThreadLeakControl$3.evaluate(ThreadLeakControl.java:468)
	at com.carrotsearch.randomizedtesting.RandomizedRunner.runSingleTest(RandomizedRunner.java:943)
	at com.carrotsearch.randomizedtesting.RandomizedRunner$5.evaluate(RandomizedRunner.java:829)
	at com.carrotsearch.randomizedtesting.RandomizedRunner$6.evaluate(RandomizedRunner.java:879)
	at com.carrotsearch.randomizedtesting.RandomizedRunner$7.evaluate(RandomizedRunner.java:890)
	at com.carrotsearch.randomizedtesting.rules.StatementAdapter.evaluate(StatementAdapter.java:36)
	at com.carrotsearch.randomizedtesting.rules.SystemPropertiesRestoreRule$1.evaluate(SystemPropertiesRestoreRule.java:57)
	at org.apache.lucene.util.AbstractBeforeAfterRule$1.evaluate(AbstractBeforeAfterRule.java:45)
	at com.carrotsearch.randomizedtesting.rules.StatementAdapter.evaluate(StatementAdapter.java:36)
	at org.apache.lucene.util.TestRuleStoreClassName$1.evaluate(TestRuleStoreClassName.java:41)
	at com.carrotsearch.randomizedtesting.rules.NoShadowingOrOverridesOnMethodsRule$1.evaluate(NoShadowingOrOverridesOnMethodsRule.java:40)
	at com.carrotsearch.randomizedtesting.rules.NoShadowingOrOverridesOnMethodsRule$1.evaluate(NoShadowingOrOverridesOnMethodsRule.java:40)
	at com.carrotsearch.randomizedtesting.rules.StatementAdapter.evaluate(StatementAdapter.java:36)
	at com.carrotsearch.randomizedtesting.rules.StatementAdapter.evaluate(StatementAdapter.java:36)
	at org.apache.lucene.util.TestRuleAssertionsRequired$1.evaluate(TestRuleAssertionsRequired.java:53)
	at org.apache.lucene.util.TestRuleMarkFailure$1.evaluate(TestRuleMarkFailure.java:47)
	at org.apache.lucene.util.TestRuleIgnoreAfterMaxFailures$1.evaluate(TestRuleIgnoreAfterMaxFailures.java:64)
	at org.apache.lucene.util.TestRuleIgnoreTestSuites$1.evaluate(TestRuleIgnoreTestSuites.java:54)
	at com.carrotsearch.randomizedtesting.rules.StatementAdapter.evaluate(StatementAdapter.java:36)
	at com.carrotsearch.randomizedtesting.ThreadLeakControl$StatementRunner.run(ThreadLeakControl.java:368)
	at java.base/java.lang.Thread.run(Thread.java:844)
Caused by: junit.framework.AssertionFailedError: Unexpected wrapped exception type, expected CoreIsClosedException
	at org.apache.lucene.util.LuceneTestCase.expectThrows(LuceneTestCase.java:2696)
	at org.apache.solr.handler.component.InfixSuggestersTest.lambda$testShutdownDuringBuild$3(InfixSuggestersTest.java:121)
	at java.base/java.util.concurrent.FutureTask.run(FutureTask.java:264)
	at org.apache.solr.common.util.ExecutorUtil$MDCAwareThreadPoolExecutor.lambda$execute$0(ExecutorUtil.java:209)
	at java.base/java.util.concurrent.ThreadPoolExecutor.runWorker(ThreadPoolExecutor.java:1167)
	at java.base/java.util.concurrent.ThreadPoolExecutor$Worker.run(ThreadPoolExecutor.java:641)
	... 1 more
Caused by: java.lang.RuntimeException: Exception during query
	at org.apache.solr.SolrTestCaseJ4.assertQ(SolrTestCaseJ4.java:917)
	at org.apache.solr.SolrTestCaseJ4.assertQ(SolrTestCaseJ4.java:877)
	at org.apache.solr.handler.component.InfixSuggestersTest.lambda$testShutdownDuringBuild$2(InfixSuggestersTest.java:122)
	at org.apache.lucene.util.LuceneTestCase.expectThrows(LuceneTestCase.java:2688)
	... 6 more
Caused by: org.apache.solr.common.SolrException: SolrCoreState already closed.
	at org.apache.solr.update.DefaultSolrCoreState.lock(DefaultSolrCoreState.java:186)
	at org.apache.solr.update.DefaultSolrCoreState.getIndexWriter(DefaultSolrCoreState.java:121)
	at org.apache.solr.update.SolrCoreState.getTragicException(SolrCoreState.java:198)
	at org.apache.solr.core.CoreContainer.checkTragicException(CoreContainer.java:1812)
	at org.apache.solr.handler.RequestHandlerBase.handleRequest(RequestHandlerBase.java:212)
	at org.apache.solr.core.SolrCore.execute(SolrCore.java:2541)
	at org.apache.solr.util.TestHarness.query(TestHarness.java:337)
	at org.apache.solr.util.TestHarness.query(TestHarness.java:319)
	at org.apache.solr.SolrTestCaseJ4.assertQ(SolrTestCaseJ4.java:891)
	... 9 more




Build Log:
[...truncated 13475 lines...]
   [junit4] Suite: org.apache.solr.handler.component.InfixSuggestersTest
   [junit4]   2> 893230 INFO  (SUITE-InfixSuggestersTest-seed#[5389734890D56900]-worker) [    ] o.a.s.SolrTestCaseJ4 SecureRandom sanity checks: test.solr.allowed.securerandom=null & java.security.egd=file:/dev/./urandom
   [junit4]   2> Creating dataDir: /home/jenkins/workspace/Lucene-Solr-master-Linux/solr/build/solr-core/test/J1/temp/solr.handler.component.InfixSuggestersTest_5389734890D56900-001/init-core-data-001
   [junit4]   2> 893230 WARN  (SUITE-InfixSuggestersTest-seed#[5389734890D56900]-worker) [    ] o.a.s.SolrTestCaseJ4 startTrackingSearchers: numOpens=1 numCloses=1
   [junit4]   2> 893230 INFO  (SUITE-InfixSuggestersTest-seed#[5389734890D56900]-worker) [    ] o.a.s.SolrTestCaseJ4 Using TrieFields (NUMERIC_POINTS_SYSPROP=false) w/NUMERIC_DOCVALUES_SYSPROP=false
   [junit4]   2> 893231 INFO  (SUITE-InfixSuggestersTest-seed#[5389734890D56900]-worker) [    ] o.a.s.SolrTestCaseJ4 Randomized ssl (true) and clientAuth (true) via: @org.apache.solr.util.RandomizeSSL(reason="", value=0.0/0.0, ssl=0.0/0.0, clientAuth=0.0/0.0)
   [junit4]   2> 893231 INFO  (SUITE-InfixSuggestersTest-seed#[5389734890D56900]-worker) [    ] o.a.s.SolrTestCaseJ4 ####initCore
   [junit4]   2> 893232 INFO  (SUITE-InfixSuggestersTest-seed#[5389734890D56900]-worker) [    ] o.a.s.c.SolrResourceLoader [null] Added 2 libs to classloader, from paths: [/home/jenkins/workspace/Lucene-Solr-master-Linux/solr/core/src/test-files/solr/collection1/lib, /home/jenkins/workspace/Lucene-Solr-master-Linux/solr/core/src/test-files/solr/collection1/lib/classes]
   [junit4]   2> 893244 INFO  (SUITE-InfixSuggestersTest-seed#[5389734890D56900]-worker) [    ] o.a.s.c.SolrConfig Using Lucene MatchVersion: 8.0.0
   [junit4]   2> 893269 INFO  (SUITE-InfixSuggestersTest-seed#[5389734890D56900]-worker) [    ] o.a.s.s.IndexSchema [null] Schema name=test
   [junit4]   2> 893348 INFO  (SUITE-InfixSuggestersTest-seed#[5389734890D56900]-worker) [    ] o.a.s.s.IndexSchema Loaded schema test/1.0 with uniqueid field id
   [junit4]   2> 893405 INFO  (SUITE-InfixSuggestersTest-seed#[5389734890D56900]-worker) [    ] o.a.s.c.TransientSolrCoreCacheDefault Allocating transient cache for 2147483647 transient cores
   [junit4]   2> 893405 INFO  (SUITE-InfixSuggestersTest-seed#[5389734890D56900]-worker) [    ] o.a.s.h.a.MetricsHistoryHandler No .system collection, keeping metrics history in memory.
   [junit4]   2> 893417 INFO  (SUITE-InfixSuggestersTest-seed#[5389734890D56900]-worker) [    ] o.a.s.m.r.SolrJmxReporter JMX monitoring for 'solr.node' (registry 'solr.node') enabled at server: com.sun.jmx.mbeanserver.JmxMBeanServer@24e1b694
   [junit4]   2> 893425 INFO  (SUITE-InfixSuggestersTest-seed#[5389734890D56900]-worker) [    ] o.a.s.m.r.SolrJmxReporter JMX monitoring for 'solr.jvm' (registry 'solr.jvm') enabled at server: com.sun.jmx.mbeanserver.JmxMBeanServer@24e1b694
   [junit4]   2> 893426 INFO  (SUITE-InfixSuggestersTest-seed#[5389734890D56900]-worker) [    ] o.a.s.m.r.SolrJmxReporter JMX monitoring for 'solr.jetty' (registry 'solr.jetty') enabled at server: com.sun.jmx.mbeanserver.JmxMBeanServer@24e1b694
   [junit4]   2> 893427 INFO  (coreLoadExecutor-5451-thread-1) [    x:collection1] o.a.s.c.SolrResourceLoader [null] Added 2 libs to classloader, from paths: [/home/jenkins/workspace/Lucene-Solr-master-Linux/solr/core/src/test-files/solr/collection1/lib, /home/jenkins/workspace/Lucene-Solr-master-Linux/solr/core/src/test-files/solr/collection1/lib/classes]
   [junit4]   2> 893437 INFO  (coreLoadExecutor-5451-thread-1) [    x:collection1] o.a.s.c.SolrConfig Using Lucene MatchVersion: 8.0.0
   [junit4]   2> 893443 INFO  (coreLoadExecutor-5451-thread-1) [    x:collection1] o.a.s.s.IndexSchema [collection1] Schema name=test
   [junit4]   2> 893491 INFO  (coreLoadExecutor-5451-thread-1) [    x:collection1] o.a.s.s.IndexSchema Loaded schema test/1.0 with uniqueid field id
   [junit4]   2> 893496 INFO  (coreLoadExecutor-5451-thread-1) [    x:collection1] o.a.s.c.CoreContainer Creating SolrCore 'collection1' using configuration from instancedir /home/jenkins/workspace/Lucene-Solr-master-Linux/solr/core/src/test-files/solr/collection1, trusted=true
   [junit4]   2> 893496 INFO  (coreLoadExecutor-5451-thread-1) [    x:collection1] o.a.s.m.r.SolrJmxReporter JMX monitoring for 'solr.core.collection1' (registry 'solr.core.collection1') enabled at server: com.sun.jmx.mbeanserver.JmxMBeanServer@24e1b694
   [junit4]   2> 893496 INFO  (coreLoadExecutor-5451-thread-1) [    x:collection1] o.a.s.c.SolrCore solr.RecoveryStrategy.Builder
   [junit4]   2> 893496 INFO  (coreLoadExecutor-5451-thread-1) [    x:collection1] o.a.s.c.SolrCore [[collection1] ] Opening new SolrCore at [/home/jenkins/workspace/Lucene-Solr-master-Linux/solr/core/src/test-files/solr/collection1], dataDir=[/home/jenkins/workspace/Lucene-Solr-master-Linux/solr/build/solr-core/test/J1/temp/solr.handler.component.InfixSuggestersTest_5389734890D56900-001/init-core-data-001/]
   [junit4]   2> 893498 INFO  (coreLoadExecutor-5451-thread-1) [    x:collection1] o.a.s.u.RandomMergePolicy RandomMergePolicy wrapping class org.apache.lucene.index.TieredMergePolicy: [TieredMergePolicy: maxMergeAtOnce=20, maxMergeAtOnceExplicit=45, maxMergedSegmentMB=2.1259765625, floorSegmentMB=2.09765625, forceMergeDeletesPctAllowed=3.6951724527149943, segmentsPerTier=46.0, maxCFSSegmentSizeMB=8.796093022207999E12, noCFSRatio=0.17524750645123827, reclaimDeletesWeight=0.05880155571549661
   [junit4]   2> 893534 INFO  (coreLoadExecutor-5451-thread-1) [    x:collection1] o.a.s.u.CommitTracker Hard AutoCommit: disabled
   [junit4]   2> 893534 INFO  (coreLoadExecutor-5451-thread-1) [    x:collection1] o.a.s.u.CommitTracker Soft AutoCommit: disabled
   [junit4]   2> 893535 INFO  (coreLoadExecutor-5451-thread-1) [    x:collection1] o.a.s.u.RandomMergePolicy RandomMergePolicy wrapping class org.apache.lucene.index.LogDocMergePolicy: [LogDocMergePolicy: minMergeSize=1000, mergeFactor=29, maxMergeSize=9223372036854775807, maxMergeSizeForForcedMerge=9223372036854775807, calibrateSizeByDeletes=true, maxMergeDocs=2147483647, maxCFSSegmentSizeMB=8.796093022207999E12, noCFSRatio=1.0]
   [junit4]   2> 893535 INFO  (coreLoadExecutor-5451-thread-1) [    x:collection1] o.a.s.s.SolrIndexSearcher Opening [Searcher@3931f80c[collection1] main]
   [junit4]   2> 893535 WARN  (coreLoadExecutor-5451-thread-1) [    x:collection1] o.a.s.r.ManagedResourceStorage Cannot write to config directory /home/jenkins/workspace/Lucene-Solr-master-Linux/solr/core/src/test-files/solr/collection1/conf; switching to use InMemory storage instead.
   [junit4]   2> 893536 INFO  (coreLoadExecutor-5451-thread-1) [    x:collection1] o.a.s.h.c.SuggestComponent Initializing SuggestComponent
   [junit4]   2> 893536 INFO  (coreLoadExecutor-5451-thread-1) [    x:collection1] o.a.s.s.s.SolrSuggester init: {name=shortRandomAnalyzingInfixSuggester,lookupImpl=AnalyzingInfixLookupFactory,dictionaryImpl=RandomTestDictionaryFactory,randDictMaxItems=100,indexPath=short_random_analyzing_infix_suggester,suggestAnalyzerFieldType=text,buildOnCommit=false,buildOnStartup=false}
   [junit4]   2> 893539 INFO  (coreLoadExecutor-5451-thread-1) [    x:collection1] o.a.s.s.s.SolrSuggester Dictionary loaded with params: {name=shortRandomAnalyzingInfixSuggester,lookupImpl=AnalyzingInfixLookupFactory,dictionaryImpl=RandomTestDictionaryFactory,randDictMaxItems=100,indexPath=short_random_analyzing_infix_suggester,suggestAnalyzerFieldType=text,buildOnCommit=false,buildOnStartup=false}
   [junit4]   2> 893539 INFO  (coreLoadExecutor-5451-thread-1) [    x:collection1] o.a.s.h.c.SuggestComponent Initializing SuggestComponent
   [junit4]   2> 893540 INFO  (coreLoadExecutor-5451-thread-1) [    x:collection1] o.a.s.s.s.SolrSuggester init: {name=longRandomAnalyzingInfixSuggester,lookupImpl=AnalyzingInfixLookupFactory,dictionaryImpl=RandomTestDictionaryFactory,randDictMaxItems=100000,indexPath=long_random_analyzing_infix_suggester,suggestAnalyzerFieldType=text,buildOnCommit=false,buildOnStartup=false}
   [junit4]   2> 893540 INFO  (coreLoadExecutor-5451-thread-1) [    x:collection1] o.a.s.s.s.SolrSuggester Dictionary loaded with params: {name=longRandomAnalyzingInfixSuggester,lookupImpl=AnalyzingInfixLookupFactory,dictionaryImpl=RandomTestDictionaryFactory,randDictMaxItems=100000,indexPath=long_random_analyzing_infix_suggester,suggestAnalyzerFieldType=text,buildOnCommit=false,buildOnStartup=false}
   [junit4]   2> 893540 INFO  (coreLoadExecutor-5451-thread-1) [    x:collection1] o.a.s.h.c.SuggestComponent Initializing SuggestComponent
   [junit4]   2> 893540 INFO  (coreLoadExecutor-5451-thread-1) [    x:collection1] o.a.s.s.s.SolrSuggester init: {name=shortRandomBlendedInfixSuggester,lookupImpl=BlendedInfixLookupFactory,dictionaryImpl=RandomTestDictionaryFactory,randDictMaxItems=100,blenderType=position_linear,suggestAnalyzerFieldType=text,indexPath=short_random_blended_infix_suggester,highlight=true,buildOnStartup=false,buildOnCommit=false}
   [junit4]   2> 893540 INFO  (coreLoadExecutor-5451-thread-1) [    x:collection1] o.a.s.s.s.SolrSuggester Dictionary loaded with params: {name=shortRandomBlendedInfixSuggester,lookupImpl=BlendedInfixLookupFactory,dictionaryImpl=RandomTestDictionaryFactory,randDictMaxItems=100,blenderType=position_linear,suggestAnalyzerFieldType=text,indexPath=short_random_blended_infix_suggester,highlight=true,buildOnStartup=false,buildOnCommit=false}
   [junit4]   2> 893540 INFO  (coreLoadExecutor-5451-thread-1) [    x:collection1] o.a.s.h.ReplicationHandler Commits will be reserved for 10000ms.
   [junit4]   2> 893541 INFO  (searcherExecutor-5452-thread-1-processing-x:collection1) [    x:collection1] o.a.s.c.SolrCore [collection1] Registered new searcher Searcher@3931f80c[collection1] main{ExitableDirectoryReader(UninvertingDirectoryReader())}
   [junit4]   2> 893541 INFO  (SUITE-InfixSuggestersTest-seed#[5389734890D56900]-worker) [    ] o.a.s.SolrTestCaseJ4 ####initCore end
   [junit4]   2> 893542 INFO  (TEST-InfixSuggestersTest.testBuildThen2xReload-seed#[5389734890D56900]) [    ] o.a.s.SolrTestCaseJ4 ###Starting testBuildThen2xReload
   [junit4]   2> 893542 INFO  (TEST-InfixSuggestersTest.testBuildThen2xReload-seed#[5389734890D56900]) [    ] o.a.s.h.c.SuggestComponent SuggestComponent prepare with : qt=/suggest_analyzing_infix_short_dictionary&suggest=true&suggest.buildAll=true&wt=xml&indent=off
   [junit4]   2> 893543 INFO  (TEST-InfixSuggestersTest.testBuildThen2xReload-seed#[5389734890D56900]) [    ] o.a.s.s.s.SolrSuggester SolrSuggester.build(shortRandomAnalyzingInfixSuggester)
   [junit4]   2> 893558 INFO  (TEST-InfixSuggestersTest.testBuildThen2xReload-seed#[5389734890D56900]) [    ] o.a.s.s.s.RandomTestDictionaryFactory org.apache.solr.spelling.suggest.RandomTestDictionaryFactory$RandomTestDictionary.enabled.shortRandomAnalyzingInfixSuggester disabled after emitting 100 items.
   [junit4]   2> 893625 INFO  (TEST-InfixSuggestersTest.testBuildThen2xReload-seed#[5389734890D56900]) [    ] o.a.s.h.c.SuggestComponent SuggestComponent process with : qt=/suggest_analyzing_infix_short_dictionary&suggest=true&suggest.buildAll=true&wt=xml&indent=off
   [junit4]   2> 893625 INFO  (TEST-InfixSuggestersTest.testBuildThen2xReload-seed#[5389734890D56900]) [    ] o.a.s.c.S.Request [collection1]  webapp=null path=null params={qt=/suggest_analyzing_infix_short_dictionary&suggest.buildAll=true&wt=xml} status=0 QTime=82
   [junit4]   2> 893626 ERROR (TEST-InfixSuggestersTest.testBuildThen2xReload-seed#[5389734890D56900]) [    ] o.a.s.c.CorePropertiesLocator Couldn't load core descriptor from /home/jenkins/workspace/Lucene-Solr-master-Linux/solr/core/src/test-files/solr/collection1/core.properties:java.nio.file.NoSuchFileException: /home/jenkins/workspace/Lucene-Solr-master-Linux/solr/core/src/test-files/solr/collection1/core.properties
   [junit4]   2> 893627 INFO  (TEST-InfixSuggestersTest.testBuildThen2xReload-seed#[5389734890D56900]) [    ] o.a.s.c.SolrResourceLoader [null] Added 2 libs to classloader, from paths: [/home/jenkins/workspace/Lucene-Solr-master-Linux/solr/core/src/test-files/solr/collection1/lib, /home/jenkins/workspace/Lucene-Solr-master-Linux/solr/core/src/test-files/solr/collection1/lib/classes]
   [junit4]   2> 893643 INFO  (TEST-InfixSuggestersTest.testBuildThen2xReload-seed#[5389734890D56900]) [    ] o.a.s.c.SolrConfig Using Lucene MatchVersion: 8.0.0
   [junit4]   2> 893651 INFO  (TEST-InfixSuggestersTest.testBuildThen2xReload-seed#[5389734890D56900]) [    ] o.a.s.s.IndexSchema [collection1] Schema name=test
   [junit4]   2> 893714 INFO  (TEST-InfixSuggestersTest.testBuildThen2xReload-seed#[5389734890D56900]) [    ] o.a.s.s.IndexSchema Loaded schema test/1.0 with uniqueid field id
   [junit4]   2> 893718 INFO  (TEST-InfixSuggestersTest.testBuildThen2xReload-seed#[5389734890D56900]) [    ] o.a.s.c.CoreContainer Reloading SolrCore 'collection1' using configuration from instancedir /home/jenkins/workspace/Lucene-Solr-master-Linux/solr/core/src/test-files/solr/collection1
   [junit4]   2> 893734 INFO  (TEST-InfixSuggestersTest.testBuildThen2xReload-seed#[5389734890D56900]) [    x:collection1] o.a.s.m.r.SolrJmxReporter JMX monitoring for 'solr.core.collection1' (registry 'solr.core.collection1') enabled at server: com.sun.jmx.mbeanserver.JmxMBeanServer@24e1b694
   [junit4]   2> 893735 INFO  (TEST-InfixSuggestersTest.testBuildThen2xReload-seed#[5389734890D56900]) [    x:collection1] o.a.s.c.SolrCore [[collection1] ] Opening new SolrCore at [/home/jenkins/workspace/Lucene-Solr-master-Linux/solr/core/src/test-files/solr/collection1], dataDir=[/home/jenkins/workspace/Lucene-Solr-master-Linux/solr/build/solr-core/test/J1/temp/solr.handler.component.InfixSuggestersTest_5389734890D56900-001/init-core-data-001/]
   [junit4]   2> 893762 INFO  (TEST-InfixSuggestersTest.testBuildThen2xReload-seed#[5389734890D56900]) [    x:collection1] o.a.s.u.CommitTracker Hard AutoCommit: disabled
   [junit4]   2> 893762 INFO  (TEST-InfixSuggestersTest.testBuildThen2xReload-seed#[5389734890D56900]) [    x:collection1] o.a.s.u.CommitTracker Soft AutoCommit: disabled
   [junit4]   2> 893763 INFO  (TEST-InfixSuggestersTest.testBuildThen2xReload-seed#[5389734890D56900]) [    x:collection1] o.a.s.s.SolrIndexSearcher Opening [Searcher@2d3c5998[collection1] main]
   [junit4]   2> 893764 WARN  (TEST-InfixSuggestersTest.testBuildThen2xReload-seed#[5389734890D56900]) [    x:collection1] o.a.s.r.ManagedResourceStorage Cannot write to config directory /home/jenkins/workspace/Lucene-Solr-master-Linux/solr/core/src/test-files/solr/collection1/conf; switching to use InMemory storage instead.
   [junit4]   2> 893764 INFO  (TEST-InfixSuggestersTest.testBuildThen2xReload-seed#[5389734890D56900]) [    x:collection1] o.a.s.h.c.SuggestComponent Initializing SuggestComponent
   [junit4]   2> 893764 INFO  (TEST-InfixSuggestersTest.testBuildThen2xReload-seed#[5389734890D56900]) [    x:collection1] o.a.s.s.s.SolrSuggester init: {name=shortRandomAnalyzingInfixSuggester,lookupImpl=AnalyzingInfixLookupFactory,dictionaryImpl=RandomTestDictionaryFactory,randDictMaxItems=100,indexPath=short_random_analyzing_infix_suggester,suggestAnalyzerFieldType=text,buildOnCommit=false,buildOnStartup=false}
   [junit4]   2> 893765 INFO  (TEST-InfixSuggestersTest.testBuildThen2xReload-seed#[5389734890D56900]) [    x:collection1] o.a.s.s.s.SolrSuggester Dictionary loaded with params: {name=shortRandomAnalyzingInfixSuggester,lookupImpl=AnalyzingInfixLookupFactory,dictionaryImpl=RandomTestDictionaryFactory,randDictMaxItems=100,indexPath=short_random_analyzing_infix_suggester,suggestAnalyzerFieldType=text,buildOnCommit=false,buildOnStartup=false}
   [junit4]   2> 893765 INFO  (TEST-InfixSuggestersTest.testBuildThen2xReload-seed#[5389734890D56900]) [    x:collection1] o.a.s.h.c.SuggestComponent Initializing SuggestComponent
   [junit4]   2> 893765 INFO  (TEST-InfixSuggestersTest.testBuildThen2xReload-seed#[5389734890D56900]) [    x:collection1] o.a.s.s.s.SolrSuggester init: {name=longRandomAnalyzingInfixSuggester,lookupImpl=AnalyzingInfixLookupFactory,dictionaryImpl=RandomTestDictionaryFactory,randDictMaxItems=100000,indexPath=long_random_analyzing_infix_suggester,suggestAnalyzerFieldType=text,buildOnCommit=false,buildOnStartup=false}
   [junit4]   2> 893765 INFO  (TEST-InfixSuggestersTest.testBuildThen2xReload-seed#[5389734890D56900]) [    x:collection1] o.a.s.s.s.SolrSuggester Dictionary loaded with params: {name=longRandomAnalyzingInfixSuggester,lookupImpl=AnalyzingInfixLookupFactory,dictionaryImpl=RandomTestDictionaryFactory,randDictMaxItems=100000,indexPath=long_random_analyzing_infix_suggester,suggestAnalyzerFieldType=text,buildOnCommit=false,buildOnStartup=false}
   [junit4]   2> 893765 INFO  (TEST-InfixSuggestersTest.testBuildThen2xReload-seed#[5389734890D56900]) [    x:collection1] o.a.s.h.c.SuggestComponent Initializing SuggestComponent
   [junit4]   2> 893765 INFO  (TEST-InfixSuggestersTest.testBuildThen2xReload-seed#[5389734890D56900]) [    x:collection1] o.a.s.s.s.SolrSuggester init: {name=shortRandomBlendedInfixSuggester,lookupImpl=BlendedInfixLookupFactory,dictionaryImpl=RandomTestDictionaryFactory,randDictMaxItems=100,blenderType=position_linear,suggestAnalyzerFieldType=text,indexPath=short_random_blended_infix_suggester,highlight=true,buildOnStartup=false,buildOnCommit=false}
   [junit4]   2> 893765 INFO  (TEST-InfixSuggestersTest.testBuildThen2xReload-seed#[5389734890D56900]) [    x:collection1] o.a.s.s.s.SolrSuggester Dictionary loaded with params: {name=shortRandomBlendedInfixSuggester,lookupImpl=BlendedInfixLookupFactory,dictionaryImpl=RandomTestDictionaryFactory,randDictMaxItems=100,blenderType=position_linear,suggestAnalyzerFieldType=text,indexPath=short_random_blended_infix_suggester,highlight=true,buildOnStartup=false,buildOnCommit=false}
   [junit4]   2> 893765 INFO  (TEST-InfixSuggestersTest.testBuildThen2xReload-seed#[5389734890D56900]) [    x:collection1] o.a.s.h.ReplicationHandler Commits will be reserved for 10000ms.
   [junit4]   2> 893767 INFO  (TEST-InfixSuggestersTest.testBuildThen2xReload-seed#[5389734890D56900]) [    x:collection1] o.a.s.u.RandomMergePolicy RandomMergePolicy wrapping class org.apache.lucene.index.LogDocMergePolicy: [LogDocMergePolicy: minMergeSize=1000, mergeFactor=20, maxMergeSize=9223372036854775807, maxMergeSizeForForcedMerge=9223372036854775807, calibrateSizeByDeletes=false, maxMergeDocs=2147483647, maxCFSSegmentSizeMB=8.796093022207999E12, noCFSRatio=1.0]
   [junit4]   2> 893767 INFO  (TEST-InfixSuggestersTest.testBuildThen2xReload-seed#[5389734890D56900]) [    x:collection1] o.a.s.u.DefaultSolrCoreState New IndexWriter is ready to be used.
   [junit4]   2> 893767 INFO  (searcherExecutor-5456-thread-1-processing-x:collection1) [    x:collection1] o.a.s.c.SolrCore [collection1] Registered new searcher Searcher@2d3c5998[collection1] main{ExitableDirectoryReader(UninvertingDirectoryReader())}
   [junit4]   2> 893767 INFO  (TEST-InfixSuggestersTest.testBuildThen2xReload-seed#[5389734890D56900]) [    x:collection1] o.a.s.s.SolrIndexSearcher Opening [Searcher@578f8fd0[collection1] main]
   [junit4]   2> 893768 INFO  (TEST-InfixSuggestersTest.testBuildThen2xReload-seed#[5389734890D56900]) [    x:collection1] o.a.s.c.SolrCore [collection1]  CLOSING SolrCore org.apache.solr.core.SolrCore@2b9fb3b2
   [junit4]   2> 893768 INFO  (TEST-InfixSuggestersTest.testBuildThen2xReload-seed#[5389734890D56900]) [    x:collection1] o.a.s.m.SolrMetricManager Closing metric reporters for registry=solr.core.collection1, tag=2b9fb3b2
   [junit4]   2> 893768 INFO  (TEST-InfixSuggestersTest.testBuildThen2xReload-seed#[5389734890D56900]) [    x:collection1] o.a.s.m.r.SolrJmxReporter Closing reporter [org.apache.solr.metrics.reporters.SolrJmxReporter@63b7102a: rootName = null, domain = solr.core.collection1, service url = null, agent id = null] for registry solr.core.collection1 / com.codahale.metrics.MetricRegistry@63cb9b94
   [junit4]   2> 893769 INFO  (searcherExecutor-5456-thread-1-processing-x:collection1) [    x:collection1] o.a.s.c.SolrCore [collection1] Registered new searcher Searcher@578f8fd0[collection1] main{ExitableDirectoryReader(UninvertingDirectoryReader())}
   [junit4]   2> 893774 ERROR (TEST-InfixSuggestersTest.testBuildThen2xReload-seed#[5389734890D56900]) [    x:collection1] o.a.s.c.CorePropertiesLocator Couldn't load core descriptor from /home/jenkins/workspace/Lucene-Solr-master-Linux/solr/core/src/test-files/solr/collection1/core.properties:java.nio.file.NoSuchFileException: /home/jenkins/workspace/Lucene-Solr-master-Linux/solr/core/src/test-files/solr/collection1/core.properties
   [junit4]   2> 893774 INFO  (TEST-InfixSuggestersTest.testBuildThen2xReload-seed#[5389734890D56900]) [    x:collection1] o.a.s.c.SolrResourceLoader [null] Added 2 libs to classloader, from paths: [/home/jenkins/workspace/Lucene-Solr-master-Linux/solr/core/src/test-files/solr/collection1/lib, /home/jenkins/workspace/Lucene-Solr-master-Linux/solr/core/src/test-files/solr/collection1/lib/classes]
   [junit4]   2> 893784 INFO  (TEST-InfixSuggestersTest.testBuildThen2xReload-seed#[5389734890D56900]) [    x:collection1] o.a.s.c.SolrConfig Using Lucene MatchVersion: 8.0.0
   [junit4]   2> 893790 INFO  (TEST-InfixSuggestersTest.testBuildThen2xReload-seed#[5389734890D56900]) [    x:collection1] o.a.s.s.IndexSchema [collection1] Schema name=test
   [junit4]   2> 893846 INFO  (TEST-InfixSuggestersTest.testBuildThen2xReload-seed#[5389734890D56900]) [    x:collection1] o.a.s.s.IndexSchema Loaded schema test/1.0 with uniqueid field id
   [junit4]   2> 893850 INFO  (TEST-InfixSuggestersTest.testBuildThen2xReload-seed#[5389734890D56900]) [    x:collection1] o.a.s.c.CoreContainer Reloading SolrCore 'collection1' using configuration from instancedir /home/jenkins/workspace/Lucene-Solr-master-Linux/solr/core/src/test-files/solr/collection1
   [junit4]   2> 893867 INFO  (TEST-InfixSuggestersTest.testBuildThen2xReload-seed#[5389734890D56900]) [    x:collection1] o.a.s.m.r.SolrJmxReporter JMX monitoring for 'solr.core.collection1' (registry 'solr.core.collection1') enabled at server: com.sun.jmx.mbeanserver.JmxMBeanServer@24e1b694
   [junit4]   2> 893867 INFO  (TEST-InfixSuggestersTest.testBuildThen2xReload-seed#[5389734890D56900]) [    x:collection1] o.a.s.c.SolrCore [[collection1] ] Opening new SolrCore at [/home/jenkins/workspace/Lucene-Solr-master-Linux/solr/core/src/test-files/solr/collection1], dataDir=[/home/jenkins/workspace/Lucene-Solr-master-Linux/solr/build/solr-core/test/J1/temp/solr.handler.component.InfixSuggestersTest_5389734890D56900-001/init-core-data-001/]
   [junit4]   2> 893908 INFO  (TEST-InfixSuggestersTest.testBuildThen2xReload-seed#[5389734890D56900]) [    x:collection1] o.a.s.u.CommitTracker Hard AutoCommit: disabled
   [junit4]   2> 893908 INFO  (TEST-InfixSuggestersTest.testBuildThen2xReload-seed#[5389734890D56900]) [    x:collection1] o.a.s.u.CommitTracker Soft AutoCommit: disabled
   [junit4]   2> 893909 INFO  (TEST-InfixSuggestersTest.testBuildThen2xReload-seed#[5389734890D56900]) [    x:collection1] o.a.s.s.SolrIndexSearcher Opening [Searcher@3afead96[collection1] main]
   [junit4]   2> 893910 WARN  (TEST-InfixSuggestersTest.testBuildThen2xReload-seed#[5389734890D56900]) [    x:collection1] o.a.s.r.ManagedResourceStorage Cannot write to config directory /home/jenkins/workspace/Lucene-Solr-master-Linux/solr/core/src/test-files/solr/collection1/conf; switching to use InMemory storage instead.
   [junit4]   2> 893910 INFO  (TEST-InfixSuggestersTest.testBuildThen2xReload-seed#[5389734890D56900]) [    x:collection1] o.a.s.h.c.SuggestComponent Initializing SuggestComponent
   [junit4]   2> 893910 INFO  (TEST-InfixSuggestersTest.testBuildThen2xReload-seed#[5389734890D56900]) [    x:collection1] o.a.s.s.s.SolrSuggester init: {name=shortRandomAnalyzingInfixSuggester,lookupImpl=AnalyzingInfixLookupFactory,dictionaryImpl=RandomTestDictionaryFactory,randDictMaxItems=100,indexPath=short_random_analyzing_infix_suggester,suggestAnalyzerFieldType=text,buildOnCommit=false,buildOnStartup=false}
   [junit4]   2> 893911 INFO  (TEST-InfixSuggestersTest.testBuildThen2xReload-seed#[5389734890D56900]) [    x:collection1] o.a.s.s.s.SolrSuggester Dictionary loaded with params: {name=shortRandomAnalyzingInfixSuggester,lookupImpl=AnalyzingInfixLookupFactory,dictionaryImpl=RandomTestDictionaryFactory,randDictMaxItems=100,indexPath=short_random_analyzing_infix_suggester,suggestAnalyzerFieldType=text,buildOnCommit=false,buildOnStartup=false}
   [junit4]   2> 893911 INFO  (TEST-InfixSuggestersTest.testBuildThen2xReload-seed#[5389734890D56900]) [    x:collection1] o.a.s.h.c.SuggestComponent Initializing SuggestComponent
   [junit4]   2> 893911 INFO  (TEST-InfixSuggestersTest.testBuildThen2xReload-seed#[5389734890D56900]) [    x:collection1] o.a.s.s.s.SolrSuggester init: {name=longRandomAnalyzingInfixSuggester,lookupImpl=AnalyzingInfixLookupFactory,dictionaryImpl=RandomTestDictionaryFactory,randDictMaxItems=100000,indexPath=long_random_analyzing_infix_suggester,suggestAnalyzerFieldType=text,buildOnCommit=false,buildOnStartup=false}
   [junit4]   2> 893911 INFO  (TEST-InfixSuggestersTest.testBuildThen2xReload-seed#[5389734890D56900]) [    x:collection1] o.a.s.s.s.SolrSuggester Dictionary loaded with params: {name=longRandomAnalyzingInfixSuggester,lookupImpl=AnalyzingInfixLookupFactory,dictionaryImpl=RandomTestDictionaryFactory,randDictMaxItems=100000,indexPath=long_random_analyzing_infix_suggester,suggestAnalyzerFieldType=text,buildOnCommit=false,buildOnStartup=false}
   [junit4]   2> 893911 INFO  (TEST-InfixSuggestersTest.testBuildThen2xReload-seed#[5389734890D56900]) [    x:collection1] o.a.s.h.c.SuggestComponent Initializing SuggestComponent
   [junit4]   2> 893911 INFO  (TEST-InfixSuggestersTest.testBuildThen2xReload-seed#[5389734890D56900]) [    x:collection1] o.a.s.s.s.SolrSuggester init: {name=shortRandomBlendedInfixSuggester,lookupImpl=BlendedInfixLookupFactory,dictionaryImpl=RandomTestDictionaryFactory,randDictMaxItems=100,blenderType=position_linear,suggestAnalyzerFieldType=text,indexPath=short_random_blended_infix_suggester,highlight=true,buildOnStartup=false,buildOnCommit=false}
   [junit4]   2> 893911 INFO  (TEST-InfixSuggestersTest.testBuildThen2xReload-seed#[5389734890D56900]) [    x:collection1] o.a.s.s.s.SolrSuggester Dictionary loaded with params: {name=shortRandomBlendedInfixSuggester,lookupImpl=BlendedInfixLookupFactory,dictionaryImpl=RandomTestDictionaryFactory,randDictMaxItems=100,blenderType=position_linear,suggestAnalyzerFieldType=text,indexPath=short_random_blended_infix_suggester,highlight=true,buildOnStartup=false,buildOnCommit=false}
   [junit4]   2> 893911 INFO  (TEST-InfixSuggestersTest.testBuildThen2xReload-seed#[5389734890D56900]) [    x:collection1] o.a.s.h.ReplicationHandler Commits will be reserved for 10000ms.
   [junit4]   2> 893912 INFO  (TEST-InfixSuggestersTest.testBuildThen2xReload-seed#[5389734890D56900]) [    x:collection1] o.a.s.u.RandomMergePolicy RandomMergePolicy wrapping class org.apache.lucene.index.MockRandomMergePolicy: org.apache.lucene.index.MockRandomMergePolicy@6e24c6db
   [junit4]   2> 893912 INFO  (TEST-InfixSuggestersTest.testBuildThen2xReload-seed#[5389734890D56900]) [    x:collection1] o.a.s.u.DefaultSolrCoreState New IndexWriter is ready to be used.
   [junit4]   2> 893913 INFO  (searcherExecutor-5460-thread-1-processing-x:collection1) [    x:collection1] o.a.s.c.SolrCore [collection1] Registered new searcher Searcher@3afead96[collection1] main{ExitableDirectoryReader(UninvertingDirectoryReader())}
   [junit4]   2> 893913 INFO  (TEST-InfixSuggestersTest.testBuildThen2xReload-seed#[5389734890D56900]) [    x:collection1] o.a.s.s.SolrIndexSearcher Opening [Searcher@6bca900d[collection1] main]
   [junit4]   2> 893913 INFO  (TEST-InfixSuggestersTest.testBuildThen2xReload-seed#[5389734890D56900]) [    x:collection1] o.a.s.c.SolrCore [collection1]  CLOSING SolrCore org.apache.solr.core.SolrCore@5e01c5d9
   [junit4]   2> 893913 INFO  (TEST-InfixSuggestersTest.testBuildThen2xReload-seed#[5389734890D56900]) [    x:collection1] o.a.s.m.SolrMetricManager Closing metric reporters for registry=solr.core.collection1, tag=5e01c5d9
   [junit4]   2> 893913 INFO  (TEST-InfixSuggestersTest.testBuildThen2xReload-seed#[5389734890D56900]) [    x:collection1] o.a.s.m.r.SolrJmxReporter Closing reporter [org.apache.solr.metrics.reporters.SolrJmxReporter@7676ee76: rootName = null, domain = solr.core.collection1, service url = null, agent id = null] for registry solr.core.collection1 / com.codahale.metrics.MetricRegistry@63cb9b94
   [junit4]   2> 893914 INFO  (searcherExecutor-5460-thread-1-processing-x:collection1) [    x:collection1] o.a.s.c.SolrCore [collection1] Registered new searcher Searcher@6bca900d[collection1] main{ExitableDirectoryReader(UninvertingDirectoryReader())}
   [junit4]   2> 893919 INFO  (TEST-InfixSuggestersTest.testBuildThen2xReload-seed#[5389734890D56900]) [    x:collection1] o.a.s.SolrTestCaseJ4 ###Ending testBuildThen2xReload
   [junit4]   2> 893921 INFO  (TEST-InfixSuggestersTest.test2xBuildReload-seed#[5389734890D56900]) [    x:collection1] o.a.s.SolrTestCaseJ4 ###Starting test2xBuildReload
   [junit4]   2> 893921 INFO  (TEST-InfixSuggestersTest.test2xBuildReload-seed#[5389734890D56900]) [    x:collection1] o.a.s.h.c.SuggestComponent SuggestComponent prepare with : qt=/suggest_analyzing_infix_short_dictionary&suggest=true&suggest.buildAll=true&wt=xml&indent=off
   [junit4]   2> 893921 INFO  (TEST-InfixSuggestersTest.test2xBuildReload-seed#[5389734890D56900]) [    x:collection1] o.a.s.s.s.SolrSuggester SolrSuggester.build(shortRandomAnalyzingInfixSuggester)
   [junit4]   2> 893930 INFO  (TEST-InfixSuggestersTest.test2xBuildReload-seed#[5389734890D56900]) [    x:collection1] o.a.s.s.s.RandomTestDictionaryFactory org.apache.solr.spelling.suggest.RandomTestDictionaryFactory$RandomTestDictionary.enabled.shortRandomAnalyzingInfixSuggester disabled after emitting 100 items.
   [junit4]   2> 894008 INFO  (TEST-InfixSuggestersTest.test2xBuildReload-seed#[5389734890D56900]) [    x:collection1] o.a.s.h.c.SuggestComponent SuggestComponent process with : qt=/suggest_analyzing_infix_short_dictionary&suggest=true&suggest.buildAll=true&wt=xml&indent=off
   [junit4]   2> 894009 INFO  (TEST-InfixSuggestersTest.test2xBuildReload-seed#[5389734890D56900]) [    x:collection1] o.a.s.c.S.Request [collection1]  webapp=null path=null params={qt=/suggest_analyzing_infix_short_dictionary&suggest.buildAll=true&wt=xml} status=0 QTime=87
   [junit4]   2> 894009 ERROR (TEST-InfixSuggestersTest.test2xBuildReload-seed#[5389734890D56900]) [    x:collection1] o.a.s.c.CorePropertiesLocator Couldn't load core descriptor from /home/jenkins/workspace/Lucene-Solr-master-Linux/solr/core/src/test-files/solr/collection1/core.properties:java.nio.file.NoSuchFileException: /home/jenkins/workspace/Lucene-Solr-master-Linux/solr/core/src/test-files/solr/collection1/core.properties
   [junit4]   2> 894009 INFO  (TEST-InfixSuggestersTest.test2xBuildReload-seed#[5389734890D56900]) [    x:collection1] o.a.s.c.SolrResourceLoader [null] Added 2 libs to classloader, from paths: [/home/jenkins/workspace/Lucene-Solr-master-Linux/solr/core/src/test-files/solr/collection1/lib, /home/jenkins/workspace/Lucene-Solr-master-Linux/solr/core/src/test-files/solr/collection1/lib/classes]
   [junit4]   2> 894024 INFO  (TEST-InfixSuggestersTest.test2xBuildReload-seed#[5389734890D56900]) [    x:collection1] o.a.s.c.SolrConfig Using Lucene MatchVersion: 8.0.0
   [junit4]   2> 894032 INFO  (TEST-InfixSuggestersTest.test2xBuildReload-seed#[5389734890D56900]) [    x:collection1] o.a.s.s.IndexSchema [collection1] Schema name=test
   [junit4]   2> 894089 INFO  (TEST-InfixSuggestersTest.test2xBuildReload-seed#[5389734890D56900]) [    x:collection1] o.a.s.s.IndexSchema Loaded schema test/1.0 with uniqueid field id
   [junit4]   2> 894094 INFO  (TEST-InfixSuggestersTest.test2xBuildReload-seed#[5389734890D56900]) [    x:collection1] o.a.s.c.CoreContainer Reloading SolrCore 'collection1' using configuration from instancedir /home/jenkins/workspace/Lucene-Solr-master-Linux/solr/core/src/test-files/solr/collection1
   [junit4]   2> 894110 INFO  (TEST-InfixSuggestersTest.test2xBuildReload-seed#[5389734890D56900]) [    x:collection1] o.a.s.m.r.SolrJmxReporter JMX monitoring for 'solr.core.collection1' (registry 'solr.core.collection1') enabled at server: com.sun.jmx.mbeanserver.JmxMBeanServer@24e1b694
   [junit4]   2> 894110 INFO  (TEST-InfixSuggestersTest.test2xBuildReload-seed#[5389734890D56900]) [    x:collection1] o.a.s.c.SolrCore [[collection1] ] Opening new SolrCore at [/home/jenkins/workspace/Lucene-Solr-master-Linux/solr/core/src/test-files/solr/collection1], dataDir=[/home/jenkins/workspace/Lucene-Solr-master-Linux/solr/build/solr-core/test/J1/temp/solr.handler.component.InfixSuggestersTest_5389734890D56900-001/init-core-data-001/]
   [junit4]   2> 894140 INFO  (TEST-InfixSuggestersTest.test2xBuildReload-seed#[5389734890D56900]) [    x:collection1] o.a.s.u.CommitTracker Hard AutoCommit: disabled
   [junit4]   2> 894140 INFO  (TEST-InfixSuggestersTest.test2xBuildReload-seed#[5389734890D56900]) [    x:collection1] o.a.s.u.CommitTracker Soft AutoCommit: disabled
   [junit4]   2> 894141 INFO  (TEST-InfixSuggestersTest.test2xBuildReload-seed#[5389734890D56900]) [    x:collection1] o.a.s.s.SolrIndexSearcher Opening [Searcher@3e4daeaa[collection1] main]
   [junit4]   2> 894142 WARN  (TEST-InfixSuggestersTest.test2xBuildReload-seed#[5389734890D56900]) [    x:collection1] o.a.s.r.ManagedResourceStorage Cannot write to config directory /home/jenkins/workspace/Lucene-Solr-master-Linux/solr/core/src/test-files/solr/collection1/conf; switching to use InMemory storage instead.
   [junit4]   2> 894142 INFO  (TEST-InfixSuggestersTest.test2xBuildReload-seed#[5389734890D56900]) [    x:collection1] o.a.s.h.c.SuggestComponent Initializing SuggestComponent
   [junit4]   2> 894142 INFO  (TEST-InfixSuggestersTest.test2xBuildReload-seed#[5389734890D56900]) [    x:collection1] o.a.s.s.s.SolrSuggester init: {name=shortRandomAnalyzingInfixSuggester,lookupImpl=AnalyzingInfixLookupFactory,dictionaryImpl=RandomTestDictionaryFactory,randDictMaxItems=100,indexPath=short_random_analyzing_infix_suggester,suggestAnalyzerFieldType=text,buildOnCommit=false,buildOnStartup=false}
   [junit4]   2> 894143 INFO  (TEST-InfixSuggestersTest.test2xBuildReload-seed#[5389734890D56900]) [    x:collection1] o.a.s.s.s.SolrSuggester Dictionary loaded with params: {name=shortRandomAnalyzingInfixSuggester,lookupImpl=AnalyzingInfixLookupFactory,dictionaryImpl=RandomTestDictionaryFactory,randDictMaxItems=100,indexPath=short_random_analyzing_infix_suggester,suggestAnalyzerFieldType=text,buildOnCommit=false,buildOnStartup=false}
   [junit4]   2> 894143 INFO  (TEST-InfixSuggestersTest.test2xBuildReload-seed#[5389734890D56900]) [    x:collection1] o.a.s.h.c.SuggestComponent Initializing SuggestComponent
   [junit4]   2> 894143 INFO  (TEST-InfixSuggestersTest.test2xBuildReload-seed#[5389734890D56900]) [    x:collection1] o.a.s.s.s.SolrSuggester init: {name=longRandomAnalyzingInfixSuggester,lookupImpl=AnalyzingInfixLookupFactory,dictionaryImpl=RandomTestDictionaryFactory,randDictMaxItems=100000,indexPath=long_random_analyzing_infix_suggester,suggestAnalyzerFieldType=text,buildOnCommit=false,buildOnStartup=false}
   [junit4]   2> 894144 INFO  (TEST-InfixSuggestersTest.test2xBuildReload-seed#[5389734890D56900]) [    x:collection1] o.a.s.s.s.SolrSuggester Dictionary loaded with params: {name=longRandomAnalyzingInfixSuggester,lookupImpl=AnalyzingInfixLookupFactory,dictionaryImpl=RandomTestDictionaryFactory,randDictMaxItems=100000,indexPath=long_random_analyzing_infix_suggester,suggestAnalyzerFieldType=text,buildOnCommit=false,buildOnStartup=false}
   [junit4]   2> 894144 INFO  (TEST-InfixSuggestersTest.test2xBuildReload-seed#[5389734890D56900]) [    x:collection1] o.a.s.h.c.SuggestComponent Initializing SuggestComponent
   [junit4]   2> 894144 INFO  (TEST-InfixSuggestersTest.test2xBuildReload-seed#[5389734890D56900]) [    x:collection1] o.a.s.s.s.SolrSuggester init: {name=shortRandomBlendedInfixSuggester,lookupImpl=BlendedInfixLookupFactory,dictionaryImpl=RandomTestDictionaryFactory,randDictMaxItems=100,blenderType=position_linear,suggestAnalyzerFieldType=text,indexPath=short_random_blended_infix_suggester,highlight=true,buildOnStartup=false,buildOnCommit=false}
   [junit4]   2> 894144 INFO  (TEST-InfixSuggestersTest.test2xBuildReload-seed#[5389734890D56900]) [    x:collection1] o.a.s.s.s.SolrSuggester Dictionary loaded with params: {name=shortRandomBlendedInfixSuggester,lookupImpl=BlendedInfixLookupFactory,dictionaryImpl=RandomTestDictionaryFactory,randDictMaxItems=100,blenderType=position_linear,suggestAnalyzerFieldType=text,indexPath=short_random_blended_infix_suggester,highlight=true,buildOnStartup=false,buildOnCommit=false}
   [junit4]   2> 894144 INFO  (TEST-InfixSuggestersTest.test2xBuildReload-seed#[5389734890D56900]) [    x:collection1] o.a.s.h.ReplicationHandler Commits will be reserved for 10000ms.
   [junit4]   2> 894146 INFO  (searcherExecutor-5464-thread-1-processing-x:collection1) [    x:collection1] o.a.s.c.SolrCore [collection1] Registered new searcher Searcher@3e4daeaa[collection1] main{ExitableDirectoryReader(UninvertingDirectoryReader())}
   [junit4]   2> 894146 INFO  (TEST-InfixSuggestersTest.test2xBuildReload-seed#[5389734890D56900]) [    x:collection1] o.a.s.u.RandomMergePolicy RandomMergePolicy wrapping class org.apache.lucene.index.TieredMergePolicy: [TieredMergePolicy: maxMergeAtOnce=19, maxMergeAtOnceExplicit=34, maxMergedSegmentMB=43.896484375, floorSegmentMB=2.0244140625, forceMergeDeletesPctAllowed=25.51594549542508, segmentsPerTier=30.0, maxCFSSegmentSizeMB=8.796093022207999E12, noCFSRatio=0.0, reclaimDeletesWeight=2.2297886850537463
   [junit4]   2> 894146 INFO  (TEST-InfixSuggestersTest.test2xBuildReload-seed#[5389734890D56900]) [    x:collection1] o.a.s.u.DefaultSolrCoreState New IndexWriter is ready to be used.
   [junit4]   2> 894146 INFO  (TEST-InfixSuggestersTest.test2xBuildReload-seed#[5389734890D56900]) [    x:collection1] o.a.s.s.SolrIndexSearcher Opening [Searcher@77e861e6[collection1] main]
   [junit4]   2> 894147 INFO  (TEST-InfixSuggestersTest.test2xBuildReload-seed#[5389734890D56900]) [    x:collection1] o.a.s.c.SolrCore [collection1]  CLOSING SolrCore org.apache.solr.core.SolrCore@50193a87
   [junit4]   2> 894147 INFO  (TEST-InfixSuggestersTest.test2xBuildReload-seed#[5389734890D56900]) [    x:collection1] o.a.s.m.SolrMetricManager Closing metric reporters for registry=solr.core.collection1, tag=50193a87
   [junit4]   2> 894147 INFO  (TEST-InfixSuggestersTest.test2xBuildReload-seed#[5389734890D56900]) [    x:collection1] o.a.s.m.r.SolrJmxReporter Closing reporter [org.apache.solr.metrics.reporters.SolrJmxReporter@35c8aadf: rootName = null, domain = solr.core.collection1, service url = null, agent id = null] for registry solr.core.collection1 / com.codahale.metrics.MetricRegistry@63cb9b94
   [junit4]   2> 894148 INFO  (searcherExecutor-5464-thread-1-processing-x:collection1) [    x:collection1] o.a.s.c.SolrCore [collection1] Registered new searcher Searcher@77e861e6[collection1] main{ExitableDirectoryReader(UninvertingDirectoryReader())}
   [junit4]   2> 894155 INFO  (TEST-InfixSuggestersTest.test2xBuildReload-seed#[5389734890D56900]) [    x:collection1] o.a.s.h.c.SuggestComponent SuggestComponent prepare with : qt=/suggest_analyzing_infix_short_dictionary&suggest=true&suggest.buildAll=true&wt=xml&indent=off
   [junit4]   2> 894155 INFO  (TEST-InfixSuggestersTest.test2xBuildReload-seed#[5389734890D56900]) [    x:collection1] o.a.s.s.s.SolrSuggester SolrSuggester.build(shortRandomAnalyzingInfixSuggester)
   [junit4]   2> 894165 INFO  (TEST-InfixSuggestersTest.test2xBuildReload-seed#[5389734890D56900]) [    x:collection1] o.a.s.s.s.RandomTestDictionaryFactory org.apache.solr.spelling.suggest.RandomTestDictionaryFactory$RandomTestDictionary.enabled.shortRandomAnalyzingInfixSuggester disabled after emitting 100 items.
   [junit4]   2> 894229 INFO  (TEST-InfixSuggestersTest.test2xBuildReload-seed#[5389734890D56900]) [    x:collection1] o.a.s.h.c.SuggestComponent SuggestComponent process with : qt=/suggest_analyzing_infix_short_dictionary&suggest=true&suggest.buildAll=true&wt=xml&indent=off
   [junit4]   2> 894229 INFO  (TEST-InfixSuggestersTest.test2xBuildReload-seed#[5389734890D56900]) [    x:collection1] o.a.s.c.S.Request [collection1]  webapp=null path=null params={qt=/suggest_analyzing_infix_short_dictionary&suggest.buildAll=true&wt=xml} status=0 QTime=73
   [junit4]   2> 894229 ERROR (TEST-InfixSuggestersTest.test2xBuildReload-seed#[5389734890D56900]) [    x:collection1] o.a.s.c.CorePropertiesLocator Couldn't load core descriptor from /home/jenkins/workspace/Lucene-Solr-master-Linux/solr/core/src/test-files/solr/collection1/core.properties:java.nio.file.NoSuchFileException: /home/jenkins/workspace/Lucene-Solr-master-Linux/solr/core/src/test-files/solr/collection1/core.properties
   [junit4]   2> 894230 INFO  (TEST-InfixSuggestersTest.test2xBuildReload-seed#[5389734890D56900]) [    x:collection1] o.a.s.c.SolrResourceLoader [null] Added 2 libs to classloader, from paths: [/home/jenkins/workspace/Lucene-Solr-master-Linux/solr/core/src/test-files/solr/collection1/lib, /home/jenkins/workspace/Lucene-Solr-master-Linux/solr/core/src/test-files/solr/collection1/lib/classes]
   [junit4]   2> 894245 INFO  (TEST-InfixSuggestersTest.test2xBuildReload-seed#[5389734890D56900]) [    x:collection1] o.a.s.c.SolrConfig Using Lucene MatchVersion: 8.0.0
   [junit4]   2> 894253 INFO  (TEST-InfixSuggestersTest.test2xBuildReload-seed#[5389734890D56900]) [    x:collection1] o.a.s.s.IndexSchema [collection1] Schema name=test
   [junit4]   2> 894306 INFO  (TEST-InfixSuggestersTest.test2xBuildReload-seed#[5389734890D56900]) [    x:collection1] o.a.s.s.IndexSchema Loaded schema test/1.0 with uniqueid field id
   [junit4]   2> 894311 INFO  (TEST-InfixSuggestersTest.test2xBuildReload-seed#[5389734890D56900]) [    x:collection1] o.a.s.c.CoreContainer Reloading SolrCore 'collection1' using configuration from instancedir /home/jenkins/workspace/Lucene-Solr-master-Linux/solr/core/src/test-files/solr/collection1
   [junit4]   2> 894327 INFO  (TEST-InfixSuggestersTest.test2xBuildReload-seed#[5389734890D56900]) [    x:collection1] o.a.s.m.r.SolrJmxReporter JMX monitoring for 'solr.core.collection1' (registry 'solr.core.collection1') enabled at server: com.sun.jmx.mbeanserver.JmxMBeanServer@24e1b694
   [junit4]   2> 894327 INFO  (TEST-InfixSuggestersTest.test2xBuildReload-seed#[5389734890D56900]) [    x:collection1] o.a.s.c.SolrCore [[collection1] ] Opening new SolrCore at [/home/jenkins/workspace/Lucene-Solr-master-Linux/solr/core/src/test-files/solr/collection1], dataDir=[/home/jenkins/workspace/Lucene-Solr-master-Linux/solr/build/solr-core/test/J1/temp/solr.handler.component.InfixSuggestersTest_5389734890D56900-001/init-core-data-001/]
   [junit4]   2> 894355 INFO  (TEST-InfixSuggestersTest.test2xBuildReload-seed#[5389734890D56900]) [    x:collection1] o.a.s.u.CommitTracker Hard AutoCommit: disabled
   [junit4]   2> 894355 INFO  (TEST-InfixSuggestersTest.test2xBuildReload-seed#[5389734890D56900]) [    x:collection1] o.a.s.u.CommitTracker Soft AutoCommit: disabled
   [junit4]   2> 894356 INFO  (TEST-InfixSuggestersTest.test2xBuildReload-seed#[5389734890D56900]) [    x:collection1] o.a.s.s.SolrIndexSearcher Opening [Searcher@353a4d0c[collection1] main]
   [junit4]   2> 894356 WARN  (TEST-InfixSuggestersTest.test2xBuildReload-seed#[5389734890D56900]) [    x:collection1] o.a.s.r.ManagedResourceStorage Cannot write to config directory /home/jenkins/workspace/Lucene-Solr-master-Linux/solr/core/src/test-files/solr/collection1/conf; switching to use InMemory storage instead.
   [junit4]   2> 894357 INFO  (TEST-InfixSuggestersTest.test2xBuildReload-seed#[5389734890D56900]) [    x:collection1] o.a.s.h.c.SuggestComponent Initializing SuggestComponent
   [junit4]   2> 894357 INFO  (TEST-InfixSuggestersTest.test2xBuildReload-seed#[5389734890D56900]) [    x:collection1] o.a.s.s.s.SolrSuggester init: {name=shortRandomAnalyzingInfixSuggester,lookupImpl=AnalyzingInfixLookupFactory,dictionaryImpl=RandomTestDictionaryFactory,randDictMaxItems=100,indexPath=short_random_analyzing_infix_suggester,suggestAnalyzerFieldType=text,buildOnCommit=false,buildOnStartup=false}
   [junit4]   2> 894357 INFO  (TEST-InfixSuggestersTest.test2xBuildReload-seed#[5389734890D56900]) [    x:collection1] o.a.s.s.s.SolrSuggester Dictionary loaded with params: {name=shortRandomAnalyzingInfixSuggester,lookupImpl=AnalyzingInfixLookupFactory,dictionaryImpl=RandomTestDictionaryFactory,randDictMaxItems=100,indexPath=short_random_analyzing_infix_suggester,suggestAnalyzerFieldType=text,buildOnCommit=false,buildOnStartup=false}
   [junit4]   2> 894357 INFO  (TEST-InfixSuggestersTest.test2xBuildReload-seed#[5389734890D56900]) [    x:collection1] o.a.s.h.c.SuggestComponent Initializing SuggestComponent
   [junit4]   2> 894357 INFO  (TEST-InfixSuggestersTest.test2xBuildReload-seed#[5389734890D56900]) [    x:collection1] o.a.s.s.s.SolrSuggester init: {name=longRandomAnalyzingInfixSuggester,lookupImpl=AnalyzingInfixLookupFactory,dictionaryImpl=RandomTestDictionaryFactory,randDictMaxItems=100000,indexPath=long_random_analyzing_infix_suggester,suggestAnalyzerFieldType=text,buildOnCommit=false,buildOnStartup=false}
   [junit4]   2> 894358 INFO  (TEST-InfixSuggestersTest.test2xBuildReload-seed#[5389734890D56900]) [    x:collection1] o.a.s.s.s.SolrSuggester Dictionary loaded with params: {name=longRandomAnalyzingInfixSuggester,lookupImpl=AnalyzingInfixLookupFactory,dictionaryImpl=RandomTestDictionaryFactory,randDictMaxItems=100000,indexPath=long_random_analyzing_infix_suggester,suggestAnalyzerFieldType=text,buildOnCommit=false,buildOnStartup=false}
   [junit4]   2> 894358 INFO  (TEST-InfixSuggestersTest.test2xBuildReload-seed#[5389734890D56900]) [    x:collection1] o.a.s.h.c.SuggestComponent Initializing SuggestComponent
   [junit4]   2> 894358 INFO  (TEST-InfixSuggestersTest.test2xBuildReload-seed#[5389734890D56900]) [    x:collection1] o.a.s.s.s.SolrSuggester init: {name=shortRandomBlendedInfixSuggester,lookupImpl=BlendedInfixLookupFactory,dictionaryImpl=RandomTestDictionaryFactory,randDictMaxItems=100,blenderType=position_linear,suggestAnalyzerFieldType=text,indexPath=short_random_blended_infix_suggester,highlight=true,buildOnStartup=false,buildOnCommit=false}
   [junit4]   2> 894358 INFO  (TEST-InfixSuggestersTest.test2xBuildReload-seed#[5389734890D56900]) [    x:collection1] o.a.s.s.s.SolrSuggester Dictionary loaded with params: {name=shortRandomBlendedInfixSuggester,lookupImpl=BlendedInfixLookupFactory,dictionaryImpl=RandomTestDictionaryFactory,randDictMaxItems=100,blenderType=position_linear,suggestAnalyzerFieldType=text,indexPath=short_random_blended_infix_suggester,highlight=true,buildOnStartup=false,buildOnCommit=false}
   [junit4]   2> 894358 INFO  (TEST-InfixSuggestersTest.test2xBuildReload-seed#[5389734890D56900]) [    x:collection1] o.a.s.h.ReplicationHandler Commits will be reserved for 10000ms.
   [junit4]   2> 894359 INFO  (TEST-InfixSuggestersTest.test2xBuildReload-seed#[5389734890D56900]) [    x:collection1] o.a.s.u.RandomMergePolicy RandomMergePolicy wrapping class org.apache.lucene.index.TieredMergePolicy: [TieredMergePolicy: maxMergeAtOnce=14, maxMergeAtOnceExplicit=15, maxMergedSegmentMB=51.841796875, floorSegmentMB=0.4697265625, forceMergeDeletesPctAllowed=18.990934762900398, segmentsPerTier=12.0, maxCFSSegmentSizeMB=0.8369140625, noCFSRatio=1.0, reclaimDeletesWeight=3.03686137554885
   [junit4]   2> 894359 INFO  (TEST-InfixSuggestersTest.test2xBuildReload-seed#[5389734890D56900]) [    x:collection1] o.a.s.u.DefaultSolrCoreState New IndexWriter is ready to be used.
   [junit4]   2> 894359 INFO  (searcherExecutor-5468-thread-1-processing-x:collection1) [    x:collection1] o.a.s.c.SolrCore [collection1] Registered new searcher Searcher@353a4d0c[collection1] main{ExitableDirectoryReader(UninvertingDirectoryReader())}
   [junit4]   2> 894360 INFO  (TEST-InfixSuggestersTest.test2xBuildReload-seed#[5389734890D56900]) [    x:collection1] o.a.s.s.SolrIndexSearcher Opening [Searcher@6edee393[collection1] main]
   [junit4]   2> 894360 INFO  (TEST-InfixSuggestersTest.test2xBuildReload-seed#[5389734890D56900]) [    x:collection1] o.a.s.c.SolrCore [collection1]  CLOSING SolrCore org.apache.solr.core.SolrCore@6673a5e9
   [junit4]   2> 894360 INFO  (TEST-InfixSuggestersTest.test2xBuildReload-seed#[5389734890D56900]) [    x:collection1] o.a.s.m.SolrMetricManager Closing metric reporters for registry=solr.core.collection1, tag=6673a5e9
   [junit4]   2> 894360 INFO  (TEST-InfixSuggestersTest.test2xBuildReload-seed#[5389734890D56900]) [    x:collection1] o.a.s.m.r.SolrJmxReporter Closing reporter [org.apache.solr.metrics.reporters.SolrJmxReporter@45252dbe: rootName = null, domain = solr.core.collection1, service url = null, agent id = null] for registry solr.core.collection1 / com.codahale.metrics.MetricRegistry@63cb9b94
   [junit4]   2> 894361 INFO  (searcherExecutor-5468-thread-1-processing-x:collection1) [    x:collection1] o.a.s.c.SolrCore [collection1] Registered new searcher Searcher@6edee393[collection1] main{ExitableDirectoryReader(UninvertingDirectoryReader())}
   [junit4]   2> 894367 INFO  (TEST-InfixSuggestersTest.test2xBuildReload-seed#[5389734890D56900]) [    x:collection1] o.a.s.SolrTestCaseJ4 ###Ending test2xBuildReload
   [junit4]   2> 894368 INFO  (TEST-InfixSuggestersTest.testShutdownDuringBuild-seed#[5389734890D56900]) [    x:collection1] o.a.s.SolrTestCaseJ4 ###Starting testShutdownDuringBuild
   [junit4]   2> 894368 INFO  (AnalyzingInfixSuggesterTest-3294-thread-1-processing-x:collection1) [    x:collection1] o.a.s.h.c.SuggestComponent SuggestComponent prepare with : qt=/suggest_analyzing_infix_long_dictionary&suggest=true&suggest.buildAll=true&wt=xml&indent=off
   [junit4]   2> 894368 INFO  (AnalyzingInfixSuggesterTest-3294-thread-1-processing-x:collection1) [    x:collection1] o.a.s.s.s.SolrSuggester SolrSuggester.build(longRandomAnalyzingInfixSuggester)
   [junit4]   2> 894402 INFO  (AnalyzingInfixSuggesterTest-3294-thread-1-processing-x:collection1) [    x:collection1] o.a.s.s.s.RandomTestDictionaryFactory org.apache.solr.spelling.suggest.RandomTestDictionaryFactory$RandomTestDictionary.enabled.longRandomAnalyzingInfixSuggester emitted 1000 items.
   [junit4]   2> 894435 INFO  (AnalyzingInfixSuggesterTest-3294-thread-1-processing-x:collection1) [    x:collection1] o.a.s.s.s.RandomTestDictionaryFactory org.apache.solr.spelling.suggest.RandomTestDictionaryFactory$RandomTestDictionary.enabled.longRandomAnalyzingInfixSuggester emitted 2000 items.
   [junit4]   2> 894468 INFO  (TEST-InfixSuggestersTest.testShutdownDuringBuild-seed#[5389734890D56900]) [    x:collection1] o.a.s.c.CoreContainer Shutting down CoreContainer instance=1596353900
   [junit4]   2> 894469 INFO  (TEST-InfixSuggestersTest.testShutdownDuringBuild-seed#[5389734890D56900]) [    x:collection1] o.a.s.m.SolrMetricManager Closing metric reporters for registry=solr.node, tag=null
   [junit4]   2> 894469 INFO  (TEST-InfixSuggestersTest.testShutdownDuringBuild-seed#[5389734890D56900]) [    x:collection1] o.a.s.m.r.SolrJmxReporter Closing reporter [org.apache.solr.metrics.reporters.SolrJmxReporter@632120e5: rootName = null, domain = solr.node, service url = null, agent id = null] for registry solr.node / com.codahale.metrics.MetricRegistry@e5f50a1
   [junit4]   2> 894472 INFO  (AnalyzingInfixSuggesterTest-3294-thread-1-processing-x:collection1) [    x:collection1] o.a.s.s.s.RandomTestDictionaryFactory org.apache.solr.spelling.suggest.RandomTestDictionaryFactory$RandomTestDictionary.enabled.longRandomAnalyzingInfixSuggester emitted 3000 items.
   [junit4]   2> 894476 INFO  (TEST-InfixSuggestersTest.testShutdownDuringBuild-seed#[5389734890D56900]) [    x:collection1] o.a.s.m.SolrMetricManager Closing metric reporters for registry=solr.jvm, tag=null
   [junit4]   2> 894476 INFO  (TEST-InfixSuggestersTest.testShutdownDuringBuild-seed#[5389734890D56900]) [    x:collection1] o.a.s.m.r.SolrJmxReporter Closing reporter [org.apache.solr.metrics.reporters.SolrJmxReporter@705232e2: rootName = null, domain = solr.jvm, service url = null, agent id = null] for registry solr.jvm / com.codahale.metrics.MetricRegistry@7392de62
   [junit4]   2> 894480 INFO  (TEST-InfixSuggestersTest.testShutdownDuringBuild-seed#[5389734890D56900]) [    x:collection1] o.a.s.m.SolrMetricManager Closing metric reporters for registry=solr.jetty, tag=null
   [junit4]   2> 894480 INFO  (TEST-InfixSuggestersTest.testShutdownDuringBuild-seed#[5389734890D56900]) [    x:collection1] o.a.s.m.r.SolrJmxReporter Closing reporter [org.apache.solr.metrics.reporters.SolrJmxReporter@5f69001e: rootName = null, domain = solr.jetty, service url = null, agent id = null] for registry solr.jetty / com.codahale.metrics.MetricRegistry@fb3d757
   [junit4]   2> 894493 INFO  (coreCloseExecutor-5472-thread-1-processing-x:collection1) [    x:collection1] o.a.s.c.SolrCore [collection1]  CLOSING SolrCore org.apache.solr.core.SolrCore@105e333b
   [junit4]   2> 894493 INFO  (coreCloseExecutor-5472-thread-1-processing-x:collection1) [    x:collection1] o.a.s.m.SolrMetricManager Closing metric reporters for registry=solr.core.collection1, tag=105e333b
   [junit4]   2> 894493 INFO  (coreCloseExecutor-5472-thread-1-processing-x:collection1) [    x:collection1] o.a.s.m.r.SolrJmxReporter Closing reporter [org.apache.solr.metrics.reporters.SolrJmxReporter@197b8def: rootName = null, domain = solr.core.collection1, service url = null, agent id = null] for registry solr.core.collection1 / com.codahale.metrics.MetricRegistry@63cb9b94
   [junit4]   2> 895057 ERROR (AnalyzingInfixSuggesterTest-3294-thread-1-processing-x:collection1) [    x:collection1] o.a.s.SolrTestCaseJ4 REQUEST FAILED: qt=/suggest_analyzing_infix_long_dictionary&suggest.buildAll=true&wt=xml:org.apache.solr.common.SolrException: SolrCoreState already closed.
   [junit4]   2> 	at org.apache.solr.update.DefaultSolrCoreState.lock(DefaultSolrCoreState.java:186)
   [junit4]   2> 	at org.apache.solr.update.DefaultSolrCoreState.getIndexWriter(DefaultSolrCoreState.java:121)
   [junit4]   2> 	at org.apache.solr.update.SolrCoreState.getTragicException(SolrCoreState.java:198)
   [junit4]   2> 	at org.apache.solr.core.CoreContainer.checkTragicException(CoreContainer.java:1812)
   [junit4]   2> 	at org.apache.solr.handler.RequestHandlerBase.handleRequest(RequestHandlerBase.java:212)
   [junit4]   2> 	at org.apache.solr.core.SolrCore.execute(SolrCore.java:2541)
   [junit4]   2> 	at org.apache.solr.util.TestHarness.query(TestHarness.java:337)
   [junit4]   2> 	at org.apache.solr.util.TestHarness.query(TestHarness.java:319)
   [junit4]   2> 	at org.apache.solr.SolrTestCaseJ4.assertQ(SolrTestCaseJ4.java:891)
   [junit4]   2> 	at org.apache.solr.SolrTestCaseJ4.assertQ(SolrTestCaseJ4.java:877)
   [junit4]   2> 	at org.apache.solr.handler.component.InfixSuggestersTest.lambda$testShutdownDuringBuild$2(InfixSuggestersTest.java:122)
   [junit4]   2> 	at org.apache.lucene.util.LuceneTestCase.expectThrows(LuceneTestCase.java:2688)
   [junit4]   2> 	at org.apache.solr.handler.component.InfixSuggestersTest.lambda$testShutdownDuringBuild$3(InfixSuggestersTest.java:121)
   [junit4]   2> 	at java.base/java.util.concurrent.FutureTask.run(FutureTask.java:264)
   [junit4]   2> 	at org.apache.solr.common.util.ExecutorUtil$MDCAwareThreadPoolExecutor.lambda$execute$0(ExecutorUtil.java:209)
   [junit4]   2> 	at java.base/java.util.concurrent.ThreadPoolExecutor.runWorker(ThreadPoolExecutor.java:1167)
   [junit4]   2> 	at java.base/java.util.concurrent.ThreadPoolExecutor$Worker.run(ThreadPoolExecutor.java:641)
   [junit4]   2> 	at java.base/java.lang.Thread.run(Thread.java:844)
   [junit4]   2> 
   [junit4]   2> 895058 INFO  (TEST-InfixSuggestersTest.testShutdownDuringBuild-seed#[5389734890D56900]) [    x:collection1] o.a.s.SolrTestCaseJ4 ####initCore
   [junit4]   2> 895058 INFO  (TEST-InfixSuggestersTest.testShutdownDuringBuild-seed#[5389734890D56900]) [    x:collection1] o.a.s.c.SolrResourceLoader [null] Added 2 libs to classloader, from paths: [/home/jenkins/workspace/Lucene-Solr-master-Linux/solr/core/src/test-files/solr/collection1/lib, /home/jenkins/workspace/Lucene-Solr-master-Linux/solr/core/src/test-files/solr/collection1/lib/classes]
   [junit4]   2> 895073 INFO  (TEST-InfixSuggestersTest.testShutdownDuringBuild-seed#[5389734890D56900]) [    x:collection1] o.a.s.c.SolrConfig Using Lucene MatchVersion: 8.0.0
   [junit4]   2> 895082 INFO  (TEST-InfixSuggestersTest.testShutdownDuringBuild-seed#[5389734890D56900]) [    x:collection1] o.a.s.s.IndexSchema [null] Schema name=test
   [junit4]   2> 895138 INFO  (TEST-InfixSuggestersTest.testShutdownDuringBuild-seed#[5389734890D56900]) [    x:collection1] o.a.s.s.IndexSchema Loaded schema test/1.0 with uniqueid field id
   [junit4]   2> 895203 INFO  (TEST-InfixSuggestersTest.testShutdownDuringBuild-seed#[5389734890D56900]) [    x:collection1] o.a.s.c.TransientSolrCoreCacheDefault Allocating transient cache for 2147483647 transient cores
   [junit4]   2> 895203 INFO  (TEST-InfixSuggestersTest.testShutdownDuringBuild-seed#[5389734890D56900]) [    x:collection1] o.a.s.h.a.MetricsHistoryHandler No .system collection, keeping metrics history in memory.
   [junit4]   2> 895211 INFO  (TEST-InfixSuggestersTest.testShutdownDuringBuild-seed#[5389734890D56900]) [    x:collection1] o.a.s.m.r.SolrJmxReporter JMX monitoring for 'solr.node' (registry 'solr.node') enabled at server: com.sun.jmx.mbeanserver.JmxMBeanServer@24e1b694
   [junit4]   2> 895217 INFO  (TEST-InfixSuggestersTest.testShutdownDuringBuild-seed#[5389734890D56900]) [    x:collection1] o.a.s.m.r.SolrJmxReporter JMX monitoring for 'solr.jvm' (registry 'solr.jvm') enabled at server: com.sun.jmx.mbeanserver.JmxMBeanServer@24e1b694
   [junit4]   2> 895217 INFO  (TEST-InfixSuggestersTest.testShutdownDuringBuild-seed#[5389734890D56900]) [    x:collection1] o.a.s.m.r.SolrJmxReporter JMX monitoring for 'solr.jetty' (registry 'solr.jetty') enabled at server: com.sun.jmx.mbeanserver.JmxMBeanServer@24e1b694
   [junit4]   2> 895218 INFO  (coreLoadExecutor-5482-thread-1-processing-x:collection1) [    x:collection1] o.a.s.c.SolrResourceLoader [null] Added 2 libs to classloader, from paths: [/home/jenkins/workspace/Lucene-Solr-master-Linux/solr/core/src/test-files/solr/collection1/lib, /home/jenkins/workspace/Lucene-Solr-master-Linux/solr/core/src/test-files/solr/collection1/lib/classes]
   [junit4]   2> 895244 INFO  (coreLoadExecutor-5482-thread-1-processing-x:collection1) [    x:collection1] o.a.s.c.SolrConfig Using Lucene MatchVersion: 8.0.0
   [junit4]   2> 895252 INFO  (coreLoadExecutor-5482-thread-1-processing-x:collection1) [    x:collection1] o.a.s.s.IndexSchema [collection1] Schema name=test
   [junit4]   2> 895323 INFO  (coreLoadExecutor-5482-thread-1-processing-x:collection1) [    x:collection1] o.a.s.s.IndexSchema Loaded schema test/1.0 with uniqueid field id
   [junit4]   2> 895328 INFO  (coreLoadExecutor-5482-thread-1-processing-x:collection1) [    x:collection1] o.a.s.c.CoreContainer Creating SolrCore 'collection1' using configuration from instancedir /home/jenkins/workspace/Lucene-Solr-master-Linux/solr/core/src/test-files/solr/collection1, trusted=true
   [junit4]   2> 895328 INFO  (coreLoadExecutor-5482-thread-1-processing-x:collection1) [    x:collection1] o.a.s.m.r.SolrJmxReporter JMX monitoring for 'solr.core.collection1' (registry 'solr.core.collection1') enabled at server: com.sun.jmx.mbeanserver.JmxMBeanServer@24e1b694
   [junit4]   2> 895328 INFO  (coreLoadExecutor-5482-thread-1-processing-x:collection1) [    x:collection1] o.a.s.c.SolrCore solr.RecoveryStrategy.Builder
   [junit4]   2> 895328 INFO  (coreLoadExecutor-5482-thread-1-processing-x:collection1) [    x:collection1] o.a.s.c.SolrCore [[collection1] ] Opening new SolrCore at [/home/jenkins/workspace/Lucene-Solr-master-Linux/solr/core/src/test-files/solr/collection1], dataDir=[/home/jenkins/workspace/Lucene-Solr-master-Linux/solr/build/solr-core/test/J1/temp/solr.handler.component.InfixSuggestersTest_5389734890D56900-001/init-core-data-001/]
   [junit4]   2> 895350 INFO  (coreLoadExecutor-5482-thread-1-processing-x:collection1) [    x:collection1] o.a.s.u.CommitTracker Hard AutoCommit: disabled
   [junit4]   2> 895350 INFO  (coreLoadExecutor-5482-thread-1-processing-x:collection1) [    x:collection1] o.a.s.u.CommitTracker Soft AutoCommit: disabled
   [junit4]   2> 895351 INFO  (coreLoadExecutor-5482-thread-1-processing-x:collection1) [    x:collection1] o.a.s.u.RandomMergePolicy RandomMergePolicy wrapping class org.apache.lucene.index.TieredMergePolicy: [TieredMergePolicy: maxMergeAtOnce=20, maxMergeAtOnceExplicit=45, maxMergedSegmentMB=2.1259765625, floorSegmentMB=2.09765625, forceMergeDeletesPctAllowed=3.6951724527149943, segmentsPerTier=46.0, maxCFSSegmentSizeMB=8.796093022207999E12, noCFSRatio=0.17524750645123827, reclaimDeletesWeight=0.05880155571549661
   [junit4]   2> 895351 INFO  (coreLoadExecutor-5482-thread-1-processing-x:collection1) [    x:collection1] o.a.s.s.SolrIndexSearcher Opening [Searcher@7606bbc7[collection1] main]
   [junit4]   2> 895351 WARN  (coreLoadExecutor-5482-thread-1-processing-x:collection1) [    x:collection1] o.a.s.r.ManagedResourceStorage Cannot write to config directory /home/jenkins/workspace/Lucene-Solr-master-Linux/solr/core/src/test-files/solr/collection1/conf; switching to use InMemory storage instead.
   [junit4]   2> 895352 INFO  (coreLoadExecutor-5482-thread-1-processing-x:collection1) [    x:collection1] o.a.s.h.c.SuggestComponent Initializing SuggestComponent
   [junit4]   2> 895352 INFO  (coreLoadExecutor-5482-thread-1-processing-x:collection1) [    x:collection1] o.a.s.s.s.SolrSuggester init: {name=shortRandomAnalyzingInfixSuggester,lookupImpl=AnalyzingInfixLookupFactory,dictionaryImpl=RandomTestDictionaryFactory,randDictMaxItems=100,indexPath=short_random_analyzing_infix_suggester,suggestAnalyzerFieldType=text,buildOnCommit=false,buildOnStartup=false}
   [junit4]   2> 895353 INFO  (coreLoadExecutor-5482-thread-1-processing-x:collection1) [    x:collection1] o.a.s.s.s.SolrSuggester Dictionary loaded with params: {name=shortRandomAnalyzingInfixSuggester,lookupImpl=AnalyzingInfixLookupFactory,dictionaryImpl=RandomTestDictionaryFactory,randDictMaxItems=100,indexPath=short_random_analyzing_infix_suggester,suggestAnalyzerFieldType=text,buildOnCommit=false,buildOnStartup=false}
   [junit4]   2> 895353 INFO  (coreLoadExecutor-5482-thread-1-processing-x:collection1) [    x:collection1] o.a.s.h.c.SuggestComponent Initializing SuggestComponent
   [junit4]   2> 895353 INFO  (coreLoadExecutor-5482-thread-1-processing-x:collection1) [    x:collection1] o.a.s.s.s.SolrSuggester init: {name=longRandomAnalyzingInfixSuggester,lookupImpl=AnalyzingInfixLookupFactory,dictionaryImpl=RandomTestDictionaryFactory,randDictMaxItems=100000,indexPath=long_random_analyzing_infix_suggester,suggestAnalyzerFieldType=text,buildOnCommit=false,buildOnStartup=false}
   [junit4]   2> 895354 INFO  (coreLoadExecutor-5482-thread-1-processing-x:collection1) [    x:collection1] o.a.s.s.s.SolrSuggester Dictionary loaded with params: {name=longRandomAnalyzingInfixSuggester,lookupImpl=AnalyzingInfixLookupFactory,dictionaryImpl=RandomTestDictionaryFactory,randDictMaxItems=100000,indexPath=long_random_analyzing_infix_suggester,suggestAnalyzerFieldType=text,buildOnCommit=false,buildOnStartup=false}
   [junit4]   2> 895354 INFO  (coreLoadExecutor-5482-thread-1-processing-x:collection1) [    x:collection1] o.a.s.h.c.SuggestComponent Initializing SuggestComponent
   [junit4]   2> 895354 INFO  (coreLoadExecutor-5482-thread-1-processing-x:collection1) [    x:collection1] o.a.s.s.s.SolrSuggester init: {name=shortRandomBlendedInfixSuggester,lookupImpl=BlendedInfixLookupFactory,dictionaryImpl=RandomTestDictionaryFactory,randDictMaxItems=100,blenderType=position_linear,suggestAnalyzerFieldType=text,indexPath=short_random_blended_infix_suggester,highlight=true,buildOnStartup=false,buildOnCommit=false}
   [junit4]   2> 895355 INFO  (coreLoadExecutor-5482-thread-1-processing-x:collection1) [    x:collection1] o.a.s.s.s.SolrSuggester Dictionary loaded with params: {name=shortRandomBlendedInfixSuggester,lookupImpl=BlendedInfixLookupFactory,dictionaryImpl=RandomTestDictionaryFactory,randDictMaxItems=100,blenderType=position_linear,suggestAnalyzerFieldType=text,indexPath=short_random_blended_infix_suggester,highlight=true,buildOnStartup=false,buildOnCommit=false}
   [junit4]   2> 895355 INFO  (coreLoadExecutor-5482-thread-1-processing-x:collection1) [    x:collection1] o.a.s.h.ReplicationHandler Commits will be reserved for 10000ms.
   [junit4]   2> 895355 INFO  (searcherExecutor-5483-thread-1-processing-x:collection1) [    x:collection1] o.a.s.c.SolrCore [collection1] Registered new searcher Searcher@7606bbc7[collection1] main{ExitableDirectoryReader(UninvertingDirectoryReader())}
   [junit4]   2> 895356 INFO  (TEST-InfixSuggestersTest.testShutdownDuringBuild-seed#[5389734890D56900]) [    x:collection1] o.a.s.SolrTestCaseJ4 ####initCore end
   [junit4]   2> 895356 INFO  (TEST-InfixSuggestersTest.testShutdownDuringBuild-seed#[5389734890D56900]) [    x:collection1] o.a.s.SolrTestCaseJ4 ###Ending testShutdownDuringBuild
   [junit4]   2> NOTE: reproduce with: ant test  -Dtestcase=InfixSuggestersTest -Dtests.method=testShutdownDuringBuild -Dtests.seed=5389734890D56900 -Dtests.multiplier=3 -Dtests.slow=true -Dtests.locale=de-DE -Dtests.timezone=Indian/Maldives -Dtests.asserts=true -Dtests.file.encoding=UTF-8
   [junit4] ERROR   0.99s J1 | InfixSuggestersTest.testShutdownDuringBuild <<<
   [junit4]    > Throwable #1: java.util.concurrent.ExecutionException: junit.framework.AssertionFailedError: Unexpected wrapped exception type, expected CoreIsClosedException
   [junit4]    > 	at __randomizedtesting.SeedInfo.seed([5389734890D56900:8C0411F7AEBC3C62]:0)
   [junit4]    > 	at java.base/java.util.concurrent.FutureTask.report(FutureTask.java:122)
   [junit4]    > 	at java.base/java.util.concurrent.FutureTask.get(FutureTask.java:191)
   [junit4]    > 	at org.apache.solr.handler.component.InfixSuggestersTest.testShutdownDuringBuild(InfixSuggestersTest.java:130)
   [junit4]    > 	at java.base/jdk.internal.reflect.NativeMethodAccessorImpl.invoke0(Native Method)
   [junit4]    > 	at java.base/jdk.internal.reflect.NativeMethodAccessorImpl.invoke(NativeMethodAccessorImpl.java:62)
   [junit4]    > 	at java.base/jdk.internal.reflect.DelegatingMethodAccessorImpl.invoke(DelegatingMethodAccessorImpl.java:43)
   [junit4]    > 	at java.base/java.lang.reflect.Method.invoke(Method.java:564)
   [junit4]    > 	at java.base/java.lang.Thread.run(Thread.java:844)
   [junit4]    > Caused by: junit.framework.AssertionFailedError: Unexpected wrapped exception type, expected CoreIsClosedException
   [junit4]    > 	at org.apache.lucene.util.LuceneTestCase.expectThrows(LuceneTestCase.java:2696)
   [junit4]    > 	at org.apache.solr.handler.component.InfixSuggestersTest.lambda$testShutdownDuringBuild$3(InfixSuggestersTest.java:121)
   [junit4]    > 	at java.base/java.util.concurrent.FutureTask.run(FutureTask.java:264)
   [junit4]    > 	at org.apache.solr.common.util.ExecutorUtil$MDCAwareThreadPoolExecutor.lambda$execute$0(ExecutorUtil.java:209)
   [junit4]    > 	at java.base/java.util.concurrent.ThreadPoolExecutor.runWorker(ThreadPoolExecutor.java:1167)
   [junit4]    > 	at java.base/java.util.concurrent.ThreadPoolExecutor$Worker.run(ThreadPoolExecutor.java:641)
   [junit4]    > 	... 1 more
   [junit4]    > Caused by: java.lang.RuntimeException: Exception during query
   [junit4]    > 	at org.apache.solr.SolrTestCaseJ4.assertQ(SolrTestCaseJ4.java:917)
   [junit4]    > 	at org.apache.solr.SolrTestCaseJ4.assertQ(SolrTestCaseJ4.java:877)
   [junit4]    > 	at org.apache.solr.handler.component.InfixSuggestersTest.lambda$testShutdownDuringBuild$2(InfixSuggestersTest.java:122)
   [junit4]    > 	at org.apache.lucene.util.LuceneTestCase.expectThrows(LuceneTestCase.java:2688)
   [junit4]    > 	... 6 more
   [junit4]    > Caused by: org.apache.solr.common.SolrException: SolrCoreState already closed.
   [junit4]    > 	at org.apache.solr.update.DefaultSolrCoreState.lock(DefaultSolrCoreState.java:186)
   [junit4]    > 	at org.apache.solr.update.DefaultSolrCoreState.getIndexWriter(DefaultSolrCoreState.java:121)
   [junit4]    > 	at org.apache.solr.update.SolrCoreState.getTragicException(SolrCoreState.java:198)
   [junit4]    > 	at org.apache.solr.core.CoreContainer.checkTragicException(CoreContainer.java:1812)
   [junit4]    > 	at org.apache.solr.handler.RequestHandlerBase.handleRequest(RequestHandlerBase.java:212)
   [junit4]    > 	at org.apache.solr.core.SolrCore.execute(SolrCore.java:2541)
   [junit4]    > 	at org.apache.solr.util.TestHarness.query(TestHarness.java:337)
   [junit4]    > 	at org.apache.solr.util.TestHarness.query(TestHarness.java:319)
   [junit4]    > 	at org.apache.solr.SolrTestCaseJ4.assertQ(SolrTestCaseJ4.java:891)
   [junit4]    > 	... 9 more
   [junit4]   2> 895360 INFO  (TEST-InfixSuggestersTest.testReloadDuringBuild-seed#[5389734890D56900]) [    x:collection1] o.a.s.SolrTestCaseJ4 ###Starting testReloadDuringBuild
   [junit4]   2> 895360 ERROR (TEST-InfixSuggestersTest.testReloadDuringBuild-seed#[5389734890D56900]) [    x:collection1] o.a.s.c.CorePropertiesLocator Couldn't load core descriptor from /home/jenkins/workspace/Lucene-Solr-master-Linux/solr/core/src/test-files/solr/collection1/core.properties:java.nio.file.NoSuchFileException: /home/jenkins/workspace/Lucene-Solr-master-Linux/solr/core/src/test-files/solr/collection1/core.properties
   [junit4]   2> 895361 INFO  (AnalyzingInfixSuggesterTest-3297-thread-1-processing-x:collection1) [    x:collection1] o.a.s.h.c.SuggestComponent SuggestComponent prepare with : qt=/suggest_analyzing_infix_long_dictionary&suggest=true&suggest.buildAll=true&wt=xml&indent=off
   [junit4]   2> 895361 INFO  (AnalyzingInfixSuggesterTest-3297-thread-1-processing-x:collection1) [    x:collection1] o.a.s.s.s.SolrSuggester SolrSuggester.build(longRandomAnalyzingInfixSuggester)
   [junit4]   2> 895361 INFO  (TEST-InfixSuggestersTest.testReloadDuringBuild-seed#[5389734890D56900]) [    x:collection1] o.a.s.c.SolrResourceLoader [null] Added 2 libs to classloader, from paths: [/home/jenkins/workspace/Lucene-Solr-master-Linux/solr/core/src/test-files/solr/collection1/lib, /home/jenkins/workspace/Lucene-Solr-master-Linux/solr/core/src/test-files/solr/collection1/lib/classes]
   [junit4]   2> 895377 INFO  (TEST-InfixSuggestersTest.testReloadDuringBuild-seed#[5389734890D56900]) [    x:collection1] o.a.s.c.SolrConfig Using Lucene MatchVersion: 8.0.0
   [junit4]   2> 895384 INFO  (TEST-InfixSuggestersTest.testReloadDuringBuild-seed#[5389734890D56900]) [    x:collection1] o.a.s.s.IndexSchema [collection1] Schema name=test
   [junit4]   2> 895409 INFO  (AnalyzingInfixSuggesterTest-3297-thread-1-processing-x:collection1) [    x:collection1] o.a.s.s.s.RandomTestDictionaryFactory org.apache.solr.spelling.suggest.RandomTestDictionaryFactory$RandomTestDictionary.enabled.longRandomAnalyzingInfixSuggester emitted 1000 items.
   [junit4]   2> 895452 INFO  (AnalyzingInfixSuggesterTest-3297-thread-1-processing-x:collection1) [    x:collection1] o.a.s.s.s.RandomTestDictionaryFactory org.apache.solr.spelling.suggest.RandomTestDictionaryFactory$RandomTestDictionary.enabled.longRandomAnalyzingInfixSuggester emitted 2000 items.
   [junit4]   2> 895480 INFO  (TEST-InfixSuggestersTest.testReloadDuringBuild-seed#[5389734890D56900]) [    x:collection1] o.a.s.s.IndexSchema Loaded schema test/1.0 with uniqueid field id
   [junit4]   2> 895486 INFO  (TEST-InfixSuggestersTest.testReloadDuringBuild-seed#[5389734890D56900]) [    x:collection1] o.a.s.c.CoreContainer Reloading SolrCore 'collection1' using configuration from instancedir /home/jenkins/workspace/Lucene-Solr-master-Linux/solr/core/src/test-files/solr/collection1
   [junit4]   2> 895507 INFO  (AnalyzingInfixSuggesterTest-3297-thread-1-processing-x:collection1) [    x:collection1] o.a.s.s.s.RandomTestDictionaryFactory org.apache.solr.spelling.suggest.RandomTestDictionaryFactory$RandomTestDictionary.enabled.longRandomAnalyzingInfixSuggester emitted 3000 items.
   [junit4]   2> 895512 INFO  (TEST-InfixSuggestersTest.testReloadDuringBuild-seed#[5389734890D56900]) [    x:collection1] o.a.s.m.r.SolrJmxReporter JMX monitoring for 'solr.core.collection1' (registry 'solr.core.collection1') enabled at server: com.sun.jmx.mbeanserver.JmxMBeanServer@24e1b694
   [junit4]   2> 895512 INFO  (TEST-InfixSuggestersTest.testReloadDuringBuild-seed#[5389734890D56900]) [    x:collection1] o.a.s.c.SolrCore [[collection1] ] Opening new SolrCore at [/home/jenkins/workspace/Lucene-Solr-master-Linux/solr/core/src/test-files/solr/collection1], dataDir=[/home/jenkins/workspace/Lucene-Solr-master-Linux/solr/build/solr-core/test/J1/temp/solr.handler.component.InfixSuggestersTest_5389734890D56900-001/init-core-data-001/]
   [junit4]   2> 895548 INFO  (AnalyzingInfixSuggesterTest-3297-thread-1-processing-x:collection1) [    x:collection1] o.a.s.s.s.RandomTestDictionaryFactory org.apache.solr.spelling.suggest.RandomTestDictionaryFactory$RandomTestDictionary.enabled.longRandomAnalyzingInfixSuggester emitted 4000 items.
   [junit4]   2> 895556 INFO  (TEST-InfixSuggestersTest.testReloadDuringBuild-seed#[5389734890D56900]) [    x:collection1] o.a.s.u.CommitTracker Hard AutoCommit: disabled
   [junit4]   2> 895556 INFO  (TEST-InfixSuggestersTest.testReloadDuringBuild-seed#[5389734890D56900]) [    x:collection1] o.a.s.u.CommitTracker Soft AutoCommit: disabled
   [junit4]   2> 895557 INFO  (TEST-InfixSuggestersTest.testReloadDuringBuild-seed#[5389734890D56900]) [    x:collection1] o.a.s.s.SolrIndexSearcher Opening [Searcher@6788ed5f[collection1] main]
   [junit4]   2> 895557 WARN  (TEST-InfixSuggestersTest.testReloadDuringBuild-seed#[5389734890D56900]) [    x:collection1] o.a.s.r.ManagedResourceStorage Cannot write to config directory /home/jenkins/workspace/Lucene-Solr-master-Linux/solr/core/src/test-files/solr/collection1/conf; switching to use InMemory storage instead.
   [junit4]   2> 895557 INFO  (TEST-InfixSuggestersTest.testReloadDuringBuild-seed#[5389734890D56900]) [    x:collection1] o.a.s.h.c.SuggestComponent Initializing SuggestComponent
   [junit4]   2> 895557 INFO  (TEST-InfixSuggestersTest.testReloadDuringBuild-seed#[5389734890D56900]) [    x:collection1] o.a.s.s.s.SolrSuggester init: {name=shortRandomAnalyzingInfixSuggester,lookupImpl=AnalyzingInfixLookupFactory,dictionaryImpl=RandomTestDictionaryFactory,randDictMaxItems=100,indexPath=short_random_analyzing_infix_suggester,suggestAnalyzerFieldType=text,buildOnCommit=false,buildOnStartup=false}
   [junit4]   2> 895558 INFO  (TEST-InfixSuggestersTest.testReloadDuringBuild-seed#[5389734890D56900]) [    x:collection1] o.a.s.s.s.SolrSuggester Dictionary loaded with params: {name=shortRandomAnalyzingInfixSuggester,lookupImpl=AnalyzingInfixLookupFactory,dictionaryImpl=RandomTestDictionaryFactory,randDictMaxItems=100,indexPath=short_random_analyzing_infix_suggester,suggestAnalyzerFieldType=text,buildOnCommit=false,buildOnStartup=false}
   [junit4]   2> 895558 INFO  (TEST-InfixSuggestersTest.testReloadDuringBuild-seed#[5389734890D56900]) [    x:collection1] o.a.s.h.c.SuggestComponent Initializing SuggestComponent
   [junit4]   2> 895558 INFO  (TEST-InfixSuggestersTest.testReloadDuringBuild-seed#[5389734890D56900]) [    x:collection1] o.a.s.s.s.SolrSuggester init: {name=longRandomAnalyzingInfixSuggester,lookupImpl=AnalyzingInfixLookupFactory,dictionaryImpl=RandomTestDictionaryFactory,randDictMaxItems=100000,indexPath=long_random_analyzing_infix_suggester,suggestAnalyzerFieldType=text,buildOnCommit=false,buildOnStartup=false}
   [junit4]   2> 895559 INFO  (TEST-InfixSuggestersTest.testReloadDuringBuild-seed#[5389734890D56900]) [    x:collection1] o.a.s.s.s.SolrSuggester Dictionary loaded with params: {name=longRandomAnalyzingInfixSuggester,lookupImpl=AnalyzingInfixLookupFactory,dictionaryImpl=RandomTestDictionaryFactory,randDictMaxItems=100000,indexPath=long_random_analyzing_infix_suggester,suggestAnalyzerFieldType=text,buildOnCommit=false,buildOnStartup=false}
   [junit4]   2> 895559 INFO  (TEST-InfixSuggestersTest.testReloadDuringBuild-seed#[5389734890D56900]) [    x:collection1] o.a.s.h.c.SuggestComponent Initializing SuggestComponent
   [junit4]   2> 895559 INFO  (TEST-InfixSuggestersTest.testReloadDuringBuild-seed#[5389734890D56900]) [    x:collection1] o.a.s.s.s.SolrSuggester init: {name=shortRandomBlendedInfixSuggester,lookupImpl=BlendedInfixLookupFactory,dictionaryImpl=RandomTestDictionaryFactory,randDictMaxItems=100,blenderType=position_linear,suggestAnalyzerFieldType=text,indexPath=short_random_blended_infix_suggester,highlight=true,buildOnStartup=false,buildOnCommit=false}
   [junit4]   2> 895560 INFO  (TEST-InfixSuggestersTest.testReloadDuringBuild-seed#[5389734890D56900]) [    x:collection1] o.a.s.s.s.SolrSuggester Dictionary loaded with params: {name=shortRandomBlendedInfixSuggester,lookupImpl=BlendedInfixLookupFactory,dictionaryImpl=RandomTestDictionaryFactory,randDictMaxItems=100,blenderType=position_linear,suggestAnalyzerFieldType=text,indexPath=short_random_blended_infix_suggester,highlight=true,buildOnStartup=false,buildOnCommit=false}
   [junit4]   2> 895560 INFO  (TEST-InfixSuggestersTest.testReloadDuringBuild-seed#[5389734890D56900]) [    x:collection1] o.a.s.h.ReplicationHandler Commits will be reserved for 10000ms.
   [junit4]   2> 895561 INFO  (searcherExecutor-5487-thread-1-processing-x:collection1) [    x:collection1] o.a.s.c.SolrCore [collection1] Registered new searcher Searcher@6788ed5f[collection1] main{ExitableDirectoryReader(UninvertingDirectoryReader())}
   [junit4]   2> 895561 INFO  (TEST-InfixSuggestersTest.testReloadDuringBuild-seed#[5389734890D56900]) [    x:collection1] o.a.s.u.RandomMergePolicy RandomMergePolicy wrapping class org.apache.lucene.index.TieredMergePolicy: [TieredMergePolicy: maxMergeAtOnce=34, maxMergeAtOnceExplicit=48, maxMergedSegmentMB=50.2236328125, floorSegmentMB=1.7978515625, forceMergeDeletesPctAllowed=20.153808728899225, segmentsPerTier=19.0, maxCFSSegmentSizeMB=8.796093022207999E12, noCFSRatio=0.34242199186517586, reclaimDeletesWeight=2.1798511902054445
   [junit4]   2> 895562 INFO  (TEST-InfixSuggestersTest.testReloadDuringBuild-seed#[5389734890D56900]) [    x:collection1] o.a.s.u.DefaultSolrCoreState New IndexWriter is ready to be used.
   [junit4]   2> 895562 INFO  (TEST-InfixSuggestersTest.testReloadDuringBuild-seed#[5389734890D56900]) [    x:collection1] o.a.s.s.SolrIndexSearcher Opening [Searcher@420479c8[collection1] main]
   [junit4]   2> 895563 INFO  (TEST-InfixSuggestersTest.testReloadDuringBuild-seed#[5389734890D56900]) [    x:collection1] o.a.s.c.SolrCore [collection1]  CLOSING SolrCore org.apache.solr.core.SolrCore@4c6f0d07
   [junit4]   2> 895563 INFO  (TEST-InfixSuggestersTest.testReloadDuringBuild-seed#[5389734890D56900]) [    x:collection1] o.a.s.m.SolrMetricManager Closing metric reporters for registry=solr.core.collection1, tag=4c6f0d07
   [junit4]   2> 895563 INFO  (TEST-InfixSuggestersTest.testReloadDuringBuild-seed#[5389734890D56900]) [    x:collection1] o.a.s.m.r.SolrJmxReporter Closing reporter [org.apache.solr.metrics.reporters.SolrJmxReporter@17c1f6ac: rootName = null, domain = solr.core.collection1, service url = null, agent id = null] for registry solr.core.collection1 / com.codahale.metrics.MetricRegistry@89c91e0
   [junit4]   2> 895563 INFO  (searcherExecutor-5487-thread-1-processing-x:collection1) [    x:collection1] o.a.s.c.SolrCore [collection1] Registered new searcher Searcher@420479c8[collection1] main{ExitableDirectoryReader(UninvertingDirectoryReader())}
   [junit4]   2> 896138 ERROR (AnalyzingInfixSuggesterTest-3297-thread-1-processing-x:collection1) [    x:collection1] o.a.s.h.RequestHandlerBase org.apache.solr.update.SolrCoreState$CoreIsClosedException: Suggester build has been interrupted by a core reload or shutdown.
   [junit4]   2> 	at org.apache.solr.spelling.suggest.SolrSuggester.build(SolrSuggester.java:183)
   [junit4]   2> 	at org.apache.solr.handler.component.SuggestComponent.prepare(SuggestComponent.java:185)
   [junit4]   2> 	at org.apache.solr.handler.component.SearchHandler.handleRequestBody(SearchHandler.java:272)
   [junit4]   2> 	at org.apache.solr.handler.RequestHandlerBase.handleRequest(RequestHandlerBase.java:199)
   [junit4]   2> 	at org.apache.solr.core.SolrCore.execute(SolrCore.java:2541)
   [junit4]   2> 	at org.apache.solr.util.TestHarness.query(TestHarness.java:337)
   [junit4]   2> 	at org.apache.solr.util.TestHarness.query(TestHarness.java:319)
   [junit4]   2> 	at org.apache.solr.SolrTestCaseJ4.assertQ(SolrTestCaseJ4.java:891)
   [junit4]   2> 	at org.apache.solr.SolrTestCaseJ4.assertQ(SolrTestCaseJ4.java:877)
   [junit4]   2> 	at org.apache.solr.handler.component.InfixSuggestersTest.lambda$testReloadDuringBuild$0(InfixSuggestersTest.java:102)
   [junit4]   2> 	at org.apache.lucene.util.LuceneTestCase.expectThrows(LuceneTestCase.java:2688)
   [junit4]   2> 	at org.apache.solr.handler.component.InfixSuggestersTest.lambda$testReloadDuringBuild$1(InfixSuggestersTest.java:101)
   [junit4]   2> 	at java.base/java.util.concurrent.FutureTask.run(FutureTask.java:264)
   [junit4]   2> 	at org.apache.solr.common.util.ExecutorUtil$MDCAwareThreadPoolExecutor.lambda$execute$0(ExecutorUtil.java:209)
   [junit4]   2> 	at java.base/java.util.concurrent.ThreadPoolExecutor.runWorker(ThreadPoolExecutor.java:1167)
   [junit4]   2> 	at java.base/java.util.concurrent.ThreadPoolExecutor$Worker.run(ThreadPoolExecutor.java:641)
   [junit4]   2> 	at java.base/java.lang.Thread.run(Thread.java:844)
   [junit4]   2> Caused by: org.apache.lucene.store.AlreadyClosedException: this IndexWriter is closed
   [junit4]   2> 	at org.apache.lucene.index.IndexWriter.ensureOpen(IndexWriter.java:671)
   [junit4]   2> 	at org.apache.lucene.index.IndexWriter.ensureOpen(IndexWriter.java:685)
   [junit4]   2> 	at org.apache.lucene.index.IndexWriter.updateDocument(IndexWriter.java:1598)
   [junit4]   2> 	at org.apache.lucene.index.IndexWriter.addDocument(IndexWriter.java:1220)
   [junit4]   2> 	at org.apache.lucene.search.suggest.analyzing.AnalyzingInfixSuggester.add(AnalyzingInfixSuggester.java:396)
   [junit4]   2> 	at org.apache.lucene.search.suggest.analyzing.AnalyzingInfixSuggester.build(AnalyzingInfixSuggester.java:310)
   [junit4]   2> 	at org.apache.lucene.search.suggest.Lookup.build(Lookup.java:190)
   [junit4]   2> 	at org.apache.solr.spelling.suggest.SolrSuggester.build(SolrSuggester.java:181)
   [junit4]   2> 	... 16 more
   [junit4]   2> 
   [junit4]   2> 896138 INFO  (AnalyzingInfixSuggesterTest-3297-thread-1-processing-x:collection1) [    x:collection1] o.a.s.c.S.Request [collection1]  webapp=null path=null params={qt=/suggest_analy

[...truncated too long message...]

teSizeMergePolicy: minMergeSize=1677721, mergeFactor=26, maxMergeSize=2147483648, maxMergeSizeForForcedMerge=9223372036854775807, calibrateSizeByDeletes=true, maxMergeDocs=2147483647, maxCFSSegmentSizeMB=8.796093022207999E12, noCFSRatio=1.0]
   [junit4]   2> 897587 INFO  (searcherExecutor-5503-thread-1-processing-x:collection1) [    x:collection1] o.a.s.c.SolrCore [collection1] Registered new searcher Searcher@722e4f24[collection1] main{ExitableDirectoryReader(UninvertingDirectoryReader())}
   [junit4]   2> 897587 INFO  (TEST-InfixSuggestersTest.testTwoSuggestersBuildThenReload-seed#[5389734890D56900]) [    x:collection1] o.a.s.u.DefaultSolrCoreState New IndexWriter is ready to be used.
   [junit4]   2> 897587 INFO  (TEST-InfixSuggestersTest.testTwoSuggestersBuildThenReload-seed#[5389734890D56900]) [    x:collection1] o.a.s.s.SolrIndexSearcher Opening [Searcher@5bdb23df[collection1] main]
   [junit4]   2> 897587 INFO  (TEST-InfixSuggestersTest.testTwoSuggestersBuildThenReload-seed#[5389734890D56900]) [    x:collection1] o.a.s.c.SolrCore [collection1]  CLOSING SolrCore org.apache.solr.core.SolrCore@457ec2dd
   [junit4]   2> 897587 INFO  (TEST-InfixSuggestersTest.testTwoSuggestersBuildThenReload-seed#[5389734890D56900]) [    x:collection1] o.a.s.m.SolrMetricManager Closing metric reporters for registry=solr.core.collection1, tag=457ec2dd
   [junit4]   2> 897587 INFO  (TEST-InfixSuggestersTest.testTwoSuggestersBuildThenReload-seed#[5389734890D56900]) [    x:collection1] o.a.s.m.r.SolrJmxReporter Closing reporter [org.apache.solr.metrics.reporters.SolrJmxReporter@7cf337ef: rootName = null, domain = solr.core.collection1, service url = null, agent id = null] for registry solr.core.collection1 / com.codahale.metrics.MetricRegistry@89c91e0
   [junit4]   2> 897588 INFO  (searcherExecutor-5503-thread-1-processing-x:collection1) [    x:collection1] o.a.s.c.SolrCore [collection1] Registered new searcher Searcher@5bdb23df[collection1] main{ExitableDirectoryReader(UninvertingDirectoryReader())}
   [junit4]   2> 897593 INFO  (TEST-InfixSuggestersTest.testTwoSuggestersBuildThenReload-seed#[5389734890D56900]) [    x:collection1] o.a.s.SolrTestCaseJ4 ###Ending testTwoSuggestersBuildThenReload
   [junit4]   2> 897594 INFO  (SUITE-InfixSuggestersTest-seed#[5389734890D56900]-worker) [    x:collection1] o.a.s.SolrTestCaseJ4 ###deleteCore
   [junit4]   2> 897594 INFO  (SUITE-InfixSuggestersTest-seed#[5389734890D56900]-worker) [    x:collection1] o.a.s.c.CoreContainer Shutting down CoreContainer instance=1511303145
   [junit4]   2> 897604 INFO  (SUITE-InfixSuggestersTest-seed#[5389734890D56900]-worker) [    x:collection1] o.a.s.m.SolrMetricManager Closing metric reporters for registry=solr.node, tag=null
   [junit4]   2> 897604 INFO  (SUITE-InfixSuggestersTest-seed#[5389734890D56900]-worker) [    x:collection1] o.a.s.m.r.SolrJmxReporter Closing reporter [org.apache.solr.metrics.reporters.SolrJmxReporter@5889c7a3: rootName = null, domain = solr.node, service url = null, agent id = null] for registry solr.node / com.codahale.metrics.MetricRegistry@673c27e1
   [junit4]   2> 897607 INFO  (SUITE-InfixSuggestersTest-seed#[5389734890D56900]-worker) [    x:collection1] o.a.s.m.SolrMetricManager Closing metric reporters for registry=solr.jvm, tag=null
   [junit4]   2> 897607 INFO  (SUITE-InfixSuggestersTest-seed#[5389734890D56900]-worker) [    x:collection1] o.a.s.m.r.SolrJmxReporter Closing reporter [org.apache.solr.metrics.reporters.SolrJmxReporter@3db8b765: rootName = null, domain = solr.jvm, service url = null, agent id = null] for registry solr.jvm / com.codahale.metrics.MetricRegistry@7392de62
   [junit4]   2> 897608 INFO  (SUITE-InfixSuggestersTest-seed#[5389734890D56900]-worker) [    x:collection1] o.a.s.m.SolrMetricManager Closing metric reporters for registry=solr.jetty, tag=null
   [junit4]   2> 897608 INFO  (SUITE-InfixSuggestersTest-seed#[5389734890D56900]-worker) [    x:collection1] o.a.s.m.r.SolrJmxReporter Closing reporter [org.apache.solr.metrics.reporters.SolrJmxReporter@57445f1: rootName = null, domain = solr.jetty, service url = null, agent id = null] for registry solr.jetty / com.codahale.metrics.MetricRegistry@fb3d757
   [junit4]   2> 897609 INFO  (coreCloseExecutor-5507-thread-1-processing-x:collection1) [    x:collection1] o.a.s.c.SolrCore [collection1]  CLOSING SolrCore org.apache.solr.core.SolrCore@5c7df9e5
   [junit4]   2> 897609 INFO  (coreCloseExecutor-5507-thread-1-processing-x:collection1) [    x:collection1] o.a.s.m.SolrMetricManager Closing metric reporters for registry=solr.core.collection1, tag=5c7df9e5
   [junit4]   2> 897609 INFO  (coreCloseExecutor-5507-thread-1-processing-x:collection1) [    x:collection1] o.a.s.m.r.SolrJmxReporter Closing reporter [org.apache.solr.metrics.reporters.SolrJmxReporter@6e76efb3: rootName = null, domain = solr.core.collection1, service url = null, agent id = null] for registry solr.core.collection1 / com.codahale.metrics.MetricRegistry@89c91e0
   [junit4]   2> NOTE: leaving temporary files on disk at: /home/jenkins/workspace/Lucene-Solr-master-Linux/solr/build/solr-core/test/J1/temp/solr.handler.component.InfixSuggestersTest_5389734890D56900-001
   [junit4]   2> NOTE: test params are: codec=Asserting(Lucene70): {textgrams=PostingsFormat(name=LuceneFixedGap), text=PostingsFormat(name=LuceneFixedGap), exacttext=PostingsFormat(name=MockRandom)}, docValues:{weight=DocValuesFormat(name=Asserting), text=DocValuesFormat(name=Lucene70)}, maxPointsInLeafNode=896, maxMBSortInHeap=5.282178149192143, sim=Asserting(org.apache.lucene.search.similarities.AssertingSimilarity@23caeb52), locale=de-DE, timezone=Indian/Maldives
   [junit4]   2> NOTE: Linux 4.15.0-24-generic amd64/Oracle Corporation 9.0.4 (64-bit)/cpus=8,threads=1,free=287525896,total=518979584
   [junit4]   2> NOTE: All tests run in this JVM: [BadIndexSchemaTest, ScheduledMaintenanceTriggerTest, ZkStateWriterTest, TestBulkSchemaConcurrent, TestHighFrequencyDictionaryFactory, SolrJmxReporterTest, XsltUpdateRequestHandlerTest, AtomicUpdatesTest, ProtectedTermFilterFactoryTest, TestEmbeddedSolrServerSchemaAPI, VersionInfoTest, TestExactStatsCache, ClassificationUpdateProcessorTest, TestRetrieveFieldsOptimizer, TestInitParams, TestConfigSetsAPI, TestConfigReload, SyncSliceTest, TestFieldTypeCollectionResource, RegexBoostProcessorTest, TestSolrDeletionPolicy2, CoreMergeIndexesAdminHandlerTest, TestHashPartitioner, TestLegacyField, MissingSegmentRecoveryTest, SearchHandlerTest, MoveReplicaTest, TestStressRecovery, NodeMutatorTest, CdcrUpdateLogTest, MultiTermTest, BJQParserTest, TestMaxScoreQueryParser, TestSuggestSpellingConverter, TestLMJelinekMercerSimilarityFactory, TlogReplayBufferedWhileIndexingTest, TestFastLRUCache, LargeFieldTest, TestReload, RulesTest, TestRestoreCore, TestNamedUpdateProcessors, SolrShardReporterTest, TestDelegationWithHadoopAuth, NodeAddedTriggerIntegrationTest, MetricsHistoryHandlerTest, TestStressVersions, TestTolerantUpdateProcessorRandomCloud, TestRandomFaceting, TestDynamicFieldResource, TestSegmentSorting, TestStreamBody, TestGraphMLResponseWriter, TestMergePolicyConfig, TestAtomicUpdateErrorCases, TestRangeQuery, SolrCoreTest, TestCloudDeleteByQuery, CdcrReplicationDistributedZkTest, TestBulkSchemaAPI, DistributedExpandComponentTest, BlockJoinFacetSimpleTest, TestLegacyTerms, SolrGangliaReporterTest, LeaderElectionIntegrationTest, SimpleFacetsTest, ResourceLoaderTest, HdfsDirectoryFactoryTest, TestDynamicURP, DOMUtilTest, FileUtilsTest, TestManagedSchema, TestLargeCluster, TestHashQParserPlugin, HdfsTlogReplayBufferedWhileIndexingTest, SuggestComponentTest, AssignBackwardCompatibilityTest, XmlInterpolationTest, TestManagedResource, SuggesterTSTTest, TestLeaderInitiatedRecoveryThread, UniqFieldsUpdateProcessorFactoryTest, SolrRequestParserTest, TestCryptoKeys, OpenExchangeRatesOrgProviderTest, CustomHighlightComponentTest, TestCloudJSONFacetSKG, TestAddFieldRealTimeGet, TestPKIAuthenticationPlugin, TestFiltering, TestAnalyzeInfixSuggestions, TestSchemalessBufferedUpdates, TestCoreContainer, TestUninvertingReader, SignificantTermsQParserPluginTest, TestBM25SimilarityFactory, PreAnalyzedFieldTest, TestDistribStateManager, V2ApiIntegrationTest, TestCursorMarkWithoutUniqueKey, DistributedQueryComponentOptimizationTest, TestCollationField, ConcurrentDeleteAndCreateCollectionTest, TestSystemIdResolver, CopyFieldTest, ReplicationFactorTest, VMParamsZkACLAndCredentialsProvidersTest, JavabinLoaderTest, TestSolrCloudWithSecureImpersonation, QueryParsingTest, TestPolicyCloud, IndexSizeTriggerTest, MinimalSchemaTest, TestSkipOverseerOperations, SSLMigrationTest, TestNestedDocsSort, InfixSuggestersTest]
   [junit4] Completed [348/824 (1!)] on J1 in 4.39s, 7 tests, 1 error <<< FAILURES!

[...truncated 43417 lines...]
[repro] Jenkins log URL: https://jenkins.thetaphi.de/job/Lucene-Solr-master-Linux/22461/consoleText

[repro] Revision: f291f3eb6c91f7288226c48d72bc41a9c377e867

[repro] Ant options: "-Dargs=-XX:+UseCompressedOops -XX:+UseSerialGC"
[repro] Repro line:  ant test  -Dtestcase=InfixSuggestersTest -Dtests.method=testShutdownDuringBuild -Dtests.seed=5389734890D56900 -Dtests.multiplier=3 -Dtests.slow=true -Dtests.locale=de-DE -Dtests.timezone=Indian/Maldives -Dtests.asserts=true -Dtests.file.encoding=UTF-8

[repro] ant clean

[...truncated 6 lines...]
[repro] Test suites by module:
[repro]    solr/core
[repro]       InfixSuggestersTest
[repro] ant compile-test

[...truncated 3306 lines...]
[repro] ant test-nocompile -Dtests.dups=5 -Dtests.maxfailures=5 -Dtests.class="*.InfixSuggestersTest" -Dtests.showOutput=onerror "-Dargs=-XX:+UseCompressedOops -XX:+UseSerialGC" -Dtests.seed=5389734890D56900 -Dtests.multiplier=3 -Dtests.slow=true -Dtests.locale=de-DE -Dtests.timezone=Indian/Maldives -Dtests.asserts=true -Dtests.file.encoding=UTF-8

[...truncated 106 lines...]
[repro] Failures:
[repro]   0/5 failed: org.apache.solr.handler.component.InfixSuggestersTest
[repro] Exiting with code 0

[...truncated 40 lines...]

Mime
View raw message