lucene-dev mailing list archives

Site index · List index
Message view « Date » · « Thread »
Top « Date » · « Thread »
From Policeman Jenkins Server <jenk...@thetaphi.de>
Subject [JENKINS] Lucene-Solr-master-Windows (64bit/jdk-10) - Build # 7414 - Unstable!
Date Thu, 12 Jul 2018 16:49:55 GMT
Build: https://jenkins.thetaphi.de/job/Lucene-Solr-master-Windows/7414/
Java: 64bit/jdk-10 -XX:-UseCompressedOops -XX:+UseParallelGC

1 tests failed.
FAILED:  org.apache.solr.cloud.autoscaling.ScheduledTriggerTest.testTrigger

Error Message:
expected:<3> but was:<2>

Stack Trace:
java.lang.AssertionError: expected:<3> but was:<2>
	at __randomizedtesting.SeedInfo.seed([892F927EF5AD6190:EAE4A4FC6C6212BD]:0)
	at org.junit.Assert.fail(Assert.java:93)
	at org.junit.Assert.failNotEquals(Assert.java:647)
	at org.junit.Assert.assertEquals(Assert.java:128)
	at org.junit.Assert.assertEquals(Assert.java:472)
	at org.junit.Assert.assertEquals(Assert.java:456)
	at org.apache.solr.cloud.autoscaling.ScheduledTriggerTest.scheduledTriggerTest(ScheduledTriggerTest.java:112)
	at org.apache.solr.cloud.autoscaling.ScheduledTriggerTest.testTrigger(ScheduledTriggerTest.java:65)
	at java.base/jdk.internal.reflect.NativeMethodAccessorImpl.invoke0(Native Method)
	at java.base/jdk.internal.reflect.NativeMethodAccessorImpl.invoke(NativeMethodAccessorImpl.java:62)
	at java.base/jdk.internal.reflect.DelegatingMethodAccessorImpl.invoke(DelegatingMethodAccessorImpl.java:43)
	at java.base/java.lang.reflect.Method.invoke(Method.java:564)
	at com.carrotsearch.randomizedtesting.RandomizedRunner.invoke(RandomizedRunner.java:1737)
	at com.carrotsearch.randomizedtesting.RandomizedRunner$8.evaluate(RandomizedRunner.java:934)
	at com.carrotsearch.randomizedtesting.RandomizedRunner$9.evaluate(RandomizedRunner.java:970)
	at com.carrotsearch.randomizedtesting.RandomizedRunner$10.evaluate(RandomizedRunner.java:984)
	at com.carrotsearch.randomizedtesting.rules.SystemPropertiesRestoreRule$1.evaluate(SystemPropertiesRestoreRule.java:57)
	at org.apache.lucene.util.TestRuleSetupTeardownChained$1.evaluate(TestRuleSetupTeardownChained.java:49)
	at org.apache.lucene.util.AbstractBeforeAfterRule$1.evaluate(AbstractBeforeAfterRule.java:45)
	at org.apache.lucene.util.TestRuleThreadAndTestName$1.evaluate(TestRuleThreadAndTestName.java:48)
	at org.apache.lucene.util.TestRuleIgnoreAfterMaxFailures$1.evaluate(TestRuleIgnoreAfterMaxFailures.java:64)
	at org.apache.lucene.util.TestRuleMarkFailure$1.evaluate(TestRuleMarkFailure.java:47)
	at com.carrotsearch.randomizedtesting.rules.StatementAdapter.evaluate(StatementAdapter.java:36)
	at com.carrotsearch.randomizedtesting.ThreadLeakControl$StatementRunner.run(ThreadLeakControl.java:368)
	at com.carrotsearch.randomizedtesting.ThreadLeakControl.forkTimeoutingTask(ThreadLeakControl.java:817)
	at com.carrotsearch.randomizedtesting.ThreadLeakControl$3.evaluate(ThreadLeakControl.java:468)
	at com.carrotsearch.randomizedtesting.RandomizedRunner.runSingleTest(RandomizedRunner.java:943)
	at com.carrotsearch.randomizedtesting.RandomizedRunner$5.evaluate(RandomizedRunner.java:829)
	at com.carrotsearch.randomizedtesting.RandomizedRunner$6.evaluate(RandomizedRunner.java:879)
	at com.carrotsearch.randomizedtesting.RandomizedRunner$7.evaluate(RandomizedRunner.java:890)
	at com.carrotsearch.randomizedtesting.rules.StatementAdapter.evaluate(StatementAdapter.java:36)
	at com.carrotsearch.randomizedtesting.rules.SystemPropertiesRestoreRule$1.evaluate(SystemPropertiesRestoreRule.java:57)
	at org.apache.lucene.util.AbstractBeforeAfterRule$1.evaluate(AbstractBeforeAfterRule.java:45)
	at com.carrotsearch.randomizedtesting.rules.StatementAdapter.evaluate(StatementAdapter.java:36)
	at org.apache.lucene.util.TestRuleStoreClassName$1.evaluate(TestRuleStoreClassName.java:41)
	at com.carrotsearch.randomizedtesting.rules.NoShadowingOrOverridesOnMethodsRule$1.evaluate(NoShadowingOrOverridesOnMethodsRule.java:40)
	at com.carrotsearch.randomizedtesting.rules.NoShadowingOrOverridesOnMethodsRule$1.evaluate(NoShadowingOrOverridesOnMethodsRule.java:40)
	at com.carrotsearch.randomizedtesting.rules.StatementAdapter.evaluate(StatementAdapter.java:36)
	at com.carrotsearch.randomizedtesting.rules.StatementAdapter.evaluate(StatementAdapter.java:36)
	at org.apache.lucene.util.TestRuleAssertionsRequired$1.evaluate(TestRuleAssertionsRequired.java:53)
	at org.apache.lucene.util.TestRuleMarkFailure$1.evaluate(TestRuleMarkFailure.java:47)
	at org.apache.lucene.util.TestRuleIgnoreAfterMaxFailures$1.evaluate(TestRuleIgnoreAfterMaxFailures.java:64)
	at org.apache.lucene.util.TestRuleIgnoreTestSuites$1.evaluate(TestRuleIgnoreTestSuites.java:54)
	at com.carrotsearch.randomizedtesting.rules.StatementAdapter.evaluate(StatementAdapter.java:36)
	at com.carrotsearch.randomizedtesting.ThreadLeakControl$StatementRunner.run(ThreadLeakControl.java:368)
	at java.base/java.lang.Thread.run(Thread.java:844)




Build Log:
[...truncated 14181 lines...]
   [junit4] Suite: org.apache.solr.cloud.autoscaling.ScheduledTriggerTest
   [junit4]   2> 2429802 INFO  (SUITE-ScheduledTriggerTest-seed#[892F927EF5AD6190]-worker)
[    ] o.a.s.SolrTestCaseJ4 SecureRandom sanity checks: test.solr.allowed.securerandom=null
& java.security.egd=file:/dev/./urandom
   [junit4]   2> Creating dataDir: C:\Users\jenkins\workspace\Lucene-Solr-master-Windows\solr\build\solr-core\test\J0\temp\solr.cloud.autoscaling.ScheduledTriggerTest_892F927EF5AD6190-001\init-core-data-001
   [junit4]   2> 2429803 WARN  (SUITE-ScheduledTriggerTest-seed#[892F927EF5AD6190]-worker)
[    ] o.a.s.SolrTestCaseJ4 startTrackingSearchers: numOpens=5 numCloses=5
   [junit4]   2> 2429803 INFO  (SUITE-ScheduledTriggerTest-seed#[892F927EF5AD6190]-worker)
[    ] o.a.s.SolrTestCaseJ4 Using PointFields (NUMERIC_POINTS_SYSPROP=true) w/NUMERIC_DOCVALUES_SYSPROP=true
   [junit4]   2> 2429804 INFO  (SUITE-ScheduledTriggerTest-seed#[892F927EF5AD6190]-worker)
[    ] o.a.s.SolrTestCaseJ4 Randomized ssl (false) and clientAuth (false) via: @org.apache.solr.util.RandomizeSSL(reason="",
value=0.0/0.0, ssl=0.0/0.0, clientAuth=0.0/0.0)
   [junit4]   2> 2429805 INFO  (SUITE-ScheduledTriggerTest-seed#[892F927EF5AD6190]-worker)
[    ] o.a.s.c.MiniSolrCloudCluster Starting cluster of 1 servers in C:\Users\jenkins\workspace\Lucene-Solr-master-Windows\solr\build\solr-core\test\J0\temp\solr.cloud.autoscaling.ScheduledTriggerTest_892F927EF5AD6190-001\tempDir-001
   [junit4]   2> 2429805 INFO  (SUITE-ScheduledTriggerTest-seed#[892F927EF5AD6190]-worker)
[    ] o.a.s.c.ZkTestServer STARTING ZK TEST SERVER
   [junit4]   2> 2429805 INFO  (Thread-4915) [    ] o.a.s.c.ZkTestServer client port:0.0.0.0/0.0.0.0:0
   [junit4]   2> 2429805 INFO  (Thread-4915) [    ] o.a.s.c.ZkTestServer Starting server
   [junit4]   2> 2429808 ERROR (Thread-4915) [    ] o.a.z.s.ZooKeeperServer ZKShutdownHandler
is not registered, so ZooKeeper server won't take any action on ERROR or SHUTDOWN server state
changes
   [junit4]   2> 2429905 INFO  (SUITE-ScheduledTriggerTest-seed#[892F927EF5AD6190]-worker)
[    ] o.a.s.c.ZkTestServer start zk server on port:53666
   [junit4]   2> 2429908 INFO  (zkConnectionManagerCallback-8335-thread-1) [    ] o.a.s.c.c.ConnectionManager
zkClient has connected
   [junit4]   2> 2429912 INFO  (jetty-launcher-8332-thread-1) [    ] o.e.j.s.Server jetty-9.4.11.v20180605;
built: 2018-06-05T18:24:03.829Z; git: d5fc0523cfa96bfebfbda19606cad384d772f04c; jvm 10+46
   [junit4]   2> 2429913 INFO  (jetty-launcher-8332-thread-1) [    ] o.e.j.s.session DefaultSessionIdManager
workerName=node0
   [junit4]   2> 2429913 INFO  (jetty-launcher-8332-thread-1) [    ] o.e.j.s.session No
SessionScavenger set, using defaults
   [junit4]   2> 2429913 INFO  (jetty-launcher-8332-thread-1) [    ] o.e.j.s.session node0
Scavenging every 660000ms
   [junit4]   2> 2429913 INFO  (jetty-launcher-8332-thread-1) [    ] o.e.j.s.h.ContextHandler
Started o.e.j.s.ServletContextHandler@19c9c3b9{/solr,null,AVAILABLE}
   [junit4]   2> 2429914 INFO  (jetty-launcher-8332-thread-1) [    ] o.e.j.s.AbstractConnector
Started ServerConnector@260e3c30{HTTP/1.1,[http/1.1]}{127.0.0.1:53670}
   [junit4]   2> 2429914 INFO  (jetty-launcher-8332-thread-1) [    ] o.e.j.s.Server Started
@2429943ms
   [junit4]   2> 2429914 INFO  (jetty-launcher-8332-thread-1) [    ] o.a.s.c.s.e.JettySolrRunner
Jetty properties: {hostContext=/solr, hostPort=53670}
   [junit4]   2> 2429914 ERROR (jetty-launcher-8332-thread-1) [    ] o.a.s.u.StartupLoggingUtils
Missing Java Option solr.log.dir. Logging may be missing or incomplete.
   [junit4]   2> 2429914 INFO  (jetty-launcher-8332-thread-1) [    ] o.a.s.s.SolrDispatchFilter
Using logger factory org.apache.logging.slf4j.Log4jLoggerFactory
   [junit4]   2> 2429914 INFO  (jetty-launcher-8332-thread-1) [    ] o.a.s.s.SolrDispatchFilter
 ___      _       Welcome to Apache Solr? version 8.0.0
   [junit4]   2> 2429914 INFO  (jetty-launcher-8332-thread-1) [    ] o.a.s.s.SolrDispatchFilter
/ __| ___| |_ _   Starting in cloud mode on port null
   [junit4]   2> 2429914 INFO  (jetty-launcher-8332-thread-1) [    ] o.a.s.s.SolrDispatchFilter
\__ \/ _ \ | '_|  Install dir: null
   [junit4]   2> 2429914 INFO  (jetty-launcher-8332-thread-1) [    ] o.a.s.s.SolrDispatchFilter
|___/\___/_|_|    Start time: 2018-07-12T16:17:00.155253400Z
   [junit4]   2> 2429916 INFO  (zkConnectionManagerCallback-8337-thread-1) [    ] o.a.s.c.c.ConnectionManager
zkClient has connected
   [junit4]   2> 2429917 INFO  (jetty-launcher-8332-thread-1) [    ] o.a.s.s.SolrDispatchFilter
solr.xml found in ZooKeeper. Loading...
   [junit4]   2> 2429983 INFO  (jetty-launcher-8332-thread-1) [    ] o.a.s.c.ZkContainer
Zookeeper client=127.0.0.1:53666/solr
   [junit4]   2> 2429986 INFO  (zkConnectionManagerCallback-8341-thread-1) [    ] o.a.s.c.c.ConnectionManager
zkClient has connected
   [junit4]   2> 2429989 INFO  (zkConnectionManagerCallback-8343-thread-1) [    ] o.a.s.c.c.ConnectionManager
zkClient has connected
   [junit4]   2> 2430079 INFO  (jetty-launcher-8332-thread-1) [n:127.0.0.1:53670_solr 
  ] o.a.s.c.Overseer Overseer (id=null) closing
   [junit4]   2> 2430079 INFO  (jetty-launcher-8332-thread-1) [n:127.0.0.1:53670_solr 
  ] o.a.s.c.OverseerElectionContext I am going to be the leader 127.0.0.1:53670_solr
   [junit4]   2> 2430080 INFO  (jetty-launcher-8332-thread-1) [n:127.0.0.1:53670_solr 
  ] o.a.s.c.Overseer Overseer (id=72067775408242691-127.0.0.1:53670_solr-n_0000000000) starting
   [junit4]   2> 2430087 INFO  (zkConnectionManagerCallback-8350-thread-1) [    ] o.a.s.c.c.ConnectionManager
zkClient has connected
   [junit4]   2> 2430089 INFO  (jetty-launcher-8332-thread-1) [n:127.0.0.1:53670_solr 
  ] o.a.s.c.s.i.ZkClientClusterStateProvider Cluster at 127.0.0.1:53666/solr ready
   [junit4]   2> 2430090 INFO  (jetty-launcher-8332-thread-1) [n:127.0.0.1:53670_solr 
  ] o.a.s.c.ZkController Register node as live in ZooKeeper:/live_nodes/127.0.0.1:53670_solr
   [junit4]   2> 2430090 DEBUG (OverseerAutoScalingTriggerThread-72067775408242691-127.0.0.1:53670_solr-n_0000000000)
[    ] o.a.s.c.a.OverseerTriggerThread Adding .auto_add_replicas and .scheduled_maintenance
triggers
   [junit4]   2> 2430091 DEBUG (OverseerAutoScalingTriggerThread-72067775408242691-127.0.0.1:53670_solr-n_0000000000)
[    ] o.a.s.c.a.OverseerTriggerThread Refreshing /autoscaling.json with znode version 1
   [junit4]   2> 2430091 INFO  (OverseerStateUpdate-72067775408242691-127.0.0.1:53670_solr-n_0000000000)
[    ] o.a.s.c.c.ZkStateReader Updated live nodes from ZooKeeper... (0) -> (1)
   [junit4]   2> 2430091 DEBUG (OverseerAutoScalingTriggerThread-72067775408242691-127.0.0.1:53670_solr-n_0000000000)
[    ] o.a.s.c.a.OverseerTriggerThread Current znodeVersion 1, lastZnodeVersion -1
   [junit4]   2> 2430091 DEBUG (OverseerAutoScalingTriggerThread-72067775408242691-127.0.0.1:53670_solr-n_0000000000)
[    ] o.a.s.c.a.OverseerTriggerThread Processed trigger updates upto znodeVersion 1
   [junit4]   2> 2430093 INFO  (zkCallback-8349-thread-1) [    ] o.a.s.c.c.ZkStateReader
Updated live nodes from ZooKeeper... (0) -> (1)
   [junit4]   2> 2430094 DEBUG (OverseerAutoScalingTriggerThread-72067775408242691-127.0.0.1:53670_solr-n_0000000000)
[    ] o.a.s.c.a.NodeLostTrigger NodeLostTrigger .auto_add_replicas - Initial livenodes: [127.0.0.1:53670_solr]
   [junit4]   2> 2430094 DEBUG (OverseerAutoScalingTriggerThread-72067775408242691-127.0.0.1:53670_solr-n_0000000000)
[    ] o.a.s.c.a.OverseerTriggerThread -- clean old nodeAdded markers
   [junit4]   2> 2430095 DEBUG (OverseerAutoScalingTriggerThread-72067775408242691-127.0.0.1:53670_solr-n_0000000000)
[    ] o.a.s.c.a.OverseerTriggerThread Current znodeVersion 1, lastZnodeVersion 1
   [junit4]   2> 2430095 DEBUG (ScheduledTrigger-11877-thread-1) [    ] o.a.s.c.a.NodeLostTrigger
Running NodeLostTrigger: .auto_add_replicas with currently live nodes: 1
   [junit4]   2> 2430115 INFO  (jetty-launcher-8332-thread-1) [n:127.0.0.1:53670_solr 
  ] o.a.s.h.a.MetricsHistoryHandler No .system collection, keeping metrics history in memory.
   [junit4]   2> 2430131 INFO  (jetty-launcher-8332-thread-1) [n:127.0.0.1:53670_solr 
  ] o.a.s.m.r.SolrJmxReporter JMX monitoring for 'solr_53670.solr.node' (registry 'solr.node')
enabled at server: com.sun.jmx.mbeanserver.JmxMBeanServer@2d4ed287
   [junit4]   2> 2430135 INFO  (jetty-launcher-8332-thread-1) [n:127.0.0.1:53670_solr 
  ] o.a.s.m.r.SolrJmxReporter JMX monitoring for 'solr_53670.solr.jvm' (registry 'solr.jvm')
enabled at server: com.sun.jmx.mbeanserver.JmxMBeanServer@2d4ed287
   [junit4]   2> 2430135 INFO  (jetty-launcher-8332-thread-1) [n:127.0.0.1:53670_solr 
  ] o.a.s.m.r.SolrJmxReporter JMX monitoring for 'solr_53670.solr.jetty' (registry 'solr.jetty')
enabled at server: com.sun.jmx.mbeanserver.JmxMBeanServer@2d4ed287
   [junit4]   2> 2430137 INFO  (jetty-launcher-8332-thread-1) [n:127.0.0.1:53670_solr 
  ] o.a.s.c.CorePropertiesLocator Found 0 core definitions underneath C:\Users\jenkins\workspace\Lucene-Solr-master-Windows\solr\build\solr-core\test\J0\temp\solr.cloud.autoscaling.ScheduledTriggerTest_892F927EF5AD6190-001\tempDir-001\node1\.
   [junit4]   2> 2430150 INFO  (zkConnectionManagerCallback-8353-thread-1) [    ] o.a.s.c.c.ConnectionManager
zkClient has connected
   [junit4]   2> 2430154 INFO  (zkConnectionManagerCallback-8358-thread-1) [    ] o.a.s.c.c.ConnectionManager
zkClient has connected
   [junit4]   2> 2430155 INFO  (SUITE-ScheduledTriggerTest-seed#[892F927EF5AD6190]-worker)
[    ] o.a.s.c.c.ZkStateReader Updated live nodes from ZooKeeper... (0) -> (1)
   [junit4]   2> 2430156 INFO  (SUITE-ScheduledTriggerTest-seed#[892F927EF5AD6190]-worker)
[    ] o.a.s.c.s.i.ZkClientClusterStateProvider Cluster at 127.0.0.1:53666/solr ready
   [junit4]   2> 2430166 INFO  (TEST-ScheduledTriggerTest.testTrigger-seed#[892F927EF5AD6190])
[    ] o.a.s.SolrTestCaseJ4 ###Starting testTrigger
   [junit4]   2> 2431096 DEBUG (ScheduledTrigger-11877-thread-2) [    ] o.a.s.c.a.NodeLostTrigger
Running NodeLostTrigger: .auto_add_replicas with currently live nodes: 1
   [junit4]   2> 2432106 DEBUG (ScheduledTrigger-11877-thread-1) [    ] o.a.s.c.a.NodeLostTrigger
Running NodeLostTrigger: .auto_add_replicas with currently live nodes: 1
   [junit4]   2> 2433107 DEBUG (ScheduledTrigger-11877-thread-1) [    ] o.a.s.c.a.NodeLostTrigger
Running NodeLostTrigger: .auto_add_replicas with currently live nodes: 1
   [junit4]   2> 2434108 DEBUG (ScheduledTrigger-11877-thread-3) [    ] o.a.s.c.a.NodeLostTrigger
Running NodeLostTrigger: .auto_add_replicas with currently live nodes: 1
   [junit4]   2> 2435109 DEBUG (ScheduledTrigger-11877-thread-1) [    ] o.a.s.c.a.NodeLostTrigger
Running NodeLostTrigger: .auto_add_replicas with currently live nodes: 1
   [junit4]   2> 2436110 DEBUG (ScheduledTrigger-11877-thread-3) [    ] o.a.s.c.a.NodeLostTrigger
Running NodeLostTrigger: .auto_add_replicas with currently live nodes: 1
   [junit4]   2> 2436168 WARN  (TEST-ScheduledTriggerTest.testTrigger-seed#[892F927EF5AD6190])
[    ] o.a.s.c.a.ScheduledTrigger ScheduledTrigger was not able to run event at scheduled
time: 2018-07-12T16:17:03.408Z. Now: 2018-07-12T16:17:06.407Z
   [junit4]   2> 2437111 DEBUG (ScheduledTrigger-11877-thread-1) [    ] o.a.s.c.a.NodeLostTrigger
Running NodeLostTrigger: .auto_add_replicas with currently live nodes: 1
   [junit4]   2> 2438112 DEBUG (ScheduledTrigger-11877-thread-3) [    ] o.a.s.c.a.NodeLostTrigger
Running NodeLostTrigger: .auto_add_replicas with currently live nodes: 1
   [junit4]   2> 2439114 DEBUG (ScheduledTrigger-11877-thread-1) [    ] o.a.s.c.a.NodeLostTrigger
Running NodeLostTrigger: .auto_add_replicas with currently live nodes: 1
   [junit4]   2> 2439168 WARN  (TEST-ScheduledTriggerTest.testTrigger-seed#[892F927EF5AD6190])
[    ] o.a.s.c.a.ScheduledTrigger ScheduledTrigger was not able to run event at scheduled
time: 2018-07-12T16:17:06.408Z. Now: 2018-07-12T16:17:09.407Z
   [junit4]   2> 2439168 INFO  (TEST-ScheduledTriggerTest.testTrigger-seed#[892F927EF5AD6190])
[    ] o.a.s.SolrTestCaseJ4 ###Ending testTrigger
   [junit4]   2> NOTE: reproduce with: ant test  -Dtestcase=ScheduledTriggerTest -Dtests.method=testTrigger
-Dtests.seed=892F927EF5AD6190 -Dtests.slow=true -Dtests.locale=en-MS -Dtests.timezone=Africa/Libreville
-Dtests.asserts=true -Dtests.file.encoding=US-ASCII
   [junit4] FAILURE 9.01s J0 | ScheduledTriggerTest.testTrigger <<<
   [junit4]    > Throwable #1: java.lang.AssertionError: expected:<3> but was:<2>
   [junit4]    > 	at __randomizedtesting.SeedInfo.seed([892F927EF5AD6190:EAE4A4FC6C6212BD]:0)
   [junit4]    > 	at org.apache.solr.cloud.autoscaling.ScheduledTriggerTest.scheduledTriggerTest(ScheduledTriggerTest.java:112)
   [junit4]    > 	at org.apache.solr.cloud.autoscaling.ScheduledTriggerTest.testTrigger(ScheduledTriggerTest.java:65)
   [junit4]    > 	at java.base/jdk.internal.reflect.NativeMethodAccessorImpl.invoke0(Native
Method)
   [junit4]    > 	at java.base/jdk.internal.reflect.NativeMethodAccessorImpl.invoke(NativeMethodAccessorImpl.java:62)
   [junit4]    > 	at java.base/jdk.internal.reflect.DelegatingMethodAccessorImpl.invoke(DelegatingMethodAccessorImpl.java:43)
   [junit4]    > 	at java.base/java.lang.reflect.Method.invoke(Method.java:564)
   [junit4]    > 	at java.base/java.lang.Thread.run(Thread.java:844)
   [junit4]   2> 2439174 INFO  (TEST-ScheduledTriggerTest.testIgnoredEvent-seed#[892F927EF5AD6190])
[    ] o.a.s.SolrTestCaseJ4 ###Starting testIgnoredEvent
   [junit4]   2> 2439175 WARN  (TEST-ScheduledTriggerTest.testIgnoredEvent-seed#[892F927EF5AD6190])
[    ] o.a.s.c.a.ScheduledTrigger ScheduledTrigger was not able to run event at scheduled
time: 2018-07-11T16:17:09.416Z. Now: 2018-07-12T16:17:09.415Z
   [junit4]   2> 2439180 INFO  (TEST-ScheduledTriggerTest.testIgnoredEvent-seed#[892F927EF5AD6190])
[    ] o.a.s.SolrTestCaseJ4 ###Ending testIgnoredEvent
   [junit4]   2> 2439182 WARN  (NIOServerCxn.Factory:0.0.0.0/0.0.0.0:0) [    ] o.a.z.s.NIOServerCnxn
Unable to read additional data from client sessionid 0x100094288f60006, likely client has
closed socket
   [junit4]   2> 2439214 INFO  (jetty-closer-8333-thread-1) [    ] o.e.j.s.AbstractConnector
Stopped ServerConnector@260e3c30{HTTP/1.1,[http/1.1]}{127.0.0.1:0}
   [junit4]   2> 2439214 INFO  (jetty-closer-8333-thread-1) [    ] o.a.s.c.CoreContainer
Shutting down CoreContainer instance=285658839
   [junit4]   2> 2439215 INFO  (jetty-closer-8333-thread-1) [    ] o.a.s.m.SolrMetricManager
Closing metric reporters for registry=solr.node, tag=null
   [junit4]   2> 2439215 INFO  (jetty-closer-8333-thread-1) [    ] o.a.s.m.r.SolrJmxReporter
Closing reporter [org.apache.solr.metrics.reporters.SolrJmxReporter@3ab2867c: rootName = solr_53670,
domain = solr.node, service url = null, agent id = null] for registry solr.node / com.codahale.metrics.MetricRegistry@40268a38
   [junit4]   2> 2439219 INFO  (jetty-closer-8333-thread-1) [    ] o.a.s.m.SolrMetricManager
Closing metric reporters for registry=solr.jvm, tag=null
   [junit4]   2> 2439219 INFO  (jetty-closer-8333-thread-1) [    ] o.a.s.m.r.SolrJmxReporter
Closing reporter [org.apache.solr.metrics.reporters.SolrJmxReporter@3650c99f: rootName = solr_53670,
domain = solr.jvm, service url = null, agent id = null] for registry solr.jvm / com.codahale.metrics.MetricRegistry@2baa972c
   [junit4]   2> 2439221 INFO  (jetty-closer-8333-thread-1) [    ] o.a.s.m.SolrMetricManager
Closing metric reporters for registry=solr.jetty, tag=null
   [junit4]   2> 2439221 INFO  (jetty-closer-8333-thread-1) [    ] o.a.s.m.r.SolrJmxReporter
Closing reporter [org.apache.solr.metrics.reporters.SolrJmxReporter@53da6979: rootName = solr_53670,
domain = solr.jetty, service url = null, agent id = null] for registry solr.jetty / com.codahale.metrics.MetricRegistry@7ec36395
   [junit4]   2> 2439222 INFO  (jetty-closer-8333-thread-1) [    ] o.a.s.c.ZkController
Remove node as live in ZooKeeper:/live_nodes/127.0.0.1:53670_solr
   [junit4]   2> 2439224 INFO  (jetty-closer-8333-thread-1) [    ] o.a.s.m.SolrMetricManager
Closing metric reporters for registry=solr.cluster, tag=null
   [junit4]   2> 2439224 INFO  (jetty-closer-8333-thread-1) [    ] o.a.s.c.TransientSolrCoreCacheDefault
Allocating transient cache for 2147483647 transient cores
   [junit4]   2> 2439224 INFO  (jetty-closer-8333-thread-1) [    ] o.a.s.c.Overseer Overseer
(id=72067775408242691-127.0.0.1:53670_solr-n_0000000000) closing
   [junit4]   2> 2439225 INFO  (OverseerStateUpdate-72067775408242691-127.0.0.1:53670_solr-n_0000000000)
[    ] o.a.s.c.Overseer Overseer Loop exiting : 127.0.0.1:53670_solr
   [junit4]   2> 2439225 WARN  (OverseerAutoScalingTriggerThread-72067775408242691-127.0.0.1:53670_solr-n_0000000000)
[    ] o.a.s.c.a.OverseerTriggerThread OverseerTriggerThread woken up but we are closed, exiting.
   [junit4]   2> 2439226 DEBUG (jetty-closer-8333-thread-1) [    ] o.a.s.c.a.ScheduledTriggers
Shutting down scheduled thread pool executor now
   [junit4]   2> 2439226 DEBUG (jetty-closer-8333-thread-1) [    ] o.a.s.c.a.ScheduledTriggers
Shutting down action executor now
   [junit4]   2> 2439226 DEBUG (jetty-closer-8333-thread-1) [    ] o.a.s.c.a.ScheduledTriggers
Awaiting termination for action executor
   [junit4]   2> 2439226 DEBUG (jetty-closer-8333-thread-1) [    ] o.a.s.c.a.ScheduledTriggers
Awaiting termination for scheduled thread pool executor
   [junit4]   2> 2439226 INFO  (zkCallback-8342-thread-1) [    ] o.a.s.c.c.ZkStateReader
Updated live nodes from ZooKeeper... (1) -> (0)
   [junit4]   2> 2439226 INFO  (zkCallback-8349-thread-1) [    ] o.a.s.c.c.ZkStateReader
Updated live nodes from ZooKeeper... (1) -> (0)
   [junit4]   2> 2439226 DEBUG (jetty-closer-8333-thread-1) [    ] o.a.s.c.a.ScheduledTriggers
ScheduledTriggers closed completely
   [junit4]   2> 2439226 DEBUG (jetty-closer-8333-thread-1) [    ] o.a.s.c.a.OverseerTriggerThread
OverseerTriggerThread has been closed explicitly
   [junit4]   2> 2439228 INFO  (jetty-closer-8333-thread-1) [    ] o.e.j.s.h.ContextHandler
Stopped o.e.j.s.ServletContextHandler@19c9c3b9{/solr,null,UNAVAILABLE}
   [junit4]   2> 2439228 INFO  (jetty-closer-8333-thread-1) [    ] o.e.j.s.session node0
Stopped scavenging
   [junit4]   2> 2439229 ERROR (SUITE-ScheduledTriggerTest-seed#[892F927EF5AD6190]-worker)
[    ] o.a.z.s.ZooKeeperServer ZKShutdownHandler is not registered, so ZooKeeper server won't
take any action on ERROR or SHUTDOWN server state changes
   [junit4]   2> 2439229 INFO  (SUITE-ScheduledTriggerTest-seed#[892F927EF5AD6190]-worker)
[    ] o.a.s.c.ZkTestServer connecting to 127.0.0.1:53666 53666
   [junit4]   2> 2439230 INFO  (Thread-4915) [    ] o.a.s.c.ZkTestServer connecting to
127.0.0.1:53666 53666
   [junit4]   2> 2439230 WARN  (Thread-4915) [    ] o.a.s.c.ZkTestServer Watch limit violations:

   [junit4]   2> Maximum concurrent create/delete watches above limit:
   [junit4]   2> 
   [junit4]   2> 	3	/solr/aliases.json
   [junit4]   2> 	3	/solr/clusterprops.json
   [junit4]   2> 
   [junit4]   2> Maximum concurrent data watches above limit:
   [junit4]   2> 
   [junit4]   2> 	3	/solr/clusterstate.json
   [junit4]   2> 
   [junit4]   2> Maximum concurrent children watches above limit:
   [junit4]   2> 
   [junit4]   2> 	3	/solr/live_nodes
   [junit4]   2> 	3	/solr/collections
   [junit4]   2> 
   [junit4]   2> NOTE: leaving temporary files on disk at: C:\Users\jenkins\workspace\Lucene-Solr-master-Windows\solr\build\solr-core\test\J0\temp\solr.cloud.autoscaling.ScheduledTriggerTest_892F927EF5AD6190-001
   [junit4]   2> Jul 12, 2018 4:17:09 PM com.carrotsearch.randomizedtesting.ThreadLeakControl
checkThreadLeaks
   [junit4]   2> WARNING: Will linger awaiting termination of 4 leaked thread(s).
   [junit4]   2> NOTE: test params are: codec=HighCompressionCompressingStoredFields(storedFieldsFormat=CompressingStoredFieldsFormat(compressionMode=HIGH_COMPRESSION,
chunkSize=26259, maxDocsPerChunk=152, blockSize=6), termVectorsFormat=CompressingTermVectorsFormat(compressionMode=HIGH_COMPRESSION,
chunkSize=26259, blockSize=6)), sim=Asserting(org.apache.lucene.search.similarities.AssertingSimilarity@5291282d),
locale=en-MS, timezone=Africa/Libreville
   [junit4]   2> NOTE: Windows 10 10.0 amd64/Oracle Corporation 10 (64-bit)/cpus=3,threads=1,free=187347048,total=521666560
   [junit4]   2> NOTE: All tests run in this JVM: [TestWordDelimiterFilterFactory, ScriptEngineTest,
TestFieldCacheWithThreads, SSLMigrationTest, AutoAddReplicasIntegrationTest, SolrJmxReporterTest,
AnalyticsMergeStrategyTest, SpatialHeatmapFacetsTest, TestSolrCoreParser, HdfsThreadLeakTest,
TestCloudManagedSchema, ChaosMonkeyNothingIsSafeTest, SolrCoreTest, ZkShardTermsTest, DocumentAnalysisRequestHandlerTest,
TestConfigSets, TestCSVResponseWriter, XmlUpdateRequestHandlerTest, DistributedFacetPivotLargeTest,
NumericFieldsTest, FullSolrCloudDistribCmdsTest, SuggesterFSTTest, BlockCacheTest, TestConfigSetImmutable,
DistributedFacetPivotSmallAdvancedTest, TermVectorComponentTest, ResponseBuilderTest, TestNumericTerms32,
AtomicUpdateProcessorFactoryTest, TestCollationField, TestNodeAddedTrigger, TestQueryTypes,
ChaosMonkeySafeLeaderTest, TestConfigSetsAPIExclusivity, AnalysisErrorHandlingTest, TestBadConfig,
TestFreeTextSuggestions, UpdateLogTest, HDFSCollectionsAPITest, TestEmbeddedSolrServerConstructors,
DistribDocExpirationUpdateProcessorTest, TestSQLHandlerNonCloud, SignificantTermsQParserPluginTest,
TaggingAttributeTest, HttpTriggerListenerTest, TestLuceneMatchVersion, TestReRankQParserPlugin,
TestBinaryField, TestLazyCores, TestMacros, AsyncCallRequestStatusResponseTest, Tagger2Test,
UpdateRequestProcessorFactoryTest, NodeAddedTriggerIntegrationTest, BasicDistributedZkTest,
OpenCloseCoreStressTest, TestCopyFieldCollectionResource, DistributedQueryComponentCustomSortTest,
SpatialRPTFieldTypeTest, CopyFieldTest, TestIBSimilarityFactory, TestClusterProperties, TestMultiWordSynonyms,
QueryResultKeyTest, TestRTGBase, TestConfigsApi, SolrCloudReportersTest, DistributedQueryElevationComponentTest,
TestJoin, SpellPossibilityIteratorTest, TestImplicitCoreProperties, TestBM25SimilarityFactory,
TestStressVersions, DistributedSuggestComponentTest, TestHalfAndHalfDocValues, SimpleFacetsTest,
DeleteStatusTest, TestScoreJoinQPScore, TestPartialUpdateDeduplication, LIROnShardRestartTest,
ConjunctionSolrSpellCheckerTest, TestSolrXml, TestNumericRangeQuery64, GraphQueryTest, SmileWriterTest,
SearchRateTriggerTest, PingRequestHandlerTest, BasicAuthStandaloneTest, BadComponentTest,
OverseerStatusTest, CoreAdminHandlerTest, CacheHeaderTest, TestHdfsBackupRestoreCore, TestRangeQuery,
MultiTermTest, TestAnalyzeInfixSuggestions, TestInitQParser, TestAtomicUpdateErrorCases, TestHdfsCloudBackupRestore,
TestIntervalFaceting, ClusterStateUpdateTest, TestSolrJ, TestRawResponseWriter, TriggerIntegrationTest,
CustomCollectionTest, TemplateUpdateProcessorTest, FastVectorHighlighterTest, ZkFailoverTest,
TestInPlaceUpdatesDistrib, TestHashQParserPlugin, CloudExitableDirectoryReaderTest, TestDynamicFieldResource,
TestLRUStatsCache, DocumentBuilderTest, TestRestManager, BlobRepositoryCloudTest, PreAnalyzedUpdateProcessorTest,
TestSchemaResource, FacetPivotSmallTest, HdfsChaosMonkeySafeLeaderTest, SolrXmlInZkTest, TestDefaultStatsCache,
SpatialFilterTest, TestGenericDistributedQueue, TestBlobHandler, DeleteLastCustomShardedReplicaTest,
TestOverriddenPrefixQueryForCustomFieldType, NodeLostTriggerIntegrationTest, TestSortByMinMaxFunction,
TestSubQueryTransformerCrossCore, TestMultiValuedNumericRangeQuery, TimeZoneUtilsTest, ConcurrentCreateRoutedAliasTest,
CloudMLTQParserTest, CurrencyRangeFacetCloudTest, TestBlendedInfixSuggestions, TestLMJelinekMercerSimilarityFactory,
TestNRTOpen, ExternalFileFieldSortTest, ResponseLogComponentTest, OverriddenZkACLAndCredentialsProvidersTest,
TestLeaderElectionZkExpiry, TestStreamBody, TlogReplayBufferedWhileIndexingTest, TestHttpShardHandlerFactory,
AutoscalingHistoryHandlerTest, BadCopyFieldTest, TestCoreDiscovery, UUIDUpdateProcessorFallbackTest,
HdfsUnloadDistributedZkTest, MetricsHistoryIntegrationTest, TestRestoreCore, TestAuthenticationFramework,
SolrCLIZkUtilsTest, TestSort, SpellCheckCollatorTest, TestOnReconnectListenerSupport, TestFastLRUCache,
MetricsConfigTest, DocValuesNotIndexedTest, HighlighterMaxOffsetTest, HdfsLockFactoryTest,
TestSolrDeletionPolicy2, LeaderElectionContextKeyTest, PreAnalyzedFieldTest, LargeFieldTest,
TestTrie, DataDrivenBlockJoinTest, SolrMetricManagerTest, IndexSchemaTest, SolrIndexMetricsTest,
TestSchemaManager, TestExceedMaxTermLength, ExecutePlanActionTest, TestIndexingPerformance,
CollectionStateFormat2Test, HttpSolrCallGetCoreTest, TestWriterPerf, DebugComponentTest, ClassificationUpdateProcessorTest,
TestSolrCloudWithKerberosAlt, SegmentsInfoRequestHandlerTest, TestStressLucene, TestCollectionAPI,
TestCloudRecovery, TestConfig, BooleanFieldTest, RequiredFieldsTest, TestExactSharedStatsCache,
TestRTimerTree, SuggesterTest, TestFilteredDocIdSet, TestQuerySenderNoQuery, TestShortCircuitedRequests,
ProtectedTermFilterFactoryTest, TestRandomFaceting, CdcrRequestHandlerTest, MissingSegmentRecoveryTest,
TestSSLRandomization, TestSchemaVersionResource, AnalysisAfterCoreReloadTest, BasicFunctionalityTest,
ConvertedLegacyTest, CursorPagingTest, DisMaxRequestHandlerTest, DistributedIntervalFacetingTest,
EchoParamsTest, MinimalSchemaTest, OutputWriterTest, SampleTest, SolrInfoBeanTest, SolrTestCaseJ4Test,
TestCrossCoreJoin, TestCursorMarkWithoutUniqueKey, TestDistributedGrouping, TestDistributedMissingSort,
TestDistributedSearch, TestDocumentBuilder, TestGroupingSearch, TestHighlightDedupGrouping,
TestSolrCoreProperties, TestTolerantSearch, TestLuceneIndexBackCompat, TestEmbeddedSolrServerAdminHandler,
TestJettySolrRunner, ConnectionReuseTest, ActionThrottleTest, AddReplicaTest, AliasIntegrationTest,
CleanupOldIndexTest, ConnectionManagerTest, CreateCollectionCleanupTest, DeleteInactiveReplicaTest,
DeleteShardTest, DistributedQueueTest, DistributedVersionInfoTest, HttpPartitionOnCommitTest,
HttpPartitionTest, LeaderElectionTest, LeaderTragicEventTest, LegacyCloudClusterPropTest,
MultiSolrCloudTestCaseTest, MultiThreadedOCPTest, NodeMutatorTest, OutOfBoxZkACLAndCredentialsProvidersTest,
OverseerModifyCollectionTest, OverseerRolesTest, OverseerTest, PeerSyncReplicationTest, RecoveryAfterSoftCommitTest,
ReplicationFactorTest, TestDistributedMap, TestDownShardTolerantSearch, TestExclusionRuleCollectionAccess,
TestLeaderElectionWithEmptyReplica, TestPullReplica, TestRandomFlRTGCloud, TestRandomRequestDistribution,
TestRebalanceLeaders, TestRequestForwarding, TestSkipOverseerOperations, TestSolrCloudWithDelegationTokens,
TestStressCloudBlindAtomicUpdates, TestStressInPlaceUpdates, TestStressLiveNodes, TestTlogReplica,
CollectionsAPIAsyncDistributedZkTest, ConcurrentDeleteAndCreateCollectionTest, ShardSplitTest,
SimpleCollectionCreateDeleteTest, TestReplicaProperties, TestRequestStatusCollectionAPI, AutoScalingHandlerTest,
ComputePlanActionTest, MetricTriggerTest, NodeMarkersRegistrationTest, ScheduledMaintenanceTriggerTest,
ScheduledTriggerIntegrationTest, ScheduledTriggerTest]
   [junit4] Completed [537/824 (1!)] on J0 in 9.71s, 2 tests, 1 failure <<< FAILURES!

[...truncated 42773 lines...]
[repro] Jenkins log URL: https://jenkins.thetaphi.de/job/Lucene-Solr-master-Windows/7414/consoleText

[repro] Revision: 8997d41357ab95eaa88702b93c75de4b1813457b

[repro] Ant options: "-Dargs=-XX:-UseCompressedOops -XX:+UseParallelGC"

[repro] ant clean

[...truncated 6 lines...]
[repro] Test suites by module:
[repro]    solr\core
[repro]       ScheduledTriggerTest
[repro] ant compile-test

[...truncated 3326 lines...]
[repro] ant test-nocompile -Dtests.dups=5 -Dtests.maxfailures=5 -Dtests.class="*.ScheduledTriggerTest"
-Dtests.showOutput=onerror "-Dargs=-XX:-UseCompressedOops -XX:+UseParallelGC" -Dtests.seed=892F927EF5AD6190
-Dtests.slow=true -Dtests.locale=en-MS -Dtests.timezone=Africa/Libreville -Dtests.asserts=true
-Dtests.file.encoding=US-ASCII

[...truncated 79 lines...]
[repro] Failures:
[repro]   0/5 failed: org.apache.solr.cloud.autoscaling.ScheduledTriggerTest
[repro] Exiting with code 0

[...truncated 75 lines...]

Mime
View raw message