lucene-dev mailing list archives

Site index · List index
Message view « Date » · « Thread »
Top « Date » · « Thread »
From Policeman Jenkins Server <jenk...@thetaphi.de>
Subject [JENKINS] Lucene-Solr-7.x-Windows (64bit/jdk1.8.0_172) - Build # 691 - Still Failing!
Date Sun, 15 Jul 2018 10:44:23 GMT
Build: https://jenkins.thetaphi.de/job/Lucene-Solr-7.x-Windows/691/
Java: 64bit/jdk1.8.0_172 -XX:-UseCompressedOops -XX:+UseSerialGC

4 tests failed.
FAILED:  org.apache.solr.cloud.LeaderTragicEventTest.test

Error Message:
Error from server at http://127.0.0.1:56190/solr: collection already exists: collection1

Stack Trace:
org.apache.solr.client.solrj.impl.HttpSolrClient$RemoteSolrException: Error from server at http://127.0.0.1:56190/solr: collection already exists: collection1
	at __randomizedtesting.SeedInfo.seed([CE980F4F4BCAF072:46CC3095E5369D8A]:0)
	at org.apache.solr.client.solrj.impl.HttpSolrClient.executeMethod(HttpSolrClient.java:643)
	at org.apache.solr.client.solrj.impl.HttpSolrClient.request(HttpSolrClient.java:255)
	at org.apache.solr.client.solrj.impl.HttpSolrClient.request(HttpSolrClient.java:244)
	at org.apache.solr.client.solrj.impl.LBHttpSolrClient.doRequest(LBHttpSolrClient.java:483)
	at org.apache.solr.client.solrj.impl.LBHttpSolrClient.request(LBHttpSolrClient.java:413)
	at org.apache.solr.client.solrj.impl.CloudSolrClient.sendRequest(CloudSolrClient.java:1106)
	at org.apache.solr.client.solrj.impl.CloudSolrClient.requestWithRetryOnStaleState(CloudSolrClient.java:886)
	at org.apache.solr.client.solrj.impl.CloudSolrClient.request(CloudSolrClient.java:819)
	at org.apache.solr.client.solrj.SolrRequest.process(SolrRequest.java:194)
	at org.apache.solr.client.solrj.SolrRequest.process(SolrRequest.java:211)
	at org.apache.solr.cloud.LeaderTragicEventTest.test(LeaderTragicEventTest.java:70)
	at sun.reflect.NativeMethodAccessorImpl.invoke0(Native Method)
	at sun.reflect.NativeMethodAccessorImpl.invoke(NativeMethodAccessorImpl.java:62)
	at sun.reflect.DelegatingMethodAccessorImpl.invoke(DelegatingMethodAccessorImpl.java:43)
	at java.lang.reflect.Method.invoke(Method.java:498)
	at com.carrotsearch.randomizedtesting.RandomizedRunner.invoke(RandomizedRunner.java:1737)
	at com.carrotsearch.randomizedtesting.RandomizedRunner$8.evaluate(RandomizedRunner.java:934)
	at com.carrotsearch.randomizedtesting.RandomizedRunner$9.evaluate(RandomizedRunner.java:970)
	at com.carrotsearch.randomizedtesting.RandomizedRunner$10.evaluate(RandomizedRunner.java:984)
	at com.carrotsearch.randomizedtesting.rules.SystemPropertiesRestoreRule$1.evaluate(SystemPropertiesRestoreRule.java:57)
	at org.apache.lucene.util.TestRuleSetupTeardownChained$1.evaluate(TestRuleSetupTeardownChained.java:49)
	at org.apache.lucene.util.AbstractBeforeAfterRule$1.evaluate(AbstractBeforeAfterRule.java:45)
	at org.apache.lucene.util.TestRuleThreadAndTestName$1.evaluate(TestRuleThreadAndTestName.java:48)
	at org.apache.lucene.util.TestRuleIgnoreAfterMaxFailures$1.evaluate(TestRuleIgnoreAfterMaxFailures.java:64)
	at org.apache.lucene.util.TestRuleMarkFailure$1.evaluate(TestRuleMarkFailure.java:47)
	at com.carrotsearch.randomizedtesting.rules.StatementAdapter.evaluate(StatementAdapter.java:36)
	at com.carrotsearch.randomizedtesting.ThreadLeakControl$StatementRunner.run(ThreadLeakControl.java:368)
	at com.carrotsearch.randomizedtesting.ThreadLeakControl.forkTimeoutingTask(ThreadLeakControl.java:817)
	at com.carrotsearch.randomizedtesting.ThreadLeakControl$3.evaluate(ThreadLeakControl.java:468)
	at com.carrotsearch.randomizedtesting.RandomizedRunner.runSingleTest(RandomizedRunner.java:943)
	at com.carrotsearch.randomizedtesting.RandomizedRunner$5.evaluate(RandomizedRunner.java:829)
	at com.carrotsearch.randomizedtesting.RandomizedRunner$6.evaluate(RandomizedRunner.java:879)
	at com.carrotsearch.randomizedtesting.RandomizedRunner$7.evaluate(RandomizedRunner.java:890)
	at com.carrotsearch.randomizedtesting.rules.StatementAdapter.evaluate(StatementAdapter.java:36)
	at com.carrotsearch.randomizedtesting.rules.SystemPropertiesRestoreRule$1.evaluate(SystemPropertiesRestoreRule.java:57)
	at org.apache.lucene.util.AbstractBeforeAfterRule$1.evaluate(AbstractBeforeAfterRule.java:45)
	at com.carrotsearch.randomizedtesting.rules.StatementAdapter.evaluate(StatementAdapter.java:36)
	at org.apache.lucene.util.TestRuleStoreClassName$1.evaluate(TestRuleStoreClassName.java:41)
	at com.carrotsearch.randomizedtesting.rules.NoShadowingOrOverridesOnMethodsRule$1.evaluate(NoShadowingOrOverridesOnMethodsRule.java:40)
	at com.carrotsearch.randomizedtesting.rules.NoShadowingOrOverridesOnMethodsRule$1.evaluate(NoShadowingOrOverridesOnMethodsRule.java:40)
	at com.carrotsearch.randomizedtesting.rules.StatementAdapter.evaluate(StatementAdapter.java:36)
	at com.carrotsearch.randomizedtesting.rules.StatementAdapter.evaluate(StatementAdapter.java:36)
	at com.carrotsearch.randomizedtesting.rules.StatementAdapter.evaluate(StatementAdapter.java:36)
	at org.apache.lucene.util.TestRuleAssertionsRequired$1.evaluate(TestRuleAssertionsRequired.java:53)
	at org.apache.lucene.util.TestRuleMarkFailure$1.evaluate(TestRuleMarkFailure.java:47)
	at org.apache.lucene.util.TestRuleIgnoreAfterMaxFailures$1.evaluate(TestRuleIgnoreAfterMaxFailures.java:64)
	at org.apache.lucene.util.TestRuleIgnoreTestSuites$1.evaluate(TestRuleIgnoreTestSuites.java:54)
	at com.carrotsearch.randomizedtesting.rules.StatementAdapter.evaluate(StatementAdapter.java:36)
	at com.carrotsearch.randomizedtesting.ThreadLeakControl$StatementRunner.run(ThreadLeakControl.java:368)
	at java.lang.Thread.run(Thread.java:748)


FAILED:  junit.framework.TestSuite.org.apache.solr.handler.component.SuggestComponentTest

Error Message:
Could not remove the following files (in the order of attempts):    C:\Users\jenkins\workspace\Lucene-Solr-7.x-Windows\solr\build\solr-core\test\J0\temp\solr.handler.component.SuggestComponentTest_CE980F4F4BCAF072-001\init-core-data-001: java.nio.file.AccessDeniedException: C:\Users\jenkins\workspace\Lucene-Solr-7.x-Windows\solr\build\solr-core\test\J0\temp\solr.handler.component.SuggestComponentTest_CE980F4F4BCAF072-001\init-core-data-001    C:\Users\jenkins\workspace\Lucene-Solr-7.x-Windows\solr\build\solr-core\test\J0\temp\solr.handler.component.SuggestComponentTest_CE980F4F4BCAF072-001: java.nio.file.DirectoryNotEmptyException: C:\Users\jenkins\workspace\Lucene-Solr-7.x-Windows\solr\build\solr-core\test\J0\temp\solr.handler.component.SuggestComponentTest_CE980F4F4BCAF072-001 

Stack Trace:
java.io.IOException: Could not remove the following files (in the order of attempts):
   C:\Users\jenkins\workspace\Lucene-Solr-7.x-Windows\solr\build\solr-core\test\J0\temp\solr.handler.component.SuggestComponentTest_CE980F4F4BCAF072-001\init-core-data-001: java.nio.file.AccessDeniedException: C:\Users\jenkins\workspace\Lucene-Solr-7.x-Windows\solr\build\solr-core\test\J0\temp\solr.handler.component.SuggestComponentTest_CE980F4F4BCAF072-001\init-core-data-001
   C:\Users\jenkins\workspace\Lucene-Solr-7.x-Windows\solr\build\solr-core\test\J0\temp\solr.handler.component.SuggestComponentTest_CE980F4F4BCAF072-001: java.nio.file.DirectoryNotEmptyException: C:\Users\jenkins\workspace\Lucene-Solr-7.x-Windows\solr\build\solr-core\test\J0\temp\solr.handler.component.SuggestComponentTest_CE980F4F4BCAF072-001

	at __randomizedtesting.SeedInfo.seed([CE980F4F4BCAF072]:0)
	at org.apache.lucene.util.IOUtils.rm(IOUtils.java:318)
	at org.apache.lucene.util.TestRuleTemporaryFilesCleanup.afterAlways(TestRuleTemporaryFilesCleanup.java:216)
	at com.carrotsearch.randomizedtesting.rules.TestRuleAdapter$1.afterAlways(TestRuleAdapter.java:31)
	at com.carrotsearch.randomizedtesting.rules.StatementAdapter.evaluate(StatementAdapter.java:43)
	at com.carrotsearch.randomizedtesting.rules.StatementAdapter.evaluate(StatementAdapter.java:36)
	at org.apache.lucene.util.TestRuleAssertionsRequired$1.evaluate(TestRuleAssertionsRequired.java:53)
	at org.apache.lucene.util.TestRuleMarkFailure$1.evaluate(TestRuleMarkFailure.java:47)
	at org.apache.lucene.util.TestRuleIgnoreAfterMaxFailures$1.evaluate(TestRuleIgnoreAfterMaxFailures.java:64)
	at org.apache.lucene.util.TestRuleIgnoreTestSuites$1.evaluate(TestRuleIgnoreTestSuites.java:54)
	at com.carrotsearch.randomizedtesting.rules.StatementAdapter.evaluate(StatementAdapter.java:36)
	at com.carrotsearch.randomizedtesting.ThreadLeakControl$StatementRunner.run(ThreadLeakControl.java:368)
	at java.lang.Thread.run(Thread.java:748)


FAILED:  org.apache.lucene.document.TestLatLonShape.testBasicIntersects

Error Message:
Java heap space

Stack Trace:
java.lang.OutOfMemoryError: Java heap space
	at __randomizedtesting.SeedInfo.seed([63E7B9534F6D54C2:549A4AA673FAF7BC]:0)
	at org.apache.lucene.store.RAMFile.newBuffer(RAMFile.java:78)
	at org.apache.lucene.store.RAMFile.addBuffer(RAMFile.java:51)
	at org.apache.lucene.store.RAMOutputStream.switchCurrentBuffer(RAMOutputStream.java:164)
	at org.apache.lucene.store.RAMOutputStream.writeBytes(RAMOutputStream.java:150)
	at org.apache.lucene.store.MockIndexOutputWrapper.writeBytes(MockIndexOutputWrapper.java:141)
	at org.apache.lucene.util.bkd.OfflinePointReader.split(OfflinePointReader.java:215)
	at org.apache.lucene.util.bkd.BKDWriter.build(BKDWriter.java:1791)
	at org.apache.lucene.util.bkd.BKDWriter.finish(BKDWriter.java:1008)
	at org.apache.lucene.index.RandomCodec$1$1.writeField(RandomCodec.java:141)
	at org.apache.lucene.codecs.asserting.AssertingPointsFormat$AssertingPointsWriter.writeField(AssertingPointsFormat.java:137)
	at org.apache.lucene.index.PointValuesWriter.flush(PointValuesWriter.java:183)
	at org.apache.lucene.index.DefaultIndexingChain.writePoints(DefaultIndexingChain.java:204)
	at org.apache.lucene.index.DefaultIndexingChain.flush(DefaultIndexingChain.java:139)
	at org.apache.lucene.index.DocumentsWriterPerThread.flush(DocumentsWriterPerThread.java:470)
	at org.apache.lucene.index.DocumentsWriter.doFlush(DocumentsWriter.java:554)
	at org.apache.lucene.index.DocumentsWriter.postUpdate(DocumentsWriter.java:413)
	at org.apache.lucene.index.DocumentsWriter.updateDocument(DocumentsWriter.java:514)
	at org.apache.lucene.index.IndexWriter.updateDocument(IndexWriter.java:1603)
	at org.apache.lucene.index.IndexWriter.addDocument(IndexWriter.java:1222)
	at org.apache.lucene.index.RandomIndexWriter.addDocument(RandomIndexWriter.java:189)
	at org.apache.lucene.document.TestLatLonShape.testBasicIntersects(TestLatLonShape.java:93)
	at sun.reflect.NativeMethodAccessorImpl.invoke0(Native Method)
	at sun.reflect.NativeMethodAccessorImpl.invoke(NativeMethodAccessorImpl.java:62)
	at sun.reflect.DelegatingMethodAccessorImpl.invoke(DelegatingMethodAccessorImpl.java:43)
	at java.lang.reflect.Method.invoke(Method.java:498)
	at com.carrotsearch.randomizedtesting.RandomizedRunner.invoke(RandomizedRunner.java:1737)
	at com.carrotsearch.randomizedtesting.RandomizedRunner$8.evaluate(RandomizedRunner.java:934)
	at com.carrotsearch.randomizedtesting.RandomizedRunner$9.evaluate(RandomizedRunner.java:970)
	at com.carrotsearch.randomizedtesting.RandomizedRunner$10.evaluate(RandomizedRunner.java:984)
	at org.apache.lucene.util.TestRuleSetupTeardownChained$1.evaluate(TestRuleSetupTeardownChained.java:49)
	at org.apache.lucene.util.AbstractBeforeAfterRule$1.evaluate(AbstractBeforeAfterRule.java:45)
	at org.apache.lucene.util.TestRuleThreadAndTestName$1.evaluate(TestRuleThreadAndTestName.java:48)


FAILED:  org.apache.solr.cloud.LeaderTragicEventTest.testOtherReplicasAreNotActive

Error Message:
Jetty Connector is not open: -2

Stack Trace:
java.lang.IllegalStateException: Jetty Connector is not open: -2
	at __randomizedtesting.SeedInfo.seed([CE980F4F4BCAF072:4B2C2338773549EA]:0)
	at org.apache.solr.client.solrj.embedded.JettySolrRunner.getBaseUrl(JettySolrRunner.java:499)
	at org.apache.solr.cloud.MiniSolrCloudCluster.getReplicaJetty(MiniSolrCloudCluster.java:539)
	at org.apache.solr.cloud.LeaderTragicEventTest.corruptLeader(LeaderTragicEventTest.java:100)
	at org.apache.solr.cloud.LeaderTragicEventTest.testOtherReplicasAreNotActive(LeaderTragicEventTest.java:150)
	at sun.reflect.NativeMethodAccessorImpl.invoke0(Native Method)
	at sun.reflect.NativeMethodAccessorImpl.invoke(NativeMethodAccessorImpl.java:62)
	at sun.reflect.DelegatingMethodAccessorImpl.invoke(DelegatingMethodAccessorImpl.java:43)
	at java.lang.reflect.Method.invoke(Method.java:498)
	at com.carrotsearch.randomizedtesting.RandomizedRunner.invoke(RandomizedRunner.java:1737)
	at com.carrotsearch.randomizedtesting.RandomizedRunner$8.evaluate(RandomizedRunner.java:934)
	at com.carrotsearch.randomizedtesting.RandomizedRunner$9.evaluate(RandomizedRunner.java:970)
	at com.carrotsearch.randomizedtesting.RandomizedRunner$10.evaluate(RandomizedRunner.java:984)
	at com.carrotsearch.randomizedtesting.rules.SystemPropertiesRestoreRule$1.evaluate(SystemPropertiesRestoreRule.java:57)
	at org.apache.lucene.util.TestRuleSetupTeardownChained$1.evaluate(TestRuleSetupTeardownChained.java:49)
	at org.apache.lucene.util.AbstractBeforeAfterRule$1.evaluate(AbstractBeforeAfterRule.java:45)
	at org.apache.lucene.util.TestRuleThreadAndTestName$1.evaluate(TestRuleThreadAndTestName.java:48)
	at org.apache.lucene.util.TestRuleIgnoreAfterMaxFailures$1.evaluate(TestRuleIgnoreAfterMaxFailures.java:64)
	at org.apache.lucene.util.TestRuleMarkFailure$1.evaluate(TestRuleMarkFailure.java:47)
	at com.carrotsearch.randomizedtesting.rules.StatementAdapter.evaluate(StatementAdapter.java:36)
	at com.carrotsearch.randomizedtesting.ThreadLeakControl$StatementRunner.run(ThreadLeakControl.java:368)
	at com.carrotsearch.randomizedtesting.ThreadLeakControl.forkTimeoutingTask(ThreadLeakControl.java:817)
	at com.carrotsearch.randomizedtesting.ThreadLeakControl$3.evaluate(ThreadLeakControl.java:468)
	at com.carrotsearch.randomizedtesting.RandomizedRunner.runSingleTest(RandomizedRunner.java:943)
	at com.carrotsearch.randomizedtesting.RandomizedRunner$5.evaluate(RandomizedRunner.java:829)
	at com.carrotsearch.randomizedtesting.RandomizedRunner$6.evaluate(RandomizedRunner.java:879)
	at com.carrotsearch.randomizedtesting.RandomizedRunner$7.evaluate(RandomizedRunner.java:890)
	at com.carrotsearch.randomizedtesting.rules.StatementAdapter.evaluate(StatementAdapter.java:36)
	at com.carrotsearch.randomizedtesting.rules.SystemPropertiesRestoreRule$1.evaluate(SystemPropertiesRestoreRule.java:57)
	at org.apache.lucene.util.AbstractBeforeAfterRule$1.evaluate(AbstractBeforeAfterRule.java:45)
	at com.carrotsearch.randomizedtesting.rules.StatementAdapter.evaluate(StatementAdapter.java:36)
	at org.apache.lucene.util.TestRuleStoreClassName$1.evaluate(TestRuleStoreClassName.java:41)
	at com.carrotsearch.randomizedtesting.rules.NoShadowingOrOverridesOnMethodsRule$1.evaluate(NoShadowingOrOverridesOnMethodsRule.java:40)
	at com.carrotsearch.randomizedtesting.rules.NoShadowingOrOverridesOnMethodsRule$1.evaluate(NoShadowingOrOverridesOnMethodsRule.java:40)
	at com.carrotsearch.randomizedtesting.rules.StatementAdapter.evaluate(StatementAdapter.java:36)
	at com.carrotsearch.randomizedtesting.rules.StatementAdapter.evaluate(StatementAdapter.java:36)
	at com.carrotsearch.randomizedtesting.rules.StatementAdapter.evaluate(StatementAdapter.java:36)
	at org.apache.lucene.util.TestRuleAssertionsRequired$1.evaluate(TestRuleAssertionsRequired.java:53)
	at org.apache.lucene.util.TestRuleMarkFailure$1.evaluate(TestRuleMarkFailure.java:47)
	at org.apache.lucene.util.TestRuleIgnoreAfterMaxFailures$1.evaluate(TestRuleIgnoreAfterMaxFailures.java:64)
	at org.apache.lucene.util.TestRuleIgnoreTestSuites$1.evaluate(TestRuleIgnoreTestSuites.java:54)
	at com.carrotsearch.randomizedtesting.rules.StatementAdapter.evaluate(StatementAdapter.java:36)
	at com.carrotsearch.randomizedtesting.ThreadLeakControl$StatementRunner.run(ThreadLeakControl.java:368)
	at java.lang.Thread.run(Thread.java:748)




Build Log:
[...truncated 9615 lines...]
   [junit4] Suite: org.apache.lucene.document.TestLatLonShape
   [junit4]   2> NOTE: reproduce with: ant test  -Dtestcase=TestLatLonShape -Dtests.method=testBasicIntersects -Dtests.seed=63E7B9534F6D54C2 -Dtests.slow=true -Dtests.locale=ar-QA -Dtests.timezone=Australia/ACT -Dtests.asserts=true -Dtests.file.encoding=Cp1252
   [junit4] ERROR   13.4s J1 | TestLatLonShape.testBasicIntersects <<<
   [junit4]    > Throwable #1: java.lang.OutOfMemoryError: Java heap space
   [junit4]    > 	at __randomizedtesting.SeedInfo.seed([63E7B9534F6D54C2:549A4AA673FAF7BC]:0)
   [junit4]    > 	at org.apache.lucene.store.RAMFile.newBuffer(RAMFile.java:78)
   [junit4]    > 	at org.apache.lucene.store.RAMFile.addBuffer(RAMFile.java:51)
   [junit4]    > 	at org.apache.lucene.store.RAMOutputStream.switchCurrentBuffer(RAMOutputStream.java:164)
   [junit4]    > 	at org.apache.lucene.store.RAMOutputStream.writeBytes(RAMOutputStream.java:150)
   [junit4]    > 	at org.apache.lucene.store.MockIndexOutputWrapper.writeBytes(MockIndexOutputWrapper.java:141)
   [junit4]    > 	at org.apache.lucene.util.bkd.OfflinePointReader.split(OfflinePointReader.java:215)
   [junit4]    > 	at org.apache.lucene.util.bkd.BKDWriter.build(BKDWriter.java:1791)
   [junit4]    > 	at org.apache.lucene.util.bkd.BKDWriter.finish(BKDWriter.java:1008)
   [junit4]    > 	at org.apache.lucene.index.RandomCodec$1$1.writeField(RandomCodec.java:141)
   [junit4]    > 	at org.apache.lucene.codecs.asserting.AssertingPointsFormat$AssertingPointsWriter.writeField(AssertingPointsFormat.java:137)
   [junit4]    > 	at org.apache.lucene.index.PointValuesWriter.flush(PointValuesWriter.java:183)
   [junit4]    > 	at org.apache.lucene.index.DefaultIndexingChain.writePoints(DefaultIndexingChain.java:204)
   [junit4]    > 	at org.apache.lucene.index.DefaultIndexingChain.flush(DefaultIndexingChain.java:139)
   [junit4]    > 	at org.apache.lucene.index.DocumentsWriterPerThread.flush(DocumentsWriterPerThread.java:470)
   [junit4]    > 	at org.apache.lucene.index.DocumentsWriter.doFlush(DocumentsWriter.java:554)
   [junit4]    > 	at org.apache.lucene.index.DocumentsWriter.postUpdate(DocumentsWriter.java:413)
   [junit4]    > 	at org.apache.lucene.index.DocumentsWriter.updateDocument(DocumentsWriter.java:514)
   [junit4]    > 	at org.apache.lucene.index.IndexWriter.updateDocument(IndexWriter.java:1603)
   [junit4]    > 	at org.apache.lucene.index.IndexWriter.addDocument(IndexWriter.java:1222)
   [junit4]    > 	at org.apache.lucene.index.RandomIndexWriter.addDocument(RandomIndexWriter.java:189)
   [junit4]    > 	at org.apache.lucene.document.TestLatLonShape.testBasicIntersects(TestLatLonShape.java:93)
   [junit4]   2> NOTE: test params are: codec=Asserting(Lucene70): {}, docValues:{}, maxPointsInLeafNode=518, maxMBSortInHeap=6.367554632568028, sim=RandomSimilarity(queryNorm=false): {}, locale=ar-QA, timezone=Australia/ACT
   [junit4]   2> NOTE: Windows 10 10.0 amd64/Oracle Corporation 1.8.0_172 (64-bit)/cpus=3,threads=1,free=402400400,total=518979584
   [junit4]   2> NOTE: All tests run in this JVM: [TestTermAutomatonQuery, TestFieldCacheTermsFilter, TestIntervals, TestDocValuesNumbersQuery, TestBigIntegerPoint, TestTessellator, TestDoubleRangeField, TestFloatPointNearestNeighbor, TestHalfFloatPoint, TestLatLonDocValuesField, TestLatLonPoint, TestLatLonPointDistanceSort, TestLatLonShape]
   [junit4] Completed [22/24 (1!)] on J1 in 13.44s, 2 tests, 1 error, 1 skipped <<< FAILURES!

[...truncated 27 lines...]
   [junit4] JVM J1: stdout was not empty, see: C:\Users\jenkins\workspace\Lucene-Solr-7.x-Windows\lucene\build\sandbox\test\temp\junit4-J1-20180715_092358_1484231723561499940684.sysout
   [junit4] >>> JVM J1 emitted unexpected output (verbatim) ----
   [junit4] java.lang.OutOfMemoryError: Java heap space
   [junit4] Dumping heap to C:\Users\jenkins\workspace\Lucene-Solr-7.x-Windows\heapdumps\java_pid16152.hprof ...
   [junit4] Heap dump file created [524655046 bytes in 0.744 secs]
   [junit4] <<< JVM J1: EOF ----

[...truncated 4365 lines...]
   [junit4] Suite: org.apache.solr.cloud.LeaderTragicEventTest
   [junit4]   2> Creating dataDir: C:\Users\jenkins\workspace\Lucene-Solr-7.x-Windows\solr\build\solr-core\test\J0\temp\solr.cloud.LeaderTragicEventTest_CE980F4F4BCAF072-001\init-core-data-001
   [junit4]   2> 2373632 INFO  (SUITE-LeaderTragicEventTest-seed#[CE980F4F4BCAF072]-worker) [    ] o.a.s.c.MiniSolrCloudCluster Starting cluster of 2 servers in C:\Users\jenkins\workspace\Lucene-Solr-7.x-Windows\solr\build\solr-core\test\J0\temp\solr.cloud.LeaderTragicEventTest_CE980F4F4BCAF072-001\tempDir-001
   [junit4]   2> 2373632 INFO  (SUITE-LeaderTragicEventTest-seed#[CE980F4F4BCAF072]-worker) [    ] o.a.s.c.ZkTestServer STARTING ZK TEST SERVER
   [junit4]   2> 2373634 INFO  (Thread-3740) [    ] o.a.s.c.ZkTestServer client port:0.0.0.0/0.0.0.0:0
   [junit4]   2> 2373634 INFO  (Thread-3740) [    ] o.a.s.c.ZkTestServer Starting server
   [junit4]   2> 2373636 ERROR (Thread-3740) [    ] o.a.z.s.ZooKeeperServer ZKShutdownHandler is not registered, so ZooKeeper server won't take any action on ERROR or SHUTDOWN server state changes
   [junit4]   2> 2373733 INFO  (SUITE-LeaderTragicEventTest-seed#[CE980F4F4BCAF072]-worker) [    ] o.a.s.c.ZkTestServer start zk server on port:56182
   [junit4]   2> 2373736 INFO  (zkConnectionManagerCallback-5006-thread-1) [    ] o.a.s.c.c.ConnectionManager zkClient has connected
   [junit4]   2> 2373741 INFO  (jetty-launcher-5003-thread-1) [    ] o.e.j.s.Server jetty-9.4.11.v20180605; built: 2018-06-05T18:24:03.829Z; git: d5fc0523cfa96bfebfbda19606cad384d772f04c; jvm 1.8.0_172-b11
   [junit4]   2> 2373741 INFO  (jetty-launcher-5003-thread-2) [    ] o.e.j.s.Server jetty-9.4.11.v20180605; built: 2018-06-05T18:24:03.829Z; git: d5fc0523cfa96bfebfbda19606cad384d772f04c; jvm 1.8.0_172-b11
   [junit4]   2> 2373741 INFO  (jetty-launcher-5003-thread-2) [    ] o.e.j.s.session DefaultSessionIdManager workerName=node0
   [junit4]   2> 2373741 INFO  (jetty-launcher-5003-thread-2) [    ] o.e.j.s.session No SessionScavenger set, using defaults
   [junit4]   2> 2373741 INFO  (jetty-launcher-5003-thread-2) [    ] o.e.j.s.session node0 Scavenging every 600000ms
   [junit4]   2> 2373742 INFO  (jetty-launcher-5003-thread-2) [    ] o.e.j.s.h.ContextHandler Started o.e.j.s.ServletContextHandler@6a4ac36d{/solr,null,AVAILABLE}
   [junit4]   2> 2373742 INFO  (jetty-launcher-5003-thread-1) [    ] o.e.j.s.session DefaultSessionIdManager workerName=node0
   [junit4]   2> 2373742 INFO  (jetty-launcher-5003-thread-1) [    ] o.e.j.s.session No SessionScavenger set, using defaults
   [junit4]   2> 2373742 INFO  (jetty-launcher-5003-thread-1) [    ] o.e.j.s.session node0 Scavenging every 660000ms
   [junit4]   2> 2373742 INFO  (jetty-launcher-5003-thread-1) [    ] o.e.j.s.h.ContextHandler Started o.e.j.s.ServletContextHandler@22374a39{/solr,null,AVAILABLE}
   [junit4]   2> 2373743 INFO  (jetty-launcher-5003-thread-2) [    ] o.e.j.s.AbstractConnector Started ServerConnector@2785a97c{HTTP/1.1,[http/1.1]}{127.0.0.1:56186}
   [junit4]   2> 2373743 INFO  (jetty-launcher-5003-thread-2) [    ] o.e.j.s.Server Started @2373797ms
   [junit4]   2> 2373743 INFO  (jetty-launcher-5003-thread-2) [    ] o.a.s.c.s.e.JettySolrRunner Jetty properties: {hostContext=/solr, hostPort=56186}
   [junit4]   2> 2373743 INFO  (jetty-launcher-5003-thread-1) [    ] o.e.j.s.AbstractConnector Started ServerConnector@7c2b902b{HTTP/1.1,[http/1.1]}{127.0.0.1:56190}
   [junit4]   2> 2373744 INFO  (jetty-launcher-5003-thread-1) [    ] o.e.j.s.Server Started @2373797ms
   [junit4]   2> 2373744 INFO  (jetty-launcher-5003-thread-1) [    ] o.a.s.c.s.e.JettySolrRunner Jetty properties: {hostContext=/solr, hostPort=56190}
   [junit4]   2> 2373744 ERROR (jetty-launcher-5003-thread-2) [    ] o.a.s.u.StartupLoggingUtils Missing Java Option solr.log.dir. Logging may be missing or incomplete.
   [junit4]   2> 2373744 INFO  (jetty-launcher-5003-thread-2) [    ] o.a.s.s.SolrDispatchFilter Using logger factory org.apache.logging.slf4j.Log4jLoggerFactory
   [junit4]   2> 2373744 ERROR (jetty-launcher-5003-thread-1) [    ] o.a.s.u.StartupLoggingUtils Missing Java Option solr.log.dir. Logging may be missing or incomplete.
   [junit4]   2> 2373744 INFO  (jetty-launcher-5003-thread-1) [    ] o.a.s.s.SolrDispatchFilter Using logger factory org.apache.logging.slf4j.Log4jLoggerFactory
   [junit4]   2> 2373744 INFO  (jetty-launcher-5003-thread-1) [    ] o.a.s.s.SolrDispatchFilter  ___      _       Welcome to Apache Solr? version 7.5.0
   [junit4]   2> 2373744 INFO  (jetty-launcher-5003-thread-2) [    ] o.a.s.s.SolrDispatchFilter  ___      _       Welcome to Apache Solr? version 7.5.0
   [junit4]   2> 2373744 INFO  (jetty-launcher-5003-thread-1) [    ] o.a.s.s.SolrDispatchFilter / __| ___| |_ _   Starting in cloud mode on port null
   [junit4]   2> 2373744 INFO  (jetty-launcher-5003-thread-1) [    ] o.a.s.s.SolrDispatchFilter \__ \/ _ \ | '_|  Install dir: null
   [junit4]   2> 2373744 INFO  (jetty-launcher-5003-thread-2) [    ] o.a.s.s.SolrDispatchFilter / __| ___| |_ _   Starting in cloud mode on port null
   [junit4]   2> 2373744 INFO  (jetty-launcher-5003-thread-1) [    ] o.a.s.s.SolrDispatchFilter |___/\___/_|_|    Start time: 2018-07-15T10:06:37.526Z
   [junit4]   2> 2373744 INFO  (jetty-launcher-5003-thread-2) [    ] o.a.s.s.SolrDispatchFilter \__ \/ _ \ | '_|  Install dir: null
   [junit4]   2> 2373744 INFO  (jetty-launcher-5003-thread-2) [    ] o.a.s.s.SolrDispatchFilter |___/\___/_|_|    Start time: 2018-07-15T10:06:37.526Z
   [junit4]   2> 2373746 INFO  (zkConnectionManagerCallback-5008-thread-1) [    ] o.a.s.c.c.ConnectionManager zkClient has connected
   [junit4]   2> 2373746 INFO  (zkConnectionManagerCallback-5010-thread-1) [    ] o.a.s.c.c.ConnectionManager zkClient has connected
   [junit4]   2> 2373746 INFO  (jetty-launcher-5003-thread-2) [    ] o.a.s.s.SolrDispatchFilter solr.xml found in ZooKeeper. Loading...
   [junit4]   2> 2373746 INFO  (jetty-launcher-5003-thread-1) [    ] o.a.s.s.SolrDispatchFilter solr.xml found in ZooKeeper. Loading...
   [junit4]   2> 2373770 WARN  (NIOServerCxn.Factory:0.0.0.0/0.0.0.0:0) [    ] o.a.z.s.NIOServerCnxn Unable to read additional data from client sessionid 0x10017628a0d0001, likely client has closed socket
   [junit4]   2> 2373865 INFO  (jetty-launcher-5003-thread-2) [    ] o.a.s.c.ZkContainer Zookeeper client=127.0.0.1:56182/solr
   [junit4]   2> 2373867 INFO  (zkConnectionManagerCallback-5014-thread-1) [    ] o.a.s.c.c.ConnectionManager zkClient has connected
   [junit4]   2> 2373868 WARN  (NIOServerCxn.Factory:0.0.0.0/0.0.0.0:0) [    ] o.a.z.s.NIOServerCnxn Unable to read additional data from client sessionid 0x10017628a0d0003, likely client has closed socket
   [junit4]   2> 2373870 INFO  (zkConnectionManagerCallback-5016-thread-1) [    ] o.a.s.c.c.ConnectionManager zkClient has connected
   [junit4]   2> 2373982 INFO  (jetty-launcher-5003-thread-2) [n:127.0.0.1:56186_solr    ] o.a.s.c.Overseer Overseer (id=null) closing
   [junit4]   2> 2373982 INFO  (jetty-launcher-5003-thread-2) [n:127.0.0.1:56186_solr    ] o.a.s.c.OverseerElectionContext I am going to be the leader 127.0.0.1:56186_solr
   [junit4]   2> 2373983 INFO  (jetty-launcher-5003-thread-2) [n:127.0.0.1:56186_solr    ] o.a.s.c.Overseer Overseer (id=72083306028269572-127.0.0.1:56186_solr-n_0000000000) starting
   [junit4]   2> 2373991 INFO  (zkConnectionManagerCallback-5023-thread-1) [    ] o.a.s.c.c.ConnectionManager zkClient has connected
   [junit4]   2> 2373993 INFO  (jetty-launcher-5003-thread-2) [n:127.0.0.1:56186_solr    ] o.a.s.c.s.i.ZkClientClusterStateProvider Cluster at 127.0.0.1:56182/solr ready
   [junit4]   2> 2373995 INFO  (jetty-launcher-5003-thread-2) [n:127.0.0.1:56186_solr    ] o.a.s.c.ZkController Register node as live in ZooKeeper:/live_nodes/127.0.0.1:56186_solr
   [junit4]   2> 2373997 INFO  (OverseerStateUpdate-72083306028269572-127.0.0.1:56186_solr-n_0000000000) [    ] o.a.s.c.c.ZkStateReader Updated live nodes from ZooKeeper... (0) -> (1)
   [junit4]   2> 2374008 INFO  (zkCallback-5022-thread-1) [    ] o.a.s.c.c.ZkStateReader Updated live nodes from ZooKeeper... (0) -> (1)
   [junit4]   2> 2374049 INFO  (jetty-launcher-5003-thread-2) [n:127.0.0.1:56186_solr    ] o.a.s.h.a.MetricsHistoryHandler No .system collection, keeping metrics history in memory.
   [junit4]   2> 2374108 INFO  (jetty-launcher-5003-thread-2) [n:127.0.0.1:56186_solr    ] o.a.s.m.r.SolrJmxReporter JMX monitoring for 'solr_56186.solr.node' (registry 'solr.node') enabled at server: com.sun.jmx.mbeanserver.JmxMBeanServer@7e1d4dd3
   [junit4]   2> 2374112 INFO  (jetty-launcher-5003-thread-2) [n:127.0.0.1:56186_solr    ] o.a.s.m.r.SolrJmxReporter JMX monitoring for 'solr_56186.solr.jvm' (registry 'solr.jvm') enabled at server: com.sun.jmx.mbeanserver.JmxMBeanServer@7e1d4dd3
   [junit4]   2> 2374112 INFO  (jetty-launcher-5003-thread-2) [n:127.0.0.1:56186_solr    ] o.a.s.m.r.SolrJmxReporter JMX monitoring for 'solr_56186.solr.jetty' (registry 'solr.jetty') enabled at server: com.sun.jmx.mbeanserver.JmxMBeanServer@7e1d4dd3
   [junit4]   2> 2374114 INFO  (jetty-launcher-5003-thread-2) [n:127.0.0.1:56186_solr    ] o.a.s.c.CorePropertiesLocator Found 0 core definitions underneath C:\Users\jenkins\workspace\Lucene-Solr-7.x-Windows\solr\build\solr-core\test\J0\temp\solr.cloud.LeaderTragicEventTest_CE980F4F4BCAF072-001\tempDir-001\node2\.
   [junit4]   2> 2374188 INFO  (jetty-launcher-5003-thread-1) [    ] o.a.s.c.ZkContainer Zookeeper client=127.0.0.1:56182/solr
   [junit4]   2> 2374190 INFO  (zkConnectionManagerCallback-5028-thread-1) [    ] o.a.s.c.c.ConnectionManager zkClient has connected
   [junit4]   2> 2374190 WARN  (NIOServerCxn.Factory:0.0.0.0/0.0.0.0:0) [    ] o.a.z.s.NIOServerCnxn Unable to read additional data from client sessionid 0x10017628a0d0006, likely client has closed socket
   [junit4]   2> 2374192 INFO  (zkConnectionManagerCallback-5030-thread-1) [    ] o.a.s.c.c.ConnectionManager zkClient has connected
   [junit4]   2> 2374199 INFO  (jetty-launcher-5003-thread-1) [n:127.0.0.1:56190_solr    ] o.a.s.c.c.ZkStateReader Updated live nodes from ZooKeeper... (0) -> (1)
   [junit4]   2> 2374201 INFO  (jetty-launcher-5003-thread-1) [n:127.0.0.1:56190_solr    ] o.a.s.c.Overseer Overseer (id=null) closing
   [junit4]   2> 2374203 INFO  (jetty-launcher-5003-thread-1) [n:127.0.0.1:56190_solr    ] o.a.s.c.TransientSolrCoreCacheDefault Allocating transient cache for 2147483647 transient cores
   [junit4]   2> 2374203 INFO  (jetty-launcher-5003-thread-1) [n:127.0.0.1:56190_solr    ] o.a.s.c.ZkController Register node as live in ZooKeeper:/live_nodes/127.0.0.1:56190_solr
   [junit4]   2> 2374204 INFO  (zkCallback-5015-thread-1) [    ] o.a.s.c.c.ZkStateReader Updated live nodes from ZooKeeper... (1) -> (2)
   [junit4]   2> 2374206 INFO  (zkCallback-5022-thread-1) [    ] o.a.s.c.c.ZkStateReader Updated live nodes from ZooKeeper... (1) -> (2)
   [junit4]   2> 2374206 INFO  (zkCallback-5029-thread-1) [    ] o.a.s.c.c.ZkStateReader Updated live nodes from ZooKeeper... (1) -> (2)
   [junit4]   2> 2374255 INFO  (zkConnectionManagerCallback-5037-thread-1) [    ] o.a.s.c.c.ConnectionManager zkClient has connected
   [junit4]   2> 2374257 INFO  (jetty-launcher-5003-thread-1) [n:127.0.0.1:56190_solr    ] o.a.s.c.c.ZkStateReader Updated live nodes from ZooKeeper... (0) -> (2)
   [junit4]   2> 2374258 INFO  (jetty-launcher-5003-thread-1) [n:127.0.0.1:56190_solr    ] o.a.s.c.s.i.ZkClientClusterStateProvider Cluster at 127.0.0.1:56182/solr ready
   [junit4]   2> 2374258 INFO  (jetty-launcher-5003-thread-1) [n:127.0.0.1:56190_solr    ] o.a.s.h.a.MetricsHistoryHandler No .system collection, keeping metrics history in memory.
   [junit4]   2> 2374279 INFO  (jetty-launcher-5003-thread-1) [n:127.0.0.1:56190_solr    ] o.a.s.m.r.SolrJmxReporter JMX monitoring for 'solr_56190.solr.node' (registry 'solr.node') enabled at server: com.sun.jmx.mbeanserver.JmxMBeanServer@7e1d4dd3
   [junit4]   2> 2374284 INFO  (jetty-launcher-5003-thread-1) [n:127.0.0.1:56190_solr    ] o.a.s.m.r.SolrJmxReporter JMX monitoring for 'solr_56190.solr.jvm' (registry 'solr.jvm') enabled at server: com.sun.jmx.mbeanserver.JmxMBeanServer@7e1d4dd3
   [junit4]   2> 2374284 INFO  (jetty-launcher-5003-thread-1) [n:127.0.0.1:56190_solr    ] o.a.s.m.r.SolrJmxReporter JMX monitoring for 'solr_56190.solr.jetty' (registry 'solr.jetty') enabled at server: com.sun.jmx.mbeanserver.JmxMBeanServer@7e1d4dd3
   [junit4]   2> 2374285 INFO  (jetty-launcher-5003-thread-1) [n:127.0.0.1:56190_solr    ] o.a.s.c.CorePropertiesLocator Found 0 core definitions underneath C:\Users\jenkins\workspace\Lucene-Solr-7.x-Windows\solr\build\solr-core\test\J0\temp\solr.cloud.LeaderTragicEventTest_CE980F4F4BCAF072-001\tempDir-001\node1\.
   [junit4]   2> 2374311 INFO  (zkConnectionManagerCallback-5040-thread-1) [    ] o.a.s.c.c.ConnectionManager zkClient has connected
   [junit4]   2> 2374313 WARN  (NIOServerCxn.Factory:0.0.0.0/0.0.0.0:0) [    ] o.a.z.s.NIOServerCnxn Unable to read additional data from client sessionid 0x10017628a0d0009, likely client has closed socket
   [junit4]   2> 2374318 INFO  (zkConnectionManagerCallback-5045-thread-1) [    ] o.a.s.c.c.ConnectionManager zkClient has connected
   [junit4]   2> 2374319 INFO  (SUITE-LeaderTragicEventTest-seed#[CE980F4F4BCAF072]-worker) [    ] o.a.s.c.c.ZkStateReader Updated live nodes from ZooKeeper... (0) -> (2)
   [junit4]   2> 2374320 INFO  (SUITE-LeaderTragicEventTest-seed#[CE980F4F4BCAF072]-worker) [    ] o.a.s.c.s.i.ZkClientClusterStateProvider Cluster at 127.0.0.1:56182/solr ready
   [junit4]   2> 2374338 INFO  (qtp1069426861-19761) [n:127.0.0.1:56186_solr    ] o.a.s.h.a.CollectionsHandler Invoked Collection Action :create with params collection.configName=config&name=collection1&nrtReplicas=2&action=CREATE&numShards=1&wt=javabin&version=2 and sendToOCPQueue=true
   [junit4]   2> 2374342 INFO  (OverseerThreadFactory-9383-thread-1) [    ] o.a.s.c.a.c.CreateCollectionCmd Create collection collection1
   [junit4]   2> 2374466 INFO  (OverseerStateUpdate-72083306028269572-127.0.0.1:56186_solr-n_0000000000) [    ] o.a.s.c.o.SliceMutator createReplica() {
   [junit4]   2>   "operation":"ADDREPLICA",
   [junit4]   2>   "collection":"collection1",
   [junit4]   2>   "shard":"shard1",
   [junit4]   2>   "core":"collection1_shard1_replica_n1",
   [junit4]   2>   "state":"down",
   [junit4]   2>   "base_url":"http://127.0.0.1:56190/solr",
   [junit4]   2>   "type":"NRT",
   [junit4]   2>   "waitForFinalState":"false"} 
   [junit4]   2> 2374469 INFO  (OverseerStateUpdate-72083306028269572-127.0.0.1:56186_solr-n_0000000000) [    ] o.a.s.c.o.SliceMutator createReplica() {
   [junit4]   2>   "operation":"ADDREPLICA",
   [junit4]   2>   "collection":"collection1",
   [junit4]   2>   "shard":"shard1",
   [junit4]   2>   "core":"collection1_shard1_replica_n2",
   [junit4]   2>   "state":"down",
   [junit4]   2>   "base_url":"http://127.0.0.1:56186/solr",
   [junit4]   2>   "type":"NRT",
   [junit4]   2>   "waitForFinalState":"false"} 
   [junit4]   2> 2374672 INFO  (qtp1069426861-19757) [n:127.0.0.1:56186_solr    x:collection1_shard1_replica_n2] o.a.s.h.a.CoreAdminOperation core create command qt=/admin/cores&coreNodeName=core_node4&collection.configName=config&newCollection=true&name=collection1_shard1_replica_n2&action=CREATE&numShards=1&collection=collection1&shard=shard1&wt=javabin&version=2&replicaType=NRT
   [junit4]   2> 2374673 INFO  (qtp1069426861-19757) [n:127.0.0.1:56186_solr    x:collection1_shard1_replica_n2] o.a.s.c.TransientSolrCoreCacheDefault Allocating transient cache for 2147483647 transient cores
   [junit4]   2> 2374674 INFO  (qtp1636872710-19767) [n:127.0.0.1:56190_solr    x:collection1_shard1_replica_n1] o.a.s.h.a.CoreAdminOperation core create command qt=/admin/cores&coreNodeName=core_node3&collection.configName=config&newCollection=true&name=collection1_shard1_replica_n1&action=CREATE&numShards=1&collection=collection1&shard=shard1&wt=javabin&version=2&replicaType=NRT
   [junit4]   2> 2375702 INFO  (qtp1069426861-19757) [n:127.0.0.1:56186_solr c:collection1 s:shard1 r:core_node4 x:collection1_shard1_replica_n2] o.a.s.c.SolrConfig Using Lucene MatchVersion: 7.5.0
   [junit4]   2> 2375702 INFO  (qtp1636872710-19767) [n:127.0.0.1:56190_solr c:collection1 s:shard1 r:core_node3 x:collection1_shard1_replica_n1] o.a.s.c.SolrConfig Using Lucene MatchVersion: 7.5.0
   [junit4]   2> 2375709 INFO  (qtp1636872710-19767) [n:127.0.0.1:56190_solr c:collection1 s:shard1 r:core_node3 x:collection1_shard1_replica_n1] o.a.s.s.IndexSchema [collection1_shard1_replica_n1] Schema name=minimal
   [junit4]   2> 2375709 INFO  (qtp1069426861-19757) [n:127.0.0.1:56186_solr c:collection1 s:shard1 r:core_node4 x:collection1_shard1_replica_n2] o.a.s.s.IndexSchema [collection1_shard1_replica_n2] Schema name=minimal
   [junit4]   2> 2375718 INFO  (qtp1636872710-19767) [n:127.0.0.1:56190_solr c:collection1 s:shard1 r:core_node3 x:collection1_shard1_replica_n1] o.a.s.s.IndexSchema Loaded schema minimal/1.1 with uniqueid field id
   [junit4]   2> 2375718 INFO  (qtp1069426861-19757) [n:127.0.0.1:56186_solr c:collection1 s:shard1 r:core_node4 x:collection1_shard1_replica_n2] o.a.s.s.IndexSchema Loaded schema minimal/1.1 with uniqueid field id
   [junit4]   2> 2375718 INFO  (qtp1636872710-19767) [n:127.0.0.1:56190_solr c:collection1 s:shard1 r:core_node3 x:collection1_shard1_replica_n1] o.a.s.c.CoreContainer Creating SolrCore 'collection1_shard1_replica_n1' using configuration from collection collection1, trusted=true
   [junit4]   2> 2375718 INFO  (qtp1069426861-19757) [n:127.0.0.1:56186_solr c:collection1 s:shard1 r:core_node4 x:collection1_shard1_replica_n2] o.a.s.c.CoreContainer Creating SolrCore 'collection1_shard1_replica_n2' using configuration from collection collection1, trusted=true
   [junit4]   2> 2375718 INFO  (qtp1069426861-19757) [n:127.0.0.1:56186_solr c:collection1 s:shard1 r:core_node4 x:collection1_shard1_replica_n2] o.a.s.m.r.SolrJmxReporter JMX monitoring for 'solr_56186.solr.core.collection1.shard1.replica_n2' (registry 'solr.core.collection1.shard1.replica_n2') enabled at server: com.sun.jmx.mbeanserver.JmxMBeanServer@7e1d4dd3
   [junit4]   2> 2375718 INFO  (qtp1636872710-19767) [n:127.0.0.1:56190_solr c:collection1 s:shard1 r:core_node3 x:collection1_shard1_replica_n1] o.a.s.m.r.SolrJmxReporter JMX monitoring for 'solr_56190.solr.core.collection1.shard1.replica_n1' (registry 'solr.core.collection1.shard1.replica_n1') enabled at server: com.sun.jmx.mbeanserver.JmxMBeanServer@7e1d4dd3
   [junit4]   2> 2375718 INFO  (qtp1069426861-19757) [n:127.0.0.1:56186_solr c:collection1 s:shard1 r:core_node4 x:collection1_shard1_replica_n2] o.a.s.c.SolrCore solr.RecoveryStrategy.Builder
   [junit4]   2> 2375718 INFO  (qtp1636872710-19767) [n:127.0.0.1:56190_solr c:collection1 s:shard1 r:core_node3 x:collection1_shard1_replica_n1] o.a.s.c.SolrCore solr.RecoveryStrategy.Builder
   [junit4]   2> 2375718 INFO  (qtp1069426861-19757) [n:127.0.0.1:56186_solr c:collection1 s:shard1 r:core_node4 x:collection1_shard1_replica_n2] o.a.s.c.SolrCore [[collection1_shard1_replica_n2] ] Opening new SolrCore at [C:\Users\jenkins\workspace\Lucene-Solr-7.x-Windows\solr\build\solr-core\test\J0\temp\solr.cloud.LeaderTragicEventTest_CE980F4F4BCAF072-001\tempDir-001\node2\collection1_shard1_replica_n2], dataDir=[C:\Users\jenkins\workspace\Lucene-Solr-7.x-Windows\solr\build\solr-core\test\J0\temp\solr.cloud.LeaderTragicEventTest_CE980F4F4BCAF072-001\tempDir-001\node2\.\collection1_shard1_replica_n2\data\]
   [junit4]   2> 2375718 INFO  (qtp1636872710-19767) [n:127.0.0.1:56190_solr c:collection1 s:shard1 r:core_node3 x:collection1_shard1_replica_n1] o.a.s.c.SolrCore [[collection1_shard1_replica_n1] ] Opening new SolrCore at [C:\Users\jenkins\workspace\Lucene-Solr-7.x-Windows\solr\build\solr-core\test\J0\temp\solr.cloud.LeaderTragicEventTest_CE980F4F4BCAF072-001\tempDir-001\node1\collection1_shard1_replica_n1], dataDir=[C:\Users\jenkins\workspace\Lucene-Solr-7.x-Windows\solr\build\solr-core\test\J0\temp\solr.cloud.LeaderTragicEventTest_CE980F4F4BCAF072-001\tempDir-001\node1\.\collection1_shard1_replica_n1\data\]
   [junit4]   2> 2375844 INFO  (qtp1636872710-19767) [n:127.0.0.1:56190_solr c:collection1 s:shard1 r:core_node3 x:collection1_shard1_replica_n1] o.a.s.u.UpdateHandler Using UpdateLog implementation: org.apache.solr.update.UpdateLog
   [junit4]   2> 2375844 INFO  (qtp1636872710-19767) [n:127.0.0.1:56190_solr c:collection1 s:shard1 r:core_node3 x:collection1_shard1_replica_n1] o.a.s.u.UpdateLog Initializing UpdateLog: dataDir=null defaultSyncLevel=FLUSH numRecordsToKeep=100 maxNumLogsToKeep=10 numVersionBuckets=65536
   [junit4]   2> 2375846 INFO  (qtp1636872710-19767) [n:127.0.0.1:56190_solr c:collection1 s:shard1 r:core_node3 x:collection1_shard1_replica_n1] o.a.s.u.CommitTracker Hard AutoCommit: disabled
   [junit4]   2> 2375846 INFO  (qtp1636872710-19767) [n:127.0.0.1:56190_solr c:collection1 s:shard1 r:core_node3 x:collection1_shard1_replica_n1] o.a.s.u.CommitTracker Soft AutoCommit: disabled
   [junit4]   2> 2375847 INFO  (qtp1069426861-19757) [n:127.0.0.1:56186_solr c:collection1 s:shard1 r:core_node4 x:collection1_shard1_replica_n2] o.a.s.u.UpdateHandler Using UpdateLog implementation: org.apache.solr.update.UpdateLog
   [junit4]   2> 2375847 INFO  (qtp1069426861-19757) [n:127.0.0.1:56186_solr c:collection1 s:shard1 r:core_node4 x:collection1_shard1_replica_n2] o.a.s.u.UpdateLog Initializing UpdateLog: dataDir=null defaultSyncLevel=FLUSH numRecordsToKeep=100 maxNumLogsToKeep=10 numVersionBuckets=65536
   [junit4]   2> 2375848 INFO  (qtp1636872710-19767) [n:127.0.0.1:56190_solr c:collection1 s:shard1 r:core_node3 x:collection1_shard1_replica_n1] o.a.s.s.SolrIndexSearcher Opening [Searcher@2eb0afbe[collection1_shard1_replica_n1] main]
   [junit4]   2> 2375849 INFO  (qtp1069426861-19757) [n:127.0.0.1:56186_solr c:collection1 s:shard1 r:core_node4 x:collection1_shard1_replica_n2] o.a.s.u.CommitTracker Hard AutoCommit: disabled
   [junit4]   2> 2375849 INFO  (qtp1069426861-19757) [n:127.0.0.1:56186_solr c:collection1 s:shard1 r:core_node4 x:collection1_shard1_replica_n2] o.a.s.u.CommitTracker Soft AutoCommit: disabled
   [junit4]   2> 2375849 INFO  (qtp1636872710-19767) [n:127.0.0.1:56190_solr c:collection1 s:shard1 r:core_node3 x:collection1_shard1_replica_n1] o.a.s.r.ManagedResourceStorage Configured ZooKeeperStorageIO with znodeBase: /configs/config
   [junit4]   2> 2375849 INFO  (qtp1636872710-19767) [n:127.0.0.1:56190_solr c:collection1 s:shard1 r:core_node3 x:collection1_shard1_replica_n1] o.a.s.r.ManagedResourceStorage Loaded null at path _rest_managed.json using ZooKeeperStorageIO:path=/configs/config
   [junit4]   2> 2375849 INFO  (qtp1636872710-19767) [n:127.0.0.1:56190_solr c:collection1 s:shard1 r:core_node3 x:collection1_shard1_replica_n1] o.a.s.h.ReplicationHandler Commits will be reserved for 10000ms.
   [junit4]   2> 2375850 INFO  (qtp1636872710-19767) [n:127.0.0.1:56190_solr c:collection1 s:shard1 r:core_node3 x:collection1_shard1_replica_n1] o.a.s.u.UpdateLog Could not find max version in index or recent updates, using new clock 1606050591153324032
   [junit4]   2> 2375850 INFO  (qtp1069426861-19757) [n:127.0.0.1:56186_solr c:collection1 s:shard1 r:core_node4 x:collection1_shard1_replica_n2] o.a.s.s.SolrIndexSearcher Opening [Searcher@4042afb3[collection1_shard1_replica_n2] main]
   [junit4]   2> 2375850 INFO  (searcherExecutor-9395-thread-1-processing-n:127.0.0.1:56190_solr x:collection1_shard1_replica_n1 c:collection1 s:shard1 r:core_node3) [n:127.0.0.1:56190_solr c:collection1 s:shard1 r:core_node3 x:collection1_shard1_replica_n1] o.a.s.c.SolrCore [collection1_shard1_replica_n1] Registered new searcher Searcher@2eb0afbe[collection1_shard1_replica_n1] main{ExitableDirectoryReader(UninvertingDirectoryReader())}
   [junit4]   2> 2375850 INFO  (qtp1069426861-19757) [n:127.0.0.1:56186_solr c:collection1 s:shard1 r:core_node4 x:collection1_shard1_replica_n2] o.a.s.r.ManagedResourceStorage Configured ZooKeeperStorageIO with znodeBase: /configs/config
   [junit4]   2> 2375851 INFO  (qtp1069426861-19757) [n:127.0.0.1:56186_solr c:collection1 s:shard1 r:core_node4 x:collection1_shard1_replica_n2] o.a.s.r.ManagedResourceStorage Loaded null at path _rest_managed.json using ZooKeeperStorageIO:path=/configs/config
   [junit4]   2> 2375851 INFO  (qtp1069426861-19757) [n:127.0.0.1:56186_solr c:collection1 s:shard1 r:core_node4 x:collection1_shard1_replica_n2] o.a.s.h.ReplicationHandler Commits will be reserved for 10000ms.
   [junit4]   2> 2375851 INFO  (qtp1069426861-19757) [n:127.0.0.1:56186_solr c:collection1 s:shard1 r:core_node4 x:collection1_shard1_replica_n2] o.a.s.u.UpdateLog Could not find max version in index or recent updates, using new clock 1606050591154372608
   [junit4]   2> 2375851 INFO  (searcherExecutor-9396-thread-1-processing-n:127.0.0.1:56186_solr x:collection1_shard1_replica_n2 c:collection1 s:shard1 r:core_node4) [n:127.0.0.1:56186_solr c:collection1 s:shard1 r:core_node4 x:collection1_shard1_replica_n2] o.a.s.c.SolrCore [collection1_shard1_replica_n2] Registered new searcher Searcher@4042afb3[collection1_shard1_replica_n2] main{ExitableDirectoryReader(UninvertingDirectoryReader())}
   [junit4]   2> 2375854 INFO  (qtp1636872710-19767) [n:127.0.0.1:56190_solr c:collection1 s:shard1 r:core_node3 x:collection1_shard1_replica_n1] o.a.s.c.ZkShardTerms Successful update of terms at /collections/collection1/terms/shard1 to Terms{values={core_node3=0}, version=0}
   [junit4]   2> 2375855 INFO  (qtp1069426861-19757) [n:127.0.0.1:56186_solr c:collection1 s:shard1 r:core_node4 x:collection1_shard1_replica_n2] o.a.s.c.ZkShardTerms Failed to save terms, version is not a match, retrying
   [junit4]   2> 2375855 INFO  (qtp1069426861-19757) [n:127.0.0.1:56186_solr c:collection1 s:shard1 r:core_node4 x:collection1_shard1_replica_n2] o.a.s.c.ZkShardTerms Successful update of terms at /collections/collection1/terms/shard1 to Terms{values={core_node3=0, core_node4=0}, version=1}
   [junit4]   2> 2375858 INFO  (qtp1636872710-19767) [n:127.0.0.1:56190_solr c:collection1 s:shard1 r:core_node3 x:collection1_shard1_replica_n1] o.a.s.c.ShardLeaderElectionContext Enough replicas found to continue.
   [junit4]   2> 2375858 INFO  (qtp1636872710-19767) [n:127.0.0.1:56190_solr c:collection1 s:shard1 r:core_node3 x:collection1_shard1_replica_n1] o.a.s.c.ShardLeaderElectionContext I may be the new leader - try and sync
   [junit4]   2> 2375858 INFO  (qtp1636872710-19767) [n:127.0.0.1:56190_solr c:collection1 s:shard1 r:core_node3 x:collection1_shard1_replica_n1] o.a.s.c.SyncStrategy Sync replicas to http://127.0.0.1:56190/solr/collection1_shard1_replica_n1/
   [junit4]   2> 2375858 INFO  (qtp1636872710-19767) [n:127.0.0.1:56190_solr c:collection1 s:shard1 r:core_node3 x:collection1_shard1_replica_n1] o.a.s.u.PeerSync PeerSync: core=collection1_shard1_replica_n1 url=http://127.0.0.1:56190/solr START replicas=[http://127.0.0.1:56186/solr/collection1_shard1_replica_n2/] nUpdates=100
   [junit4]   2> 2375858 INFO  (qtp1636872710-19767) [n:127.0.0.1:56190_solr c:collection1 s:shard1 r:core_node3 x:collection1_shard1_replica_n1] o.a.s.u.PeerSync PeerSync: core=collection1_shard1_replica_n1 url=http://127.0.0.1:56190/solr DONE.  We have no versions.  sync failed.
   [junit4]   2> 2375860 INFO  (qtp1069426861-19760) [n:127.0.0.1:56186_solr c:collection1 s:shard1 r:core_node4 x:collection1_shard1_replica_n2] o.a.s.c.S.Request [collection1_shard1_replica_n2]  webapp=/solr path=/get params={distrib=false&qt=/get&fingerprint=false&getVersions=100&wt=javabin&version=2} status=0 QTime=0
   [junit4]   2> 2375860 INFO  (qtp1636872710-19767) [n:127.0.0.1:56190_solr c:collection1 s:shard1 r:core_node3 x:collection1_shard1_replica_n1] o.a.s.c.SyncStrategy Leader's attempt to sync with shard failed, moving to the next candidate
   [junit4]   2> 2375860 INFO  (qtp1636872710-19767) [n:127.0.0.1:56190_solr c:collection1 s:shard1 r:core_node3 x:collection1_shard1_replica_n1] o.a.s.c.ShardLeaderElectionContext We failed sync, but we have no versions - we can't sync in that case - we were active before, so become leader anyway
   [junit4]   2> 2375860 INFO  (qtp1636872710-19767) [n:127.0.0.1:56190_solr c:collection1 s:shard1 r:core_node3 x:collection1_shard1_replica_n1] o.a.s.c.ShardLeaderElectionContext Found all replicas participating in election, clear LIR
   [junit4]   2> 2375864 INFO  (qtp1636872710-19767) [n:127.0.0.1:56190_solr c:collection1 s:shard1 r:core_node3 x:collection1_shard1_replica_n1] o.a.s.c.ShardLeaderElectionContext I am the new leader: http://127.0.0.1:56190/solr/collection1_shard1_replica_n1/ shard1
   [junit4]   2> 2376016 INFO  (qtp1636872710-19767) [n:127.0.0.1:56190_solr c:collection1 s:shard1 r:core_node3 x:collection1_shard1_replica_n1] o.a.s.c.ZkController I am the leader, no recovery necessary
   [junit4]   2> 2376022 INFO  (qtp1636872710-19767) [n:127.0.0.1:56190_solr c:collection1 s:shard1 r:core_node3 x:collection1_shard1_replica_n1] o.a.s.s.HttpSolrCall [admin] webapp=null path=/admin/cores params={qt=/admin/cores&coreNodeName=core_node3&collection.configName=config&newCollection=true&name=collection1_shard1_replica_n1&action=CREATE&numShards=1&collection=collection1&shard=shard1&wt=javabin&version=2&replicaType=NRT} status=0 QTime=1347
   [junit4]   2> 2376122 INFO  (zkCallback-5029-thread-1) [    ] o.a.s.c.c.ZkStateReader A cluster state change: [WatchedEvent state:SyncConnected type:NodeDataChanged path:/collections/collection1/state.json] for collection [collection1] has occurred - updating... (live nodes size: [2])
   [junit4]   2> 2376861 INFO  (qtp1069426861-19757) [n:127.0.0.1:56186_solr c:collection1 s:shard1 r:core_node4 x:collection1_shard1_replica_n2] o.a.s.s.HttpSolrCall [admin] webapp=null path=/admin/cores params={qt=/admin/cores&coreNodeName=core_node4&collection.configName=config&newCollection=true&name=collection1_shard1_replica_n2&action=CREATE&numShards=1&collection=collection1&shard=shard1&wt=javabin&version=2&replicaType=NRT} status=0 QTime=2189
   [junit4]   2> 2376863 INFO  (qtp1069426861-19761) [n:127.0.0.1:56186_solr    ] o.a.s.h.a.CollectionsHandler Wait for new collection to be active for at most 30 seconds. Check all shard replicas
   [junit4]   2> 2376960 INFO  (zkCallback-5015-thread-1) [    ] o.a.s.c.c.ZkStateReader A cluster state change: [WatchedEvent state:SyncConnected type:NodeDataChanged path:/collections/collection1/state.json] for collection [collection1] has occurred - updating... (live nodes size: [2])
   [junit4]   2> 2376960 INFO  (zkCallback-5029-thread-1) [    ] o.a.s.c.c.ZkStateReader A cluster state change: [WatchedEvent state:SyncConnected type:NodeDataChanged path:/collections/collection1/state.json] for collection [collection1] has occurred - updating... (live nodes size: [2])
   [junit4]   2> 2377863 INFO  (qtp1069426861-19761) [n:127.0.0.1:56186_solr    ] o.a.s.s.HttpSolrCall [admin] webapp=null path=/admin/collections params={collection.configName=config&name=collection1&nrtReplicas=2&action=CREATE&numShards=1&wt=javabin&version=2} status=0 QTime=3524
   [junit4]   2> 2377869 INFO  (TEST-LeaderTragicEventTest.testOtherReplicasAreNotActive-seed#[CE980F4F4BCAF072]) [    ] o.e.j.s.AbstractConnector Stopped ServerConnector@2785a97c{HTTP/1.1,[http/1.1]}{127.0.0.1:0}
   [junit4]   2> 2377870 INFO  (TEST-LeaderTragicEventTest.testOtherReplicasAreNotActive-seed#[CE980F4F4BCAF072]) [    ] o.a.s.c.CoreContainer Shutting down CoreContainer instance=1612171147
   [junit4]   2> 2377870 INFO  (TEST-LeaderTragicEventTest.testOtherReplicasAreNotActive-seed#[CE980F4F4BCAF072]) [    ] o.a.s.m.SolrMetricManager Closing metric reporters for registry=solr.node, tag=null
   [junit4]   2> 2377870 INFO  (TEST-LeaderTragicEventTest.testOtherReplicasAreNotActive-seed#[CE980F4F4BCAF072]) [    ] o.a.s.m.r.SolrJmxReporter Closing reporter [org.apache.solr.metrics.reporters.SolrJmxReporter@3518dd3: rootName = solr_56186, domain = solr.node, service url = null, agent id = null] for registry solr.node / com.codahale.metrics.MetricRegistry@5aff40ac
   [junit4]   2> 2377875 INFO  (TEST-LeaderTragicEventTest.testOtherReplicasAreNotActive-seed#[CE980F4F4BCAF072]) [    ] o.a.s.m.SolrMetricManager Closing metric reporters for registry=solr.jvm, tag=null
   [junit4]   2> 2377875 INFO  (TEST-LeaderTragicEventTest.testOtherReplicasAreNotActive-seed#[CE980F4F4BCAF072]) [    ] o.a.s.m.r.SolrJmxReporter Closing reporter [org.apache.solr.metrics.reporters.SolrJmxReporter@5d2cacc6: rootName = solr_56186, domain = solr.jvm, service url = null, agent id = null] for registry solr.jvm / com.codahale.metrics.MetricRegistry@249b32db
   [junit4]   2> 2377877 INFO  (TEST-LeaderTragicEventTest.testOtherReplicasAreNotActive-seed#[CE980F4F4BCAF072]) [    ] o.a.s.m.SolrMetricManager Closing metric reporters for registry=solr.jetty, tag=null
   [junit4]   2> 2377877 INFO  (TEST-LeaderTragicEventTest.testOtherReplicasAreNotActive-seed#[CE980F4F4BCAF072]) [    ] o.a.s.m.r.SolrJmxReporter Closing reporter [org.apache.solr.metrics.reporters.SolrJmxReporter@4d58803: rootName = solr_56186, domain = solr.jetty, service url = null, agent id = null] for registry solr.jetty / com.codahale.metrics.MetricRegistry@30343716
   [junit4]   2> 2377879 INFO  (TEST-LeaderTragicEventTest.testOtherReplicasAreNotActive-seed#[CE980F4F4BCAF072]) [    ] o.a.s.c.ZkController Remove node as live in ZooKeeper:/live_nodes/127.0.0.1:56186_solr
   [junit4]   2> 2377880 INFO  (TEST-LeaderTragicEventTest.testOtherReplicasAreNotActive-seed#[CE980F4F4BCAF072]) [    ] o.a.s.m.SolrMetricManager Closing metric reporters for registry=solr.cluster, tag=null
   [junit4]   2> 2377882 INFO  (zkCallback-5029-thread-1) [    ] o.a.s.c.c.ZkStateReader Updated live nodes from ZooKeeper... (2) -> (1)
   [junit4]   2> 2377882 INFO  (zkCallback-5015-thread-2) [    ] o.a.s.c.c.ZkStateReader Updated live nodes from ZooKeeper... (2) -> (1)
   [junit4]   2> 2377882 INFO  (zkCallback-5022-thread-1) [    ] o.a.s.c.c.ZkStateReader Updated live nodes from ZooKeeper... (2) -> (1)
   [junit4]   2> 2377882 INFO  (zkCallback-5044-thread-1) [    ] o.a.s.c.c.ZkStateReader Updated live nodes from ZooKeeper... (2) -> (1)
   [junit4]   2> 2377882 INFO  (zkCallback-5036-thread-1) [    ] o.a.s.c.c.ZkStateReader Updated live nodes from ZooKeeper... (2) -> (1)
   [junit4]   2> 2377882 INFO  (coreCloseExecutor-9405-thread-1) [n:127.0.0.1:56186_solr c:collection1 s:shard1 r:core_node4 x:collection1_shard1_replica_n2] o.a.s.c.SolrCore [collection1_shard1_replica_n2]  CLOSING SolrCore org.apache.solr.core.SolrCore@27757f31
   [junit4]   2> 2377883 INFO  (coreCloseExecutor-9405-thread-1) [n:127.0.0.1:56186_solr c:collection1 s:shard1 r:core_node4 x:collection1_shard1_replica_n2] o.a.s.m.SolrMetricManager Closing metric reporters for registry=solr.core.collection1.shard1.replica_n2, tag=27757f31
   [junit4]   2> 2377883 INFO  (coreCloseExecutor-9405-thread-1) [n:127.0.0.1:56186_solr c:collection1 s:shard1 r:core_node4 x:collection1_shard1_replica_n2] o.a.s.m.r.SolrJmxReporter Closing reporter [org.apache.solr.metrics.reporters.SolrJmxReporter@7d36d50f: rootName = solr_56186, domain = solr.core.collection1.shard1.replica_n2, service url = null, agent id = null] for registry solr.core.collection1.shard1.replica_n2 / com.codahale.metrics.MetricRegistry@7a9fa676
   [junit4]   2> 2377888 INFO  (coreCloseExecutor-9405-thread-1) [n:127.0.0.1:56186_solr c:collection1 s:shard1 r:core_node4 x:collection1_shard1_replica_n2] o.a.s.m.SolrMetricManager Closing metric reporters for registry=solr.collection.collection1.shard1.leader, tag=27757f31
   [junit4]   2> 2377890 INFO  (TEST-LeaderTragicEventTest.testOtherReplicasAreNotActive-seed#[CE980F4F4BCAF072]) [    ] o.a.s.c.Overseer Overseer (id=72083306028269572-127.0.0.1:56186_solr-n_0000000000) closing
   [junit4]   2> 2377891 INFO  (OverseerStateUpdate-72083306028269572-127.0.0.1:56186_solr-n_0000000000) [    ] o.a.s.c.Overseer Overseer Loop exiting : 127.0.0.1:56186_solr
   [junit4]   2> 2377891 WARN  (OverseerAutoScalingTriggerThread-72083306028269572-127.0.0.1:56186_solr-n_0000000000) [    ] o.a.s.c.a.OverseerTriggerThread OverseerTriggerThread woken up but we are closed, exiting.
   [junit4]   2> 2377893 WARN  (NIOServerCxn.Factory:0.0.0.0/0.0.0.0:0) [    ] o.a.z.s.NIOServerCnxn Unable to read additional data from client sessionid 0x10017628a0d0004, likely client has closed socket
   [junit4]   2> 2377894 INFO  (TEST-LeaderTragicEventTest.testOtherReplicasAreNotActive-seed#[CE980F4F4BCAF072]) [    ] o.e.j.s.h.ContextHandler Stopped o.e.j.s.ServletContextHandler@6a4ac36d{/solr,null,UNAVAILABLE}
   [junit4]   2> 2377894 INFO  (zkCallback-5029-thread-1) [    ] o.a.s.c.OverseerElectionContext I am going to be the leader 127.0.0.1:56190_solr
   [junit4]   2> 2377894 INFO  (TEST-LeaderTragicEventTest.testOtherReplicasAreNotActive-seed#[CE980F4F4BCAF072]) [    ] o.e.j.s.session node0 Stopped scavenging
   [junit4]   2> 2377895 INFO  (zkCallback-5029-thread-1) [    ] o.a.s.c.Overseer Overseer (id=72083306028269575-127.0.0.1:56190_solr-n_0000000001) starting
   [junit4]   2> 2377902 INFO  (zkCallback-5029-thread-1) [    ] o.a.s.c.c.ZkStateReader A cluster state change: [WatchedEvent state:SyncConnected type:NodeDataChanged path:/collections/collection1/state.json] for collection [collection1] has occurred - updating... (live nodes size: [1])
   [junit4]   2> 2377902 INFO  (zkCallback-5044-thread-1) [    ] o.a.s.c.c.ZkStateReader A cluster state change: [WatchedEvent state:SyncConnected type:NodeDataChanged path:/collections/collection1/state.json] for collection [collection1] has occurred - updating... (live nodes size: [1])
   [junit4]   2> NOTE: reproduce with: ant test  -Dtestcase=LeaderTragicEventTest -Dtests.method=testOtherReplicasAreNotActive -Dtests.seed=CE980F4F4BCAF072 -Dtests.slow=true -Dtests.locale=es-DO -Dtests.timezone=Africa/Monrovia -Dtests.asserts=true -Dtests.file.encoding=ISO-8859-1
   [junit4] ERROR   3.58s J0 | LeaderTragicEventTest.testOtherReplicasAreNotActive <<<
   [junit4]    > Throwable #1: java.lang.IllegalStateException: Jetty Connector is not open: -2
   [junit4]    > 	at __randomizedtesting.SeedInfo.seed([CE980F4F4BCAF072:4B2C2338773549EA]:0)
   [junit4]    > 	at org.apache.solr.client.solrj.embedded.JettySolrRunner.getBaseUrl(JettySolrRunner.java:499)
   [junit4]    > 	at org.apache.solr.cloud.MiniSolrCloudCluster.getReplicaJetty(MiniSolrCloudCluster.java:539)
   [junit4]    > 	at org.apache.solr.cloud.LeaderTragicEventTest.corruptLeader(LeaderTragicEventTest.java:100)
   [junit4]    > 	at org.apache.solr.cloud.LeaderTragicEventTest.testOtherReplicasAreNotActive(LeaderTragicEventTest.java:150)
   [junit4]    > 	at java.lang.Thread.run(Thread.java:748)
   [junit4]   2> 2377922 INFO  (qtp1636872710-19756) [n:127.0.0.1:56190_solr    ] o.a.s.h.a.CollectionsHandler Invoked Collection Action :create with params collection.configName=config&name=collection1&nrtReplicas=2&action=CREATE&numShards=1&wt=javabin&version=2 and sendToOCPQueue=true
   [junit4]   2> 2377925 INFO  (OverseerThreadFactory-9410-thread-1) [    ] o.a.s.c.a.c.CreateCollectionCmd Create collection collection1
   [junit4]   2> 2377925 ERROR (OverseerThreadFactory-9410-thread-1) [    ] o.a.s.c.a.c.OverseerCollectionMessageHandler Collection: collection1 operation: create failed:org.apache.solr.common.SolrException: collection already exists: collection1
   [junit4]   2> 	at org.apache.solr.cloud.api.collections.CreateCollectionCmd.call(CreateCollectionCmd.java:106)
   [junit4]   2> 	at org.apache.solr.cloud.api.collections.OverseerCollectionMessageHandler.processMessage(OverseerCollectionMessageHandler.java:255)
   [junit4]   2> 	at org.apache.solr.cloud.OverseerTaskProcessor$Runner.run(OverseerTaskProcessor.java:469)
   [junit4]   2> 	at org.apache.solr.common.util.ExecutorUtil$MDCAwareThreadPoolExecutor.lambda$execute$0(ExecutorUtil.java:209)
   [junit4]   2> 	at java.util.concurrent.ThreadPoolExecutor.runWorker(ThreadPoolExecutor.java:1149)
   [junit4]   2> 	at java.util.concurrent.ThreadPoolExecutor$Worker.run(ThreadPoolExecutor.java:624)
   [junit4]   2> 	at java.lang.Thread.run(Thread.java:748)
   [junit4]   2> 
   [junit4]   2> 2377928 INFO  (qtp1636872710-19756) [n:127.0.0.1:56190_solr    ] o.a.s.s.HttpSolrCall [admin] webapp=null path=/admin/collections params={collection.configName=config&name=collection1&nrtReplicas=2&action=CREATE&numShards=1&wt=javabin&version=2} status=400 QTime=5
   [junit4]   2> NOTE: reproduce with: ant test  -Dtestcase=LeaderTragicEventTest -Dtests.method=test -Dtests.seed=CE980F4F4BCAF072 -Dtests.slow=true -Dtests.locale=es-DO -Dtests.timezone=Africa/Monrovia -Dtests.asserts=true -Dtests.file.encoding=ISO-8859-1
   [junit4] ERROR   0.02s J0 | LeaderTragicEventTest.test <<<
   [junit4]    > Throwable #1: org.apache.solr.client.solrj.impl.HttpSolrClient$RemoteSolrException: Error from server at http://127.0.0.1:56190/solr: collection already exists: collection1
   [junit4]    > 	at __randomizedtesting.SeedInfo.seed([CE980F4F4BCAF072:46CC3095E5369D8A]:0)
   [junit4]    > 	at org.apache.solr.client.solrj.impl.HttpSolrClient.executeMethod(HttpSolrClient.java:643)
   [junit4]    > 	at org.apache.solr.client.solrj.impl.HttpSolrClient.request(HttpSolrClient.java:255)
   [junit4]    > 	at org.apache.solr.client.solrj.impl.HttpSolrClient.request(HttpSolrClient.java:244)
   [junit4]    > 	at org.apache.solr.client.solrj.impl.LBHttpSolrClient.doRequest(LBHttpSolrClient.java:483)
   [junit4]    > 	at org.apache.solr.client.solrj.impl.LBHttpSolrClient.request(LBHttpSolrClient.java:413)
   [junit4]    > 	at org.apache.solr.client.solrj.impl.CloudSolrClient.sendRequest(CloudSolrClient.java:1106)
   [junit4]    > 	at org.apache.solr.client.solrj.impl.CloudSolrClient.requestWithRetryOnStaleState(CloudSolrClient.java:886)
   [junit4]    > 	at org.apache.solr.client.solrj.impl.CloudSolrClient.request(CloudSolrClient.java:819)
   [junit4]    > 	at org.apache.solr.client.solrj.SolrRequest.process(SolrRequest.java:194)
   [junit4]    > 	at org.apache.solr.client.solrj.SolrRequest.process(SolrRequest.java:211)
   [junit4]    > 	at org.apache.solr.cloud.LeaderTragicEventTest.test(LeaderTragicEventTest.java:70)
   [junit4]    > 	at java.lang.Thread.run(Thread.java:748)
   [junit4]   2> 2377931 INFO  (jetty-closer-5004-thread-2) [    ] o.e.j.s.AbstractConnector Stopped ServerConnector@7c2b902b{HTTP/1.1,[http/1.1]}{127.0.0.1:0}
   [junit4]   2> 2377931 INFO  (jetty-closer-5004-thread-2) [    ] o.a.s.c.CoreContainer Shutting down CoreContainer instance=240370786
   [junit4]   2> 2377932 INFO  (jetty-closer-5004-thread-2) [    ] o.a.s.m.SolrMetricManager Closing metric reporters for registry=solr.node, tag=null
   [junit4]   2> 2377932 INFO  (jetty-closer-5004-thread-2) [    ] o.a.s.m.r.SolrJmxReporter Closing reporter [org.apache.solr.metrics.reporters.SolrJmxReporter@798821ba: rootName = solr_56190, domain = solr.node, service url = null, agent id = null] for registry solr.node / com.codahale.metrics.MetricRegistry@35115773
   [junit4]   2> 2377935 INFO  (jetty-closer-5004-thread-2) [    ] o.a.s.m.SolrMetricManager Closing metric reporters for registry=solr.jvm, tag=null
   [junit4]   2> 2377935 INFO  (jetty-closer-5004-thread-2) [    ] o.a.s.m.r.SolrJmxReporter Closing reporter [org.apache.solr.metrics.reporters.SolrJmxReporter@7bb6334e: rootName = solr_56190, domain = solr.jvm, service url = null, agent id = null] for registry solr.jvm / com.codahale.metrics.MetricRegistry@249b32db
   [junit4]   2> 2377936 INFO  (jetty-closer-5004-thread-2) [    ] o.a.s.m.SolrMetricManager Closing metric reporters for registry=solr.jetty, tag=null
   [junit4]   2> 2377936 INFO  (jetty-closer-5004-thread-2) [    ] o.a.s.m.r.SolrJmxReporter Closing reporter [org.apache.solr.metrics.reporters.SolrJmxReporter@6fd5cdd2: rootName = solr_56190, domain = solr.jetty, service url = null, agent id = null] for registry solr.jetty / com.codahale.metrics.MetricRegistry@30343716
   [junit4]   2> 2377938 INFO  (jetty-closer-5004-thread-2) [    ] o.a.s.c.ZkController Remove node as live in ZooKeeper:/live_nodes/127.0.0.1:56190_solr
   [junit4]   2> 2377939 INFO  (jetty-closer-5004-thread-2) [    ] o.a.s.m.SolrMetricManager Closing metric reporters for registry=solr.cluster, tag=null
   [junit4]   2> 2377939 INFO  (zkCallback-5029-thread-2) [    ] o.a.s.c.c.ZkStateReader Updated live nodes from ZooKeeper... (1) -> (0)
   [junit4]   2> 2377939 INFO  (zkCallback-5036-thread-1) [    ] o.a.s.c.c.ZkStateReader Updated live nodes from ZooKeeper... (1) -> (0)
   [junit4]   2> 2377940 INFO  (coreCloseExecutor-9411-thread-1) [n:127.0.0.1:56190_solr c:collection1 s:shard1 r:core_node3 x:collection1_shard1_replica_n1] o.a.s.c.SolrCore [collection1_shard1_replica_n1]  CLOSING SolrCore org.apache.solr.core.SolrCore@32610a7c
   [junit4]   2> 2377940 INFO  (coreCloseExecutor-9411-thread-1) [n:127.0.0.1:56190_solr c:collection1 s:shard1 r:core_node3 x:collection1_shard1_replica_n1] o.a.s.m.SolrMetricManager Closing metric reporters for registry=solr.core.collection1.shard1.replica_n1, tag=32610a7c
   [junit4]   2> 2377940 INFO  (coreCloseExecutor-9411-thread-1) [n:127.0.0.1:56190_solr c:collection1 s:shard1 r:core_node3 x:collection1_shard1_replica_n1] o.a.s.m.r.SolrJmxReporter Closing reporter [org.apache.solr.metrics.reporters.SolrJmxReporter@68c630bd: rootName = solr_56190, domain = solr.core.collection1.shard1.replica_n1, service url = null, agent id = null] for registry solr.core.collection1.shard1.replica_n1 / com.codahale.metrics.MetricRegistry@8ebb691
   [junit4]   2> 2377946 INFO  (coreCloseExecutor-9411-thread-1) [n:127.0.0.1:56190_solr c:collection1 s:shard1 r:core_node3 x:collection1_shard1_replica_n1] o.a.s.m.SolrMetricManager Closing metric reporters for registry=solr.collection.collection1.shard1.leader, tag=32610a7c
   [junit4]   2> 2377948 INFO  (jetty-closer-5004-thread-2) [    ] o.a.s.c.Overseer Overseer (id=72083306028269575-127.0.0.1:56190_solr-n_0000000001) closing
   [junit4]   2> 2377949 INFO  (OverseerStateUpdate-72083306028269575-127.0.0.1:56190_solr-n_0000000001) [    ] o.a.s.c.Overseer Overseer Loop exiting : 127.0.0.1:56190_solr
   [junit4]   2> 2377949 WARN  (OverseerAutoScalingTriggerThread-72083306028269575-127.0.0.1:56190_solr-n_0000000001) [    ] o.a.s.c.a.OverseerTriggerThread OverseerTriggerThread woken up but we are closed, exiting.
   [junit4]   2> 2377950 INFO  (jetty-closer-5004-thread-2) [    ] o.e.j.s.h.ContextHandler Stopped o.e.j.s.ServletContextHandler@22374a39{/solr,null,UNAVAILABLE}
   [junit4]   2> 2377951 INFO  (jetty-closer-5004-thread-2) [    ] o.e.j.s.session node0 Stopped scavenging
   [junit4]   2> 2377951 ERROR (SUITE-LeaderTragicEventTest-seed#[CE980F4F4BCAF072]-worker) [    ] o.a.z.s.ZooKeeperServer ZKShutdownHandler is not registered, so ZooKeeper server won't take any action on ERROR or SHUTDOWN server state changes
   [junit4]   2> 2377951 INFO  (SUITE-LeaderTragicEventTest-seed#[CE980F4F4BCAF072]-worker) [    ] o.a.s.c.ZkTestServer connecting to 127.0.0.1:56182 56182
   [junit4]   2> 2377951 INFO  (Thread-3740) [    ] o.a.s.c.ZkTestServer connecting to 127.0.0.1:56182 56182
   [junit4]   2> 2377951 WARN  (Thread-3740) [    ] o.a.s.c.ZkTestServer Watch limit violations: 
   [junit4]   2> Maximum concurrent create/delete watches above limit:
   [junit4]   2> 
   [junit4]   2> 	6	/solr/collections/collection1/terms/shard1
   [junit4]   2> 	5	/solr/aliases.json
   [junit4]   2> 	5	/solr/clusterprops.json
   [junit4]   2> 	2	/solr/security.json
   [junit4]   2> 	2	/solr/configs/config
   [junit4]   2> 
   [junit4]   2> Maximum concurrent data watches above limit:
   [junit4]   2> 
   [junit4]   2> 	5	/solr/clusterstate.json
   [junit4]   2> 	3	/solr/collections/collection1/state.json
   [junit4]   2> 	2	/solr/autoscaling.json
   [junit4]   2> 
   [junit4]   2> Maximum concurrent children watches above limit:
   [junit4]   2> 
   [junit4]   2> 	5	/solr/live_nodes
   [junit4]   2> 	5	/solr/collections
   [junit4]   2> 	2	/solr/overseer/queue
   [junit4]   2> 	2	/solr/autoscaling/events/.scheduled_maintenance
   [junit4]   2> 	2	/solr/autoscaling/events/.auto_add_replicas
   [junit4]   2> 	2	/solr/overseer/collection-queue-work
   [junit4]   2> 	2	/solr/overseer/queue-work
   [junit4]   2> 
   [junit4]   2> NOTE: leaving temporary files on disk at: C:\Users\jenkins\workspace\Lucene-Solr-7.x-Windows\solr\build\solr-core\test\J0\temp\solr.cloud.LeaderTragicEventTest_CE980F4F4BCAF072-001
   [junit4]   2> Jul 15, 2018 10:06:41 AM com.carrotsearch.randomizedtesting.ThreadLeakControl checkThreadLeaks
   [junit4]   2> WARNING: Will linger awaiting termination of 6 leaked thread(s).
   [junit4]   2> NOTE: test params are: codec=Asserting(Lucene70): {}, docValues:{}, maxPointsInLeafNode=783, maxMBSortInHeap=5.869925796724529, sim=RandomSimilarity(queryNorm=true): {}, locale=es-DO, timezone=Africa/Monrovia
   [junit4]   2> NOTE: Windows 10 10.0 amd64/Oracle Corporation 1.8.0_172 (64-bit)/cpus=3,threads=1,free=76988096,total=424185856
   [junit4]   2> NOTE: All tests run in this JVM: [VMParamsZkACLAndCredentialsProvidersTest, TestImpersonationWithHadoopAuth, TestDeleteCollectionOnDownNodes, TestSearcherReuse, HdfsAutoAddReplicasIntegrationTest, DeleteReplicaTest, TransactionLogTest, CollectionStateFormat2Test, DistributedQueueTest, DistanceFunctionTest, ClassificationUpdateProcessorIntegrationTest, HdfsCollectionsAPIDistributedZkTest, EchoParamsTest, TestSchemaSimilarityResource, TestCrossCoreJoin, TestSchemalessBufferedUpdates, TestSolrFieldCacheBean, TestReqParamsAPI, RAMDirectoryFactoryTest, HttpPartitionTest, OverseerTaskQueueTest, SpellCheckComponentTest, CollectionReloadTest, TestHdfsUpdateLog, DirectSolrConnectionTest, TestDocBasedVersionConstraints, DistributedFacetExistsSmallTest, TestJoin, TestManagedResourceStorage, QueryParsingTest, RestoreTriggerStateTest, UniqFieldsUpdateProcessorFactoryTest, IgnoreCommitOptimizeUpdateProcessorFactoryTest, URLClassifyProcessorTest, JavabinLoaderTest, TestGeoJSONResponseWriter, UtilsToolTest, SaslZkACLProviderTest, SimpleCollectionCreateDeleteTest, AddBlockUpdateTest, DocValuesMultiTest, TestManagedSchemaThreadSafety, TermsComponentTest, MergeStrategyTest, SuggesterWFSTTest, TestTolerantUpdateProcessorRandomCloud, DisMaxRequestHandlerTest, TestSolr4Spatial2, ProtectedTermFilterFactoryTest, TestJsonFacetRefinement, LeaderElectionIntegrationTest, ReplicationFactorTest, NodeAddedTriggerTest, DistributedDebugComponentTest, TestStressInPlaceUpdates, TestStressRecovery, TestLeaderElectionWithEmptyReplica, DateMathParserTest, JSONWriterTest, CreateRoutedAliasTest, SolrCloudExampleTest, SynonymTokenizerTest, NotRequiredUniqueKeyTest, TestCoreAdminApis, AliasIntegrationTest, TestSolrCloudWithSecureImpersonation, TestNodeLostTrigger, TestCollectionAPIs, ParsingFieldUpdateProcessorsTest, TermVectorComponentDistributedTest, TestManagedStopFilterFactory, TestFieldCollectionResource, TestNumericRangeQuery32, NoCacheHeaderTest, TestCloudSearcherWarming, TestJavabinTupleStreamParser, TestFieldCacheSort, ConcurrentCreateRoutedAliasTest, DocValuesNotIndexedTest, TaggerTest, TestConfigOverlay, MigrateRouteKeyTest, SimpleMLTQParserTest, LoggingHandlerTest, TestMissingGroups, MaxSizeAutoCommitTest, TestLegacyFieldCache, TestSha256AuthenticationProvider, TestReplicationHandler, PrimitiveFieldTypeTest, SystemLogListenerTest, OutputWriterTest, TestSolrQueryParser, TestRecoveryHdfs, HLLUtilTest, CustomHighlightComponentTest, TestSimDistributedQueue, TestObjectReleaseTracker, TestPayloadCheckQParserPlugin, HighlighterTest, TestCloudInspectUtil, TestCollationFieldDocValues, ShowFileRequestHandlerTest, TestLuceneMatchVersion, TestNoOpRegenerator, SliceStateTest, ReplicaListTransformerTest, ReplaceNodeNoTargetTest, ZkControllerTest, TestReloadDeadlock, OrderedExecutorTest, DeleteLastCustomShardedReplicaTest, TestSizeLimitedDistributedMap, LIRRollingUpdatesTest, TestSolrIndexConfig, TestSolrQueryResponse, TestInPlaceUpdatesStandalone, SolrSlf4jReporterTest, UninvertDocValuesMergePolicyTest, SearchRateTriggerIntegrationTest, SubstringBytesRefFilterTest, InfixSuggestersTest, TestReloadAndDeleteDocs, TestComputePlanAction, TestTrie, AddSchemaFieldsUpdateProcessorFactoryTest, AtomicUpdatesTest, XsltUpdateRequestHandlerTest, TestLeaderInitiatedRecoveryThread, DistributedMLTComponentTest, TestPivotHelperCode, TestFieldCacheVsDocValues, TestFaceting, TestRequestStatusCollectionAPI, BasicDistributedZkTest, TestExactStatsCache, CheckHdfsIndexTest, DirectUpdateHandlerTest, TriLevelCompositeIdRoutingTest, FieldAnalysisRequestHandlerTest, DistributedTermsComponentTest, TestSolrDeletionPolicy1, TestLFUCache, PluginInfoTest, RandomizedTaggerTest, TestAnalyzedSuggestions, RequestLoggingTest, CursorMarkTest, ConnectionManagerTest, TestAddFieldRealTimeGet, HdfsTlogReplayBufferedWhileIndexingTest, ZkStateWriterTest, TestDistribIDF, CdcrBootstrapTest, EnumFieldTest, CoreMergeIndexesAdminHandlerTest, UUIDFieldTest, SolrJmxReporterCloudTest, RollingRestartTest, TestConfigSetProperties, SolrCoreMetricManagerTest, TestComponentsName, HdfsDirectoryTest, TestCSVLoader, ReturnFieldsTest, TestJsonRequest, TestStandardQParsers, AutoAddReplicasPlanActionTest, HdfsWriteToMultipleCollectionsTest, ResourceLoaderTest, CdcrUpdateLogTest, SimplePostToolTest, SpellingQueryConverterTest, TestScoreJoinQPNoScore, DistributedSpellCheckComponentTest, TestBulkSchemaConcurrent, NodeLostTriggerTest, TestEmbeddedSolrServerConstructors, TestFunctionQuery, TestConfigSetsAPIZkFailure, HighlighterConfigTest, SolrIndexConfigTest, TestRawTransformer, OverseerRolesTest, TestFastOutputStream, TestManagedSchema, TriggerSetPropertiesIntegrationTest, DateRangeFieldTest, BitVectorTest, TestManagedSynonymGraphFilterFactory, TestQuerySenderListener, SolrShardReporterTest, TestSegmentSorting, ShardRoutingTest, TestDistributedMap, CurrencyFieldTypeTest, TestTlogReplica, HdfsChaosMonkeyNothingIsSafeTest, SearchHandlerTest, BaseCdcrDistributedZkTest, AnalysisAfterCoreReloadTest, BasicFunctionalityTest, ConvertedLegacyTest, CursorPagingTest, DistributedIntervalFacetingTest, MinimalSchemaTest, SolrInfoBeanTest, SolrTestCaseJ4Test, TestDistributedGrouping, TestDistributedSearch, TestDocumentBuilder, TestGroupingSearch, TestHighlightDedupGrouping, TestRandomFaceting, TestSimpleTrackingShardHandler, TestSolrCoreProperties, TestCharFilters, TestReversedWildcardFilterFactory, TestWordDelimiterFilterFactory, TokenizerChainTest, TestLuceneIndexBackCompat, TestEmbeddedSolrServerAdminHandler, TestJettySolrRunner, ActionThrottleTest, AssignBackwardCompatibilityTest, AsyncCallRequestStatusResponseTest, BasicZkTest, ChaosMonkeyNothingIsSafeTest, ChaosMonkeyNothingIsSafeWithPullReplicasTest, ChaosMonkeySafeLeaderTest, ChaosMonkeySafeLeaderWithPullReplicasTest, DeleteShardTest, DistribCursorPagingTest, DistributedVersionInfoTest, LIROnShardRestartTest, LeaderFailoverAfterPartitionTest, LeaderTragicEventTest]
   [junit4] Completed [456/823 (1!)] on J0 in 5.35s, 2 tests, 2 errors <<< FAILURES!

[...truncated 557 lines...]
   [junit4] Suite: org.apache.solr.handler.component.SuggestComponentTest
   [junit4]   2> Creating dataDir: C:\Users\jenkins\workspace\Lucene-Solr-7.x-Windows\solr\build\solr-core\test\J0\temp\solr.handler.component.SuggestComponentTest_CE980F4F4BCAF072-001\init-core-data-001
   [junit4]   2> 3367485 INFO  (SUITE-SuggestComponentTest-seed#[CE980F4F4BCAF072]-worker) [    ] o.a.s.c.SolrResourceLoader [null] Added 2 libs to classloader, from paths: [/C:/Users/jenkins/workspace/Lucene-Solr-7.x-Windows/solr/core/src/test-files/solr/collection1/lib, /C:/Users/jenkins/workspace/Lucene-Solr-7.x-Windows/solr/core/src/test-files/solr/collection1/lib/classes]
   [junit4]   2> 3367573 INFO  (SUITE-SuggestComponentTest-seed#[CE980F4F4BCAF072]-worker) [    ] o.a.s.c.SolrConfig Using Lucene MatchVersion: 7.5.0
   [junit4]   2> 3367582 INFO  (SUITE-SuggestComponentTest-seed#[CE980F4F4BCAF072]-worker) [    ] o.a.s.s.IndexSchema [null] Schema name=test
   [junit4]   2> 3367673 INFO  (SUITE-SuggestComponentTest-seed#[CE980F4F4BCAF072]-worker) [    ] o.a.s.s.IndexSchema Loaded schema test/1.0 with uniqueid field id
   [junit4]   2> 3367914 INFO  (SUITE-SuggestComponentTest-seed#[CE980F4F4BCAF072]-worker) [    ] o.a.s.c.TransientSolrCoreCacheDefault Allocating transient cache for 2147483647 transient cores
   [junit4]   2> 3367914 INFO  (SUITE-SuggestComponentTest-seed#[CE980F4F4BCAF072]-worker) [    ] o.a.s.h.a.MetricsHistoryHandler No .system collection, keeping metrics history in memory.
   [junit4]   2> 3367938 INFO  (SUITE-SuggestComponentTest-seed#[CE980F4F4BCAF072]-worker) [    ] o.a.s.m.r.SolrJmxReporter JMX monitoring for 'solr.node' (registry 'solr.node') enabled at server: com.sun.jmx.mbeanserver.JmxMBeanServer@7e1d4dd3
   [junit4]   2> 3367943 INFO  (SUITE-SuggestComponentTest-seed#[CE980F4F4BCAF072]-worker) [    ] o.a.s.m.r.SolrJmxReporter JMX monitoring for 'solr.jvm' (registry 'solr.jvm') enabled at server: com.sun.jmx.mbeanserver.JmxMBeanServer@7e1d4dd3
   [junit4]   2> 3367943 INFO  (SUITE-SuggestComponentTest-seed#[CE980F4F4BCAF072]-worker) [    ] o.a.s.m.r.SolrJmxReporter JMX monitoring for 'solr.jetty' (registry 'solr.jetty') enabled at server: com.sun.jmx.mbeanserver.JmxMBeanServer@7e1d4dd3
   [junit4]   2> 3367946 INFO  (coreLoadExecutor-14533-thread-1) [    x:collection1] o.a.s.c.SolrResourceLoader [null] Added 2 libs to classloader, from paths: [/C:/Users/jenkins/workspace/Lucene-Solr-7.x-Windows/solr/core/src/test-files/solr/collection1/lib, /C:/Users/jenkins/workspace/Lucene-Solr-7.x-Windows/solr/core/src/test-files/solr/collection1/lib/classes]
   [junit4]   2> 3368004 INFO  (coreLoadExecutor-14533-thread-1) [    x:collection1] o.a.s.c.SolrConfig Using Lucene MatchVersion: 7.5.0
   [junit4]   2> 3368013 INFO  (coreLoadExecutor-14533-thread-1) [    x:collection1] o.a.s.s.IndexSchema [collection1] Schema name=test
   [junit4]   2> 3368112 INFO  (coreLoadExecutor-14533-thread-1) [    x:collection1] o.a.s.s.IndexSchema Loaded schema test/1.0 with uniqueid field id
   [junit4]   2> 3368120 INFO  (coreLoadExecutor-14533-thread-1) [    x:collection1] o.a.s.c.CoreContainer Creating SolrCore 'collection1' using configuration from instancedir C:\Users\jenkins\workspace\Lucene-Solr-7.x-Windows\solr\core\src\test-files\solr\collection1, trusted=true
   [junit4]   2> 3368121 INFO  (coreLoadExecutor-14533-thread-1) [    x:collection1] o.a.s.m.r.SolrJmxReporter JMX monitoring for 'solr.core.collection1' (registry 'solr.core.collection1') enabled at server: com.sun.jmx.mbeanserver.JmxMBeanServer@7e1d4dd3
   [junit4]   2> 3368121 INFO  (coreLoadExecutor-14533-thread-1) [    x:collection1] o.a.s.c.SolrCore solr.RecoveryStrategy.Builder
   [junit4]   2> 3368121 INFO  (coreLoadExecutor-14533-thread-1) [    x:collection1] o.a.s.c.SolrCore [[collection1] ] Opening new SolrCore at [C:\Users\jenkins\workspace\Lucene-Solr-7.x-Windows\solr\core\src\test-files\solr\collection1], dataDir=[C:\Users\jenkins\workspace\Lucene-Solr-7.x-Windows\solr\build\solr-core\test\J0\temp\solr.handler.component.SuggestComponentTest_CE980F4F4BCAF072-001\init-core-data-001\]
   [junit4]   2> 3368124 INFO  (coreLoadExecutor-14533-thread-1) [    x:collection1] o.a.s.u.RandomMergePolicy RandomMergePolicy wrapping class org.apache.lucene.index.LogDocMergePolicy: [LogDocMergePolicy: minMergeSize=1000, mergeFactor=30, maxMergeSize=9223372036854775807, maxMergeSizeForForcedMerge=9223372036854775807, calibrateSizeByDeletes=false, maxMergeDocs=2147483647, maxCFSSegmentSizeMB=8.796093022207999E12, noCFSRatio=1.0]
   [junit4]   2> 3368247 INFO  (coreLoadExecutor-14533-thread-1) [    x:collection1] o.a.s.u.CommitTracker Hard AutoCommit: disabled
   [junit4]   2> 3368247 INFO  (coreLoadExecutor-14533-thread-1) [    x:collection1] o.a.s.u.CommitTracker Soft AutoCommit: disabled
   [junit4]   2> 3368248 INFO  (coreLoadExecutor-14533-thread-1) [    x:collection1] o.a.s.u.RandomMergePolicy RandomMergePolicy wrapping class org.apache.lucene.index.TieredMergePolicy: [TieredMergePolicy: maxMergeAtOnce=24, maxMergeAtOnceExplicit=13, maxMergedSegmentMB=71.0703125, floorSegmentMB=0.419921875, forceMergeDeletesPctAllowed=10.496326391804153, segmentsPerTier=25.0, maxCFSSegmentSizeMB=8.796093022207999E12, noCFSRatio=1.0, reclaimDeletesWeight=3.283055038209451
   [junit4]   2> 3368249 INFO  (coreLoadExecutor-14533-thread-1) [    x:collection1] o.a.s.s.SolrIndexSearcher Opening [Searcher@423fbcaa[collection1] main]
   [junit4]   2> 3368249 WARN  (coreLoadExecutor-14533-thread-1) [    x:collection1] o.a.s.r.ManagedResourceStorage Cannot write to config directory C:\Users\jenkins\workspace\Lucene-Solr-7.x-Windows\solr\core\src\test-files\solr\collection1\conf; switching to use InMemory storage instead.
   [junit4]   2> 3368250 INFO  (coreLoadExecutor-14533-thread-1) [    x:collection1] o.a.s.h.c.SuggestComponent Initializing SuggestComponent
   [junit4]   2> 3368250 INFO  (coreLoadExecutor-14533-thread-1) [    x:collection1] o.a.s.s.s.SolrSuggester init: {name=suggest_fuzzy_with_high_freq_dict,lookupImpl=FuzzyLookupFactory,field=cat,storeDir=suggest_fuzzy_with_high_freq_dict,suggestAnalyzerFieldType=text,buildOnCommit=true,threshold=0.0}
   [junit4]   2> 3368251 INFO  (coreLoadExecutor-14533-thread-1) [    x:collection1] o.a.s.s.s.SolrSuggester No dictionaryImpl parameter was provided falling back to org.apache.solr.spelling.suggest.HighFrequencyDictionaryFactory
   [junit4]   2> 3368251 INFO  (coreLoadExecutor-14533-thread-1) [    x:collection1] o.a.s.s.s.SolrSuggester Dictionary loaded with params: {name=suggest_fuzzy_with_high_freq_dict,lookupImpl=FuzzyLookupFactory,field=cat,storeDir=suggest_fuzzy_with_high_freq_dict,suggestAnalyzerFieldType=text,buildOnCommit=true,threshold=0.0}
   [junit4]   2> 3368251 INFO  (coreLoadExecutor-14533-thread-1) [    x:collection1] o.a.s.h.c.SuggestComponent Registering searcher listener for suggester: suggest_fuzzy_with_high_freq_dict - SuggesterListener [core=org.apache.solr.core.SolrCore@37339dce, suggester=SolrSuggester [ name=suggest_fuzzy_with_high_freq_dict, sourceLocation=null, storeDir=C:\Users\jenkins\workspace\Lucene-Solr-7.x-Windows\solr\build\solr-core\test\J0\temp\solr.handler.component.SuggestComponentTest_CE980F4F4BCAF072-001\init-core-data-001\suggest_fuzzy_with_high_freq_dict, lookupImpl=FuzzyLookupFactory, dictionaryImpl=org.apache.solr.spelling.suggest.HighFrequencyDictionaryFactory, sizeInBytes=0 ], buildOnCommit=true, buildOnOptimize=false, buildOnStartup=true, isCoreReload=false]
   [junit4]   2> 3368251 INFO  (coreLoadExecutor-14533-thread-1) [    x:collection1] o.a.s.s.s.SolrSuggester init: {name=suggest_fuzzy_file_based,lookupImpl=FuzzyLookupFactory,sourceLocation=fuzzysuggest.txt,storeDir=suggest_fuzzy_file_based,suggestAnalyzerFieldType=text,buildOnCommit=true}
   [junit4]   2> 3368252 INFO  (coreLoadExecutor-14533-thread-1) [    x:collection1] o.a.s.s.s.SolrSuggester No dictionaryImpl parameter was provided falling back to org.apache.solr.spelling.suggest.FileDictionaryFactory
   [junit4]   2> 3368252 INFO  (coreLoadExecutor-14533-thread-1) [    x:collection1] o.a.s.s.s.SolrSuggester Dictionary loaded with params: {name=suggest_fuzzy_file_based,lookupImpl=FuzzyLookupFactory,sourceLocation=fuzzysuggest.txt,storeDir=suggest_fuzzy_file_based,suggestAnalyzerFieldType=text,buildOnCommit=true}
   [junit4]   2> 3368252 INFO  (coreLoadExecutor-14533-thread-1) [    x:collection1] o.a.s.h.c.SuggestComponent Registering searcher listener for suggester: suggest_fuzzy_file_based - SuggesterListener [core=org.apache.solr.core.SolrCore@37339dce, suggester=SolrSuggester [ name=suggest_fuzzy_file_based, sourceLocation=fuzzysuggest.txt, storeDir=C:\Users\jenkins\workspace\Lucene-Solr-7.x-Windows\solr\build\solr-core\test\J0\temp\solr.handler.component.SuggestComponentTest_CE980F4F4BCAF072-001\init-core-data-001\suggest_fuzzy_file_based, lookupImpl=FuzzyLookupFactory, dictionaryImpl=org.apache.solr.spelling.suggest.FileDictionaryFactory, sizeInBytes=0 ], buildOnCommit=true, buildOnOptimize=false, buildOnStartup=true, isCoreReload=false]
   [junit4]   2> 3368252 INFO  (coreLoadExecutor-14533-thread-1) [    x:collection1] o.a.s.s.s.SolrSuggester init: {name=suggest_fuzzy_doc_dict,lookupImpl=FuzzyLookupFactory,dictionaryImpl=DocumentDictionaryFactory,field=cat,weightField=price,suggestAnalyzerFieldType=text,buildOnCommit=true,buildOnStartup=false}
   [junit4]   2> 3368253 INFO  (coreLoadExecutor-14533-thread-1) [    x:collection1] o.a.s.s.s.SolrSuggester Dictionary loaded with params: {name=suggest_fuzzy_doc_dict,lookupImpl=FuzzyLookupFactory,dictionaryImpl=DocumentDictionaryFactory,field=cat,weightField=price,suggestAnalyzerFieldType=text,buildOnCommit=true,buildOnStartup=false}
   [junit4]   2> 3368253 INFO  (coreLoadExecutor-14533-thread-1) [    x:collection1] o.a.s.h.c.SuggestComponent Registering searcher listener for suggester: suggest_fuzzy_doc_dict - SuggesterListener [core=org.apache.solr.core.SolrCore@37339dce, suggester=SolrSuggester [ name=suggest_fuzzy_doc_dict, sourceLocation=null, storeDir=, lookupImpl=FuzzyLookupFactory, dictionaryImpl=DocumentDictionaryFactory, sizeInBytes=0 ], buildOnCommit=true, buildOnOptimize=false, buildOnStartup=false, isCoreReload=false]
   [junit4]   2> 3368253 INFO  (coreLoadExecutor-14533-thread-1) [    x:collection1] o.a.s.s.s.SolrSuggester init: {name=suggest_fuzzy_doc_expr_dict,dictionaryImpl=DocumentExpressionDictionaryFactory,lookupImpl=FuzzyLookupFactory,field=cat,weightExpression=((price * 2) + weight),sortField=weight,sortField=price,storeDir=suggest_fuzzy_doc_expr_dict,suggestAnalyzerFieldType=text,buildOnCommit=true}
   [junit4]   2> 3368328 INFO  (coreLoadExecutor-14533-thread-1) [    x:collection1] o.a.s.s.s.SolrSuggester Dictionary loaded with params: {name=suggest_fuzzy_doc_expr_dict,dictionaryImpl=DocumentExpressionDictionaryFactory,lookupImpl=FuzzyLookupFactory,field=cat,weightExpression=((price * 2) + weight),sortField=weight,sortField=price,storeDir=suggest_fuzzy_doc_expr_dict,suggestAnalyzerFieldType=text,buildOnCommit=true}
   [junit4]   2> 3368329 INFO  (coreLoadExecutor-14533-thread-1) [    x:collection1] o.a.s.h.c.SuggestComponent Registering searcher listener for suggester: suggest_fuzzy_doc_expr_dict - SuggesterListener [core=org.apache.solr.core.SolrCore@37339dce, suggester=SolrSuggester [ name=suggest_fuzzy_doc_expr_dict, sourceLocation=null, storeDir=C:\Users\jenkins\workspace\Lucene-Solr-7.x-Windows\solr\build\solr-core\test\J0\temp\solr.handler.component.SuggestComponentTest_CE980F4F4BCAF072-001\init-core-data-001\suggest_fuzzy_doc_expr_dict, lookupImpl=FuzzyLookupFactory, dictionaryImpl=DocumentExpressionDictionaryFactory, sizeInBytes=0 ], buildOnCommit=true, buildOnOptimize=false, buildOnStartup=true, isCoreReload=false]
   [junit4]   2> 3368329 INFO  (coreLoadExecutor-14533-thread-1) [    x:collection1] o.a.s.s.s.SolrSuggester init: {name=suggest_fuzzy_doc_dict_build_startup,lookupImpl=FuzzyLookupFactory,dictionaryImpl=DocumentDictionaryFactory,field=cat,weightField=price,suggestAnalyzerFieldType=text,buildOnCommit=false,buildOnStartup=true}
   [junit4]   2> 3368329 INFO  (coreLoadExecutor-14533-thread-1) [    x:collection1] o.a.s.s.s.SolrSuggester Dictionary loaded with params: {name=suggest_fuzzy_doc_dict_build_startup,lookupImpl=FuzzyLookupFactory,dictionaryImpl=DocumentDictionaryFactory,field=cat,weightField=price,suggestAnalyzerFieldType=text,buildOnCommit=false,buildOnStartup=true}
   [junit4]   2> 3368329 INFO  (coreLoadExecutor-14533-thread-1) [    x:collection1] o.a.s.h.c.SuggestComponent Registering searcher listener for suggester: suggest_fuzzy_doc_dict_build_startup - SuggesterListener [core=org.apache.solr.core.SolrCore@37339dce, suggester=SolrSuggester [ name=suggest_fuzzy_doc_dict_build_startup, sourceLocation=null, storeDir=, lookupImpl=FuzzyLookupFactory, dictionaryImpl=DocumentDictionaryFactory, sizeInBytes=0 ], buildOnCommit=false, buildOnOptimize=false, buildOnStartup=true, isCoreReload=false]
   [junit4]   2> 3368329 INFO  (coreLoadExecutor-14533-thread-1) [    x:collection1] o.a.s.s.s.SolrSuggester init: {name=suggest_fuzzy_doc_manal_build,lookupImpl=FuzzyLookupFactory,dictionaryImpl=DocumentDictionaryFactory,field=cat,weightField=price,suggestAnalyzerFieldType=text,buildOnCommit=false,buildOnStartup=false,storeDir=suggest_fuzzy_doc_manal_build}
   [junit4]   2> 3368329 INFO  (coreLoadExecutor-14533-thread-1) [    x:collection1] o.a.s.s.s.SolrSuggester Dictionary loaded with params: {name=suggest_fuzzy_doc_manal_build,lookupImpl=FuzzyLookupFactory,dictionaryImpl=DocumentDictionaryFactory,field=cat,weightField=price,suggestAnalyzerFieldType=text,buildOnCommit=false,buildOnStartup=false,storeDir=suggest_fuzzy_doc_manal_build}
   [junit4]   2> 3368329 INFO  (coreLoadExecutor-14533-thread-1) [    x:collection1] o.a.s.s.s.SolrSuggester init: {name=suggest_doc_default_startup,lookupImpl=AnalyzingLookupFactory,dictionaryImpl=DocumentDictionaryFactory,field=cat,weightField=price,suggestAnalyzerFieldType=text,buildOnCommit=false,storeDir=suggest_doc_default_startup}
   [junit4]   2> 3368329 INFO  (coreLoadExecutor-14533-thread-1) [    x:collection1] o.a.s.s.s.SolrSuggester Dictionary loaded with params: {name=suggest_doc_default_startup,lookupImpl=AnalyzingLookupFactory,dictionaryImpl=DocumentDictionaryFactory,field=cat,weightField=price,suggestAnalyzerFieldType=text,buildOnCommit=false,storeDir=suggest_doc_default_startup}
   [junit4]   2> 3368329 INFO  (coreLoadExecutor-14533-thread-1) [    x:collection1] o.a.s.h.c.SuggestComponent Registering searcher listener for suggester: suggest_doc_default_startup - Suggeste

[...truncated too long message...]

ueTest, SpellCheckComponentTest, CollectionReloadTest, TestHdfsUpdateLog, DirectSolrConnectionTest, TestDocBasedVersionConstraints, DistributedFacetExistsSmallTest, TestJoin, TestManagedResourceStorage, QueryParsingTest, RestoreTriggerStateTest, UniqFieldsUpdateProcessorFactoryTest, IgnoreCommitOptimizeUpdateProcessorFactoryTest, URLClassifyProcessorTest, JavabinLoaderTest, TestGeoJSONResponseWriter, UtilsToolTest, SaslZkACLProviderTest, SimpleCollectionCreateDeleteTest, AddBlockUpdateTest, DocValuesMultiTest, TestManagedSchemaThreadSafety, TermsComponentTest, MergeStrategyTest, SuggesterWFSTTest, TestTolerantUpdateProcessorRandomCloud, DisMaxRequestHandlerTest, TestSolr4Spatial2, ProtectedTermFilterFactoryTest, TestJsonFacetRefinement, LeaderElectionIntegrationTest, ReplicationFactorTest, NodeAddedTriggerTest, DistributedDebugComponentTest, TestStressInPlaceUpdates, TestStressRecovery, TestLeaderElectionWithEmptyReplica, DateMathParserTest, JSONWriterTest, CreateRoutedAliasTest, SolrCloudExampleTest, SynonymTokenizerTest, NotRequiredUniqueKeyTest, TestCoreAdminApis, AliasIntegrationTest, TestSolrCloudWithSecureImpersonation, TestNodeLostTrigger, TestCollectionAPIs, ParsingFieldUpdateProcessorsTest, TermVectorComponentDistributedTest, TestManagedStopFilterFactory, TestFieldCollectionResource, TestNumericRangeQuery32, NoCacheHeaderTest, TestCloudSearcherWarming, TestJavabinTupleStreamParser, TestFieldCacheSort, ConcurrentCreateRoutedAliasTest, DocValuesNotIndexedTest, TaggerTest, TestConfigOverlay, MigrateRouteKeyTest, SimpleMLTQParserTest, LoggingHandlerTest, TestMissingGroups, MaxSizeAutoCommitTest, TestLegacyFieldCache, TestSha256AuthenticationProvider, TestReplicationHandler, PrimitiveFieldTypeTest, SystemLogListenerTest, OutputWriterTest, TestSolrQueryParser, TestRecoveryHdfs, HLLUtilTest, CustomHighlightComponentTest, TestSimDistributedQueue, TestObjectReleaseTracker, TestPayloadCheckQParserPlugin, HighlighterTest, TestCloudInspectUtil, TestCollationFieldDocValues, ShowFileRequestHandlerTest, TestLuceneMatchVersion, TestNoOpRegenerator, SliceStateTest, ReplicaListTransformerTest, ReplaceNodeNoTargetTest, ZkControllerTest, TestReloadDeadlock, OrderedExecutorTest, DeleteLastCustomShardedReplicaTest, TestSizeLimitedDistributedMap, LIRRollingUpdatesTest, TestSolrIndexConfig, TestSolrQueryResponse, TestInPlaceUpdatesStandalone, SolrSlf4jReporterTest, UninvertDocValuesMergePolicyTest, SearchRateTriggerIntegrationTest, SubstringBytesRefFilterTest, InfixSuggestersTest, TestReloadAndDeleteDocs, TestComputePlanAction, TestTrie, AddSchemaFieldsUpdateProcessorFactoryTest, AtomicUpdatesTest, XsltUpdateRequestHandlerTest, TestLeaderInitiatedRecoveryThread, DistributedMLTComponentTest, TestPivotHelperCode, TestFieldCacheVsDocValues, TestFaceting, TestRequestStatusCollectionAPI, BasicDistributedZkTest, TestExactStatsCache, CheckHdfsIndexTest, DirectUpdateHandlerTest, TriLevelCompositeIdRoutingTest, FieldAnalysisRequestHandlerTest, DistributedTermsComponentTest, TestSolrDeletionPolicy1, TestLFUCache, PluginInfoTest, RandomizedTaggerTest, TestAnalyzedSuggestions, RequestLoggingTest, CursorMarkTest, ConnectionManagerTest, TestAddFieldRealTimeGet, HdfsTlogReplayBufferedWhileIndexingTest, ZkStateWriterTest, TestDistribIDF, CdcrBootstrapTest, EnumFieldTest, CoreMergeIndexesAdminHandlerTest, UUIDFieldTest, SolrJmxReporterCloudTest, RollingRestartTest, TestConfigSetProperties, SolrCoreMetricManagerTest, TestComponentsName, HdfsDirectoryTest, TestCSVLoader, ReturnFieldsTest, TestJsonRequest, TestStandardQParsers, AutoAddReplicasPlanActionTest, HdfsWriteToMultipleCollectionsTest, ResourceLoaderTest, CdcrUpdateLogTest, SimplePostToolTest, SpellingQueryConverterTest, TestScoreJoinQPNoScore, DistributedSpellCheckComponentTest, TestBulkSchemaConcurrent, NodeLostTriggerTest, TestEmbeddedSolrServerConstructors, TestFunctionQuery, TestConfigSetsAPIZkFailure, HighlighterConfigTest, SolrIndexConfigTest, TestRawTransformer, OverseerRolesTest, TestFastOutputStream, TestManagedSchema, TriggerSetPropertiesIntegrationTest, DateRangeFieldTest, BitVectorTest, TestManagedSynonymGraphFilterFactory, TestQuerySenderListener, SolrShardReporterTest, TestSegmentSorting, ShardRoutingTest, TestDistributedMap, CurrencyFieldTypeTest, TestTlogReplica, HdfsChaosMonkeyNothingIsSafeTest, SearchHandlerTest, BaseCdcrDistributedZkTest, AnalysisAfterCoreReloadTest, BasicFunctionalityTest, ConvertedLegacyTest, CursorPagingTest, DistributedIntervalFacetingTest, MinimalSchemaTest, SolrInfoBeanTest, SolrTestCaseJ4Test, TestDistributedGrouping, TestDistributedSearch, TestDocumentBuilder, TestGroupingSearch, TestHighlightDedupGrouping, TestRandomFaceting, TestSimpleTrackingShardHandler, TestSolrCoreProperties, TestCharFilters, TestReversedWildcardFilterFactory, TestWordDelimiterFilterFactory, TokenizerChainTest, TestLuceneIndexBackCompat, TestEmbeddedSolrServerAdminHandler, TestJettySolrRunner, ActionThrottleTest, AssignBackwardCompatibilityTest, AsyncCallRequestStatusResponseTest, BasicZkTest, ChaosMonkeyNothingIsSafeTest, ChaosMonkeyNothingIsSafeWithPullReplicasTest, ChaosMonkeySafeLeaderTest, ChaosMonkeySafeLeaderWithPullReplicasTest, DeleteShardTest, DistribCursorPagingTest, DistributedVersionInfoTest, LIROnShardRestartTest, LeaderFailoverAfterPartitionTest, LeaderTragicEventTest, LegacyCloudClusterPropTest, MetricsHistoryIntegrationTest, MoveReplicaHDFSFailoverTest, MoveReplicaTest, SyncSliceTest, TestCloudPseudoReturnFields, TestDownShardTolerantSearch, TestExclusionRuleCollectionAccess, TestHashPartitioner, TestLockTree, TestMiniSolrCloudClusterSSL, TestPullReplica, TestRandomFlRTGCloud, TestRandomRequestDistribution, TestRequestForwarding, TestSSLRandomization, TestShortCircuitedRequests, TestSolrCloudWithDelegationTokens, TestSolrCloudWithKerberosAlt, TestStressCloudBlindAtomicUpdates, TestStressLiveNodes, TestZkChroot, TlogReplayBufferedWhileIndexingTest, UnloadDistributedZkTest, ZkCLITest, ZkNodePropsTest, ZkShardTermsTest, ZkSolrClientTest, CollectionTooManyReplicasTest, CollectionsAPIAsyncDistributedZkTest, ConcurrentDeleteAndCreateCollectionTest, CustomCollectionTest, TestCollectionsAPIViaSolrCloudCluster, TestHdfsCloudBackupRestore, TestLocalFSCloudBackupRestore, AutoScalingHandlerTest, ComputePlanActionTest, IndexSizeTriggerTest, MetricTriggerTest, NodeMarkersRegistrationTest, TriggerCooldownIntegrationTest, TestExecutePlanAction, TestLargeCluster, TestNodeAddedTrigger, CdcrBidirectionalTest, CdcrReplicationHandlerTest, CdcrVersionReplicationTest, AlternateDirectoryTest, BlobRepositoryCloudTest, CachingDirectoryFactoryTest, ConfigureRecoveryStrategyTest, CoreSorterTest, DirectoryFactoryTest, ExitableDirectoryReaderTest, HdfsDirectoryFactoryTest, QueryResultKeyTest, RequestHandlersTest, SolrCoreCheckLockOnStartupTest, TestCodecSupport, TestConfig, TestCoreContainer, TestDirectoryFactory, TestDynamicLoading, TestSolrXml, TestXIncludeConfig, TestSolrCloudSnapshots, TestConfigReload, TestRestoreCore, TestSQLHandlerNonCloud, TestSolrConfigHandlerCloud, TestSolrConfigHandlerConcurrent, V2ApiIntegrationTest, MBeansHandlerTest, DistributedFacetPivotSmallAdvancedTest, DistributedFacetPivotWhiteBoxTest, DistributedQueryElevationComponentTest, QueryElevationComponentTest, ShufflingReplicaListTransformerTest, SuggestComponentContextFilterQueryTest, SuggestComponentTest]
   [junit4]   2> NOTE: reproduce with: ant test  -Dtestcase=SuggestComponentTest -Dtests.seed=CE980F4F4BCAF072 -Dtests.slow=true -Dtests.locale=es-NI -Dtests.timezone=Asia/Yerevan -Dtests.asserts=true -Dtests.file.encoding=ISO-8859-1
   [junit4] ERROR   0.00s J0 | SuggestComponentTest (suite) <<<
   [junit4]    > Throwable #1: java.io.IOException: Could not remove the following files (in the order of attempts):
   [junit4]    >    C:\Users\jenkins\workspace\Lucene-Solr-7.x-Windows\solr\build\solr-core\test\J0\temp\solr.handler.component.SuggestComponentTest_CE980F4F4BCAF072-001\init-core-data-001: java.nio.file.AccessDeniedException: C:\Users\jenkins\workspace\Lucene-Solr-7.x-Windows\solr\build\solr-core\test\J0\temp\solr.handler.component.SuggestComponentTest_CE980F4F4BCAF072-001\init-core-data-001
   [junit4]    >    C:\Users\jenkins\workspace\Lucene-Solr-7.x-Windows\solr\build\solr-core\test\J0\temp\solr.handler.component.SuggestComponentTest_CE980F4F4BCAF072-001: java.nio.file.DirectoryNotEmptyException: C:\Users\jenkins\workspace\Lucene-Solr-7.x-Windows\solr\build\solr-core\test\J0\temp\solr.handler.component.SuggestComponentTest_CE980F4F4BCAF072-001
   [junit4]    > 	at __randomizedtesting.SeedInfo.seed([CE980F4F4BCAF072]:0)
   [junit4]    > 	at org.apache.lucene.util.IOUtils.rm(IOUtils.java:318)
   [junit4]    > 	at java.lang.Thread.run(Thread.java:748)
   [junit4] Completed [614/823 (2!)] on J0 in 13.42s, 12 tests, 1 error <<< FAILURES!

[...truncated 9411 lines...]
BUILD FAILED
C:\Users\jenkins\workspace\Lucene-Solr-7.x-Windows\build.xml:633: The following error occurred while executing this line:
C:\Users\jenkins\workspace\Lucene-Solr-7.x-Windows\build.xml:585: Some of the tests produced a heap dump, but did not fail. Maybe a suppressed OutOfMemoryError? Dumps created:
* java_pid16152.hprof

Total time: 99 minutes 31 seconds
Build step 'Invoke Ant' marked build as failure
Archiving artifacts
Setting ANT_1_8_2_HOME=C:\Users\jenkins\tools\hudson.tasks.Ant_AntInstallation\ANT_1.8.2
[WARNINGS] Skipping publisher since build result is FAILURE
Recording test results
Setting ANT_1_8_2_HOME=C:\Users\jenkins\tools\hudson.tasks.Ant_AntInstallation\ANT_1.8.2
Email was triggered for: Failure - Any
Sending email for trigger: Failure - Any
Setting ANT_1_8_2_HOME=C:\Users\jenkins\tools\hudson.tasks.Ant_AntInstallation\ANT_1.8.2
Setting ANT_1_8_2_HOME=C:\Users\jenkins\tools\hudson.tasks.Ant_AntInstallation\ANT_1.8.2
Setting ANT_1_8_2_HOME=C:\Users\jenkins\tools\hudson.tasks.Ant_AntInstallation\ANT_1.8.2
Setting ANT_1_8_2_HOME=C:\Users\jenkins\tools\hudson.tasks.Ant_AntInstallation\ANT_1.8.2

Mime
View raw message