lucene-dev mailing list archives

Site index · List index
Message view « Date » · « Thread »
Top « Date » · « Thread »
From Policeman Jenkins Server <jenk...@thetaphi.de>
Subject [JENKINS] Lucene-Solr-master-Linux (64bit/jdk1.8.0_172) - Build # 22445 - Unstable!
Date Fri, 13 Jul 2018 03:59:38 GMT
Build: https://jenkins.thetaphi.de/job/Lucene-Solr-master-Linux/22445/
Java: 64bit/jdk1.8.0_172 -XX:-UseCompressedOops -XX:+UseG1GC

2 tests failed.
FAILED:  org.apache.solr.cloud.LeaderTragicEventTest.testOtherReplicasAreNotActive

Error Message:
Jetty Connector is not open: -2

Stack Trace:
java.lang.IllegalStateException: Jetty Connector is not open: -2
	at __randomizedtesting.SeedInfo.seed([863C380842680552:388147F7E97BCCA]:0)
	at org.apache.solr.client.solrj.embedded.JettySolrRunner.getBaseUrl(JettySolrRunner.java:499)
	at org.apache.solr.cloud.MiniSolrCloudCluster.getReplicaJetty(MiniSolrCloudCluster.java:539)
	at org.apache.solr.cloud.LeaderTragicEventTest.corruptLeader(LeaderTragicEventTest.java:100)
	at org.apache.solr.cloud.LeaderTragicEventTest.testOtherReplicasAreNotActive(LeaderTragicEventTest.java:150)
	at sun.reflect.NativeMethodAccessorImpl.invoke0(Native Method)
	at sun.reflect.NativeMethodAccessorImpl.invoke(NativeMethodAccessorImpl.java:62)
	at sun.reflect.DelegatingMethodAccessorImpl.invoke(DelegatingMethodAccessorImpl.java:43)
	at java.lang.reflect.Method.invoke(Method.java:498)
	at com.carrotsearch.randomizedtesting.RandomizedRunner.invoke(RandomizedRunner.java:1737)
	at com.carrotsearch.randomizedtesting.RandomizedRunner$8.evaluate(RandomizedRunner.java:934)
	at com.carrotsearch.randomizedtesting.RandomizedRunner$9.evaluate(RandomizedRunner.java:970)
	at com.carrotsearch.randomizedtesting.RandomizedRunner$10.evaluate(RandomizedRunner.java:984)
	at com.carrotsearch.randomizedtesting.rules.SystemPropertiesRestoreRule$1.evaluate(SystemPropertiesRestoreRule.java:57)
	at org.apache.lucene.util.TestRuleSetupTeardownChained$1.evaluate(TestRuleSetupTeardownChained.java:49)
	at org.apache.lucene.util.AbstractBeforeAfterRule$1.evaluate(AbstractBeforeAfterRule.java:45)
	at org.apache.lucene.util.TestRuleThreadAndTestName$1.evaluate(TestRuleThreadAndTestName.java:48)
	at org.apache.lucene.util.TestRuleIgnoreAfterMaxFailures$1.evaluate(TestRuleIgnoreAfterMaxFailures.java:64)
	at org.apache.lucene.util.TestRuleMarkFailure$1.evaluate(TestRuleMarkFailure.java:47)
	at com.carrotsearch.randomizedtesting.rules.StatementAdapter.evaluate(StatementAdapter.java:36)
	at com.carrotsearch.randomizedtesting.ThreadLeakControl$StatementRunner.run(ThreadLeakControl.java:368)
	at com.carrotsearch.randomizedtesting.ThreadLeakControl.forkTimeoutingTask(ThreadLeakControl.java:817)
	at com.carrotsearch.randomizedtesting.ThreadLeakControl$3.evaluate(ThreadLeakControl.java:468)
	at com.carrotsearch.randomizedtesting.RandomizedRunner.runSingleTest(RandomizedRunner.java:943)
	at com.carrotsearch.randomizedtesting.RandomizedRunner$5.evaluate(RandomizedRunner.java:829)
	at com.carrotsearch.randomizedtesting.RandomizedRunner$6.evaluate(RandomizedRunner.java:879)
	at com.carrotsearch.randomizedtesting.RandomizedRunner$7.evaluate(RandomizedRunner.java:890)
	at com.carrotsearch.randomizedtesting.rules.StatementAdapter.evaluate(StatementAdapter.java:36)
	at com.carrotsearch.randomizedtesting.rules.SystemPropertiesRestoreRule$1.evaluate(SystemPropertiesRestoreRule.java:57)
	at org.apache.lucene.util.AbstractBeforeAfterRule$1.evaluate(AbstractBeforeAfterRule.java:45)
	at com.carrotsearch.randomizedtesting.rules.StatementAdapter.evaluate(StatementAdapter.java:36)
	at org.apache.lucene.util.TestRuleStoreClassName$1.evaluate(TestRuleStoreClassName.java:41)
	at com.carrotsearch.randomizedtesting.rules.NoShadowingOrOverridesOnMethodsRule$1.evaluate(NoShadowingOrOverridesOnMethodsRule.java:40)
	at com.carrotsearch.randomizedtesting.rules.NoShadowingOrOverridesOnMethodsRule$1.evaluate(NoShadowingOrOverridesOnMethodsRule.java:40)
	at com.carrotsearch.randomizedtesting.rules.StatementAdapter.evaluate(StatementAdapter.java:36)
	at com.carrotsearch.randomizedtesting.rules.StatementAdapter.evaluate(StatementAdapter.java:36)
	at com.carrotsearch.randomizedtesting.rules.StatementAdapter.evaluate(StatementAdapter.java:36)
	at org.apache.lucene.util.TestRuleAssertionsRequired$1.evaluate(TestRuleAssertionsRequired.java:53)
	at org.apache.lucene.util.TestRuleMarkFailure$1.evaluate(TestRuleMarkFailure.java:47)
	at org.apache.lucene.util.TestRuleIgnoreAfterMaxFailures$1.evaluate(TestRuleIgnoreAfterMaxFailures.java:64)
	at org.apache.lucene.util.TestRuleIgnoreTestSuites$1.evaluate(TestRuleIgnoreTestSuites.java:54)
	at com.carrotsearch.randomizedtesting.rules.StatementAdapter.evaluate(StatementAdapter.java:36)
	at com.carrotsearch.randomizedtesting.ThreadLeakControl$StatementRunner.run(ThreadLeakControl.java:368)
	at java.lang.Thread.run(Thread.java:748)


FAILED:  org.apache.solr.cloud.LeaderTragicEventTest.test

Error Message:
Error from server at http://127.0.0.1:34427/solr: collection already exists: collection1

Stack Trace:
org.apache.solr.client.solrj.impl.HttpSolrClient$RemoteSolrException: Error from server at http://127.0.0.1:34427/solr: collection already exists: collection1
	at __randomizedtesting.SeedInfo.seed([863C380842680552:E6807D2EC9468AA]:0)
	at org.apache.solr.client.solrj.impl.HttpSolrClient.executeMethod(HttpSolrClient.java:643)
	at org.apache.solr.client.solrj.impl.HttpSolrClient.request(HttpSolrClient.java:255)
	at org.apache.solr.client.solrj.impl.HttpSolrClient.request(HttpSolrClient.java:244)
	at org.apache.solr.client.solrj.impl.LBHttpSolrClient.doRequest(LBHttpSolrClient.java:483)
	at org.apache.solr.client.solrj.impl.LBHttpSolrClient.request(LBHttpSolrClient.java:413)
	at org.apache.solr.client.solrj.impl.CloudSolrClient.sendRequest(CloudSolrClient.java:1106)
	at org.apache.solr.client.solrj.impl.CloudSolrClient.requestWithRetryOnStaleState(CloudSolrClient.java:886)
	at org.apache.solr.client.solrj.impl.CloudSolrClient.request(CloudSolrClient.java:819)
	at org.apache.solr.client.solrj.SolrRequest.process(SolrRequest.java:194)
	at org.apache.solr.client.solrj.SolrRequest.process(SolrRequest.java:211)
	at org.apache.solr.cloud.LeaderTragicEventTest.test(LeaderTragicEventTest.java:70)
	at sun.reflect.NativeMethodAccessorImpl.invoke0(Native Method)
	at sun.reflect.NativeMethodAccessorImpl.invoke(NativeMethodAccessorImpl.java:62)
	at sun.reflect.DelegatingMethodAccessorImpl.invoke(DelegatingMethodAccessorImpl.java:43)
	at java.lang.reflect.Method.invoke(Method.java:498)
	at com.carrotsearch.randomizedtesting.RandomizedRunner.invoke(RandomizedRunner.java:1737)
	at com.carrotsearch.randomizedtesting.RandomizedRunner$8.evaluate(RandomizedRunner.java:934)
	at com.carrotsearch.randomizedtesting.RandomizedRunner$9.evaluate(RandomizedRunner.java:970)
	at com.carrotsearch.randomizedtesting.RandomizedRunner$10.evaluate(RandomizedRunner.java:984)
	at com.carrotsearch.randomizedtesting.rules.SystemPropertiesRestoreRule$1.evaluate(SystemPropertiesRestoreRule.java:57)
	at org.apache.lucene.util.TestRuleSetupTeardownChained$1.evaluate(TestRuleSetupTeardownChained.java:49)
	at org.apache.lucene.util.AbstractBeforeAfterRule$1.evaluate(AbstractBeforeAfterRule.java:45)
	at org.apache.lucene.util.TestRuleThreadAndTestName$1.evaluate(TestRuleThreadAndTestName.java:48)
	at org.apache.lucene.util.TestRuleIgnoreAfterMaxFailures$1.evaluate(TestRuleIgnoreAfterMaxFailures.java:64)
	at org.apache.lucene.util.TestRuleMarkFailure$1.evaluate(TestRuleMarkFailure.java:47)
	at com.carrotsearch.randomizedtesting.rules.StatementAdapter.evaluate(StatementAdapter.java:36)
	at com.carrotsearch.randomizedtesting.ThreadLeakControl$StatementRunner.run(ThreadLeakControl.java:368)
	at com.carrotsearch.randomizedtesting.ThreadLeakControl.forkTimeoutingTask(ThreadLeakControl.java:817)
	at com.carrotsearch.randomizedtesting.ThreadLeakControl$3.evaluate(ThreadLeakControl.java:468)
	at com.carrotsearch.randomizedtesting.RandomizedRunner.runSingleTest(RandomizedRunner.java:943)
	at com.carrotsearch.randomizedtesting.RandomizedRunner$5.evaluate(RandomizedRunner.java:829)
	at com.carrotsearch.randomizedtesting.RandomizedRunner$6.evaluate(RandomizedRunner.java:879)
	at com.carrotsearch.randomizedtesting.RandomizedRunner$7.evaluate(RandomizedRunner.java:890)
	at com.carrotsearch.randomizedtesting.rules.StatementAdapter.evaluate(StatementAdapter.java:36)
	at com.carrotsearch.randomizedtesting.rules.SystemPropertiesRestoreRule$1.evaluate(SystemPropertiesRestoreRule.java:57)
	at org.apache.lucene.util.AbstractBeforeAfterRule$1.evaluate(AbstractBeforeAfterRule.java:45)
	at com.carrotsearch.randomizedtesting.rules.StatementAdapter.evaluate(StatementAdapter.java:36)
	at org.apache.lucene.util.TestRuleStoreClassName$1.evaluate(TestRuleStoreClassName.java:41)
	at com.carrotsearch.randomizedtesting.rules.NoShadowingOrOverridesOnMethodsRule$1.evaluate(NoShadowingOrOverridesOnMethodsRule.java:40)
	at com.carrotsearch.randomizedtesting.rules.NoShadowingOrOverridesOnMethodsRule$1.evaluate(NoShadowingOrOverridesOnMethodsRule.java:40)
	at com.carrotsearch.randomizedtesting.rules.StatementAdapter.evaluate(StatementAdapter.java:36)
	at com.carrotsearch.randomizedtesting.rules.StatementAdapter.evaluate(StatementAdapter.java:36)
	at com.carrotsearch.randomizedtesting.rules.StatementAdapter.evaluate(StatementAdapter.java:36)
	at org.apache.lucene.util.TestRuleAssertionsRequired$1.evaluate(TestRuleAssertionsRequired.java:53)
	at org.apache.lucene.util.TestRuleMarkFailure$1.evaluate(TestRuleMarkFailure.java:47)
	at org.apache.lucene.util.TestRuleIgnoreAfterMaxFailures$1.evaluate(TestRuleIgnoreAfterMaxFailures.java:64)
	at org.apache.lucene.util.TestRuleIgnoreTestSuites$1.evaluate(TestRuleIgnoreTestSuites.java:54)
	at com.carrotsearch.randomizedtesting.rules.StatementAdapter.evaluate(StatementAdapter.java:36)
	at com.carrotsearch.randomizedtesting.ThreadLeakControl$StatementRunner.run(ThreadLeakControl.java:368)
	at java.lang.Thread.run(Thread.java:748)




Build Log:
[...truncated 13003 lines...]
   [junit4] Suite: org.apache.solr.cloud.LeaderTragicEventTest
   [junit4]   2> 672890 INFO  (SUITE-LeaderTragicEventTest-seed#[863C380842680552]-worker) [    ] o.a.s.SolrTestCaseJ4 SecureRandom sanity checks: test.solr.allowed.securerandom=null & java.security.egd=file:/dev/./urandom
   [junit4]   2> Creating dataDir: /home/jenkins/workspace/Lucene-Solr-master-Linux/solr/build/solr-core/test/J2/temp/solr.cloud.LeaderTragicEventTest_863C380842680552-001/init-core-data-001
   [junit4]   2> 672891 WARN  (SUITE-LeaderTragicEventTest-seed#[863C380842680552]-worker) [    ] o.a.s.SolrTestCaseJ4 startTrackingSearchers: numOpens=1 numCloses=1
   [junit4]   2> 672891 INFO  (SUITE-LeaderTragicEventTest-seed#[863C380842680552]-worker) [    ] o.a.s.SolrTestCaseJ4 Using PointFields (NUMERIC_POINTS_SYSPROP=true) w/NUMERIC_DOCVALUES_SYSPROP=false
   [junit4]   2> 672892 INFO  (SUITE-LeaderTragicEventTest-seed#[863C380842680552]-worker) [    ] o.a.s.SolrTestCaseJ4 Randomized ssl (false) and clientAuth (true) via: @org.apache.solr.util.RandomizeSSL(reason=, value=NaN, ssl=NaN, clientAuth=NaN)
   [junit4]   2> 672892 INFO  (SUITE-LeaderTragicEventTest-seed#[863C380842680552]-worker) [    ] o.a.s.c.MiniSolrCloudCluster Starting cluster of 2 servers in /home/jenkins/workspace/Lucene-Solr-master-Linux/solr/build/solr-core/test/J2/temp/solr.cloud.LeaderTragicEventTest_863C380842680552-001/tempDir-001
   [junit4]   2> 672892 INFO  (SUITE-LeaderTragicEventTest-seed#[863C380842680552]-worker) [    ] o.a.s.c.ZkTestServer STARTING ZK TEST SERVER
   [junit4]   2> 672893 INFO  (Thread-2713) [    ] o.a.s.c.ZkTestServer client port:0.0.0.0/0.0.0.0:0
   [junit4]   2> 672893 INFO  (Thread-2713) [    ] o.a.s.c.ZkTestServer Starting server
   [junit4]   2> 672894 ERROR (Thread-2713) [    ] o.a.z.s.ZooKeeperServer ZKShutdownHandler is not registered, so ZooKeeper server won't take any action on ERROR or SHUTDOWN server state changes
   [junit4]   2> 672993 INFO  (SUITE-LeaderTragicEventTest-seed#[863C380842680552]-worker) [    ] o.a.s.c.ZkTestServer start zk server on port:45335
   [junit4]   2> 672995 INFO  (zkConnectionManagerCallback-1807-thread-1) [    ] o.a.s.c.c.ConnectionManager zkClient has connected
   [junit4]   2> 672998 INFO  (jetty-launcher-1804-thread-2) [    ] o.e.j.s.Server jetty-9.4.11.v20180605; built: 2018-06-05T18:24:03.829Z; git: d5fc0523cfa96bfebfbda19606cad384d772f04c; jvm 1.8.0_172-b11
   [junit4]   2> 672998 INFO  (jetty-launcher-1804-thread-1) [    ] o.e.j.s.Server jetty-9.4.11.v20180605; built: 2018-06-05T18:24:03.829Z; git: d5fc0523cfa96bfebfbda19606cad384d772f04c; jvm 1.8.0_172-b11
   [junit4]   2> 672998 INFO  (jetty-launcher-1804-thread-2) [    ] o.e.j.s.session DefaultSessionIdManager workerName=node0
   [junit4]   2> 672998 INFO  (jetty-launcher-1804-thread-2) [    ] o.e.j.s.session No SessionScavenger set, using defaults
   [junit4]   2> 672998 INFO  (jetty-launcher-1804-thread-1) [    ] o.e.j.s.session DefaultSessionIdManager workerName=node0
   [junit4]   2> 672998 INFO  (jetty-launcher-1804-thread-1) [    ] o.e.j.s.session No SessionScavenger set, using defaults
   [junit4]   2> 672998 INFO  (jetty-launcher-1804-thread-2) [    ] o.e.j.s.session node0 Scavenging every 600000ms
   [junit4]   2> 672999 INFO  (jetty-launcher-1804-thread-1) [    ] o.e.j.s.session node0 Scavenging every 600000ms
   [junit4]   2> 672999 INFO  (jetty-launcher-1804-thread-1) [    ] o.e.j.s.h.ContextHandler Started o.e.j.s.ServletContextHandler@267318cc{/solr,null,AVAILABLE}
   [junit4]   2> 672999 INFO  (jetty-launcher-1804-thread-2) [    ] o.e.j.s.h.ContextHandler Started o.e.j.s.ServletContextHandler@35bb1b0a{/solr,null,AVAILABLE}
   [junit4]   2> 672999 INFO  (jetty-launcher-1804-thread-2) [    ] o.e.j.s.AbstractConnector Started ServerConnector@5656df24{HTTP/1.1,[http/1.1]}{127.0.0.1:34427}
   [junit4]   2> 672999 INFO  (jetty-launcher-1804-thread-1) [    ] o.e.j.s.AbstractConnector Started ServerConnector@2a389af9{HTTP/1.1,[http/1.1]}{127.0.0.1:38315}
   [junit4]   2> 672999 INFO  (jetty-launcher-1804-thread-1) [    ] o.e.j.s.Server Started @673037ms
   [junit4]   2> 672999 INFO  (jetty-launcher-1804-thread-2) [    ] o.e.j.s.Server Started @673037ms
   [junit4]   2> 672999 INFO  (jetty-launcher-1804-thread-1) [    ] o.a.s.c.s.e.JettySolrRunner Jetty properties: {hostContext=/solr, hostPort=38315}
   [junit4]   2> 672999 INFO  (jetty-launcher-1804-thread-2) [    ] o.a.s.c.s.e.JettySolrRunner Jetty properties: {hostContext=/solr, hostPort=34427}
   [junit4]   2> 673000 ERROR (jetty-launcher-1804-thread-2) [    ] o.a.s.u.StartupLoggingUtils Missing Java Option solr.log.dir. Logging may be missing or incomplete.
   [junit4]   2> 673000 ERROR (jetty-launcher-1804-thread-1) [    ] o.a.s.u.StartupLoggingUtils Missing Java Option solr.log.dir. Logging may be missing or incomplete.
   [junit4]   2> 673000 INFO  (jetty-launcher-1804-thread-2) [    ] o.a.s.s.SolrDispatchFilter Using logger factory org.apache.logging.slf4j.Log4jLoggerFactory
   [junit4]   2> 673000 INFO  (jetty-launcher-1804-thread-1) [    ] o.a.s.s.SolrDispatchFilter Using logger factory org.apache.logging.slf4j.Log4jLoggerFactory
   [junit4]   2> 673000 INFO  (jetty-launcher-1804-thread-1) [    ] o.a.s.s.SolrDispatchFilter  ___      _       Welcome to Apache Solr™ version 8.0.0
   [junit4]   2> 673000 INFO  (jetty-launcher-1804-thread-2) [    ] o.a.s.s.SolrDispatchFilter  ___      _       Welcome to Apache Solr™ version 8.0.0
   [junit4]   2> 673000 INFO  (jetty-launcher-1804-thread-1) [    ] o.a.s.s.SolrDispatchFilter / __| ___| |_ _   Starting in cloud mode on port null
   [junit4]   2> 673000 INFO  (jetty-launcher-1804-thread-2) [    ] o.a.s.s.SolrDispatchFilter / __| ___| |_ _   Starting in cloud mode on port null
   [junit4]   2> 673000 INFO  (jetty-launcher-1804-thread-1) [    ] o.a.s.s.SolrDispatchFilter \__ \/ _ \ | '_|  Install dir: null
   [junit4]   2> 673000 INFO  (jetty-launcher-1804-thread-2) [    ] o.a.s.s.SolrDispatchFilter \__ \/ _ \ | '_|  Install dir: null
   [junit4]   2> 673000 INFO  (jetty-launcher-1804-thread-2) [    ] o.a.s.s.SolrDispatchFilter |___/\___/_|_|    Start time: 2018-07-13T03:13:08.085Z
   [junit4]   2> 673000 INFO  (jetty-launcher-1804-thread-1) [    ] o.a.s.s.SolrDispatchFilter |___/\___/_|_|    Start time: 2018-07-13T03:13:08.085Z
   [junit4]   2> 673001 INFO  (zkConnectionManagerCallback-1810-thread-1) [    ] o.a.s.c.c.ConnectionManager zkClient has connected
   [junit4]   2> 673001 INFO  (zkConnectionManagerCallback-1811-thread-1) [    ] o.a.s.c.c.ConnectionManager zkClient has connected
   [junit4]   2> 673001 INFO  (jetty-launcher-1804-thread-1) [    ] o.a.s.s.SolrDispatchFilter solr.xml found in ZooKeeper. Loading...
   [junit4]   2> 673001 INFO  (jetty-launcher-1804-thread-2) [    ] o.a.s.s.SolrDispatchFilter solr.xml found in ZooKeeper. Loading...
   [junit4]   2> 673037 INFO  (jetty-launcher-1804-thread-1) [    ] o.a.s.c.ZkContainer Zookeeper client=127.0.0.1:45335/solr
   [junit4]   2> 673038 INFO  (zkConnectionManagerCallback-1815-thread-1) [    ] o.a.s.c.c.ConnectionManager zkClient has connected
   [junit4]   2> 673039 INFO  (zkConnectionManagerCallback-1817-thread-1) [    ] o.a.s.c.c.ConnectionManager zkClient has connected
   [junit4]   2> 673072 INFO  (jetty-launcher-1804-thread-1) [n:127.0.0.1:38315_solr    ] o.a.s.c.Overseer Overseer (id=null) closing
   [junit4]   2> 673072 INFO  (jetty-launcher-1804-thread-1) [n:127.0.0.1:38315_solr    ] o.a.s.c.OverseerElectionContext I am going to be the leader 127.0.0.1:38315_solr
   [junit4]   2> 673073 INFO  (jetty-launcher-1804-thread-1) [n:127.0.0.1:38315_solr    ] o.a.s.c.Overseer Overseer (id=72117937281105924-127.0.0.1:38315_solr-n_0000000000) starting
   [junit4]   2> 673082 INFO  (zkConnectionManagerCallback-1824-thread-1) [    ] o.a.s.c.c.ConnectionManager zkClient has connected
   [junit4]   2> 673083 INFO  (jetty-launcher-1804-thread-1) [n:127.0.0.1:38315_solr    ] o.a.s.c.s.i.ZkClientClusterStateProvider Cluster at 127.0.0.1:45335/solr ready
   [junit4]   2> 673084 INFO  (jetty-launcher-1804-thread-1) [n:127.0.0.1:38315_solr    ] o.a.s.c.ZkController Register node as live in ZooKeeper:/live_nodes/127.0.0.1:38315_solr
   [junit4]   2> 673085 INFO  (zkCallback-1823-thread-1) [    ] o.a.s.c.c.ZkStateReader Updated live nodes from ZooKeeper... (0) -> (1)
   [junit4]   2> 673085 INFO  (zkCallback-1816-thread-1) [    ] o.a.s.c.c.ZkStateReader Updated live nodes from ZooKeeper... (0) -> (1)
   [junit4]   2> 673102 INFO  (jetty-launcher-1804-thread-1) [n:127.0.0.1:38315_solr    ] o.a.s.h.a.MetricsHistoryHandler No .system collection, keeping metrics history in memory.
   [junit4]   2> 673117 INFO  (jetty-launcher-1804-thread-1) [n:127.0.0.1:38315_solr    ] o.a.s.m.r.SolrJmxReporter JMX monitoring for 'solr_38315.solr.node' (registry 'solr.node') enabled at server: com.sun.jmx.mbeanserver.JmxMBeanServer@2e763509
   [junit4]   2> 673121 INFO  (jetty-launcher-1804-thread-2) [    ] o.a.s.c.ZkContainer Zookeeper client=127.0.0.1:45335/solr
   [junit4]   2> 673122 INFO  (zkConnectionManagerCallback-1829-thread-1) [    ] o.a.s.c.c.ConnectionManager zkClient has connected
   [junit4]   2> 673122 INFO  (jetty-launcher-1804-thread-1) [n:127.0.0.1:38315_solr    ] o.a.s.m.r.SolrJmxReporter JMX monitoring for 'solr_38315.solr.jvm' (registry 'solr.jvm') enabled at server: com.sun.jmx.mbeanserver.JmxMBeanServer@2e763509
   [junit4]   2> 673122 INFO  (jetty-launcher-1804-thread-1) [n:127.0.0.1:38315_solr    ] o.a.s.m.r.SolrJmxReporter JMX monitoring for 'solr_38315.solr.jetty' (registry 'solr.jetty') enabled at server: com.sun.jmx.mbeanserver.JmxMBeanServer@2e763509
   [junit4]   2> 673123 INFO  (jetty-launcher-1804-thread-1) [n:127.0.0.1:38315_solr    ] o.a.s.c.CorePropertiesLocator Found 0 core definitions underneath /home/jenkins/workspace/Lucene-Solr-master-Linux/solr/build/solr-core/test/J2/temp/solr.cloud.LeaderTragicEventTest_863C380842680552-001/tempDir-001/node1/.
   [junit4]   2> 673123 INFO  (zkConnectionManagerCallback-1831-thread-1) [    ] o.a.s.c.c.ConnectionManager zkClient has connected
   [junit4]   2> 673126 INFO  (jetty-launcher-1804-thread-2) [n:127.0.0.1:34427_solr    ] o.a.s.c.c.ZkStateReader Updated live nodes from ZooKeeper... (0) -> (1)
   [junit4]   2> 673127 INFO  (jetty-launcher-1804-thread-2) [n:127.0.0.1:34427_solr    ] o.a.s.c.Overseer Overseer (id=null) closing
   [junit4]   2> 673128 INFO  (jetty-launcher-1804-thread-2) [n:127.0.0.1:34427_solr    ] o.a.s.c.TransientSolrCoreCacheDefault Allocating transient cache for 2147483647 transient cores
   [junit4]   2> 673128 INFO  (jetty-launcher-1804-thread-2) [n:127.0.0.1:34427_solr    ] o.a.s.c.ZkController Register node as live in ZooKeeper:/live_nodes/127.0.0.1:34427_solr
   [junit4]   2> 673128 INFO  (zkCallback-1816-thread-1) [    ] o.a.s.c.c.ZkStateReader Updated live nodes from ZooKeeper... (1) -> (2)
   [junit4]   2> 673128 INFO  (zkCallback-1823-thread-1) [    ] o.a.s.c.c.ZkStateReader Updated live nodes from ZooKeeper... (1) -> (2)
   [junit4]   2> 673129 INFO  (zkCallback-1830-thread-1) [    ] o.a.s.c.c.ZkStateReader Updated live nodes from ZooKeeper... (1) -> (2)
   [junit4]   2> 673140 INFO  (zkConnectionManagerCallback-1838-thread-1) [    ] o.a.s.c.c.ConnectionManager zkClient has connected
   [junit4]   2> 673141 INFO  (jetty-launcher-1804-thread-2) [n:127.0.0.1:34427_solr    ] o.a.s.c.c.ZkStateReader Updated live nodes from ZooKeeper... (0) -> (2)
   [junit4]   2> 673141 INFO  (jetty-launcher-1804-thread-2) [n:127.0.0.1:34427_solr    ] o.a.s.c.s.i.ZkClientClusterStateProvider Cluster at 127.0.0.1:45335/solr ready
   [junit4]   2> 673142 INFO  (jetty-launcher-1804-thread-2) [n:127.0.0.1:34427_solr    ] o.a.s.h.a.MetricsHistoryHandler No .system collection, keeping metrics history in memory.
   [junit4]   2> 673152 INFO  (jetty-launcher-1804-thread-2) [n:127.0.0.1:34427_solr    ] o.a.s.m.r.SolrJmxReporter JMX monitoring for 'solr_34427.solr.node' (registry 'solr.node') enabled at server: com.sun.jmx.mbeanserver.JmxMBeanServer@2e763509
   [junit4]   2> 673156 INFO  (jetty-launcher-1804-thread-2) [n:127.0.0.1:34427_solr    ] o.a.s.m.r.SolrJmxReporter JMX monitoring for 'solr_34427.solr.jvm' (registry 'solr.jvm') enabled at server: com.sun.jmx.mbeanserver.JmxMBeanServer@2e763509
   [junit4]   2> 673156 INFO  (jetty-launcher-1804-thread-2) [n:127.0.0.1:34427_solr    ] o.a.s.m.r.SolrJmxReporter JMX monitoring for 'solr_34427.solr.jetty' (registry 'solr.jetty') enabled at server: com.sun.jmx.mbeanserver.JmxMBeanServer@2e763509
   [junit4]   2> 673157 INFO  (jetty-launcher-1804-thread-2) [n:127.0.0.1:34427_solr    ] o.a.s.c.CorePropertiesLocator Found 0 core definitions underneath /home/jenkins/workspace/Lucene-Solr-master-Linux/solr/build/solr-core/test/J2/temp/solr.cloud.LeaderTragicEventTest_863C380842680552-001/tempDir-001/node2/.
   [junit4]   2> 673171 INFO  (zkConnectionManagerCallback-1841-thread-1) [    ] o.a.s.c.c.ConnectionManager zkClient has connected
   [junit4]   2> 673173 INFO  (zkConnectionManagerCallback-1846-thread-1) [    ] o.a.s.c.c.ConnectionManager zkClient has connected
   [junit4]   2> 673174 INFO  (SUITE-LeaderTragicEventTest-seed#[863C380842680552]-worker) [    ] o.a.s.c.c.ZkStateReader Updated live nodes from ZooKeeper... (0) -> (2)
   [junit4]   2> 673174 INFO  (SUITE-LeaderTragicEventTest-seed#[863C380842680552]-worker) [    ] o.a.s.c.s.i.ZkClientClusterStateProvider Cluster at 127.0.0.1:45335/solr ready
   [junit4]   2> 673186 INFO  (TEST-LeaderTragicEventTest.testOtherReplicasAreNotActive-seed#[863C380842680552]) [    ] o.a.s.SolrTestCaseJ4 ###Starting testOtherReplicasAreNotActive
   [junit4]   2> 673187 INFO  (qtp1326362811-8595) [n:127.0.0.1:38315_solr    ] o.a.s.h.a.CollectionsHandler Invoked Collection Action :create with params collection.configName=config&name=collection1&nrtReplicas=2&action=CREATE&numShards=1&wt=javabin&version=2 and sendToOCPQueue=true
   [junit4]   2> 673188 INFO  (OverseerThreadFactory-3175-thread-1) [    ] o.a.s.c.a.c.CreateCollectionCmd Create collection collection1
   [junit4]   2> 673294 INFO  (OverseerStateUpdate-72117937281105924-127.0.0.1:38315_solr-n_0000000000) [    ] o.a.s.c.o.SliceMutator createReplica() {
   [junit4]   2>   "operation":"ADDREPLICA",
   [junit4]   2>   "collection":"collection1",
   [junit4]   2>   "shard":"shard1",
   [junit4]   2>   "core":"collection1_shard1_replica_n1",
   [junit4]   2>   "state":"down",
   [junit4]   2>   "base_url":"http://127.0.0.1:34427/solr",
   [junit4]   2>   "type":"NRT",
   [junit4]   2>   "waitForFinalState":"false"} 
   [junit4]   2> 673295 INFO  (OverseerStateUpdate-72117937281105924-127.0.0.1:38315_solr-n_0000000000) [    ] o.a.s.c.o.SliceMutator createReplica() {
   [junit4]   2>   "operation":"ADDREPLICA",
   [junit4]   2>   "collection":"collection1",
   [junit4]   2>   "shard":"shard1",
   [junit4]   2>   "core":"collection1_shard1_replica_n2",
   [junit4]   2>   "state":"down",
   [junit4]   2>   "base_url":"http://127.0.0.1:38315/solr",
   [junit4]   2>   "type":"NRT",
   [junit4]   2>   "waitForFinalState":"false"} 
   [junit4]   2> 673498 INFO  (qtp557615559-8594) [n:127.0.0.1:34427_solr    x:collection1_shard1_replica_n1] o.a.s.h.a.CoreAdminOperation core create command qt=/admin/cores&coreNodeName=core_node3&collection.configName=config&newCollection=true&name=collection1_shard1_replica_n1&action=CREATE&numShards=1&collection=collection1&shard=shard1&wt=javabin&version=2&replicaType=NRT
   [junit4]   2> 673498 INFO  (qtp1326362811-8585) [n:127.0.0.1:38315_solr    x:collection1_shard1_replica_n2] o.a.s.h.a.CoreAdminOperation core create command qt=/admin/cores&coreNodeName=core_node4&collection.configName=config&newCollection=true&name=collection1_shard1_replica_n2&action=CREATE&numShards=1&collection=collection1&shard=shard1&wt=javabin&version=2&replicaType=NRT
   [junit4]   2> 673498 INFO  (qtp1326362811-8585) [n:127.0.0.1:38315_solr    x:collection1_shard1_replica_n2] o.a.s.c.TransientSolrCoreCacheDefault Allocating transient cache for 2147483647 transient cores
   [junit4]   2> 674507 INFO  (qtp557615559-8594) [n:127.0.0.1:34427_solr c:collection1 s:shard1 r:core_node3 x:collection1_shard1_replica_n1] o.a.s.c.SolrConfig Using Lucene MatchVersion: 8.0.0
   [junit4]   2> 674507 INFO  (qtp1326362811-8585) [n:127.0.0.1:38315_solr c:collection1 s:shard1 r:core_node4 x:collection1_shard1_replica_n2] o.a.s.c.SolrConfig Using Lucene MatchVersion: 8.0.0
   [junit4]   2> 674528 INFO  (qtp1326362811-8585) [n:127.0.0.1:38315_solr c:collection1 s:shard1 r:core_node4 x:collection1_shard1_replica_n2] o.a.s.s.IndexSchema [collection1_shard1_replica_n2] Schema name=minimal
   [junit4]   2> 674528 INFO  (qtp557615559-8594) [n:127.0.0.1:34427_solr c:collection1 s:shard1 r:core_node3 x:collection1_shard1_replica_n1] o.a.s.s.IndexSchema [collection1_shard1_replica_n1] Schema name=minimal
   [junit4]   2> 674530 INFO  (qtp1326362811-8585) [n:127.0.0.1:38315_solr c:collection1 s:shard1 r:core_node4 x:collection1_shard1_replica_n2] o.a.s.s.IndexSchema Loaded schema minimal/1.1 with uniqueid field id
   [junit4]   2> 674530 INFO  (qtp557615559-8594) [n:127.0.0.1:34427_solr c:collection1 s:shard1 r:core_node3 x:collection1_shard1_replica_n1] o.a.s.s.IndexSchema Loaded schema minimal/1.1 with uniqueid field id
   [junit4]   2> 674530 INFO  (qtp1326362811-8585) [n:127.0.0.1:38315_solr c:collection1 s:shard1 r:core_node4 x:collection1_shard1_replica_n2] o.a.s.c.CoreContainer Creating SolrCore 'collection1_shard1_replica_n2' using configuration from collection collection1, trusted=true
   [junit4]   2> 674530 INFO  (qtp557615559-8594) [n:127.0.0.1:34427_solr c:collection1 s:shard1 r:core_node3 x:collection1_shard1_replica_n1] o.a.s.c.CoreContainer Creating SolrCore 'collection1_shard1_replica_n1' using configuration from collection collection1, trusted=true
   [junit4]   2> 674531 INFO  (qtp1326362811-8585) [n:127.0.0.1:38315_solr c:collection1 s:shard1 r:core_node4 x:collection1_shard1_replica_n2] o.a.s.m.r.SolrJmxReporter JMX monitoring for 'solr_38315.solr.core.collection1.shard1.replica_n2' (registry 'solr.core.collection1.shard1.replica_n2') enabled at server: com.sun.jmx.mbeanserver.JmxMBeanServer@2e763509
   [junit4]   2> 674531 INFO  (qtp557615559-8594) [n:127.0.0.1:34427_solr c:collection1 s:shard1 r:core_node3 x:collection1_shard1_replica_n1] o.a.s.m.r.SolrJmxReporter JMX monitoring for 'solr_34427.solr.core.collection1.shard1.replica_n1' (registry 'solr.core.collection1.shard1.replica_n1') enabled at server: com.sun.jmx.mbeanserver.JmxMBeanServer@2e763509
   [junit4]   2> 674532 INFO  (qtp1326362811-8585) [n:127.0.0.1:38315_solr c:collection1 s:shard1 r:core_node4 x:collection1_shard1_replica_n2] o.a.s.c.SolrCore solr.RecoveryStrategy.Builder
   [junit4]   2> 674532 INFO  (qtp557615559-8594) [n:127.0.0.1:34427_solr c:collection1 s:shard1 r:core_node3 x:collection1_shard1_replica_n1] o.a.s.c.SolrCore solr.RecoveryStrategy.Builder
   [junit4]   2> 674532 INFO  (qtp1326362811-8585) [n:127.0.0.1:38315_solr c:collection1 s:shard1 r:core_node4 x:collection1_shard1_replica_n2] o.a.s.c.SolrCore [[collection1_shard1_replica_n2] ] Opening new SolrCore at [/home/jenkins/workspace/Lucene-Solr-master-Linux/solr/build/solr-core/test/J2/temp/solr.cloud.LeaderTragicEventTest_863C380842680552-001/tempDir-001/node1/collection1_shard1_replica_n2], dataDir=[/home/jenkins/workspace/Lucene-Solr-master-Linux/solr/build/solr-core/test/J2/temp/solr.cloud.LeaderTragicEventTest_863C380842680552-001/tempDir-001/node1/./collection1_shard1_replica_n2/data/]
   [junit4]   2> 674532 INFO  (qtp557615559-8594) [n:127.0.0.1:34427_solr c:collection1 s:shard1 r:core_node3 x:collection1_shard1_replica_n1] o.a.s.c.SolrCore [[collection1_shard1_replica_n1] ] Opening new SolrCore at [/home/jenkins/workspace/Lucene-Solr-master-Linux/solr/build/solr-core/test/J2/temp/solr.cloud.LeaderTragicEventTest_863C380842680552-001/tempDir-001/node2/collection1_shard1_replica_n1], dataDir=[/home/jenkins/workspace/Lucene-Solr-master-Linux/solr/build/solr-core/test/J2/temp/solr.cloud.LeaderTragicEventTest_863C380842680552-001/tempDir-001/node2/./collection1_shard1_replica_n1/data/]
   [junit4]   2> 674564 INFO  (qtp557615559-8594) [n:127.0.0.1:34427_solr c:collection1 s:shard1 r:core_node3 x:collection1_shard1_replica_n1] o.a.s.u.UpdateHandler Using UpdateLog implementation: org.apache.solr.update.UpdateLog
   [junit4]   2> 674564 INFO  (qtp1326362811-8585) [n:127.0.0.1:38315_solr c:collection1 s:shard1 r:core_node4 x:collection1_shard1_replica_n2] o.a.s.u.UpdateHandler Using UpdateLog implementation: org.apache.solr.update.UpdateLog
   [junit4]   2> 674564 INFO  (qtp557615559-8594) [n:127.0.0.1:34427_solr c:collection1 s:shard1 r:core_node3 x:collection1_shard1_replica_n1] o.a.s.u.UpdateLog Initializing UpdateLog: dataDir=null defaultSyncLevel=FLUSH numRecordsToKeep=100 maxNumLogsToKeep=10 numVersionBuckets=65536
   [junit4]   2> 674564 INFO  (qtp1326362811-8585) [n:127.0.0.1:38315_solr c:collection1 s:shard1 r:core_node4 x:collection1_shard1_replica_n2] o.a.s.u.UpdateLog Initializing UpdateLog: dataDir=null defaultSyncLevel=FLUSH numRecordsToKeep=100 maxNumLogsToKeep=10 numVersionBuckets=65536
   [junit4]   2> 674565 INFO  (qtp557615559-8594) [n:127.0.0.1:34427_solr c:collection1 s:shard1 r:core_node3 x:collection1_shard1_replica_n1] o.a.s.u.CommitTracker Hard AutoCommit: disabled
   [junit4]   2> 674565 INFO  (qtp1326362811-8585) [n:127.0.0.1:38315_solr c:collection1 s:shard1 r:core_node4 x:collection1_shard1_replica_n2] o.a.s.u.CommitTracker Hard AutoCommit: disabled
   [junit4]   2> 674565 INFO  (qtp557615559-8594) [n:127.0.0.1:34427_solr c:collection1 s:shard1 r:core_node3 x:collection1_shard1_replica_n1] o.a.s.u.CommitTracker Soft AutoCommit: disabled
   [junit4]   2> 674565 INFO  (qtp1326362811-8585) [n:127.0.0.1:38315_solr c:collection1 s:shard1 r:core_node4 x:collection1_shard1_replica_n2] o.a.s.u.CommitTracker Soft AutoCommit: disabled
   [junit4]   2> 674566 INFO  (qtp557615559-8594) [n:127.0.0.1:34427_solr c:collection1 s:shard1 r:core_node3 x:collection1_shard1_replica_n1] o.a.s.s.SolrIndexSearcher Opening [Searcher@2765a888[collection1_shard1_replica_n1] main]
   [junit4]   2> 674566 INFO  (qtp1326362811-8585) [n:127.0.0.1:38315_solr c:collection1 s:shard1 r:core_node4 x:collection1_shard1_replica_n2] o.a.s.s.SolrIndexSearcher Opening [Searcher@4ad28cd6[collection1_shard1_replica_n2] main]
   [junit4]   2> 674567 INFO  (qtp557615559-8594) [n:127.0.0.1:34427_solr c:collection1 s:shard1 r:core_node3 x:collection1_shard1_replica_n1] o.a.s.r.ManagedResourceStorage Configured ZooKeeperStorageIO with znodeBase: /configs/config
   [junit4]   2> 674567 INFO  (qtp1326362811-8585) [n:127.0.0.1:38315_solr c:collection1 s:shard1 r:core_node4 x:collection1_shard1_replica_n2] o.a.s.r.ManagedResourceStorage Configured ZooKeeperStorageIO with znodeBase: /configs/config
   [junit4]   2> 674567 INFO  (qtp557615559-8594) [n:127.0.0.1:34427_solr c:collection1 s:shard1 r:core_node3 x:collection1_shard1_replica_n1] o.a.s.r.ManagedResourceStorage Loaded null at path _rest_managed.json using ZooKeeperStorageIO:path=/configs/config
   [junit4]   2> 674567 INFO  (qtp1326362811-8585) [n:127.0.0.1:38315_solr c:collection1 s:shard1 r:core_node4 x:collection1_shard1_replica_n2] o.a.s.r.ManagedResourceStorage Loaded null at path _rest_managed.json using ZooKeeperStorageIO:path=/configs/config
   [junit4]   2> 674568 INFO  (qtp557615559-8594) [n:127.0.0.1:34427_solr c:collection1 s:shard1 r:core_node3 x:collection1_shard1_replica_n1] o.a.s.h.ReplicationHandler Commits will be reserved for 10000ms.
   [junit4]   2> 674568 INFO  (qtp1326362811-8585) [n:127.0.0.1:38315_solr c:collection1 s:shard1 r:core_node4 x:collection1_shard1_replica_n2] o.a.s.h.ReplicationHandler Commits will be reserved for 10000ms.
   [junit4]   2> 674568 INFO  (qtp1326362811-8585) [n:127.0.0.1:38315_solr c:collection1 s:shard1 r:core_node4 x:collection1_shard1_replica_n2] o.a.s.u.UpdateLog Could not find max version in index or recent updates, using new clock 1605843382071984128
   [junit4]   2> 674568 INFO  (qtp557615559-8594) [n:127.0.0.1:34427_solr c:collection1 s:shard1 r:core_node3 x:collection1_shard1_replica_n1] o.a.s.u.UpdateLog Could not find max version in index or recent updates, using new clock 1605843382071984128
   [junit4]   2> 674568 INFO  (searcherExecutor-3187-thread-1-processing-n:127.0.0.1:38315_solr x:collection1_shard1_replica_n2 c:collection1 s:shard1 r:core_node4) [n:127.0.0.1:38315_solr c:collection1 s:shard1 r:core_node4 x:collection1_shard1_replica_n2] o.a.s.c.SolrCore [collection1_shard1_replica_n2] Registered new searcher Searcher@4ad28cd6[collection1_shard1_replica_n2] main{ExitableDirectoryReader(UninvertingDirectoryReader())}
   [junit4]   2> 674568 INFO  (searcherExecutor-3188-thread-1-processing-n:127.0.0.1:34427_solr x:collection1_shard1_replica_n1 c:collection1 s:shard1 r:core_node3) [n:127.0.0.1:34427_solr c:collection1 s:shard1 r:core_node3 x:collection1_shard1_replica_n1] o.a.s.c.SolrCore [collection1_shard1_replica_n1] Registered new searcher Searcher@2765a888[collection1_shard1_replica_n1] main{ExitableDirectoryReader(UninvertingDirectoryReader())}
   [junit4]   2> 674571 INFO  (qtp1326362811-8585) [n:127.0.0.1:38315_solr c:collection1 s:shard1 r:core_node4 x:collection1_shard1_replica_n2] o.a.s.c.ZkShardTerms Successful update of terms at /collections/collection1/terms/shard1 to Terms{values={core_node4=0}, version=0}
   [junit4]   2> 674571 INFO  (qtp557615559-8594) [n:127.0.0.1:34427_solr c:collection1 s:shard1 r:core_node3 x:collection1_shard1_replica_n1] o.a.s.c.ZkShardTerms Failed to save terms, version is not a match, retrying
   [junit4]   2> 674571 INFO  (qtp557615559-8594) [n:127.0.0.1:34427_solr c:collection1 s:shard1 r:core_node3 x:collection1_shard1_replica_n1] o.a.s.c.ZkShardTerms Successful update of terms at /collections/collection1/terms/shard1 to Terms{values={core_node3=0, core_node4=0}, version=1}
   [junit4]   2> 674573 INFO  (qtp557615559-8594) [n:127.0.0.1:34427_solr c:collection1 s:shard1 r:core_node3 x:collection1_shard1_replica_n1] o.a.s.c.ShardLeaderElectionContext Enough replicas found to continue.
   [junit4]   2> 674573 INFO  (qtp557615559-8594) [n:127.0.0.1:34427_solr c:collection1 s:shard1 r:core_node3 x:collection1_shard1_replica_n1] o.a.s.c.ShardLeaderElectionContext I may be the new leader - try and sync
   [junit4]   2> 674573 INFO  (qtp557615559-8594) [n:127.0.0.1:34427_solr c:collection1 s:shard1 r:core_node3 x:collection1_shard1_replica_n1] o.a.s.c.SyncStrategy Sync replicas to http://127.0.0.1:34427/solr/collection1_shard1_replica_n1/
   [junit4]   2> 674573 INFO  (qtp557615559-8594) [n:127.0.0.1:34427_solr c:collection1 s:shard1 r:core_node3 x:collection1_shard1_replica_n1] o.a.s.u.PeerSync PeerSync: core=collection1_shard1_replica_n1 url=http://127.0.0.1:34427/solr START replicas=[http://127.0.0.1:38315/solr/collection1_shard1_replica_n2/] nUpdates=100
   [junit4]   2> 674573 INFO  (qtp557615559-8594) [n:127.0.0.1:34427_solr c:collection1 s:shard1 r:core_node3 x:collection1_shard1_replica_n1] o.a.s.u.PeerSync PeerSync: core=collection1_shard1_replica_n1 url=http://127.0.0.1:34427/solr DONE.  We have no versions.  sync failed.
   [junit4]   2> 674574 INFO  (qtp1326362811-8587) [n:127.0.0.1:38315_solr c:collection1 s:shard1 r:core_node4 x:collection1_shard1_replica_n2] o.a.s.c.S.Request [collection1_shard1_replica_n2]  webapp=/solr path=/get params={distrib=false&qt=/get&fingerprint=false&getVersions=100&wt=javabin&version=2} status=0 QTime=0
   [junit4]   2> 674574 INFO  (qtp557615559-8594) [n:127.0.0.1:34427_solr c:collection1 s:shard1 r:core_node3 x:collection1_shard1_replica_n1] o.a.s.c.SyncStrategy Leader's attempt to sync with shard failed, moving to the next candidate
   [junit4]   2> 674574 INFO  (qtp557615559-8594) [n:127.0.0.1:34427_solr c:collection1 s:shard1 r:core_node3 x:collection1_shard1_replica_n1] o.a.s.c.ShardLeaderElectionContext We failed sync, but we have no versions - we can't sync in that case - we were active before, so become leader anyway
   [junit4]   2> 674575 INFO  (qtp557615559-8594) [n:127.0.0.1:34427_solr c:collection1 s:shard1 r:core_node3 x:collection1_shard1_replica_n1] o.a.s.c.ShardLeaderElectionContext Found all replicas participating in election, clear LIR
   [junit4]   2> 674576 INFO  (qtp557615559-8594) [n:127.0.0.1:34427_solr c:collection1 s:shard1 r:core_node3 x:collection1_shard1_replica_n1] o.a.s.c.ShardLeaderElectionContext I am the new leader: http://127.0.0.1:34427/solr/collection1_shard1_replica_n1/ shard1
   [junit4]   2> 674728 INFO  (qtp557615559-8594) [n:127.0.0.1:34427_solr c:collection1 s:shard1 r:core_node3 x:collection1_shard1_replica_n1] o.a.s.c.ZkController I am the leader, no recovery necessary
   [junit4]   2> 674813 INFO  (qtp557615559-8594) [n:127.0.0.1:34427_solr c:collection1 s:shard1 r:core_node3 x:collection1_shard1_replica_n1] o.a.s.s.HttpSolrCall [admin] webapp=null path=/admin/cores params={qt=/admin/cores&coreNodeName=core_node3&collection.configName=config&newCollection=true&name=collection1_shard1_replica_n1&action=CREATE&numShards=1&collection=collection1&shard=shard1&wt=javabin&version=2&replicaType=NRT} status=0 QTime=1315
   [junit4]   2> 674830 INFO  (zkCallback-1830-thread-1) [    ] o.a.s.c.c.ZkStateReader A cluster state change: [WatchedEvent state:SyncConnected type:NodeDataChanged path:/collections/collection1/state.json] for collection [collection1] has occurred - updating... (live nodes size: [2])
   [junit4]   2> 675640 INFO  (qtp1326362811-8585) [n:127.0.0.1:38315_solr c:collection1 s:shard1 r:core_node4 x:collection1_shard1_replica_n2] o.a.s.s.HttpSolrCall [admin] webapp=null path=/admin/cores params={qt=/admin/cores&coreNodeName=core_node4&collection.configName=config&newCollection=true&name=collection1_shard1_replica_n2&action=CREATE&numShards=1&collection=collection1&shard=shard1&wt=javabin&version=2&replicaType=NRT} status=0 QTime=2142
   [junit4]   2> 675642 INFO  (qtp1326362811-8595) [n:127.0.0.1:38315_solr    ] o.a.s.h.a.CollectionsHandler Wait for new collection to be active for at most 30 seconds. Check all shard replicas
   [junit4]   2> 675676 INFO  (zkCallback-1816-thread-1) [    ] o.a.s.c.c.ZkStateReader A cluster state change: [WatchedEvent state:SyncConnected type:NodeDataChanged path:/collections/collection1/state.json] for collection [collection1] has occurred - updating... (live nodes size: [2])
   [junit4]   2> 675676 INFO  (zkCallback-1830-thread-1) [    ] o.a.s.c.c.ZkStateReader A cluster state change: [WatchedEvent state:SyncConnected type:NodeDataChanged path:/collections/collection1/state.json] for collection [collection1] has occurred - updating... (live nodes size: [2])
   [junit4]   2> 676643 INFO  (qtp1326362811-8595) [n:127.0.0.1:38315_solr    ] o.a.s.s.HttpSolrCall [admin] webapp=null path=/admin/collections params={collection.configName=config&name=collection1&nrtReplicas=2&action=CREATE&numShards=1&wt=javabin&version=2} status=0 QTime=3455
   [junit4]   2> 676645 INFO  (TEST-LeaderTragicEventTest.testOtherReplicasAreNotActive-seed#[863C380842680552]) [    ] o.e.j.s.AbstractConnector Stopped ServerConnector@2a389af9{HTTP/1.1,[http/1.1]}{127.0.0.1:0}
   [junit4]   2> 676645 INFO  (TEST-LeaderTragicEventTest.testOtherReplicasAreNotActive-seed#[863C380842680552]) [    ] o.a.s.c.CoreContainer Shutting down CoreContainer instance=1608927797
   [junit4]   2> 676645 INFO  (TEST-LeaderTragicEventTest.testOtherReplicasAreNotActive-seed#[863C380842680552]) [    ] o.a.s.m.SolrMetricManager Closing metric reporters for registry=solr.node, tag=null
   [junit4]   2> 676646 INFO  (TEST-LeaderTragicEventTest.testOtherReplicasAreNotActive-seed#[863C380842680552]) [    ] o.a.s.m.r.SolrJmxReporter Closing reporter [org.apache.solr.metrics.reporters.SolrJmxReporter@41c9d91c: rootName = solr_38315, domain = solr.node, service url = null, agent id = null] for registry solr.node / com.codahale.metrics.MetricRegistry@4a13d7fc
   [junit4]   2> 676653 INFO  (TEST-LeaderTragicEventTest.testOtherReplicasAreNotActive-seed#[863C380842680552]) [    ] o.a.s.m.SolrMetricManager Closing metric reporters for registry=solr.jvm, tag=null
   [junit4]   2> 676653 INFO  (TEST-LeaderTragicEventTest.testOtherReplicasAreNotActive-seed#[863C380842680552]) [    ] o.a.s.m.r.SolrJmxReporter Closing reporter [org.apache.solr.metrics.reporters.SolrJmxReporter@3558d5f5: rootName = solr_38315, domain = solr.jvm, service url = null, agent id = null] for registry solr.jvm / com.codahale.metrics.MetricRegistry@629fa7f4
   [junit4]   2> 676657 INFO  (TEST-LeaderTragicEventTest.testOtherReplicasAreNotActive-seed#[863C380842680552]) [    ] o.a.s.m.SolrMetricManager Closing metric reporters for registry=solr.jetty, tag=null
   [junit4]   2> 676657 INFO  (TEST-LeaderTragicEventTest.testOtherReplicasAreNotActive-seed#[863C380842680552]) [    ] o.a.s.m.r.SolrJmxReporter Closing reporter [org.apache.solr.metrics.reporters.SolrJmxReporter@1aaa01dc: rootName = solr_38315, domain = solr.jetty, service url = null, agent id = null] for registry solr.jetty / com.codahale.metrics.MetricRegistry@2fff0ebd
   [junit4]   2> 676658 INFO  (TEST-LeaderTragicEventTest.testOtherReplicasAreNotActive-seed#[863C380842680552]) [    ] o.a.s.c.ZkController Remove node as live in ZooKeeper:/live_nodes/127.0.0.1:38315_solr
   [junit4]   2> 676659 INFO  (TEST-LeaderTragicEventTest.testOtherReplicasAreNotActive-seed#[863C380842680552]) [    ] o.a.s.m.SolrMetricManager Closing metric reporters for registry=solr.cluster, tag=null
   [junit4]   2> 676659 INFO  (zkCallback-1823-thread-1) [    ] o.a.s.c.c.ZkStateReader Updated live nodes from ZooKeeper... (2) -> (1)
   [junit4]   2> 676659 INFO  (zkCallback-1845-thread-1) [    ] o.a.s.c.c.ZkStateReader Updated live nodes from ZooKeeper... (2) -> (1)
   [junit4]   2> 676659 INFO  (zkCallback-1837-thread-1) [    ] o.a.s.c.c.ZkStateReader Updated live nodes from ZooKeeper... (2) -> (1)
   [junit4]   2> 676659 INFO  (zkCallback-1830-thread-1) [    ] o.a.s.c.c.ZkStateReader Updated live nodes from ZooKeeper... (2) -> (1)
   [junit4]   2> 676659 INFO  (zkCallback-1816-thread-1) [    ] o.a.s.c.c.ZkStateReader Updated live nodes from ZooKeeper... (2) -> (1)
   [junit4]   2> 676659 INFO  (coreCloseExecutor-3197-thread-1) [n:127.0.0.1:38315_solr c:collection1 s:shard1 r:core_node4 x:collection1_shard1_replica_n2] o.a.s.c.SolrCore [collection1_shard1_replica_n2]  CLOSING SolrCore org.apache.solr.core.SolrCore@577e42a9
   [junit4]   2> 676659 INFO  (coreCloseExecutor-3197-thread-1) [n:127.0.0.1:38315_solr c:collection1 s:shard1 r:core_node4 x:collection1_shard1_replica_n2] o.a.s.m.SolrMetricManager Closing metric reporters for registry=solr.core.collection1.shard1.replica_n2, tag=577e42a9
   [junit4]   2> 676659 INFO  (coreCloseExecutor-3197-thread-1) [n:127.0.0.1:38315_solr c:collection1 s:shard1 r:core_node4 x:collection1_shard1_replica_n2] o.a.s.m.r.SolrJmxReporter Closing reporter [org.apache.solr.metrics.reporters.SolrJmxReporter@5f06089c: rootName = solr_38315, domain = solr.core.collection1.shard1.replica_n2, service url = null, agent id = null] for registry solr.core.collection1.shard1.replica_n2 / com.codahale.metrics.MetricRegistry@54d170c0
   [junit4]   2> 676665 INFO  (coreCloseExecutor-3197-thread-1) [n:127.0.0.1:38315_solr c:collection1 s:shard1 r:core_node4 x:collection1_shard1_replica_n2] o.a.s.m.SolrMetricManager Closing metric reporters for registry=solr.collection.collection1.shard1.leader, tag=577e42a9
   [junit4]   2> 676668 INFO  (TEST-LeaderTragicEventTest.testOtherReplicasAreNotActive-seed#[863C380842680552]) [    ] o.a.s.c.Overseer Overseer (id=72117937281105924-127.0.0.1:38315_solr-n_0000000000) closing
   [junit4]   2> 676668 INFO  (OverseerStateUpdate-72117937281105924-127.0.0.1:38315_solr-n_0000000000) [    ] o.a.s.c.Overseer Overseer Loop exiting : 127.0.0.1:38315_solr
   [junit4]   2> 676668 WARN  (OverseerAutoScalingTriggerThread-72117937281105924-127.0.0.1:38315_solr-n_0000000000) [    ] o.a.s.c.a.OverseerTriggerThread OverseerTriggerThread woken up but we are closed, exiting.
   [junit4]   2> 676669 INFO  (zkCallback-1830-thread-1) [    ] o.a.s.c.OverseerElectionContext I am going to be the leader 127.0.0.1:34427_solr
   [junit4]   2> 676669 INFO  (TEST-LeaderTragicEventTest.testOtherReplicasAreNotActive-seed#[863C380842680552]) [    ] o.e.j.s.h.ContextHandler Stopped o.e.j.s.ServletContextHandler@267318cc{/solr,null,UNAVAILABLE}
   [junit4]   2> 676670 INFO  (TEST-LeaderTragicEventTest.testOtherReplicasAreNotActive-seed#[863C380842680552]) [    ] o.e.j.s.session node0 Stopped scavenging
   [junit4]   2> 676670 INFO  (zkCallback-1830-thread-1) [    ] o.a.s.c.Overseer Overseer (id=72117937281105927-127.0.0.1:34427_solr-n_0000000001) starting
   [junit4]   2> 676673 INFO  (zkCallback-1845-thread-1) [    ] o.a.s.c.c.ZkStateReader A cluster state change: [WatchedEvent state:SyncConnected type:NodeDataChanged path:/collections/collection1/state.json] for collection [collection1] has occurred - updating... (live nodes size: [1])
   [junit4]   2> 676673 INFO  (zkCallback-1830-thread-1) [    ] o.a.s.c.c.ZkStateReader A cluster state change: [WatchedEvent state:SyncConnected type:NodeDataChanged path:/collections/collection1/state.json] for collection [collection1] has occurred - updating... (live nodes size: [1])
   [junit4]   2> 676674 INFO  (TEST-LeaderTragicEventTest.testOtherReplicasAreNotActive-seed#[863C380842680552]) [    ] o.a.s.SolrTestCaseJ4 ###Ending testOtherReplicasAreNotActive
   [junit4]   2> NOTE: reproduce with: ant test  -Dtestcase=LeaderTragicEventTest -Dtests.method=testOtherReplicasAreNotActive -Dtests.seed=863C380842680552 -Dtests.multiplier=3 -Dtests.slow=true -Dtests.locale=sr-BA -Dtests.timezone=Europe/Copenhagen -Dtests.asserts=true -Dtests.file.encoding=UTF-8
   [junit4] ERROR   3.50s J2 | LeaderTragicEventTest.testOtherReplicasAreNotActive <<<
   [junit4]    > Throwable #1: java.lang.IllegalStateException: Jetty Connector is not open: -2
   [junit4]    > 	at __randomizedtesting.SeedInfo.seed([863C380842680552:388147F7E97BCCA]:0)
   [junit4]    > 	at org.apache.solr.client.solrj.embedded.JettySolrRunner.getBaseUrl(JettySolrRunner.java:499)
   [junit4]    > 	at org.apache.solr.cloud.MiniSolrCloudCluster.getReplicaJetty(MiniSolrCloudCluster.java:539)
   [junit4]    > 	at org.apache.solr.cloud.LeaderTragicEventTest.corruptLeader(LeaderTragicEventTest.java:100)
   [junit4]    > 	at org.apache.solr.cloud.LeaderTragicEventTest.testOtherReplicasAreNotActive(LeaderTragicEventTest.java:150)
   [junit4]    > 	at java.lang.Thread.run(Thread.java:748)
   [junit4]   2> 676682 INFO  (TEST-LeaderTragicEventTest.test-seed#[863C380842680552]) [    ] o.a.s.SolrTestCaseJ4 ###Starting test
   [junit4]   2> 676683 INFO  (qtp557615559-8584) [n:127.0.0.1:34427_solr    ] o.a.s.h.a.CollectionsHandler Invoked Collection Action :create with params collection.configName=config&name=collection1&nrtReplicas=2&action=CREATE&numShards=1&wt=javabin&version=2 and sendToOCPQueue=true
   [junit4]   2> 676684 INFO  (OverseerThreadFactory-3202-thread-1) [    ] o.a.s.c.a.c.CreateCollectionCmd Create collection collection1
   [junit4]   2> 676685 ERROR (OverseerThreadFactory-3202-thread-1) [    ] o.a.s.c.a.c.OverseerCollectionMessageHandler Collection: collection1 operation: create failed:org.apache.solr.common.SolrException: collection already exists: collection1
   [junit4]   2> 	at org.apache.solr.cloud.api.collections.CreateCollectionCmd.call(CreateCollectionCmd.java:106)
   [junit4]   2> 	at org.apache.solr.cloud.api.collections.OverseerCollectionMessageHandler.processMessage(OverseerCollectionMessageHandler.java:255)
   [junit4]   2> 	at org.apache.solr.cloud.OverseerTaskProcessor$Runner.run(OverseerTaskProcessor.java:469)
   [junit4]   2> 	at org.apache.solr.common.util.ExecutorUtil$MDCAwareThreadPoolExecutor.lambda$execute$0(ExecutorUtil.java:209)
   [junit4]   2> 	at java.util.concurrent.ThreadPoolExecutor.runWorker(ThreadPoolExecutor.java:1149)
   [junit4]   2> 	at java.util.concurrent.ThreadPoolExecutor$Worker.run(ThreadPoolExecutor.java:624)
   [junit4]   2> 	at java.lang.Thread.run(Thread.java:748)
   [junit4]   2> 
   [junit4]   2> 676690 INFO  (qtp557615559-8584) [n:127.0.0.1:34427_solr    ] o.a.s.s.HttpSolrCall [admin] webapp=null path=/admin/collections params={collection.configName=config&name=collection1&nrtReplicas=2&action=CREATE&numShards=1&wt=javabin&version=2} status=400 QTime=7
   [junit4]   2> 676691 INFO  (TEST-LeaderTragicEventTest.test-seed#[863C380842680552]) [    ] o.a.s.SolrTestCaseJ4 ###Ending test
   [junit4]   2> NOTE: reproduce with: ant test  -Dtestcase=LeaderTragicEventTest -Dtests.method=test -Dtests.seed=863C380842680552 -Dtests.multiplier=3 -Dtests.slow=true -Dtests.locale=sr-BA -Dtests.timezone=Europe/Copenhagen -Dtests.asserts=true -Dtests.file.encoding=UTF-8
   [junit4] ERROR   0.02s J2 | LeaderTragicEventTest.test <<<
   [junit4]    > Throwable #1: org.apache.solr.client.solrj.impl.HttpSolrClient$RemoteSolrException: Error from server at http://127.0.0.1:34427/solr: collection already exists: collection1
   [junit4]    > 	at __randomizedtesting.SeedInfo.seed([863C380842680552:E6807D2EC9468AA]:0)
   [junit4]    > 	at org.apache.solr.client.solrj.impl.HttpSolrClient.executeMethod(HttpSolrClient.java:643)
   [junit4]    > 	at org.apache.solr.client.solrj.impl.HttpSolrClient.request(HttpSolrClient.java:255)
   [junit4]    > 	at org.apache.solr.client.solrj.impl.HttpSolrClient.request(HttpSolrClient.java:244)
   [junit4]    > 	at org.apache.solr.client.solrj.impl.LBHttpSolrClient.doRequest(LBHttpSolrClient.java:483)
   [junit4]    > 	at org.apache.solr.client.solrj.impl.LBHttpSolrClient.request(LBHttpSolrClient.java:413)
   [junit4]    > 	at org.apache.solr.client.solrj.impl.CloudSolrClient.sendRequest(CloudSolrClient.java:1106)
   [junit4]    > 	at org.apache.solr.client.solrj.impl.CloudSolrClient.requestWithRetryOnStaleState(CloudSolrClient.java:886)
   [junit4]    > 	at org.apache.solr.client.solrj.impl.CloudSolrClient.request(CloudSolrClient.java:819)
   [junit4]    > 	at org.apache.solr.client.solrj.SolrRequest.process(SolrRequest.java:194)
   [junit4]    > 	at org.apache.solr.client.solrj.SolrRequest.process(SolrRequest.java:211)
   [junit4]    > 	at org.apache.solr.cloud.LeaderTragicEventTest.test(LeaderTragicEventTest.java:70)
   [junit4]    > 	at java.lang.Thread.run(Thread.java:748)
   [junit4]   2> 676693 INFO  (jetty-closer-1805-thread-2) [    ] o.e.j.s.AbstractConnector Stopped ServerConnector@5656df24{HTTP/1.1,[http/1.1]}{127.0.0.1:0}
   [junit4]   2> 676693 INFO  (jetty-closer-1805-thread-2) [    ] o.a.s.c.CoreContainer Shutting down CoreContainer instance=1454913067
   [junit4]   2> 676693 INFO  (jetty-closer-1805-thread-2) [    ] o.a.s.m.SolrMetricManager Closing metric reporters for registry=solr.node, tag=null
   [junit4]   2> 676693 INFO  (jetty-closer-1805-thread-2) [    ] o.a.s.m.r.SolrJmxReporter Closing reporter [org.apache.solr.metrics.reporters.SolrJmxReporter@2a2e1c66: rootName = solr_34427, domain = solr.node, service url = null, agent id = null] for registry solr.node / com.codahale.metrics.MetricRegistry@4083502d
   [junit4]   2> 676697 INFO  (jetty-closer-1805-thread-2) [    ] o.a.s.m.SolrMetricManager Closing metric reporters for registry=solr.jvm, tag=null
   [junit4]   2> 676697 INFO  (jetty-closer-1805-thread-2) [    ] o.a.s.m.r.SolrJmxReporter Closing reporter [org.apache.solr.metrics.reporters.SolrJmxReporter@49f75d5a: rootName = solr_34427, domain = solr.jvm, service url = null, agent id = null] for registry solr.jvm / com.codahale.metrics.MetricRegistry@629fa7f4
   [junit4]   2> 676699 INFO  (jetty-closer-1805-thread-2) [    ] o.a.s.m.SolrMetricManager Closing metric reporters for registry=solr.jetty, tag=null
   [junit4]   2> 676699 INFO  (jetty-closer-1805-thread-2) [    ] o.a.s.m.r.SolrJmxReporter Closing reporter [org.apache.solr.metrics.reporters.SolrJmxReporter@50762f2f: rootName = solr_34427, domain = solr.jetty, service url = null, agent id = null] for registry solr.jetty / com.codahale.metrics.MetricRegistry@2fff0ebd
   [junit4]   2> 676700 INFO  (jetty-closer-1805-thread-2) [    ] o.a.s.c.ZkController Remove node as live in ZooKeeper:/live_nodes/127.0.0.1:34427_solr
   [junit4]   2> 676700 INFO  (jetty-closer-1805-thread-2) [    ] o.a.s.m.SolrMetricManager Closing metric reporters for registry=solr.cluster, tag=null
   [junit4]   2> 676700 INFO  (zkCallback-1837-thread-1) [    ] o.a.s.c.c.ZkStateReader Updated live nodes from ZooKeeper... (1) -> (0)
   [junit4]   2> 676701 INFO  (zkCallback-1830-thread-2) [    ] o.a.s.c.c.ZkStateReader Updated live nodes from ZooKeeper... (1) -> (0)
   [junit4]   2> 676701 INFO  (coreCloseExecutor-3203-thread-1) [n:127.0.0.1:34427_solr c:collection1 s:shard1 r:core_node3 x:collection1_shard1_replica_n1] o.a.s.c.SolrCore [collection1_shard1_replica_n1]  CLOSING SolrCore org.apache.solr.core.SolrCore@db41590
   [junit4]   2> 676701 INFO  (coreCloseExecutor-3203-thread-1) [n:127.0.0.1:34427_solr c:collection1 s:shard1 r:core_node3 x:collection1_shard1_replica_n1] o.a.s.m.SolrMetricManager Closing metric reporters for registry=solr.core.collection1.shard1.replica_n1, tag=db41590
   [junit4]   2> 676701 INFO  (coreCloseExecutor-3203-thread-1) [n:127.0.0.1:34427_solr c:collection1 s:shard1 r:core_node3 x:collection1_shard1_replica_n1] o.a.s.m.r.SolrJmxReporter Closing reporter [org.apache.solr.metrics.reporters.SolrJmxReporter@402e6fdf: rootName = solr_34427, domain = solr.core.collection1.shard1.replica_n1, service url = null, agent id = null] for registry solr.core.collection1.shard1.replica_n1 / com.codahale.metrics.MetricRegistry@742b4bbe
   [junit4]   2> 676706 INFO  (coreCloseExecutor-3203-thread-1) [n:127.0.0.1:34427_solr c:collection1 s:shard1 r:core_node3 x:collection1_shard1_replica_n1] o.a.s.m.SolrMetricManager Closing metric reporters for registry=solr.collection.collection1.shard1.leader, tag=db41590
   [junit4]   2> 676708 INFO  (jetty-closer-1805-thread-2) [    ] o.a.s.c.Overseer Overseer (id=72117937281105927-127.0.0.1:34427_solr-n_0000000001) closing
   [junit4]   2> 676708 INFO  (OverseerStateUpdate-72117937281105927-127.0.0.1:34427_solr-n_0000000001) [    ] o.a.s.c.Overseer Overseer Loop exiting : 127.0.0.1:34427_solr
   [junit4]   2> 676708 WARN  (OverseerAutoScalingTriggerThread-72117937281105927-127.0.0.1:34427_solr-n_0000000001) [    ] o.a.s.c.a.OverseerTriggerThread OverseerTriggerThread woken up but we are closed, exiting.
   [junit4]   2> 676710 INFO  (jetty-closer-1805-thread-2) [    ] o.e.j.s.h.ContextHandler Stopped o.e.j.s.ServletContextHandler@35bb1b0a{/solr,null,UNAVAILABLE}
   [junit4]   2> 676710 INFO  (jetty-closer-1805-thread-2) [    ] o.e.j.s.session node0 Stopped scavenging
   [junit4]   2> 676711 ERROR (SUITE-LeaderTragicEventTest-seed#[863C380842680552]-worker) [    ] o.a.z.s.ZooKeeperServer ZKShutdownHandler is not registered, so ZooKeeper server won't take any action on ERROR or SHUTDOWN server state changes
   [junit4]   2> 676711 INFO  (SUITE-LeaderTragicEventTest-seed#[863C380842680552]-worker) [    ] o.a.s.c.ZkTestServer connecting to 127.0.0.1:45335 45335
   [junit4]   2> 676804 INFO  (Thread-2713) [    ] o.a.s.c.ZkTestServer connecting to 127.0.0.1:45335 45335
   [junit4]   2> 676805 WARN  (Thread-2713) [    ] o.a.s.c.ZkTestServer Watch limit violations: 
   [junit4]   2> Maximum concurrent create/delete watches above limit:
   [junit4]   2> 
   [junit4]   2> 	6	/solr/collections/collection1/terms/shard1
   [junit4]   2> 	5	/solr/aliases.json
   [junit4]   2> 	5	/solr/clusterprops.json
   [junit4]   2> 	2	/solr/security.json
   [junit4]   2> 	2	/solr/configs/config
   [junit4]   2> 
   [junit4]   2> Maximum concurrent data watches above limit:
   [junit4]   2> 
   [junit4]   2> 	5	/solr/clusterstate.json
   [junit4]   2> 	3	/solr/collections/collection1/state.json
   [junit4]   2> 	2	/solr/autoscaling.json
   [junit4]   2> 
   [junit4]   2> Maximum concurrent children watches above limit:
   [junit4]   2> 
   [junit4]   2> 	5	/solr/live_nodes
   [junit4]   2> 	5	/solr/collections
   [junit4]   2> 	2	/solr/overseer/queue
   [junit4]   2> 	2	/solr/autoscaling/events/.scheduled_maintenance
   [junit4]   2> 	2	/solr/autoscaling/events/.auto_add_replicas
   [junit4]   2> 	2	/solr/overseer/queue-work
   [junit4]   2> 	2	/solr/overseer/collection-queue-work
   [junit4]   2> 
   [junit4]   2> NOTE: leaving temporary files on disk at: /home/jenkins/workspace/Lucene-Solr-master-Linux/solr/build/solr-core/test/J2/temp/solr.cloud.LeaderTragicEventTest_863C380842680552-001
   [junit4]   2> Jul 13, 2018 3:13:11 AM com.carrotsearch.randomizedtesting.ThreadLeakControl checkThreadLeaks
   [junit4]   2> WARNING: Will linger awaiting termination of 3 leaked thread(s).
   [junit4]   2> NOTE: test params are: codec=Asserting(Lucene70): {}, docValues:{}, maxPointsInLeafNode=253, maxMBSortInHeap=7.497462490153167, sim=Asserting(org.apache.lucene.search.similarities.AssertingSimilarity@7d656b7e), locale=sr-BA, timezone=Europe/Copenhagen
   [junit4]   2> NOTE: Linux 4.15.0-24-generic amd64/Oracle Corporation 1.8.0_172 (64-bit)/cpus=8,threads=1,free=227529888,total=536870912
   [junit4]   2> NOTE: All tests run in this JVM: [SolrSlf4jReporterTest, TestRequestStatusCollectionAPI, HLLUtilTest, DebugComponentTest, AddBlockUpdateTest, TestCloudManagedSchema, TestStandardQParsers, TestSolrConfigHandlerConcurrent, TestSolrConfigHandler, TestPseudoReturnFields, RequestLoggingTest, GraphQueryTest, URLClassifyProcessorTest, TestIBSimilarityFactory, TestInPlaceUpdatesDistrib, TestRequestForwarding, BufferStoreTest, TestSolrCloudWithDelegationTokens, ShowFileRequestHandlerTest, CachingDirectoryFactoryTest, TestImpersonationWithHadoopAuth, TestJoin, MoveReplicaHDFSFailoverTest, TestImplicitCoreProperties, SolrRrdBackendFactoryTest, DistributedFacetExistsSmallTest, DateMathParserTest, UUIDFieldTest, PrimitiveFieldTypeTest, TestRawResponseWriter, TestLegacyFieldReuse, BlockJoinFacetDistribTest, TestLockTree, TestCloudInspectUtil, TestCoreBackup, OverseerModifyCollectionTest, NodeMarkersRegistrationTest, TestNRTOpen, HttpPartitionOnCommitTest, TestCollapseQParserPlugin, HdfsChaosMonkeyNothingIsSafeTest, TestFieldSortValues, HdfsAutoAddReplicasIntegrationTest, TestTestInjection, ConjunctionSolrSpellCheckerTest, ChaosMonkeySafeLeaderTest, SchemaVersionSpecificBehaviorTest, TestComponentsName, NodeAddedTriggerTest, TestFieldTypeResource, TestCloudPivotFacet, CloudMLTQParserTest, MaxSizeAutoCommitTest, TestDistributedStatsComponentCardinality, TestSimDistributedQueue, BooleanFieldTest, DistributedTermsComponentTest, TestHdfsCloudBackupRestore, ClusterStateUpdateTest, TestDocumentBuilder, LIRRollingUpdatesTest, TestCoreAdminApis, TestDirectoryFactory, EmbeddedSolrNoSerializeTest, TestPhraseSuggestions, DataDrivenBlockJoinTest, CollectionsAPISolrJTest, FieldMutatingUpdateProcessorTest, TestSortableTextField, NotRequiredUniqueKeyTest, TestRecovery, TestSchemaSimilarityResource, LeaderTragicEventTest]
   [junit4] Completed [210/824 (1!)] on J2 in 4.43s, 2 tests, 2 errors <<< FAILURES!

[...truncated 50197 lines...]
[asciidoctor:convert] asciidoctor: ERROR: about-this-guide.adoc: line 1: invalid part, must have at least one section (e.g., chapter, appendix, etc.)
[asciidoctor:convert] asciidoctor: ERROR: solr-glossary.adoc: line 1: invalid part, must have at least one section (e.g., chapter, appendix, etc.)
     [java] Processed 2233 links (1787 relative) to 3129 anchors in 246 files
     [echo] Validated Links & Anchors via: /home/jenkins/workspace/Lucene-Solr-master-Linux/solr/build/solr-ref-guide/bare-bones-html/

-documentation-lint:
    [jtidy] Checking for broken html (such as invalid tags)...
   [delete] Deleting directory /home/jenkins/workspace/Lucene-Solr-master-Linux/lucene/build/jtidy_tmp
     [echo] Checking for broken links...
     [exec] 
     [exec] Crawl/parse...
     [exec] 
     [exec] Verify...
     [echo] Checking for malformed docs...

jar-checksums:

resolve:

ivy-availability-check:
[loadresource] Do not set property disallowed.ivy.jars.list as its length is 0.

-ivy-fail-disallowed-ivy-version:

ivy-fail:

ivy-configure:
[ivy:configure] :: loading settings :: file = /home/jenkins/workspace/Lucene-Solr-master-Linux/lucene/top-level-ivy-settings.xml

resolve:

ivy-availability-check:
[loadresource] Do not set property disallowed.ivy.jars.list as its length is 0.

-ivy-fail-disallowed-ivy-version:

ivy-fail:

ivy-configure:
[ivy:configure] :: loading settings :: file = /home/jenkins/workspace/Lucene-Solr-master-Linux/lucene/top-level-ivy-settings.xml

resolve:

resolve:

ivy-availability-check:
[loadresource] Do not set property disallowed.ivy.jars.list as its length is 0.

-ivy-fail-disallowed-ivy-version:

ivy-fail:

ivy-configure:
[ivy:configure] :: loading settings :: file = /home/jenkins/workspace/Lucene-Solr-master-Linux/lucene/top-level-ivy-settings.xml

resolve:

ivy-availability-check:
[loadresource] Do not set property disallowed.ivy.jars.list as its length is 0.

-ivy-fail-disallowed-ivy-version:

ivy-fail:

ivy-configure:
[ivy:configure] :: loading settings :: file = /home/jenkins/workspace/Lucene-Solr-master-Linux/lucene/top-level-ivy-settings.xml

resolve:

ivy-availability-check:
[loadresource] Do not set property disallowed.ivy.jars.list as its length is 0.

-ivy-fail-disallowed-ivy-version:

ivy-fail:

ivy-configure:
[ivy:configure] :: loading settings :: file = /home/jenkins/workspace/Lucene-Solr-master-Linux/lucene/top-level-ivy-settings.xml

resolve:

ivy-availability-check:
[loadresource] Do not set property disallowed.ivy.jars.list as its length is 0.

-ivy-fail-disallowed-ivy-version:

ivy-fail:

ivy-configure:
[ivy:configure] :: loading settings :: file = /home/jenkins/workspace/Lucene-Solr-master-Linux/lucene/top-level-ivy-settings.xml

resolve:

ivy-availability-check:
[loadresource] Do not set property disallowed.ivy.jars.list as its length is 0.

-ivy-fail-disallowed-ivy-version:

ivy-fail:

ivy-configure:
[ivy:configure] :: loading settings :: file = /home/jenkins/workspace/Lucene-Solr-master-Linux/lucene/top-level-ivy-settings.xml

resolve:

ivy-availability-check:
[loadresource] Do not set property disallowed.ivy.jars.list as its length is 0.

-ivy-fail-disallowed-ivy-version:

ivy-fail:

ivy-configure:
[ivy:configure] :: loading settings :: file = /home/jenkins/workspace/Lucene-Solr-master-Linux/lucene/top-level-ivy-settings.xml

resolve:

ivy-availability-check:
[loadresource] Do not set property disallowed.ivy.jars.list as its length is 0.

-ivy-fail-disallowed-ivy-version:

ivy-fail:

ivy-configure:
[ivy:configure] :: loading settings :: file = /home/jenkins/workspace/Lucene-Solr-master-Linux/lucene/top-level-ivy-settings.xml

resolve:

ivy-availability-check:
[loadresource] Do not set property disallowed.ivy.jars.list as its length is 0.

-ivy-fail-disallowed-ivy-version:

ivy-fail:

ivy-configure:
[ivy:configure] :: loading settings :: file = /home/jenkins/workspace/Lucene-Solr-master-Linux/lucene/top-level-ivy-settings.xml

resolve:

ivy-availability-check:
[loadresource] Do not set property disallowed.ivy.jars.list as its length is 0.

-ivy-fail-disallowed-ivy-version:

ivy-fail:

ivy-configure:
[ivy:configure] :: loading settings :: file = /home/jenkins/workspace/Lucene-Solr-master-Linux/lucene/top-level-ivy-settings.xml

resolve:

ivy-availability-check:
[loadresource] Do not set property disallowed.ivy.jars.list as its length is 0.

-ivy-fail-disallowed-ivy-version:

ivy-fail:

ivy-configure:
[ivy:configure] :: loading settings :: file = /home/jenkins/workspace/Lucene-Solr-master-Linux/lucene/top-level-ivy-settings.xml

resolve:

ivy-availability-check:
[loadresource] Do not set property disallowed.ivy.jars.list as its length is 0.

-ivy-fail-disallowed-ivy-version:

ivy-fail:

ivy-configure:
[ivy:configure] :: loading settings :: file = /home/jenkins/workspace/Lucene-Solr-master-Linux/lucene/top-level-ivy-settings.xml

resolve:

ivy-availability-check:
[loadresource] Do not set property disallowed.ivy.jars.list as its length is 0.

-ivy-fail-disallowed-ivy-version:

ivy-fail:

ivy-configure:
[ivy:configure] :: loading settings :: file = /home/jenkins/workspace/Lucene-Solr-master-Linux/lucene/top-level-ivy-settings.xml

resolve:

ivy-availability-check:
[loadresource] Do not set property disallowed.ivy.jars.list as its length is 0.

-ivy-fail-disallowed-ivy-version:

ivy-fail:

ivy-configure:
[ivy:configure] :: loading settings :: file = /home/jenkins/workspace/Lucene-Solr-master-Linux/lucene/top-level-ivy-settings.xml

resolve:

ivy-availability-check:
[loadresource] Do not set property disallowed.ivy.jars.list as its length is 0.

-ivy-fail-disallowed-ivy-version:

ivy-fail:

ivy-configure:
[ivy:configure] :: loading settings :: file = /home/jenkins/workspace/Lucene-Solr-master-Linux/lucene/top-level-ivy-settings.xml

resolve:

ivy-availability-check:
[loadresource] Do not set property disallowed.ivy.jars.list as its length is 0.

-ivy-fail-disallowed-ivy-version:

ivy-fail:

ivy-configure:
[ivy:configure] :: loading settings :: file = /home/jenkins/workspace/Lucene-Solr-master-Linux/lucene/top-level-ivy-settings.xml

resolve:

ivy-availability-check:
[loadresource] Do not set property disallowed.ivy.jars.list as its length is 0.

-ivy-fail-disallowed-ivy-version:

ivy-fail:

ivy-configure:
[ivy:configure] :: loading settings :: file = /home/jenkins/workspace/Lucene-Solr-master-Linux/lucene/top-level-ivy-settings.xml

resolve:

ivy-availability-check:
[loadresource] Do not set property disallowed.ivy.jars.list as its length is 0.

-ivy-fail-disallowed-ivy-version:

ivy-fail:

ivy-configure:
[ivy:configure] :: loading settings :: file = /home/jenkins/workspace/Lucene-Solr-master-Linux/lucene/top-level-ivy-settings.xml

resolve:

ivy-availability-check:
[loadresource] Do not set property disallowed.ivy.jars.list as its length is 0.

-ivy-fail-disallowed-ivy-version:

ivy-fail:

ivy-configure:
[ivy:configure] :: loading settings :: file = /home/jenkins/workspace/Lucene-Solr-master-Linux/lucene/top-level-ivy-settings.xml

resolve:

ivy-availability-check:
[loadresource] Do not set property disallowed.ivy.jars.list as its length is 0.

-ivy-fail-disallowed-ivy-version:

ivy-fail:

ivy-configure:
[ivy:configure] :: loading settings :: file = /home/jenkins/workspace/Lucene-Solr-master-Linux/lucene/top-level-ivy-settings.xml

resolve:

ivy-availability-check:
[loadresource] Do not set property disallowed.ivy.jars.list as its length is 0.

-ivy-fail-disallowed-ivy-version:

ivy-fail:

ivy-configure:
[ivy:configure] :: loading settings :: file = /home/jenkins/workspace/Lucene-Solr-master-Linux/lucene/top-level-ivy-settings.xml

resolve:

ivy-availability-check:
[loadresource] Do not set property disallowed.ivy.jars.list as its length is 0.

-ivy-fail-disallowed-ivy-version:

ivy-fail:

ivy-configure:
[ivy:configure] :: loading settings :: file = /home/jenkins/workspace/Lucene-Solr-master-Linux/lucene/top-level-ivy-settings.xml

resolve:

ivy-availability-check:
[loadresource] Do not set property disallowed.ivy.jars.list as its length is 0.

-ivy-fail-disallowed-ivy-version:

ivy-fail:

ivy-configure:
[ivy:configure] :: loading settings :: file = /home/jenkins/workspace/Lucene-Solr-master-Linux/lucene/top-level-ivy-settings.xml

resolve:

ivy-availability-check:
[loadresource] Do not set property disallowed.ivy.jars.list as its length is 0.

-ivy-fail-disallowed-ivy-version:

ivy-fail:

ivy-configure:
[ivy:configure] :: loading settings :: file = /home/jenkins/workspace/Lucene-Solr-master-Linux/lucene/top-level-ivy-settings.xml

resolve:

ivy-availability-check:
[loadresource] Do not set property disallowed.ivy.jars.list as its length is 0.

-ivy-fail-disallowed-ivy-version:

ivy-fail:

ivy-configure:
[ivy:configure] :: loading settings :: file = /home/jenkins/workspace/Lucene-Solr-master-Linux/lucene/top-level-ivy-settings.xml

common.resolve:

resolve:

ivy-availability-check:
[loadresource] Do not set property disallowed.ivy.jars.list as its length is 0.

-ivy-fail-disallowed-ivy-version:

ivy-fail:

ivy-configure:
[ivy:configure] :: loading settings :: file = /home/jenkins/workspace/Lucene-Solr-master-Linux/lucene/top-level-ivy-settings.xml

resolve:

ivy-availability-check:
[loadresource] Do not set property disallowed.ivy.jars.list as its length is 0.

-ivy-fail-disallowed-ivy-version:

ivy-fail:

ivy-configure:
[ivy:configure] :: loading settings :: file = /home/jenkins/workspace/Lucene-Solr-master-Linux/lucene/top-level-ivy-settings.xml

resolve:

ivy-availability-check:
[loadresource] Do not set property disallowed.ivy.jars.list as its length is 0.

-ivy-fail-disallowed-ivy-version:

ivy-fail:

ivy-configure:
[ivy:configure] :: loading settings :: file = /home/jenkins/workspace/Lucene-Solr-master-Linux/lucene/top-level-ivy-settings.xml

resolve:

ivy-availability-check:
[loadresource] Do not set property disallowed.ivy.jars.list as its length is 0.

-ivy-fail-disallowed-ivy-version:

ivy-fail:

ivy-configure:
[ivy:configure] :: loading settings :: file = /home/jenkins/workspace/Lucene-Solr-master-Linux/lucene/top-level-ivy-settings.xml

resolve:

ivy-availability-check:
[loadresource] Do not set property disallowed.ivy.jars.list as its length is 0.

-ivy-fail-disallowed-ivy-version:

ivy-fail:

ivy-configure:
[ivy:configure] :: loading settings :: file = /home/jenkins/workspace/Lucene-Solr-master-Linux/lucene/top-level-ivy-settings.xml

resolve:

jar-checksums:
    [mkdir] Created dir: /home/jenkins/workspace/Lucene-Solr-master-Linux/lucene/null1927918267
     [copy] Copying 36 files to /home/jenkins/workspace/Lucene-Solr-master-Linux/lucene/null1927918267
   [delete] Deleting directory /home/jenkins/workspace/Lucene-Solr-master-Linux/lucene/null1927918267

resolve-example:

ivy-availability-check:
[loadresource] Do not set property disallowed.ivy.jars.list as its length is 0.

-ivy-fail-disallowed-ivy-version:

ivy-fail:

ivy-configure:
[ivy:configure] :: loading settings :: file = /home/jenkins/workspace/Lucene-Solr-master-Linux/lucene/top-level-ivy-settings.xml

resolve:

resolve-server:

ivy-availability-check:
[loadresource] Do not set property disallowed.ivy.jars.list as its length is 0.

-ivy-fail-disallowed-ivy-version:

ivy-fail:

ivy-fail:

ivy-configure:
[ivy:configure] :: loading settings :: file = /home/jenkins/workspace/Lucene-Solr-master-Linux/lucene/top-level-ivy-settings.xml

resolve:

resolve:

ivy-availability-check:
[loadresource] Do not set property disallowed.ivy.jars.list as its length is 0.

-ivy-fail-disallowed-ivy-version:

ivy-fail:

ivy-fail:

ivy-configure:
[ivy:configure] :: loading settings :: file = /home/jenkins/workspace/Lucene-Solr-master-Linux/lucene/top-level-ivy-settings.xml

resolve:

ivy-availability-check:
[loadresource] Do not set property disallowed.ivy.jars.list as its length is 0.

-ivy-fail-disallowed-ivy-version:

ivy-fail:

ivy-fail:

ivy-configure:
[ivy:configure] :: loading settings :: file = /home/jenkins/workspace/Lucene-Solr-master-Linux/lucene/top-level-ivy-settings.xml

resolve:

ivy-availability-check:
[loadresource] Do not set property disallowed.ivy.jars.list as its length is 0.

-ivy-fail-disallowed-ivy-version:

ivy-fail:

ivy-configure:
[ivy:configure] :: loading settings :: file = /home/jenkins/workspace/Lucene-Solr-master-Linux/lucene/top-level-ivy-settings.xml

resolve:

ivy-availability-check:
[loadresource] Do not set property disallowed.ivy.jars.list as its length is 0.

-ivy-fail-disallowed-ivy-version:

ivy-fail:

ivy-fail:

ivy-configure:
[ivy:configure] :: loading settings :: file = /home/jenkins/workspace/Lucene-Solr-master-Linux/lucene/top-level-ivy-settings.xml

resolve:

ivy-availability-check:
[loadresource] Do not set property disallowed.ivy.jars.list as its length is 0.

-ivy-fail-disallowed-ivy-version:

ivy-fail:

ivy-configure:
[ivy:configure] :: loading settings :: file = /home/jenkins/workspace/Lucene-Solr-master-Linux/lucene/top-level-ivy-settings.xml

resolve:

ivy-availability-check:
[loadresource] Do not set property disallowed.ivy.jars.list as its length is 0.

-ivy-fail-disallowed-ivy-version:

ivy-fail:

ivy-fail:

ivy-configure:
[ivy:configure] :: loading settings :: file = /home/jenkins/workspace/Lucene-Solr-master-Linux/lucene/top-level-ivy-settings.xml

resolve:

ivy-availability-check:
[loadresource] Do not set property disallowed.ivy.jars.list as its length is 0.

-ivy-fail-disallowed-ivy-version:

ivy-fail:

ivy-fail:

ivy-configure:
[ivy:configure] :: loading settings :: file = /home/jenkins/workspace/Lucene-Solr-master-Linux/lucene/top-level-ivy-settings.xml

resolve:

ivy-availability-check:
[loadresource] Do not set property disallowed.ivy.jars.list as its length is 0.

-ivy-fail-disallowed-ivy-version:

ivy-fail:

ivy-fail:

ivy-configure:
[ivy:configure] :: loading settings :: file = /home/jenkins/workspace/Lucene-Solr-master-Linux/lucene/top-level-ivy-settings.xml

resolve:

ivy-availability-check:
[loadresource] Do not set property disallowed.ivy.jars.list as its length is 0.

-ivy-fail-disallowed-ivy-version:

ivy-fail:

ivy-fail:

ivy-configure:
[ivy:configure] :: loading settings :: file = /home/jenkins/workspace/Lucene-Solr-master-Linux/lucene/top-level-ivy-settings.xml

resolve:

ivy-availability-check:
[loadresource] Do not set property disallowed.ivy.jars.list as its length is 0.

-ivy-fail-disallowed-ivy-version:

ivy-fail:

ivy-fail:

ivy-configure:
[ivy:configure] :: loading settings :: file = /home/jenkins/workspace/Lucene-Solr-master-Linux/lucene/top-level-ivy-settings.xml

resolve:

ivy-availability-check:
[loadresource] Do not set property disallowed.ivy.jars.list as its length is 0.

-ivy-fail-disallowed-ivy-version:

ivy-fail:

ivy-fail:

ivy-configure:
[ivy:configure] :: loading settings :: file = /home/jenkins/workspace/Lucene-Solr-master-Linux/lucene/top-level-ivy-settings.xml

resolve:

ivy-availability-check:
[loadresource] Do not set property disallowed.ivy.jars.list as its length is 0.

-ivy-fail-disallowed-ivy-version:

ivy-fail:

ivy-fail:

ivy-configure:
[ivy:configure] :: loading settings :: file = /home/jenkins/workspace/Lucene-Solr-master-Linux/lucene/top-level-ivy-settings.xml

resolve:

ivy-availability-check:
[loadresource] Do not set property disallowed.ivy.jars.list as its length is 0.

-ivy-fail-disallowed-ivy-version:

ivy-fail:

ivy-fail:

ivy-configure:
[ivy:configure] :: loading settings :: file = /home/jenkins/workspace/Lucene-Solr-master-Linux/lucene/top-level-ivy-settings.xml

resolve:

ivy-availability-check:
[loadresource] Do not set property disallowed.ivy.jars.list as its length is 0.

-ivy-fail-disallowed-ivy-version:

ivy-fail:

ivy-fail:

ivy-configure:
[ivy:configure] :: loading settings :: file = /home/jenkins/workspace/Lucene-Solr-master-Linux/lucene/top-level-ivy-settings.xml

resolve:

ivy-availability-check:
[loadresource] Do not set property disallowed.ivy.jars.list as its length is 0.

-ivy-fail-disallowed-ivy-version:

ivy-fail:

ivy-fail:

ivy-configure:
[ivy:configure] :: loading settings :: file = /home/jenkins/workspace/Lucene-Solr-master-Linux/lucene/top-level-ivy-settings.xml

resolve:

jar-checksums:
    [mkdir] Created dir: /home/jenkins/workspace/Lucene-Solr-master-Linux/solr/null870337999
     [copy] Copying 241 files to /home/jenkins/workspace/Lucene-Solr-master-Linux/solr/null870337999
   [delete] Deleting directory /home/jenkins/workspace/Lucene-Solr-master-Linux/solr/null870337999

check-working-copy:
[ivy:cachepath] :: resolving dependencies :: org.eclipse.jgit#org.eclipse.jgit-caller;working
[ivy:cachepath] 	confs: [default]
[ivy:cachepath] 	found org.eclipse.jgit#org.eclipse.jgit;4.6.0.201612231935-r in public
[ivy:cachepath] 	found com.jcraft#jsch;0.1.53 in public
[ivy:cachepath] 	found com.googlecode.javaewah#JavaEWAH;1.1.6 in public
[ivy:cachepath] 	found org.apache.httpcomponents#httpclient;4.3.6 in public
[ivy:cachepath] 	found org.apache.httpcomponents#httpcore;4.3.3 in public
[ivy:cachepath] 	found commons-logging#commons-logging;1.1.3 in public
[ivy:cachepath] 	found commons-codec#commons-codec;1.6 in public
[ivy:cachepath] 	found org.slf4j#slf4j-api;1.7.2 in public
[ivy:cachepath] :: resolution report :: resolve 584ms :: artifacts dl 1ms
	---------------------------------------------------------------------
	|                  |            modules            ||   artifacts   |
	|       conf       | number| search|dwnlded|evicted|| number|dwnlded|
	---------------------------------------------------------------------
	|      default     |   8   |   0   |   0   |   0   ||   8   |   0   |
	---------------------------------------------------------------------
[wc-checker] Initializing working copy...
[wc-checker] SLF4J: Failed to load class "org.slf4j.impl.StaticLoggerBinder".
[wc-checker] SLF4J: Defaulting to no-operation (NOP) logger implementation
[wc-checker] SLF4J: See http://www.slf4j.org/codes.html#StaticLoggerBinder for further details.
[wc-checker] Checking working copy status...

-jenkins-base:

BUILD SUCCESSFUL
Total time: 82 minutes 22 seconds
Setting ANT_1_8_2_HOME=/var/lib/jenkins/tools/hudson.tasks.Ant_AntInstallation/ANT_1.8.2
[Lucene-Solr-master-Linux] $ /bin/sh -xe /tmp/jenkins389245780237469348.sh
+ mv lucene/build lucene/build.orig
+ mv solr/build solr/build.orig
+ export ANT_HOME=/var/lib/jenkins/tools/hudson.tasks.Ant_AntInstallation/ANT_1.8.2
+ export PATH=/var/lib/jenkins/tools/hudson.tasks.Ant_AntInstallation/ANT_1.8.2/bin:/home/jenkins/tools/java/64bit/jdk1.8.0_172/bin:/usr/local/bin:/usr/bin:/bin:/usr/local/games:/usr/games
+ python3 -u dev-tools/scripts/reproduceJenkinsFailures.py --no-git https://jenkins.thetaphi.de/job/Lucene-Solr-master-Linux/22445/consoleText
[repro] Jenkins log URL: https://jenkins.thetaphi.de/job/Lucene-Solr-master-Linux/22445/consoleText

[repro] Revision: 8997d41357ab95eaa88702b93c75de4b1813457b

[repro] Ant options: "-Dargs=-XX:-UseCompressedOops -XX:+UseG1GC"
[repro] Repro line:  ant test  -Dtestcase=LeaderTragicEventTest -Dtests.method=testOtherReplicasAreNotActive -Dtests.seed=863C380842680552 -Dtests.multiplier=3 -Dtests.slow=true -Dtests.locale=sr-BA -Dtests.timezone=Europe/Copenhagen -Dtests.asserts=true -Dtests.file.encoding=UTF-8

[repro] Repro line:  ant test  -Dtestcase=LeaderTragicEventTest -Dtests.method=test -Dtests.seed=863C380842680552 -Dtests.multiplier=3 -Dtests.slow=true -Dtests.locale=sr-BA -Dtests.timezone=Europe/Copenhagen -Dtests.asserts=true -Dtests.file.encoding=UTF-8

[repro] ant clean
Buildfile: /home/jenkins/workspace/Lucene-Solr-master-Linux/build.xml

clean:

clean:

clean:

BUILD SUCCESSFUL
Total time: 0 seconds
[repro] Test suites by module:
[repro]    solr/core
[repro]       LeaderTragicEventTest
[repro] ant compile-test
Buildfile: /home/jenkins/workspace/Lucene-Solr-master-Linux/solr/core/build.xml

check-analyzers-icu-uptodate:

jar-analyzers-icu:

-mrjar-classes-uptodate:

ivy-availability-check:
[loadresource] Do not set property disallowed.ivy.jars.list as its length is 0.

-ivy-fail-disallowed-ivy-version:

ivy-fail:

ivy-configure:
[ivy:configure] :: Apache Ivy 2.4.0 - 20141213170938 :: http://ant.apache.org/ivy/ ::
[ivy:configure] :: loading settings :: file = /home/jenkins/workspace/Lucene-Solr-master-Linux/lucene/top-level-ivy-settings.xml

resolve-groovy:
[ivy:cachepath] :: resolving dependencies :: org.codehaus.groovy#groovy-all-caller;working
[ivy:cachepath] 	confs: [default]
[ivy:cachepath] 	found org.codehaus.groovy#groovy-all;2.4.15 in public
[ivy:cachepath] :: resolution report :: resolve 282ms :: artifacts dl 2ms
	---------------------------------------------------------------------
	|                  |            modules            ||   artifacts   |
	|       conf       | number| search|dwnlded|evicted|| number|dwnlded|
	---------------------------------------------------------------------
	|      default     |   1   |   0   |   0   |   0   ||   1   |   0   |
	---------------------------------------------------------------------

check-analyzers-common-uptodate:

jar-analyzers-common:

-mrjar-classes-uptodate:

ivy-availability-check:
[loadresource] Do not set property disallowed.ivy.jars.list as its length is 0.

-ivy-fail-disallowed-ivy-version:

ivy-fail:

ivy-configure:
[ivy:configure] :: loading settings :: file = /home/jenkins/workspace/Lucene-Solr-master-Linux/lucene/top-level-ivy-settings.xml

resolve-groovy:

-check-git-state:

-git-cleanroot:

-copy-git-state:
     [copy] Copying 1 file to /home/jenkins/workspace/Lucene-Solr-master-Linux/lucene/build

git-autoclean:

resolve:

common.init:

compile-lucene-core:

-check-git-state:

-git-cleanroot:

-copy-git-state:

git-autoclean:

ivy-availability-check:
[loadresource] Do not set property disallowed.ivy.jars.list as its length is 0.

-ivy-fail-disallowed-ivy-version:

ivy-fail:

ivy-configure:
[ivy:configure] :: loading settings :: file = /home/jenkins/workspace/Lucene-Solr-master-Linux/lucene/top-level-ivy-settings.xml

resolve:

init:

-clover.disable:

-clover.load:

-clover.classpath:

-clover.setup:

clover:

compile-core:
    [mkdir] Created dir: /home/jenkins/workspace/Lucene-Solr-master-Linux/lucene/build/core/classes/java
    [javac] Compiling 846 source files to /home/jenkins/workspace/Lucene-Solr-master-Linux/lucene/build/core/classes/java
    [javac] Note: Some input files use or override a deprecated API.
    [javac] Note: Recompile with -Xlint:deprecation for details.
    [javac] Creating empty /home/jenkins/workspace/Lucene-Solr-master-Linux/lucene/build/core/classes/java/org/apache/lucene/util/graph/package-info.class
    [javac] Creating empty /home/jenkins/workspace/Lucene-Solr-master-Linux/lucene/build/core/classes/java/org/apache/lucene/document/package-info.class
    [javac] Creating empty /home/jenkins/workspace/Lucene-Solr-master-Linux/lucene/build/core/classes/java/org/apache/lucene/package-info.class
    [javac] Creating empty /home/jenkins/workspace/Lucene-Solr-master-Linux/lucene/build/core/classes/java/org/apache/lucene/util/bkd/package-info.class
    [javac] Creating empty /home/jenkins/workspace/Lucene-Solr-master-Linux/lucene/build/core/classes/java/org/apache/lucene/codecs/compressing/package-info.class
    [javac] Creating empty /home/jenkins/workspace/Lucene-Solr-master-Linux/lucene/build/core/classes/java/org/apache/lucene/codecs/lucene60/package-info.class
    [javac] Creating empty /home/jenkins/workspace/Lucene-Solr-master-Linux/lucene/build/core/classes/java/org/apache/lucene/codecs/package-info.class
    [javac] Creating empty /home/jenkins/workspace/Lucene-Solr-master-Linux/lucene/build/core/classes/java/org/apache/lucene/util/package-info.class
    [javac] Creating empty /home/jenkins/workspace/Lucene-Solr-master-Linux/lucene/build/core/classes/java/org/apache/lucene/index/package-info.class
    [javac] Creating empty /home/jenkins/workspace/Lucene-Solr-master-Linux/lucene/build/core/classes/java/org/apache/lucene/util/fst/package-info.class
    [javac] Creating empty /home/jenkins/workspace/Lucene-Solr-master-Linux/lucene/build/core/classes/java/org/apache/lucene/analysis/tokenattributes/package-info.class
    [javac] Creating empty /home/jenkins/workspace/Lucene-Solr-master-Linux/lucene/build/core/classes/java/org/apache/lucene/search/package-info.class
    [javac] Creating empty /home/jenkins/workspace/Lucene-Solr-master-Linux/lucene/build/core/classes/java/org/apache/lucene/util/packed/package-info.class
    [javac] Creating empty /home/jenkins/workspace/Lucene-Solr-master-Linux/lucene/build/core/classes/java/org/apache/lucene/util/mutable/package-info.class
    [javac] Creating empty /home/jenkins/workspace/Lucene-Solr-master-Linux/lucene/build/core/classes/java/org/apache/lucene/codecs/lucene70/package-info.class
    [javac] Creating empty /home/jenkins/workspace/Lucene-Solr-master-Linux/lucene/build/core/classes/java/org/apache/lucene/codecs/perfield/package-info.class
    [javac] Creating empty /home/jenkins/workspace/Lucene-Solr-master-Linux/lucene/build/core/classes/java/org/apache/lucene/analysis/package-info.class
    [javac] Creating empty /home/jenkins/workspace/Lucene-Solr-master-Linux/lucene/build/core/classes/java/org/apache/lucene/analysis/standard/package-info.class
    [javac] Creating empty /home/jenkins/workspace/Lucene-Solr-master-Linux/lucene/build/core/classes/java/org/apache/lucene/store/package-info.class
    [javac] Creating empty /home/jenkins/workspace/Lucene-Solr-master-Linux/lucene/build/core/classes/java/org/apache/lucene/codecs/blocktree/package-info.class
    [javac] Creating empty /home/jenkins/workspace/Lucene-Solr-master-Linux/lucene/build/core/classes/java/org/apache/lucene/search/spans/package-info.class
    [javac] Creating empty /home/jenkins/workspace/Lucene-Solr-master-Linux/lucene/build/core/classes/java/org/apache/lucene/search/similarities/package-info.class
    [javac] Creating empty /home/jenkins/workspace/Lucene-Solr-master-Linux/lucene/build/core/classes/java/org/apache/lucene/util/automaton/package-info.class
    [javac] Creating empty /home/jenkins/workspace/Lucene-Solr-master-Linux/lucene/build/core/classes/java/org/apache/lucene/codecs/lucene50/package-info.class
    [javac] Creating empty /home/jenkins/workspace/Lucene-Solr-master-Linux/lucene/build/core/classes/java/org/apache/lucene/geo/package-info.class
     [copy] Copying 3 files to /home/jenkins/workspace/Lucene-Solr-master-Linux/lucene/build/core/classes/java

init:

-clover.disable:

-clover.load:

-clover.classpath:

-clover.setup:

clover:

compile-core:
    [mkdir] Created dir: /home/jenkins/workspace/Lucene-Solr-master-Linux/lucene/build/analysis/common/classes/java
    [javac] Compiling 474 source files to /home/jenkins/workspace/Lucene-Solr-master-Linux/lucene/build/analysis/common/classes/java
    [javac] Note: Some input files use or override a deprecated API.
    [javac] Note: Recompile with -Xlint:deprecation for details.
    [javac] Creating empty /home/jenkins/workspace/Lucene-Solr-master-Linux/lucene/build/analysis/common/classes/java/org/apache/lucene/analysis/hunspell/package-info.class
    [javac] Creating empty /home/jenkins/workspace/Lucene-Solr-master-Linux/lucene/build/analysis/common/classes/java/org/apache/lucene/analysis/minhash/package-info.class
    [javac] Creating empty /home/jenkins/workspace/Lucene-Solr-master-Linux/lucene/build/analysis/common/classes/java/org/apache/lucene/analysis/ga/package-info.class
    [javac] Creating empty /home/jenkins/workspace/Lucene-Solr-master-Linux/lucene/build/analysis/common/classes/java/org/apache/lucene/analysis/ca/package-info.class
    [javac] Creating empty /home/jenkins/workspace/Lucene-Solr-master-Linux/lucene/build/analysis/common/classes/java/org/apache/lucene/analysis/custom/package-info.class
    [javac] Creating empty /home/jenkins/workspace/Lucene-Solr-master-Linux/lucene/build/analysis/common/classes/java/org/apache/lucene/analysis/sr/package-info.class
    [javac] Creating empty /home/jenkins/workspace/Lucene-Solr-master-Linux/lucene/build/analysis/common/classes/java/org/apache/lucene/collation/package-info.class
    [javac] Creating empty /home/jenkins/workspace/Lucene-Solr-master-Linux/lucene/build/analysis/common/classes/java/org/apache/lucene/analysis/sv/package-info.class
    [javac] Creating empty /home/jenkins/workspace/Lucene-Solr-master-Linux/lucene/build/analysis/common/classes/java/org/apache/lucene/analysis/bg/package-info.class
    [javac] Creating empty /home/jenkins/workspace/Lucene-Solr-master-Linux/lucene/build/analysis/common/classes/java/org/apache/lucene/analysis/payloads/package-info.class
    [javac] Creating empty /home/jenkins/workspace/Lucene-Solr-master-Linux/lucene/build/analysis/common/classes/java/org/apache/lucene/analysis/ngram/package-info.class
    [javac] Creating empty /home/jenki

[...truncated too long message...]

closer-2-thread-2) [    ] o.a.s.m.r.SolrJmxReporter Closing reporter [org.apache.solr.metrics.reporters.SolrJmxReporter@561fc741: rootName = solr_37469, domain = solr.node, service url = null, agent id = null] for registry solr.node / com.codahale.metrics.MetricRegistry@307cb7da
   [junit4]   2> 12224 INFO  (jetty-closer-2-thread-2) [    ] o.a.s.m.SolrMetricManager Closing metric reporters for registry=solr.jvm, tag=null
   [junit4]   2> 12224 INFO  (jetty-closer-2-thread-2) [    ] o.a.s.m.r.SolrJmxReporter Closing reporter [org.apache.solr.metrics.reporters.SolrJmxReporter@3c16838: rootName = solr_37469, domain = solr.jvm, service url = null, agent id = null] for registry solr.jvm / com.codahale.metrics.MetricRegistry@59a20a10
   [junit4]   2> 12231 INFO  (jetty-closer-2-thread-2) [    ] o.a.s.m.SolrMetricManager Closing metric reporters for registry=solr.jetty, tag=null
   [junit4]   2> 12231 INFO  (jetty-closer-2-thread-2) [    ] o.a.s.m.r.SolrJmxReporter Closing reporter [org.apache.solr.metrics.reporters.SolrJmxReporter@2bcc92ce: rootName = solr_37469, domain = solr.jetty, service url = null, agent id = null] for registry solr.jetty / com.codahale.metrics.MetricRegistry@187ba588
   [junit4]   2> 12233 INFO  (jetty-closer-2-thread-2) [    ] o.a.s.c.ZkController Remove node as live in ZooKeeper:/live_nodes/127.0.0.1:37469_solr
   [junit4]   2> 12233 INFO  (jetty-closer-2-thread-2) [    ] o.a.s.m.SolrMetricManager Closing metric reporters for registry=solr.cluster, tag=null
   [junit4]   2> 12234 INFO  (zkCallback-34-thread-1) [    ] o.a.s.c.c.ZkStateReader Updated live nodes from ZooKeeper... (1) -> (0)
   [junit4]   2> 12234 INFO  (zkCallback-19-thread-1) [    ] o.a.s.c.c.ZkStateReader Updated live nodes from ZooKeeper... (1) -> (0)
   [junit4]   2> 12235 INFO  (coreCloseExecutor-39-thread-1) [n:127.0.0.1:37469_solr c:collection1 s:shard1 r:core_node2 x:collection1_shard1_replica_n1] o.a.s.c.SolrCore [collection1_shard1_replica_n1]  CLOSING SolrCore org.apache.solr.core.SolrCore@43422dcb
   [junit4]   2> 12235 INFO  (coreCloseExecutor-39-thread-1) [n:127.0.0.1:37469_solr c:collection1 s:shard1 r:core_node2 x:collection1_shard1_replica_n1] o.a.s.m.SolrMetricManager Closing metric reporters for registry=solr.core.collection1.shard1.replica_n1, tag=43422dcb
   [junit4]   2> 12235 INFO  (coreCloseExecutor-39-thread-1) [n:127.0.0.1:37469_solr c:collection1 s:shard1 r:core_node2 x:collection1_shard1_replica_n1] o.a.s.m.r.SolrJmxReporter Closing reporter [org.apache.solr.metrics.reporters.SolrJmxReporter@30372038: rootName = solr_37469, domain = solr.core.collection1.shard1.replica_n1, service url = null, agent id = null] for registry solr.core.collection1.shard1.replica_n1 / com.codahale.metrics.MetricRegistry@3e3ee726
   [junit4]   2> 12246 INFO  (coreCloseExecutor-39-thread-1) [n:127.0.0.1:37469_solr c:collection1 s:shard1 r:core_node2 x:collection1_shard1_replica_n1] o.a.s.m.SolrMetricManager Closing metric reporters for registry=solr.collection.collection1.shard1.leader, tag=43422dcb
   [junit4]   2> 12250 INFO  (jetty-closer-2-thread-2) [    ] o.a.s.c.Overseer Overseer (id=72118100790149126-127.0.0.1:37469_solr-n_0000000001) closing
   [junit4]   2> 12250 INFO  (OverseerStateUpdate-72118100790149126-127.0.0.1:37469_solr-n_0000000001) [    ] o.a.s.c.Overseer Overseer Loop exiting : 127.0.0.1:37469_solr
   [junit4]   2> 12251 WARN  (OverseerAutoScalingTriggerThread-72118100790149126-127.0.0.1:37469_solr-n_0000000001) [    ] o.a.s.c.a.OverseerTriggerThread OverseerTriggerThread woken up but we are closed, exiting.
   [junit4]   2> 12259 INFO  (jetty-closer-2-thread-2) [    ] o.e.j.s.h.ContextHandler Stopped o.e.j.s.ServletContextHandler@6cf0b7e6{/solr,null,UNAVAILABLE}
   [junit4]   2> 12259 INFO  (jetty-closer-2-thread-2) [    ] o.e.j.s.session node0 Stopped scavenging
   [junit4]   2> 12261 ERROR (SUITE-LeaderTragicEventTest-seed#[863C380842680552]-worker) [    ] o.a.z.s.ZooKeeperServer ZKShutdownHandler is not registered, so ZooKeeper server won't take any action on ERROR or SHUTDOWN server state changes
   [junit4]   2> 12262 INFO  (SUITE-LeaderTragicEventTest-seed#[863C380842680552]-worker) [    ] o.a.s.c.ZkTestServer connecting to 127.0.0.1:34163 34163
   [junit4]   2> 13117 INFO  (Thread-1) [    ] o.a.s.c.ZkTestServer connecting to 127.0.0.1:34163 34163
   [junit4]   2> 13117 WARN  (Thread-1) [    ] o.a.s.c.ZkTestServer Watch limit violations: 
   [junit4]   2> Maximum concurrent create/delete watches above limit:
   [junit4]   2> 
   [junit4]   2> 	6	/solr/collections/collection1/terms/shard1
   [junit4]   2> 	5	/solr/aliases.json
   [junit4]   2> 	5	/solr/clusterprops.json
   [junit4]   2> 	2	/solr/security.json
   [junit4]   2> 	2	/solr/configs/config
   [junit4]   2> 
   [junit4]   2> Maximum concurrent data watches above limit:
   [junit4]   2> 
   [junit4]   2> 	5	/solr/clusterstate.json
   [junit4]   2> 	3	/solr/collections/collection1/state.json
   [junit4]   2> 	2	/solr/autoscaling.json
   [junit4]   2> 
   [junit4]   2> Maximum concurrent children watches above limit:
   [junit4]   2> 
   [junit4]   2> 	5	/solr/live_nodes
   [junit4]   2> 	5	/solr/collections
   [junit4]   2> 	2	/solr/overseer/queue
   [junit4]   2> 	2	/solr/autoscaling/events/.scheduled_maintenance
   [junit4]   2> 	2	/solr/autoscaling/events/.auto_add_replicas
   [junit4]   2> 	2	/solr/overseer/collection-queue-work
   [junit4]   2> 	2	/solr/overseer/queue-work
   [junit4]   2> 
   [junit4]   2> NOTE: leaving temporary files on disk at: /home/jenkins/workspace/Lucene-Solr-master-Linux/solr/build/solr-core/test/J1/temp/solr.cloud.LeaderTragicEventTest_863C380842680552-001
   [junit4]   2> NOTE: test params are: codec=Asserting(Lucene70): {}, docValues:{}, maxPointsInLeafNode=253, maxMBSortInHeap=7.497462490153167, sim=Asserting(org.apache.lucene.search.similarities.AssertingSimilarity@3e3ac20b), locale=sr-BA, timezone=Europe/Copenhagen
   [junit4]   2> NOTE: Linux 4.15.0-24-generic amd64/Oracle Corporation 1.8.0_172 (64-bit)/cpus=8,threads=1,free=273678280,total=536870912
   [junit4]   2> NOTE: All tests run in this JVM: [LeaderTragicEventTest]
   [junit4] Completed [1/5 (1!)] on J1 in 12.30s, 2 tests, 2 errors <<< FAILURES!
   [junit4] 
   [junit4] Suite: org.apache.solr.cloud.LeaderTragicEventTest
   [junit4] OK      13.2s J0 | LeaderTragicEventTest.testOtherReplicasAreNotActive
   [junit4] OK      18.8s J0 | LeaderTragicEventTest.test
   [junit4] Completed [2/5 (1!)] on J0 in 39.37s, 2 tests
   [junit4] 
   [junit4] Duplicate suite name used with XML reports: org.apache.solr.cloud.LeaderTragicEventTest. This may confuse tools that process XML reports. Set 'ignoreDuplicateSuites' to true to skip this message.
   [junit4] Suite: org.apache.solr.cloud.LeaderTragicEventTest
   [junit4] OK      12.8s J2 | LeaderTragicEventTest.testOtherReplicasAreNotActive
   [junit4] OK      18.5s J2 | LeaderTragicEventTest.test
   [junit4] Completed [3/5 (1!)] on J2 in 39.08s, 2 tests
   [junit4] 
   [junit4] Suite: org.apache.solr.cloud.LeaderTragicEventTest
   [junit4] OK      11.4s J1 | LeaderTragicEventTest.testOtherReplicasAreNotActive
   [junit4] OK      18.3s J1 | LeaderTragicEventTest.test
   [junit4] Completed [4/5 (1!)] on J1 in 31.11s, 2 tests
   [junit4] 
   [junit4] Suite: org.apache.solr.cloud.LeaderTragicEventTest
   [junit4] OK      9.84s J0 | LeaderTragicEventTest.testOtherReplicasAreNotActive
   [junit4] OK      18.1s J0 | LeaderTragicEventTest.test
   [junit4] Completed [5/5 (1!)] on J0 in 29.02s, 2 tests
   [junit4] 
   [junit4] 
   [junit4] Tests with failures [seed: 863C380842680552]:
   [junit4]   - org.apache.solr.cloud.LeaderTragicEventTest.testOtherReplicasAreNotActive
   [junit4]   - org.apache.solr.cloud.LeaderTragicEventTest.test
   [junit4] 
   [junit4] 
   [junit4] JVM J0:     0.98 ..    70.39 =    69.41s
   [junit4] JVM J1:     0.70 ..    45.42 =    44.72s
   [junit4] JVM J2:     0.95 ..    41.33 =    40.38s
   [junit4] Execution time total: 1 minute 10 seconds
   [junit4] Tests summary: 5 suites, 10 tests, 2 errors

BUILD FAILED
/home/jenkins/workspace/Lucene-Solr-master-Linux/lucene/common-build.xml:1568: The following error occurred while executing this line:
/home/jenkins/workspace/Lucene-Solr-master-Linux/lucene/common-build.xml:1092: There were test failures: 5 suites, 10 tests, 2 errors [seed: 863C380842680552]

Total time: 1 minute 12 seconds

[repro] Setting last failure code to 256

[repro] Failures:
[repro]   1/5 failed: org.apache.solr.cloud.LeaderTragicEventTest
[repro] Exiting with code 256
+ mv lucene/build lucene/build.repro
+ mv solr/build solr/build.repro
+ mv lucene/build.orig lucene/build
+ mv solr/build.orig solr/build
Archiving artifacts
Setting ANT_1_8_2_HOME=/var/lib/jenkins/tools/hudson.tasks.Ant_AntInstallation/ANT_1.8.2
[WARNINGS] Parsing warnings in console log with parser Java Compiler (javac)
Setting ANT_1_8_2_HOME=/var/lib/jenkins/tools/hudson.tasks.Ant_AntInstallation/ANT_1.8.2
Setting ANT_1_8_2_HOME=/var/lib/jenkins/tools/hudson.tasks.Ant_AntInstallation/ANT_1.8.2
<Git Blamer> Using GitBlamer to create author and commit information for all warnings.
<Git Blamer> GIT_COMMIT=8997d41357ab95eaa88702b93c75de4b1813457b, workspace=/var/lib/jenkins/workspace/Lucene-Solr-master-Linux
[WARNINGS] Computing warning deltas based on reference build #22444
Recording test results
Setting ANT_1_8_2_HOME=/var/lib/jenkins/tools/hudson.tasks.Ant_AntInstallation/ANT_1.8.2
Build step 'Publish JUnit test result report' changed build result to UNSTABLE
Email was triggered for: Unstable (Test Failures)
Sending email for trigger: Unstable (Test Failures)
Setting ANT_1_8_2_HOME=/var/lib/jenkins/tools/hudson.tasks.Ant_AntInstallation/ANT_1.8.2
Setting ANT_1_8_2_HOME=/var/lib/jenkins/tools/hudson.tasks.Ant_AntInstallation/ANT_1.8.2
Setting ANT_1_8_2_HOME=/var/lib/jenkins/tools/hudson.tasks.Ant_AntInstallation/ANT_1.8.2
Setting ANT_1_8_2_HOME=/var/lib/jenkins/tools/hudson.tasks.Ant_AntInstallation/ANT_1.8.2

Mime
View raw message