lucene-dev mailing list archives

Site index · List index
Message view « Date » · « Thread »
Top « Date » · « Thread »
From Policeman Jenkins Server <jenk...@thetaphi.de>
Subject [JENKINS] Lucene-Solr-master-MacOSX (64bit/jdk-9) - Build # 4734 - Still Failing!
Date Sun, 15 Jul 2018 12:14:36 GMT
Build: https://jenkins.thetaphi.de/job/Lucene-Solr-master-MacOSX/4734/
Java: 64bit/jdk-9 -XX:-UseCompressedOops -XX:+UseParallelGC

1 tests failed.
FAILED:  org.apache.lucene.document.TestLatLonShape.testBasicIntersects

Error Message:
Java heap space

Stack Trace:
java.lang.OutOfMemoryError: Java heap space
	at __randomizedtesting.SeedInfo.seed([83A94893C834B769:B4D4BB66F4A31417]:0)
	at org.apache.lucene.util.bkd.HeapPointWriter.<init>(HeapPointWriter.java:43)
	at org.apache.lucene.util.bkd.BKDWriter.getPointWriter(BKDWriter.java:1866)
	at org.apache.lucene.util.bkd.BKDWriter.build(BKDWriter.java:1785)
	at org.apache.lucene.util.bkd.BKDWriter.build(BKDWriter.java:1801)
	at org.apache.lucene.util.bkd.BKDWriter.build(BKDWriter.java:1801)
	at org.apache.lucene.util.bkd.BKDWriter.build(BKDWriter.java:1801)
	at org.apache.lucene.util.bkd.BKDWriter.build(BKDWriter.java:1814)
	at org.apache.lucene.util.bkd.BKDWriter.build(BKDWriter.java:1801)
	at org.apache.lucene.util.bkd.BKDWriter.build(BKDWriter.java:1801)
	at org.apache.lucene.util.bkd.BKDWriter.finish(BKDWriter.java:1004)
	at org.apache.lucene.index.RandomCodec$1$1.writeField(RandomCodec.java:139)
	at org.apache.lucene.codecs.asserting.AssertingPointsFormat$AssertingPointsWriter.writeField(AssertingPointsFormat.java:137)
	at org.apache.lucene.index.PointValuesWriter.flush(PointValuesWriter.java:183)
	at org.apache.lucene.index.DefaultIndexingChain.writePoints(DefaultIndexingChain.java:215)
	at org.apache.lucene.index.DefaultIndexingChain.flush(DefaultIndexingChain.java:141)
	at org.apache.lucene.index.DocumentsWriterPerThread.flush(DocumentsWriterPerThread.java:470)
	at org.apache.lucene.index.DocumentsWriter.doFlush(DocumentsWriter.java:554)
	at org.apache.lucene.index.DocumentsWriter.flushAllThreads(DocumentsWriter.java:719)
	at org.apache.lucene.index.IndexWriter.prepareCommitInternal(IndexWriter.java:3203)
	at org.apache.lucene.index.IndexWriter.commitInternal(IndexWriter.java:3448)
	at org.apache.lucene.index.IndexWriter.commit(IndexWriter.java:3413)
	at org.apache.lucene.index.RandomIndexWriter.getReader(RandomIndexWriter.java:403)
	at org.apache.lucene.index.RandomIndexWriter.getReader(RandomIndexWriter.java:332)
	at org.apache.lucene.document.TestLatLonShape.testBasicIntersects(TestLatLonShape.java:97)
	at java.base/jdk.internal.reflect.NativeMethodAccessorImpl.invoke0(Native Method)
	at java.base/jdk.internal.reflect.NativeMethodAccessorImpl.invoke(NativeMethodAccessorImpl.java:62)
	at java.base/jdk.internal.reflect.DelegatingMethodAccessorImpl.invoke(DelegatingMethodAccessorImpl.java:43)
	at java.base/java.lang.reflect.Method.invoke(Method.java:564)
	at com.carrotsearch.randomizedtesting.RandomizedRunner.invoke(RandomizedRunner.java:1737)
	at com.carrotsearch.randomizedtesting.RandomizedRunner$8.evaluate(RandomizedRunner.java:934)
	at com.carrotsearch.randomizedtesting.RandomizedRunner$9.evaluate(RandomizedRunner.java:970)
	at com.carrotsearch.randomizedtesting.RandomizedRunner$10.evaluate(RandomizedRunner.java:984)




Build Log:
[...truncated 9453 lines...]
   [junit4] Suite: org.apache.lucene.document.TestLatLonShape
   [junit4]   2> NOTE: reproduce with: ant test  -Dtestcase=TestLatLonShape -Dtests.method=testBasicIntersects
-Dtests.seed=83A94893C834B769 -Dtests.slow=true -Dtests.locale=ka -Dtests.timezone=Etc/GMT+8
-Dtests.asserts=true -Dtests.file.encoding=US-ASCII
   [junit4] ERROR   19.4s J0 | TestLatLonShape.testBasicIntersects <<<
   [junit4]    > Throwable #1: java.lang.OutOfMemoryError: Java heap space
   [junit4]    > 	at __randomizedtesting.SeedInfo.seed([83A94893C834B769:B4D4BB66F4A31417]:0)
   [junit4]    > 	at org.apache.lucene.util.bkd.HeapPointWriter.<init>(HeapPointWriter.java:43)
   [junit4]    > 	at org.apache.lucene.util.bkd.BKDWriter.getPointWriter(BKDWriter.java:1866)
   [junit4]    > 	at org.apache.lucene.util.bkd.BKDWriter.build(BKDWriter.java:1785)
   [junit4]    > 	at org.apache.lucene.util.bkd.BKDWriter.build(BKDWriter.java:1801)
   [junit4]    > 	at org.apache.lucene.util.bkd.BKDWriter.build(BKDWriter.java:1801)
   [junit4]    > 	at org.apache.lucene.util.bkd.BKDWriter.build(BKDWriter.java:1801)
   [junit4]    > 	at org.apache.lucene.util.bkd.BKDWriter.build(BKDWriter.java:1814)
   [junit4]    > 	at org.apache.lucene.util.bkd.BKDWriter.build(BKDWriter.java:1801)
   [junit4]    > 	at org.apache.lucene.util.bkd.BKDWriter.build(BKDWriter.java:1801)
   [junit4]    > 	at org.apache.lucene.util.bkd.BKDWriter.finish(BKDWriter.java:1004)
   [junit4]    > 	at org.apache.lucene.index.RandomCodec$1$1.writeField(RandomCodec.java:139)
   [junit4]    > 	at org.apache.lucene.codecs.asserting.AssertingPointsFormat$AssertingPointsWriter.writeField(AssertingPointsFormat.java:137)
   [junit4]    > 	at org.apache.lucene.index.PointValuesWriter.flush(PointValuesWriter.java:183)
   [junit4]    > 	at org.apache.lucene.index.DefaultIndexingChain.writePoints(DefaultIndexingChain.java:215)
   [junit4]    > 	at org.apache.lucene.index.DefaultIndexingChain.flush(DefaultIndexingChain.java:141)
   [junit4]    > 	at org.apache.lucene.index.DocumentsWriterPerThread.flush(DocumentsWriterPerThread.java:470)
   [junit4]    > 	at org.apache.lucene.index.DocumentsWriter.doFlush(DocumentsWriter.java:554)
   [junit4]    > 	at org.apache.lucene.index.DocumentsWriter.flushAllThreads(DocumentsWriter.java:719)
   [junit4]    > 	at org.apache.lucene.index.IndexWriter.prepareCommitInternal(IndexWriter.java:3203)
   [junit4]    > 	at org.apache.lucene.index.IndexWriter.commitInternal(IndexWriter.java:3448)
   [junit4]    > 	at org.apache.lucene.index.IndexWriter.commit(IndexWriter.java:3413)
   [junit4]    > 	at org.apache.lucene.index.RandomIndexWriter.getReader(RandomIndexWriter.java:403)
   [junit4]    > 	at org.apache.lucene.index.RandomIndexWriter.getReader(RandomIndexWriter.java:332)
   [junit4]    > 	at org.apache.lucene.document.TestLatLonShape.testBasicIntersects(TestLatLonShape.java:97)
   [junit4]    > 	at java.base/jdk.internal.reflect.NativeMethodAccessorImpl.invoke0(Native
Method)
   [junit4]    > 	at java.base/jdk.internal.reflect.NativeMethodAccessorImpl.invoke(NativeMethodAccessorImpl.java:62)
   [junit4]    > 	at java.base/jdk.internal.reflect.DelegatingMethodAccessorImpl.invoke(DelegatingMethodAccessorImpl.java:43)
   [junit4]    > 	at java.base/java.lang.reflect.Method.invoke(Method.java:564)
   [junit4]   2> NOTE: test params are: codec=Asserting(Lucene70): {}, docValues:{}, maxPointsInLeafNode=1376,
maxMBSortInHeap=7.059346409845096, sim=Asserting(org.apache.lucene.search.similarities.AssertingSimilarity@3ecd4069),
locale=ka, timezone=Etc/GMT+8
   [junit4]   2> NOTE: Mac OS X 10.11.6 x86_64/Oracle Corporation 9 (64-bit)/cpus=3,threads=1,free=124326232,total=477626368
   [junit4]   2> NOTE: All tests run in this JVM: [TestCoveringQuery, TestLatLonPoint,
TestDoubleRangeField, TestLatLonShape]
   [junit4] Completed [7/24 (1!)] on J0 in 19.40s, 2 tests, 1 error, 1 skipped <<<
FAILURES!

[...truncated 78 lines...]
   [junit4] JVM J0: stdout was not empty, see: /Users/jenkins/workspace/Lucene-Solr-master-MacOSX/lucene/build/sandbox/test/temp/junit4-J0-20180715_110457_78813230409105106347081.sysout
   [junit4] >>> JVM J0 emitted unexpected output (verbatim) ----
   [junit4] java.lang.OutOfMemoryError: Java heap space
   [junit4] Dumping heap to /Users/jenkins/workspace/Lucene-Solr-master-MacOSX/heapdumps/java_pid63395.hprof
...
   [junit4] Heap dump file created [422977192 bytes in 5.223 secs]
   [junit4] <<< JVM J0: EOF ----

[...truncated 14299 lines...]
BUILD FAILED
/Users/jenkins/workspace/Lucene-Solr-master-MacOSX/build.xml:633: The following error occurred
while executing this line:
/Users/jenkins/workspace/Lucene-Solr-master-MacOSX/build.xml:585: Some of the tests produced
a heap dump, but did not fail. Maybe a suppressed OutOfMemoryError? Dumps created:
* java_pid63395.hprof

Total time: 88 minutes 31 seconds
Build step 'Invoke Ant' marked build as failure
Archiving artifacts
Setting ANT_1_8_2_HOME=/Users/jenkins/tools/hudson.tasks.Ant_AntInstallation/ANT_1.8.2
[WARNINGS] Skipping publisher since build result is FAILURE
Recording test results
Setting ANT_1_8_2_HOME=/Users/jenkins/tools/hudson.tasks.Ant_AntInstallation/ANT_1.8.2
Email was triggered for: Failure - Any
Sending email for trigger: Failure - Any
Setting ANT_1_8_2_HOME=/Users/jenkins/tools/hudson.tasks.Ant_AntInstallation/ANT_1.8.2
Setting ANT_1_8_2_HOME=/Users/jenkins/tools/hudson.tasks.Ant_AntInstallation/ANT_1.8.2
Setting ANT_1_8_2_HOME=/Users/jenkins/tools/hudson.tasks.Ant_AntInstallation/ANT_1.8.2
Setting ANT_1_8_2_HOME=/Users/jenkins/tools/hudson.tasks.Ant_AntInstallation/ANT_1.8.2

Mime
View raw message