lucene-dev mailing list archives

Site index · List index
Message view « Date » · « Thread »
Top « Date » · « Thread »
From Policeman Jenkins Server <jenk...@thetaphi.de>
Subject [JENKINS] Lucene-Solr-master-Linux (64bit/jdk-9.0.4) - Build # 22457 - Unstable!
Date Sun, 15 Jul 2018 15:47:45 GMT
Build: https://jenkins.thetaphi.de/job/Lucene-Solr-master-Linux/22457/
Java: 64bit/jdk-9.0.4 -XX:-UseCompressedOops -XX:+UseSerialGC

1 tests failed.
FAILED:  org.apache.solr.handler.component.InfixSuggestersTest.testShutdownDuringBuild

Error Message:
junit.framework.AssertionFailedError: Unexpected wrapped exception type, expected CoreIsClosedException

Stack Trace:
java.util.concurrent.ExecutionException: junit.framework.AssertionFailedError: Unexpected wrapped exception type, expected CoreIsClosedException
	at __randomizedtesting.SeedInfo.seed([B97AD0EE113A064D:66F7B2512F53532F]:0)
	at java.base/java.util.concurrent.FutureTask.report(FutureTask.java:122)
	at java.base/java.util.concurrent.FutureTask.get(FutureTask.java:191)
	at org.apache.solr.handler.component.InfixSuggestersTest.testShutdownDuringBuild(InfixSuggestersTest.java:130)
	at java.base/jdk.internal.reflect.NativeMethodAccessorImpl.invoke0(Native Method)
	at java.base/jdk.internal.reflect.NativeMethodAccessorImpl.invoke(NativeMethodAccessorImpl.java:62)
	at java.base/jdk.internal.reflect.DelegatingMethodAccessorImpl.invoke(DelegatingMethodAccessorImpl.java:43)
	at java.base/java.lang.reflect.Method.invoke(Method.java:564)
	at com.carrotsearch.randomizedtesting.RandomizedRunner.invoke(RandomizedRunner.java:1737)
	at com.carrotsearch.randomizedtesting.RandomizedRunner$8.evaluate(RandomizedRunner.java:934)
	at com.carrotsearch.randomizedtesting.RandomizedRunner$9.evaluate(RandomizedRunner.java:970)
	at com.carrotsearch.randomizedtesting.RandomizedRunner$10.evaluate(RandomizedRunner.java:984)
	at com.carrotsearch.randomizedtesting.rules.SystemPropertiesRestoreRule$1.evaluate(SystemPropertiesRestoreRule.java:57)
	at org.apache.lucene.util.TestRuleSetupTeardownChained$1.evaluate(TestRuleSetupTeardownChained.java:49)
	at org.apache.lucene.util.AbstractBeforeAfterRule$1.evaluate(AbstractBeforeAfterRule.java:45)
	at org.apache.lucene.util.TestRuleThreadAndTestName$1.evaluate(TestRuleThreadAndTestName.java:48)
	at org.apache.lucene.util.TestRuleIgnoreAfterMaxFailures$1.evaluate(TestRuleIgnoreAfterMaxFailures.java:64)
	at org.apache.lucene.util.TestRuleMarkFailure$1.evaluate(TestRuleMarkFailure.java:47)
	at com.carrotsearch.randomizedtesting.rules.StatementAdapter.evaluate(StatementAdapter.java:36)
	at com.carrotsearch.randomizedtesting.ThreadLeakControl$StatementRunner.run(ThreadLeakControl.java:368)
	at com.carrotsearch.randomizedtesting.ThreadLeakControl.forkTimeoutingTask(ThreadLeakControl.java:817)
	at com.carrotsearch.randomizedtesting.ThreadLeakControl$3.evaluate(ThreadLeakControl.java:468)
	at com.carrotsearch.randomizedtesting.RandomizedRunner.runSingleTest(RandomizedRunner.java:943)
	at com.carrotsearch.randomizedtesting.RandomizedRunner$5.evaluate(RandomizedRunner.java:829)
	at com.carrotsearch.randomizedtesting.RandomizedRunner$6.evaluate(RandomizedRunner.java:879)
	at com.carrotsearch.randomizedtesting.RandomizedRunner$7.evaluate(RandomizedRunner.java:890)
	at com.carrotsearch.randomizedtesting.rules.StatementAdapter.evaluate(StatementAdapter.java:36)
	at com.carrotsearch.randomizedtesting.rules.SystemPropertiesRestoreRule$1.evaluate(SystemPropertiesRestoreRule.java:57)
	at org.apache.lucene.util.AbstractBeforeAfterRule$1.evaluate(AbstractBeforeAfterRule.java:45)
	at com.carrotsearch.randomizedtesting.rules.StatementAdapter.evaluate(StatementAdapter.java:36)
	at org.apache.lucene.util.TestRuleStoreClassName$1.evaluate(TestRuleStoreClassName.java:41)
	at com.carrotsearch.randomizedtesting.rules.NoShadowingOrOverridesOnMethodsRule$1.evaluate(NoShadowingOrOverridesOnMethodsRule.java:40)
	at com.carrotsearch.randomizedtesting.rules.NoShadowingOrOverridesOnMethodsRule$1.evaluate(NoShadowingOrOverridesOnMethodsRule.java:40)
	at com.carrotsearch.randomizedtesting.rules.StatementAdapter.evaluate(StatementAdapter.java:36)
	at com.carrotsearch.randomizedtesting.rules.StatementAdapter.evaluate(StatementAdapter.java:36)
	at org.apache.lucene.util.TestRuleAssertionsRequired$1.evaluate(TestRuleAssertionsRequired.java:53)
	at org.apache.lucene.util.TestRuleMarkFailure$1.evaluate(TestRuleMarkFailure.java:47)
	at org.apache.lucene.util.TestRuleIgnoreAfterMaxFailures$1.evaluate(TestRuleIgnoreAfterMaxFailures.java:64)
	at org.apache.lucene.util.TestRuleIgnoreTestSuites$1.evaluate(TestRuleIgnoreTestSuites.java:54)
	at com.carrotsearch.randomizedtesting.rules.StatementAdapter.evaluate(StatementAdapter.java:36)
	at com.carrotsearch.randomizedtesting.ThreadLeakControl$StatementRunner.run(ThreadLeakControl.java:368)
	at java.base/java.lang.Thread.run(Thread.java:844)
Caused by: junit.framework.AssertionFailedError: Unexpected wrapped exception type, expected CoreIsClosedException
	at org.apache.lucene.util.LuceneTestCase.expectThrows(LuceneTestCase.java:2696)
	at org.apache.solr.handler.component.InfixSuggestersTest.lambda$testShutdownDuringBuild$3(InfixSuggestersTest.java:121)
	at java.base/java.util.concurrent.FutureTask.run(FutureTask.java:264)
	at org.apache.solr.common.util.ExecutorUtil$MDCAwareThreadPoolExecutor.lambda$execute$0(ExecutorUtil.java:209)
	at java.base/java.util.concurrent.ThreadPoolExecutor.runWorker(ThreadPoolExecutor.java:1167)
	at java.base/java.util.concurrent.ThreadPoolExecutor$Worker.run(ThreadPoolExecutor.java:641)
	... 1 more
Caused by: java.lang.RuntimeException: Exception during query
	at org.apache.solr.SolrTestCaseJ4.assertQ(SolrTestCaseJ4.java:917)
	at org.apache.solr.SolrTestCaseJ4.assertQ(SolrTestCaseJ4.java:877)
	at org.apache.solr.handler.component.InfixSuggestersTest.lambda$testShutdownDuringBuild$2(InfixSuggestersTest.java:122)
	at org.apache.lucene.util.LuceneTestCase.expectThrows(LuceneTestCase.java:2688)
	... 6 more
Caused by: org.apache.solr.common.SolrException: SolrCoreState already closed.
	at org.apache.solr.update.DefaultSolrCoreState.lock(DefaultSolrCoreState.java:186)
	at org.apache.solr.update.DefaultSolrCoreState.getIndexWriter(DefaultSolrCoreState.java:121)
	at org.apache.solr.update.SolrCoreState.getTragicException(SolrCoreState.java:198)
	at org.apache.solr.core.CoreContainer.checkTragicException(CoreContainer.java:1812)
	at org.apache.solr.handler.RequestHandlerBase.handleRequest(RequestHandlerBase.java:212)
	at org.apache.solr.core.SolrCore.execute(SolrCore.java:2541)
	at org.apache.solr.util.TestHarness.query(TestHarness.java:337)
	at org.apache.solr.util.TestHarness.query(TestHarness.java:319)
	at org.apache.solr.SolrTestCaseJ4.assertQ(SolrTestCaseJ4.java:891)
	... 9 more




Build Log:
[...truncated 13234 lines...]
   [junit4] Suite: org.apache.solr.handler.component.InfixSuggestersTest
   [junit4]   2> 834766 INFO  (SUITE-InfixSuggestersTest-seed#[B97AD0EE113A064D]-worker) [    ] o.a.s.SolrTestCaseJ4 SecureRandom sanity checks: test.solr.allowed.securerandom=null & java.security.egd=file:/dev/./urandom
   [junit4]   2> Creating dataDir: /home/jenkins/workspace/Lucene-Solr-master-Linux/solr/build/solr-core/test/J1/temp/solr.handler.component.InfixSuggestersTest_B97AD0EE113A064D-001/init-core-data-001
   [junit4]   2> 834766 WARN  (SUITE-InfixSuggestersTest-seed#[B97AD0EE113A064D]-worker) [    ] o.a.s.SolrTestCaseJ4 startTrackingSearchers: numOpens=1 numCloses=1
   [junit4]   2> 834766 INFO  (SUITE-InfixSuggestersTest-seed#[B97AD0EE113A064D]-worker) [    ] o.a.s.SolrTestCaseJ4 Using PointFields (NUMERIC_POINTS_SYSPROP=true) w/NUMERIC_DOCVALUES_SYSPROP=false
   [junit4]   2> 834767 INFO  (SUITE-InfixSuggestersTest-seed#[B97AD0EE113A064D]-worker) [    ] o.a.s.SolrTestCaseJ4 Randomized ssl (true) and clientAuth (true) via: @org.apache.solr.util.RandomizeSSL(reason="", ssl=0.0/0.0, value=0.0/0.0, clientAuth=0.0/0.0)
   [junit4]   2> 834767 INFO  (SUITE-InfixSuggestersTest-seed#[B97AD0EE113A064D]-worker) [    ] o.a.s.SolrTestCaseJ4 ####initCore
   [junit4]   2> 834768 INFO  (SUITE-InfixSuggestersTest-seed#[B97AD0EE113A064D]-worker) [    ] o.a.s.c.SolrResourceLoader [null] Added 2 libs to classloader, from paths: [/home/jenkins/workspace/Lucene-Solr-master-Linux/solr/core/src/test-files/solr/collection1/lib, /home/jenkins/workspace/Lucene-Solr-master-Linux/solr/core/src/test-files/solr/collection1/lib/classes]
   [junit4]   2> 834778 INFO  (SUITE-InfixSuggestersTest-seed#[B97AD0EE113A064D]-worker) [    ] o.a.s.c.SolrConfig Using Lucene MatchVersion: 8.0.0
   [junit4]   2> 834786 INFO  (SUITE-InfixSuggestersTest-seed#[B97AD0EE113A064D]-worker) [    ] o.a.s.s.IndexSchema [null] Schema name=test
   [junit4]   2> 834853 INFO  (SUITE-InfixSuggestersTest-seed#[B97AD0EE113A064D]-worker) [    ] o.a.s.s.IndexSchema Loaded schema test/1.0 with uniqueid field id
   [junit4]   2> 835029 INFO  (SUITE-InfixSuggestersTest-seed#[B97AD0EE113A064D]-worker) [    ] o.a.s.c.TransientSolrCoreCacheDefault Allocating transient cache for 2147483647 transient cores
   [junit4]   2> 835029 INFO  (SUITE-InfixSuggestersTest-seed#[B97AD0EE113A064D]-worker) [    ] o.a.s.h.a.MetricsHistoryHandler No .system collection, keeping metrics history in memory.
   [junit4]   2> 835038 INFO  (SUITE-InfixSuggestersTest-seed#[B97AD0EE113A064D]-worker) [    ] o.a.s.m.r.SolrJmxReporter JMX monitoring for 'solr.node' (registry 'solr.node') enabled at server: com.sun.jmx.mbeanserver.JmxMBeanServer@348f8a11
   [junit4]   2> 835044 INFO  (SUITE-InfixSuggestersTest-seed#[B97AD0EE113A064D]-worker) [    ] o.a.s.m.r.SolrJmxReporter JMX monitoring for 'solr.jvm' (registry 'solr.jvm') enabled at server: com.sun.jmx.mbeanserver.JmxMBeanServer@348f8a11
   [junit4]   2> 835044 INFO  (SUITE-InfixSuggestersTest-seed#[B97AD0EE113A064D]-worker) [    ] o.a.s.m.r.SolrJmxReporter JMX monitoring for 'solr.jetty' (registry 'solr.jetty') enabled at server: com.sun.jmx.mbeanserver.JmxMBeanServer@348f8a11
   [junit4]   2> 835045 INFO  (coreLoadExecutor-5390-thread-1) [    x:collection1] o.a.s.c.SolrResourceLoader [null] Added 2 libs to classloader, from paths: [/home/jenkins/workspace/Lucene-Solr-master-Linux/solr/core/src/test-files/solr/collection1/lib, /home/jenkins/workspace/Lucene-Solr-master-Linux/solr/core/src/test-files/solr/collection1/lib/classes]
   [junit4]   2> 835058 INFO  (coreLoadExecutor-5390-thread-1) [    x:collection1] o.a.s.c.SolrConfig Using Lucene MatchVersion: 8.0.0
   [junit4]   2> 835066 INFO  (coreLoadExecutor-5390-thread-1) [    x:collection1] o.a.s.s.IndexSchema [collection1] Schema name=test
   [junit4]   2> 835144 INFO  (coreLoadExecutor-5390-thread-1) [    x:collection1] o.a.s.s.IndexSchema Loaded schema test/1.0 with uniqueid field id
   [junit4]   2> 835150 INFO  (coreLoadExecutor-5390-thread-1) [    x:collection1] o.a.s.c.CoreContainer Creating SolrCore 'collection1' using configuration from instancedir /home/jenkins/workspace/Lucene-Solr-master-Linux/solr/core/src/test-files/solr/collection1, trusted=true
   [junit4]   2> 835150 INFO  (coreLoadExecutor-5390-thread-1) [    x:collection1] o.a.s.m.r.SolrJmxReporter JMX monitoring for 'solr.core.collection1' (registry 'solr.core.collection1') enabled at server: com.sun.jmx.mbeanserver.JmxMBeanServer@348f8a11
   [junit4]   2> 835150 INFO  (coreLoadExecutor-5390-thread-1) [    x:collection1] o.a.s.c.SolrCore solr.RecoveryStrategy.Builder
   [junit4]   2> 835150 INFO  (coreLoadExecutor-5390-thread-1) [    x:collection1] o.a.s.c.SolrCore [[collection1] ] Opening new SolrCore at [/home/jenkins/workspace/Lucene-Solr-master-Linux/solr/core/src/test-files/solr/collection1], dataDir=[/home/jenkins/workspace/Lucene-Solr-master-Linux/solr/build/solr-core/test/J1/temp/solr.handler.component.InfixSuggestersTest_B97AD0EE113A064D-001/init-core-data-001/]
   [junit4]   2> 835152 INFO  (coreLoadExecutor-5390-thread-1) [    x:collection1] o.a.s.u.RandomMergePolicy RandomMergePolicy wrapping class org.apache.lucene.index.TieredMergePolicy: [TieredMergePolicy: maxMergeAtOnce=32, maxMergeAtOnceExplicit=45, maxMergedSegmentMB=74.9814453125, floorSegmentMB=1.537109375, forceMergeDeletesPctAllowed=26.833018525085603, segmentsPerTier=47.0, maxCFSSegmentSizeMB=8.796093022207999E12, noCFSRatio=1.0, reclaimDeletesWeight=0.6300648540324825
   [junit4]   2> 835288 INFO  (coreLoadExecutor-5390-thread-1) [    x:collection1] o.a.s.u.CommitTracker Hard AutoCommit: disabled
   [junit4]   2> 835288 INFO  (coreLoadExecutor-5390-thread-1) [    x:collection1] o.a.s.u.CommitTracker Soft AutoCommit: disabled
   [junit4]   2> 835289 INFO  (coreLoadExecutor-5390-thread-1) [    x:collection1] o.a.s.u.RandomMergePolicy RandomMergePolicy wrapping class org.apache.lucene.index.TieredMergePolicy: [TieredMergePolicy: maxMergeAtOnce=20, maxMergeAtOnceExplicit=26, maxMergedSegmentMB=44.1650390625, floorSegmentMB=1.4013671875, forceMergeDeletesPctAllowed=16.316230211583004, segmentsPerTier=38.0, maxCFSSegmentSizeMB=8.796093022207999E12, noCFSRatio=0.6279285588058265, reclaimDeletesWeight=3.052214617987618
   [junit4]   2> 835289 INFO  (coreLoadExecutor-5390-thread-1) [    x:collection1] o.a.s.s.SolrIndexSearcher Opening [Searcher@48b55ee8[collection1] main]
   [junit4]   2> 835289 WARN  (coreLoadExecutor-5390-thread-1) [    x:collection1] o.a.s.r.ManagedResourceStorage Cannot write to config directory /home/jenkins/workspace/Lucene-Solr-master-Linux/solr/core/src/test-files/solr/collection1/conf; switching to use InMemory storage instead.
   [junit4]   2> 835290 INFO  (coreLoadExecutor-5390-thread-1) [    x:collection1] o.a.s.h.c.SuggestComponent Initializing SuggestComponent
   [junit4]   2> 835290 INFO  (coreLoadExecutor-5390-thread-1) [    x:collection1] o.a.s.s.s.SolrSuggester init: {name=shortRandomAnalyzingInfixSuggester,lookupImpl=AnalyzingInfixLookupFactory,dictionaryImpl=RandomTestDictionaryFactory,randDictMaxItems=100,indexPath=short_random_analyzing_infix_suggester,suggestAnalyzerFieldType=text,buildOnCommit=false,buildOnStartup=false}
   [junit4]   2> 835295 INFO  (coreLoadExecutor-5390-thread-1) [    x:collection1] o.a.s.s.s.SolrSuggester Dictionary loaded with params: {name=shortRandomAnalyzingInfixSuggester,lookupImpl=AnalyzingInfixLookupFactory,dictionaryImpl=RandomTestDictionaryFactory,randDictMaxItems=100,indexPath=short_random_analyzing_infix_suggester,suggestAnalyzerFieldType=text,buildOnCommit=false,buildOnStartup=false}
   [junit4]   2> 835295 INFO  (coreLoadExecutor-5390-thread-1) [    x:collection1] o.a.s.h.c.SuggestComponent Initializing SuggestComponent
   [junit4]   2> 835295 INFO  (coreLoadExecutor-5390-thread-1) [    x:collection1] o.a.s.s.s.SolrSuggester init: {name=longRandomAnalyzingInfixSuggester,lookupImpl=AnalyzingInfixLookupFactory,dictionaryImpl=RandomTestDictionaryFactory,randDictMaxItems=100000,indexPath=long_random_analyzing_infix_suggester,suggestAnalyzerFieldType=text,buildOnCommit=false,buildOnStartup=false}
   [junit4]   2> 835295 INFO  (coreLoadExecutor-5390-thread-1) [    x:collection1] o.a.s.s.s.SolrSuggester Dictionary loaded with params: {name=longRandomAnalyzingInfixSuggester,lookupImpl=AnalyzingInfixLookupFactory,dictionaryImpl=RandomTestDictionaryFactory,randDictMaxItems=100000,indexPath=long_random_analyzing_infix_suggester,suggestAnalyzerFieldType=text,buildOnCommit=false,buildOnStartup=false}
   [junit4]   2> 835295 INFO  (coreLoadExecutor-5390-thread-1) [    x:collection1] o.a.s.h.c.SuggestComponent Initializing SuggestComponent
   [junit4]   2> 835295 INFO  (coreLoadExecutor-5390-thread-1) [    x:collection1] o.a.s.s.s.SolrSuggester init: {name=shortRandomBlendedInfixSuggester,lookupImpl=BlendedInfixLookupFactory,dictionaryImpl=RandomTestDictionaryFactory,randDictMaxItems=100,blenderType=position_linear,suggestAnalyzerFieldType=text,indexPath=short_random_blended_infix_suggester,highlight=true,buildOnStartup=false,buildOnCommit=false}
   [junit4]   2> 835295 INFO  (coreLoadExecutor-5390-thread-1) [    x:collection1] o.a.s.s.s.SolrSuggester Dictionary loaded with params: {name=shortRandomBlendedInfixSuggester,lookupImpl=BlendedInfixLookupFactory,dictionaryImpl=RandomTestDictionaryFactory,randDictMaxItems=100,blenderType=position_linear,suggestAnalyzerFieldType=text,indexPath=short_random_blended_infix_suggester,highlight=true,buildOnStartup=false,buildOnCommit=false}
   [junit4]   2> 835295 INFO  (coreLoadExecutor-5390-thread-1) [    x:collection1] o.a.s.h.ReplicationHandler Commits will be reserved for 10000ms.
   [junit4]   2> 835296 INFO  (searcherExecutor-5391-thread-1-processing-x:collection1) [    x:collection1] o.a.s.c.SolrCore [collection1] Registered new searcher Searcher@48b55ee8[collection1] main{ExitableDirectoryReader(UninvertingDirectoryReader())}
   [junit4]   2> 835297 INFO  (SUITE-InfixSuggestersTest-seed#[B97AD0EE113A064D]-worker) [    ] o.a.s.SolrTestCaseJ4 ####initCore end
   [junit4]   2> 835298 INFO  (TEST-InfixSuggestersTest.testAnalyzingInfixSuggesterBuildThenReload-seed#[B97AD0EE113A064D]) [    ] o.a.s.SolrTestCaseJ4 ###Starting testAnalyzingInfixSuggesterBuildThenReload
   [junit4]   2> 835298 INFO  (TEST-InfixSuggestersTest.testAnalyzingInfixSuggesterBuildThenReload-seed#[B97AD0EE113A064D]) [    ] o.a.s.h.c.SuggestComponent SuggestComponent prepare with : qt=/suggest_analyzing_infix_short_dictionary&suggest=true&suggest.buildAll=true&wt=xml&indent=off
   [junit4]   2> 835298 INFO  (TEST-InfixSuggestersTest.testAnalyzingInfixSuggesterBuildThenReload-seed#[B97AD0EE113A064D]) [    ] o.a.s.s.s.SolrSuggester SolrSuggester.build(shortRandomAnalyzingInfixSuggester)
   [junit4]   2> 835310 INFO  (TEST-InfixSuggestersTest.testAnalyzingInfixSuggesterBuildThenReload-seed#[B97AD0EE113A064D]) [    ] o.a.s.s.s.RandomTestDictionaryFactory org.apache.solr.spelling.suggest.RandomTestDictionaryFactory$RandomTestDictionary.enabled.shortRandomAnalyzingInfixSuggester disabled after emitting 100 items.
   [junit4]   2> 835523 INFO  (TEST-InfixSuggestersTest.testAnalyzingInfixSuggesterBuildThenReload-seed#[B97AD0EE113A064D]) [    ] o.a.s.h.c.SuggestComponent SuggestComponent process with : qt=/suggest_analyzing_infix_short_dictionary&suggest=true&suggest.buildAll=true&wt=xml&indent=off
   [junit4]   2> 835523 INFO  (TEST-InfixSuggestersTest.testAnalyzingInfixSuggesterBuildThenReload-seed#[B97AD0EE113A064D]) [    ] o.a.s.c.S.Request [collection1]  webapp=null path=null params={qt=/suggest_analyzing_infix_short_dictionary&suggest.buildAll=true&wt=xml} status=0 QTime=225
   [junit4]   2> 835524 ERROR (TEST-InfixSuggestersTest.testAnalyzingInfixSuggesterBuildThenReload-seed#[B97AD0EE113A064D]) [    ] o.a.s.c.CorePropertiesLocator Couldn't load core descriptor from /home/jenkins/workspace/Lucene-Solr-master-Linux/solr/core/src/test-files/solr/collection1/core.properties:java.nio.file.NoSuchFileException: /home/jenkins/workspace/Lucene-Solr-master-Linux/solr/core/src/test-files/solr/collection1/core.properties
   [junit4]   2> 835525 INFO  (TEST-InfixSuggestersTest.testAnalyzingInfixSuggesterBuildThenReload-seed#[B97AD0EE113A064D]) [    ] o.a.s.c.SolrResourceLoader [null] Added 2 libs to classloader, from paths: [/home/jenkins/workspace/Lucene-Solr-master-Linux/solr/core/src/test-files/solr/collection1/lib, /home/jenkins/workspace/Lucene-Solr-master-Linux/solr/core/src/test-files/solr/collection1/lib/classes]
   [junit4]   2> 835544 INFO  (TEST-InfixSuggestersTest.testAnalyzingInfixSuggesterBuildThenReload-seed#[B97AD0EE113A064D]) [    ] o.a.s.c.SolrConfig Using Lucene MatchVersion: 8.0.0
   [junit4]   2> 835550 INFO  (TEST-InfixSuggestersTest.testAnalyzingInfixSuggesterBuildThenReload-seed#[B97AD0EE113A064D]) [    ] o.a.s.s.IndexSchema [collection1] Schema name=test
   [junit4]   2> 835604 INFO  (TEST-InfixSuggestersTest.testAnalyzingInfixSuggesterBuildThenReload-seed#[B97AD0EE113A064D]) [    ] o.a.s.s.IndexSchema Loaded schema test/1.0 with uniqueid field id
   [junit4]   2> 835608 INFO  (TEST-InfixSuggestersTest.testAnalyzingInfixSuggesterBuildThenReload-seed#[B97AD0EE113A064D]) [    ] o.a.s.c.CoreContainer Reloading SolrCore 'collection1' using configuration from instancedir /home/jenkins/workspace/Lucene-Solr-master-Linux/solr/core/src/test-files/solr/collection1
   [junit4]   2> 835634 INFO  (TEST-InfixSuggestersTest.testAnalyzingInfixSuggesterBuildThenReload-seed#[B97AD0EE113A064D]) [    x:collection1] o.a.s.m.r.SolrJmxReporter JMX monitoring for 'solr.core.collection1' (registry 'solr.core.collection1') enabled at server: com.sun.jmx.mbeanserver.JmxMBeanServer@348f8a11
   [junit4]   2> 835634 INFO  (TEST-InfixSuggestersTest.testAnalyzingInfixSuggesterBuildThenReload-seed#[B97AD0EE113A064D]) [    x:collection1] o.a.s.c.SolrCore [[collection1] ] Opening new SolrCore at [/home/jenkins/workspace/Lucene-Solr-master-Linux/solr/core/src/test-files/solr/collection1], dataDir=[/home/jenkins/workspace/Lucene-Solr-master-Linux/solr/build/solr-core/test/J1/temp/solr.handler.component.InfixSuggestersTest_B97AD0EE113A064D-001/init-core-data-001/]
   [junit4]   2> 835665 INFO  (TEST-InfixSuggestersTest.testAnalyzingInfixSuggesterBuildThenReload-seed#[B97AD0EE113A064D]) [    x:collection1] o.a.s.u.CommitTracker Hard AutoCommit: disabled
   [junit4]   2> 835665 INFO  (TEST-InfixSuggestersTest.testAnalyzingInfixSuggesterBuildThenReload-seed#[B97AD0EE113A064D]) [    x:collection1] o.a.s.u.CommitTracker Soft AutoCommit: disabled
   [junit4]   2> 835666 INFO  (TEST-InfixSuggestersTest.testAnalyzingInfixSuggesterBuildThenReload-seed#[B97AD0EE113A064D]) [    x:collection1] o.a.s.s.SolrIndexSearcher Opening [Searcher@60687f0d[collection1] main]
   [junit4]   2> 835667 WARN  (TEST-InfixSuggestersTest.testAnalyzingInfixSuggesterBuildThenReload-seed#[B97AD0EE113A064D]) [    x:collection1] o.a.s.r.ManagedResourceStorage Cannot write to config directory /home/jenkins/workspace/Lucene-Solr-master-Linux/solr/core/src/test-files/solr/collection1/conf; switching to use InMemory storage instead.
   [junit4]   2> 835667 INFO  (TEST-InfixSuggestersTest.testAnalyzingInfixSuggesterBuildThenReload-seed#[B97AD0EE113A064D]) [    x:collection1] o.a.s.h.c.SuggestComponent Initializing SuggestComponent
   [junit4]   2> 835667 INFO  (TEST-InfixSuggestersTest.testAnalyzingInfixSuggesterBuildThenReload-seed#[B97AD0EE113A064D]) [    x:collection1] o.a.s.s.s.SolrSuggester init: {name=shortRandomAnalyzingInfixSuggester,lookupImpl=AnalyzingInfixLookupFactory,dictionaryImpl=RandomTestDictionaryFactory,randDictMaxItems=100,indexPath=short_random_analyzing_infix_suggester,suggestAnalyzerFieldType=text,buildOnCommit=false,buildOnStartup=false}
   [junit4]   2> 835668 INFO  (TEST-InfixSuggestersTest.testAnalyzingInfixSuggesterBuildThenReload-seed#[B97AD0EE113A064D]) [    x:collection1] o.a.s.s.s.SolrSuggester Dictionary loaded with params: {name=shortRandomAnalyzingInfixSuggester,lookupImpl=AnalyzingInfixLookupFactory,dictionaryImpl=RandomTestDictionaryFactory,randDictMaxItems=100,indexPath=short_random_analyzing_infix_suggester,suggestAnalyzerFieldType=text,buildOnCommit=false,buildOnStartup=false}
   [junit4]   2> 835668 INFO  (TEST-InfixSuggestersTest.testAnalyzingInfixSuggesterBuildThenReload-seed#[B97AD0EE113A064D]) [    x:collection1] o.a.s.h.c.SuggestComponent Initializing SuggestComponent
   [junit4]   2> 835668 INFO  (TEST-InfixSuggestersTest.testAnalyzingInfixSuggesterBuildThenReload-seed#[B97AD0EE113A064D]) [    x:collection1] o.a.s.s.s.SolrSuggester init: {name=longRandomAnalyzingInfixSuggester,lookupImpl=AnalyzingInfixLookupFactory,dictionaryImpl=RandomTestDictionaryFactory,randDictMaxItems=100000,indexPath=long_random_analyzing_infix_suggester,suggestAnalyzerFieldType=text,buildOnCommit=false,buildOnStartup=false}
   [junit4]   2> 835669 INFO  (TEST-InfixSuggestersTest.testAnalyzingInfixSuggesterBuildThenReload-seed#[B97AD0EE113A064D]) [    x:collection1] o.a.s.s.s.SolrSuggester Dictionary loaded with params: {name=longRandomAnalyzingInfixSuggester,lookupImpl=AnalyzingInfixLookupFactory,dictionaryImpl=RandomTestDictionaryFactory,randDictMaxItems=100000,indexPath=long_random_analyzing_infix_suggester,suggestAnalyzerFieldType=text,buildOnCommit=false,buildOnStartup=false}
   [junit4]   2> 835669 INFO  (TEST-InfixSuggestersTest.testAnalyzingInfixSuggesterBuildThenReload-seed#[B97AD0EE113A064D]) [    x:collection1] o.a.s.h.c.SuggestComponent Initializing SuggestComponent
   [junit4]   2> 835669 INFO  (TEST-InfixSuggestersTest.testAnalyzingInfixSuggesterBuildThenReload-seed#[B97AD0EE113A064D]) [    x:collection1] o.a.s.s.s.SolrSuggester init: {name=shortRandomBlendedInfixSuggester,lookupImpl=BlendedInfixLookupFactory,dictionaryImpl=RandomTestDictionaryFactory,randDictMaxItems=100,blenderType=position_linear,suggestAnalyzerFieldType=text,indexPath=short_random_blended_infix_suggester,highlight=true,buildOnStartup=false,buildOnCommit=false}
   [junit4]   2> 835669 INFO  (TEST-InfixSuggestersTest.testAnalyzingInfixSuggesterBuildThenReload-seed#[B97AD0EE113A064D]) [    x:collection1] o.a.s.s.s.SolrSuggester Dictionary loaded with params: {name=shortRandomBlendedInfixSuggester,lookupImpl=BlendedInfixLookupFactory,dictionaryImpl=RandomTestDictionaryFactory,randDictMaxItems=100,blenderType=position_linear,suggestAnalyzerFieldType=text,indexPath=short_random_blended_infix_suggester,highlight=true,buildOnStartup=false,buildOnCommit=false}
   [junit4]   2> 835669 INFO  (TEST-InfixSuggestersTest.testAnalyzingInfixSuggesterBuildThenReload-seed#[B97AD0EE113A064D]) [    x:collection1] o.a.s.h.ReplicationHandler Commits will be reserved for 10000ms.
   [junit4]   2> 835670 INFO  (TEST-InfixSuggestersTest.testAnalyzingInfixSuggesterBuildThenReload-seed#[B97AD0EE113A064D]) [    x:collection1] o.a.s.u.RandomMergePolicy RandomMergePolicy wrapping class org.apache.lucene.index.TieredMergePolicy: [TieredMergePolicy: maxMergeAtOnce=19, maxMergeAtOnceExplicit=43, maxMergedSegmentMB=17.880859375, floorSegmentMB=0.75390625, forceMergeDeletesPctAllowed=0.1860253350609853, segmentsPerTier=50.0, maxCFSSegmentSizeMB=8.796093022207999E12, noCFSRatio=0.6478759021617233, reclaimDeletesWeight=3.481856783361708
   [junit4]   2> 835670 INFO  (TEST-InfixSuggestersTest.testAnalyzingInfixSuggesterBuildThenReload-seed#[B97AD0EE113A064D]) [    x:collection1] o.a.s.u.DefaultSolrCoreState New IndexWriter is ready to be used.
   [junit4]   2> 835670 INFO  (searcherExecutor-5395-thread-1-processing-x:collection1) [    x:collection1] o.a.s.c.SolrCore [collection1] Registered new searcher Searcher@60687f0d[collection1] main{ExitableDirectoryReader(UninvertingDirectoryReader())}
   [junit4]   2> 835670 INFO  (TEST-InfixSuggestersTest.testAnalyzingInfixSuggesterBuildThenReload-seed#[B97AD0EE113A064D]) [    x:collection1] o.a.s.s.SolrIndexSearcher Opening [Searcher@5d832e63[collection1] main]
   [junit4]   2> 835670 INFO  (TEST-InfixSuggestersTest.testAnalyzingInfixSuggesterBuildThenReload-seed#[B97AD0EE113A064D]) [    x:collection1] o.a.s.c.SolrCore [collection1]  CLOSING SolrCore org.apache.solr.core.SolrCore@727ea20
   [junit4]   2> 835670 INFO  (TEST-InfixSuggestersTest.testAnalyzingInfixSuggesterBuildThenReload-seed#[B97AD0EE113A064D]) [    x:collection1] o.a.s.m.SolrMetricManager Closing metric reporters for registry=solr.core.collection1, tag=727ea20
   [junit4]   2> 835670 INFO  (TEST-InfixSuggestersTest.testAnalyzingInfixSuggesterBuildThenReload-seed#[B97AD0EE113A064D]) [    x:collection1] o.a.s.m.r.SolrJmxReporter Closing reporter [org.apache.solr.metrics.reporters.SolrJmxReporter@3ea9874a: rootName = null, domain = solr.core.collection1, service url = null, agent id = null] for registry solr.core.collection1 / com.codahale.metrics.MetricRegistry@62e8ce31
   [junit4]   2> 835671 INFO  (searcherExecutor-5395-thread-1-processing-x:collection1) [    x:collection1] o.a.s.c.SolrCore [collection1] Registered new searcher Searcher@5d832e63[collection1] main{ExitableDirectoryReader(UninvertingDirectoryReader())}
   [junit4]   2> 835678 INFO  (TEST-InfixSuggestersTest.testAnalyzingInfixSuggesterBuildThenReload-seed#[B97AD0EE113A064D]) [    x:collection1] o.a.s.SolrTestCaseJ4 ###Ending testAnalyzingInfixSuggesterBuildThenReload
   [junit4]   2> 835679 INFO  (TEST-InfixSuggestersTest.testShutdownDuringBuild-seed#[B97AD0EE113A064D]) [    x:collection1] o.a.s.SolrTestCaseJ4 ###Starting testShutdownDuringBuild
   [junit4]   2> 835680 INFO  (AnalyzingInfixSuggesterTest-6918-thread-1-processing-x:collection1) [    x:collection1] o.a.s.h.c.SuggestComponent SuggestComponent prepare with : qt=/suggest_analyzing_infix_long_dictionary&suggest=true&suggest.buildAll=true&wt=xml&indent=off
   [junit4]   2> 835680 INFO  (AnalyzingInfixSuggesterTest-6918-thread-1-processing-x:collection1) [    x:collection1] o.a.s.s.s.SolrSuggester SolrSuggester.build(longRandomAnalyzingInfixSuggester)
   [junit4]   2> 835748 INFO  (AnalyzingInfixSuggesterTest-6918-thread-1-processing-x:collection1) [    x:collection1] o.a.s.s.s.RandomTestDictionaryFactory org.apache.solr.spelling.suggest.RandomTestDictionaryFactory$RandomTestDictionary.enabled.longRandomAnalyzingInfixSuggester emitted 1000 items.
   [junit4]   2> 835780 INFO  (TEST-InfixSuggestersTest.testShutdownDuringBuild-seed#[B97AD0EE113A064D]) [    x:collection1] o.a.s.c.CoreContainer Shutting down CoreContainer instance=75932275
   [junit4]   2> 835780 INFO  (TEST-InfixSuggestersTest.testShutdownDuringBuild-seed#[B97AD0EE113A064D]) [    x:collection1] o.a.s.m.SolrMetricManager Closing metric reporters for registry=solr.node, tag=null
   [junit4]   2> 835780 INFO  (TEST-InfixSuggestersTest.testShutdownDuringBuild-seed#[B97AD0EE113A064D]) [    x:collection1] o.a.s.m.r.SolrJmxReporter Closing reporter [org.apache.solr.metrics.reporters.SolrJmxReporter@67cd9e87: rootName = null, domain = solr.node, service url = null, agent id = null] for registry solr.node / com.codahale.metrics.MetricRegistry@4b974255
   [junit4]   2> 835784 INFO  (TEST-InfixSuggestersTest.testShutdownDuringBuild-seed#[B97AD0EE113A064D]) [    x:collection1] o.a.s.m.SolrMetricManager Closing metric reporters for registry=solr.jvm, tag=null
   [junit4]   2> 835784 INFO  (TEST-InfixSuggestersTest.testShutdownDuringBuild-seed#[B97AD0EE113A064D]) [    x:collection1] o.a.s.m.r.SolrJmxReporter Closing reporter [org.apache.solr.metrics.reporters.SolrJmxReporter@1eda8a89: rootName = null, domain = solr.jvm, service url = null, agent id = null] for registry solr.jvm / com.codahale.metrics.MetricRegistry@4a6d74ac
   [junit4]   2> 835787 INFO  (TEST-InfixSuggestersTest.testShutdownDuringBuild-seed#[B97AD0EE113A064D]) [    x:collection1] o.a.s.m.SolrMetricManager Closing metric reporters for registry=solr.jetty, tag=null
   [junit4]   2> 835787 INFO  (TEST-InfixSuggestersTest.testShutdownDuringBuild-seed#[B97AD0EE113A064D]) [    x:collection1] o.a.s.m.r.SolrJmxReporter Closing reporter [org.apache.solr.metrics.reporters.SolrJmxReporter@5e73bd61: rootName = null, domain = solr.jetty, service url = null, agent id = null] for registry solr.jetty / com.codahale.metrics.MetricRegistry@4a027c35
   [junit4]   2> 835794 INFO  (coreCloseExecutor-5399-thread-1-processing-x:collection1) [    x:collection1] o.a.s.c.SolrCore [collection1]  CLOSING SolrCore org.apache.solr.core.SolrCore@4f15fa30
   [junit4]   2> 835794 INFO  (coreCloseExecutor-5399-thread-1-processing-x:collection1) [    x:collection1] o.a.s.m.SolrMetricManager Closing metric reporters for registry=solr.core.collection1, tag=4f15fa30
   [junit4]   2> 835794 INFO  (coreCloseExecutor-5399-thread-1-processing-x:collection1) [    x:collection1] o.a.s.m.r.SolrJmxReporter Closing reporter [org.apache.solr.metrics.reporters.SolrJmxReporter@39a5ecbb: rootName = null, domain = solr.core.collection1, service url = null, agent id = null] for registry solr.core.collection1 / com.codahale.metrics.MetricRegistry@62e8ce31
   [junit4]   2> 835800 INFO  (AnalyzingInfixSuggesterTest-6918-thread-1-processing-x:collection1) [    x:collection1] o.a.s.s.s.RandomTestDictionaryFactory org.apache.solr.spelling.suggest.RandomTestDictionaryFactory$RandomTestDictionary.enabled.longRandomAnalyzingInfixSuggester emitted 2000 items.
   [junit4]   2> 836183 ERROR (AnalyzingInfixSuggesterTest-6918-thread-1-processing-x:collection1) [    x:collection1] o.a.s.SolrTestCaseJ4 REQUEST FAILED: qt=/suggest_analyzing_infix_long_dictionary&suggest.buildAll=true&wt=xml:org.apache.solr.common.SolrException: SolrCoreState already closed.
   [junit4]   2> 	at org.apache.solr.update.DefaultSolrCoreState.lock(DefaultSolrCoreState.java:186)
   [junit4]   2> 	at org.apache.solr.update.DefaultSolrCoreState.getIndexWriter(DefaultSolrCoreState.java:121)
   [junit4]   2> 	at org.apache.solr.update.SolrCoreState.getTragicException(SolrCoreState.java:198)
   [junit4]   2> 	at org.apache.solr.core.CoreContainer.checkTragicException(CoreContainer.java:1812)
   [junit4]   2> 	at org.apache.solr.handler.RequestHandlerBase.handleRequest(RequestHandlerBase.java:212)
   [junit4]   2> 	at org.apache.solr.core.SolrCore.execute(SolrCore.java:2541)
   [junit4]   2> 	at org.apache.solr.util.TestHarness.query(TestHarness.java:337)
   [junit4]   2> 	at org.apache.solr.util.TestHarness.query(TestHarness.java:319)
   [junit4]   2> 	at org.apache.solr.SolrTestCaseJ4.assertQ(SolrTestCaseJ4.java:891)
   [junit4]   2> 	at org.apache.solr.SolrTestCaseJ4.assertQ(SolrTestCaseJ4.java:877)
   [junit4]   2> 	at org.apache.solr.handler.component.InfixSuggestersTest.lambda$testShutdownDuringBuild$2(InfixSuggestersTest.java:122)
   [junit4]   2> 	at org.apache.lucene.util.LuceneTestCase.expectThrows(LuceneTestCase.java:2688)
   [junit4]   2> 	at org.apache.solr.handler.component.InfixSuggestersTest.lambda$testShutdownDuringBuild$3(InfixSuggestersTest.java:121)
   [junit4]   2> 	at java.base/java.util.concurrent.FutureTask.run(FutureTask.java:264)
   [junit4]   2> 	at org.apache.solr.common.util.ExecutorUtil$MDCAwareThreadPoolExecutor.lambda$execute$0(ExecutorUtil.java:209)
   [junit4]   2> 	at java.base/java.util.concurrent.ThreadPoolExecutor.runWorker(ThreadPoolExecutor.java:1167)
   [junit4]   2> 	at java.base/java.util.concurrent.ThreadPoolExecutor$Worker.run(ThreadPoolExecutor.java:641)
   [junit4]   2> 	at java.base/java.lang.Thread.run(Thread.java:844)
   [junit4]   2> 
   [junit4]   2> 836184 INFO  (TEST-InfixSuggestersTest.testShutdownDuringBuild-seed#[B97AD0EE113A064D]) [    x:collection1] o.a.s.SolrTestCaseJ4 ####initCore
   [junit4]   2> 836184 INFO  (TEST-InfixSuggestersTest.testShutdownDuringBuild-seed#[B97AD0EE113A064D]) [    x:collection1] o.a.s.c.SolrResourceLoader [null] Added 2 libs to classloader, from paths: [/home/jenkins/workspace/Lucene-Solr-master-Linux/solr/core/src/test-files/solr/collection1/lib, /home/jenkins/workspace/Lucene-Solr-master-Linux/solr/core/src/test-files/solr/collection1/lib/classes]
   [junit4]   2> 836197 INFO  (TEST-InfixSuggestersTest.testShutdownDuringBuild-seed#[B97AD0EE113A064D]) [    x:collection1] o.a.s.c.SolrConfig Using Lucene MatchVersion: 8.0.0
   [junit4]   2> 836205 INFO  (TEST-InfixSuggestersTest.testShutdownDuringBuild-seed#[B97AD0EE113A064D]) [    x:collection1] o.a.s.s.IndexSchema [null] Schema name=test
   [junit4]   2> 836290 INFO  (TEST-InfixSuggestersTest.testShutdownDuringBuild-seed#[B97AD0EE113A064D]) [    x:collection1] o.a.s.s.IndexSchema Loaded schema test/1.0 with uniqueid field id
   [junit4]   2> 836416 INFO  (TEST-InfixSuggestersTest.testShutdownDuringBuild-seed#[B97AD0EE113A064D]) [    x:collection1] o.a.s.c.TransientSolrCoreCacheDefault Allocating transient cache for 2147483647 transient cores
   [junit4]   2> 836416 INFO  (TEST-InfixSuggestersTest.testShutdownDuringBuild-seed#[B97AD0EE113A064D]) [    x:collection1] o.a.s.h.a.MetricsHistoryHandler No .system collection, keeping metrics history in memory.
   [junit4]   2> 836429 INFO  (TEST-InfixSuggestersTest.testShutdownDuringBuild-seed#[B97AD0EE113A064D]) [    x:collection1] o.a.s.m.r.SolrJmxReporter JMX monitoring for 'solr.node' (registry 'solr.node') enabled at server: com.sun.jmx.mbeanserver.JmxMBeanServer@348f8a11
   [junit4]   2> 836438 INFO  (TEST-InfixSuggestersTest.testShutdownDuringBuild-seed#[B97AD0EE113A064D]) [    x:collection1] o.a.s.m.r.SolrJmxReporter JMX monitoring for 'solr.jvm' (registry 'solr.jvm') enabled at server: com.sun.jmx.mbeanserver.JmxMBeanServer@348f8a11
   [junit4]   2> 836438 INFO  (TEST-InfixSuggestersTest.testShutdownDuringBuild-seed#[B97AD0EE113A064D]) [    x:collection1] o.a.s.m.r.SolrJmxReporter JMX monitoring for 'solr.jetty' (registry 'solr.jetty') enabled at server: com.sun.jmx.mbeanserver.JmxMBeanServer@348f8a11
   [junit4]   2> 836440 INFO  (coreLoadExecutor-5409-thread-1-processing-x:collection1) [    x:collection1] o.a.s.c.SolrResourceLoader [null] Added 2 libs to classloader, from paths: [/home/jenkins/workspace/Lucene-Solr-master-Linux/solr/core/src/test-files/solr/collection1/lib, /home/jenkins/workspace/Lucene-Solr-master-Linux/solr/core/src/test-files/solr/collection1/lib/classes]
   [junit4]   2> 836451 INFO  (coreLoadExecutor-5409-thread-1-processing-x:collection1) [    x:collection1] o.a.s.c.SolrConfig Using Lucene MatchVersion: 8.0.0
   [junit4]   2> 836468 INFO  (coreLoadExecutor-5409-thread-1-processing-x:collection1) [    x:collection1] o.a.s.s.IndexSchema [collection1] Schema name=test
   [junit4]   2> 836527 INFO  (coreLoadExecutor-5409-thread-1-processing-x:collection1) [    x:collection1] o.a.s.s.IndexSchema Loaded schema test/1.0 with uniqueid field id
   [junit4]   2> 836531 INFO  (coreLoadExecutor-5409-thread-1-processing-x:collection1) [    x:collection1] o.a.s.c.CoreContainer Creating SolrCore 'collection1' using configuration from instancedir /home/jenkins/workspace/Lucene-Solr-master-Linux/solr/core/src/test-files/solr/collection1, trusted=true
   [junit4]   2> 836531 INFO  (coreLoadExecutor-5409-thread-1-processing-x:collection1) [    x:collection1] o.a.s.m.r.SolrJmxReporter JMX monitoring for 'solr.core.collection1' (registry 'solr.core.collection1') enabled at server: com.sun.jmx.mbeanserver.JmxMBeanServer@348f8a11
   [junit4]   2> 836532 INFO  (coreLoadExecutor-5409-thread-1-processing-x:collection1) [    x:collection1] o.a.s.c.SolrCore solr.RecoveryStrategy.Builder
   [junit4]   2> 836532 INFO  (coreLoadExecutor-5409-thread-1-processing-x:collection1) [    x:collection1] o.a.s.c.SolrCore [[collection1] ] Opening new SolrCore at [/home/jenkins/workspace/Lucene-Solr-master-Linux/solr/core/src/test-files/solr/collection1], dataDir=[/home/jenkins/workspace/Lucene-Solr-master-Linux/solr/build/solr-core/test/J1/temp/solr.handler.component.InfixSuggestersTest_B97AD0EE113A064D-001/init-core-data-001/]
   [junit4]   2> 836555 INFO  (coreLoadExecutor-5409-thread-1-processing-x:collection1) [    x:collection1] o.a.s.u.CommitTracker Hard AutoCommit: disabled
   [junit4]   2> 836555 INFO  (coreLoadExecutor-5409-thread-1-processing-x:collection1) [    x:collection1] o.a.s.u.CommitTracker Soft AutoCommit: disabled
   [junit4]   2> 836556 INFO  (coreLoadExecutor-5409-thread-1-processing-x:collection1) [    x:collection1] o.a.s.u.RandomMergePolicy RandomMergePolicy wrapping class org.apache.lucene.index.TieredMergePolicy: [TieredMergePolicy: maxMergeAtOnce=32, maxMergeAtOnceExplicit=45, maxMergedSegmentMB=74.9814453125, floorSegmentMB=1.537109375, forceMergeDeletesPctAllowed=26.833018525085603, segmentsPerTier=47.0, maxCFSSegmentSizeMB=8.796093022207999E12, noCFSRatio=1.0, reclaimDeletesWeight=0.6300648540324825
   [junit4]   2> 836556 INFO  (coreLoadExecutor-5409-thread-1-processing-x:collection1) [    x:collection1] o.a.s.s.SolrIndexSearcher Opening [Searcher@18f7b1d0[collection1] main]
   [junit4]   2> 836557 WARN  (coreLoadExecutor-5409-thread-1-processing-x:collection1) [    x:collection1] o.a.s.r.ManagedResourceStorage Cannot write to config directory /home/jenkins/workspace/Lucene-Solr-master-Linux/solr/core/src/test-files/solr/collection1/conf; switching to use InMemory storage instead.
   [junit4]   2> 836557 INFO  (coreLoadExecutor-5409-thread-1-processing-x:collection1) [    x:collection1] o.a.s.h.c.SuggestComponent Initializing SuggestComponent
   [junit4]   2> 836557 INFO  (coreLoadExecutor-5409-thread-1-processing-x:collection1) [    x:collection1] o.a.s.s.s.SolrSuggester init: {name=shortRandomAnalyzingInfixSuggester,lookupImpl=AnalyzingInfixLookupFactory,dictionaryImpl=RandomTestDictionaryFactory,randDictMaxItems=100,indexPath=short_random_analyzing_infix_suggester,suggestAnalyzerFieldType=text,buildOnCommit=false,buildOnStartup=false}
   [junit4]   2> 836559 INFO  (coreLoadExecutor-5409-thread-1-processing-x:collection1) [    x:collection1] o.a.s.s.s.SolrSuggester Dictionary loaded with params: {name=shortRandomAnalyzingInfixSuggester,lookupImpl=AnalyzingInfixLookupFactory,dictionaryImpl=RandomTestDictionaryFactory,randDictMaxItems=100,indexPath=short_random_analyzing_infix_suggester,suggestAnalyzerFieldType=text,buildOnCommit=false,buildOnStartup=false}
   [junit4]   2> 836559 INFO  (coreLoadExecutor-5409-thread-1-processing-x:collection1) [    x:collection1] o.a.s.h.c.SuggestComponent Initializing SuggestComponent
   [junit4]   2> 836559 INFO  (coreLoadExecutor-5409-thread-1-processing-x:collection1) [    x:collection1] o.a.s.s.s.SolrSuggester init: {name=longRandomAnalyzingInfixSuggester,lookupImpl=AnalyzingInfixLookupFactory,dictionaryImpl=RandomTestDictionaryFactory,randDictMaxItems=100000,indexPath=long_random_analyzing_infix_suggester,suggestAnalyzerFieldType=text,buildOnCommit=false,buildOnStartup=false}
   [junit4]   2> 836571 INFO  (coreLoadExecutor-5409-thread-1-processing-x:collection1) [    x:collection1] o.a.s.s.s.SolrSuggester Dictionary loaded with params: {name=longRandomAnalyzingInfixSuggester,lookupImpl=AnalyzingInfixLookupFactory,dictionaryImpl=RandomTestDictionaryFactory,randDictMaxItems=100000,indexPath=long_random_analyzing_infix_suggester,suggestAnalyzerFieldType=text,buildOnCommit=false,buildOnStartup=false}
   [junit4]   2> 836571 INFO  (coreLoadExecutor-5409-thread-1-processing-x:collection1) [    x:collection1] o.a.s.h.c.SuggestComponent Initializing SuggestComponent
   [junit4]   2> 836571 INFO  (coreLoadExecutor-5409-thread-1-processing-x:collection1) [    x:collection1] o.a.s.s.s.SolrSuggester init: {name=shortRandomBlendedInfixSuggester,lookupImpl=BlendedInfixLookupFactory,dictionaryImpl=RandomTestDictionaryFactory,randDictMaxItems=100,blenderType=position_linear,suggestAnalyzerFieldType=text,indexPath=short_random_blended_infix_suggester,highlight=true,buildOnStartup=false,buildOnCommit=false}
   [junit4]   2> 836571 INFO  (coreLoadExecutor-5409-thread-1-processing-x:collection1) [    x:collection1] o.a.s.s.s.SolrSuggester Dictionary loaded with params: {name=shortRandomBlendedInfixSuggester,lookupImpl=BlendedInfixLookupFactory,dictionaryImpl=RandomTestDictionaryFactory,randDictMaxItems=100,blenderType=position_linear,suggestAnalyzerFieldType=text,indexPath=short_random_blended_infix_suggester,highlight=true,buildOnStartup=false,buildOnCommit=false}
   [junit4]   2> 836571 INFO  (coreLoadExecutor-5409-thread-1-processing-x:collection1) [    x:collection1] o.a.s.h.ReplicationHandler Commits will be reserved for 10000ms.
   [junit4]   2> 836586 INFO  (searcherExecutor-5410-thread-1-processing-x:collection1) [    x:collection1] o.a.s.c.SolrCore [collection1] Registered new searcher Searcher@18f7b1d0[collection1] main{ExitableDirectoryReader(UninvertingDirectoryReader())}
   [junit4]   2> 836589 INFO  (TEST-InfixSuggestersTest.testShutdownDuringBuild-seed#[B97AD0EE113A064D]) [    x:collection1] o.a.s.SolrTestCaseJ4 ####initCore end
   [junit4]   2> 836590 INFO  (TEST-InfixSuggestersTest.testShutdownDuringBuild-seed#[B97AD0EE113A064D]) [    x:collection1] o.a.s.SolrTestCaseJ4 ###Ending testShutdownDuringBuild
   [junit4]   2> NOTE: reproduce with: ant test  -Dtestcase=InfixSuggestersTest -Dtests.method=testShutdownDuringBuild -Dtests.seed=B97AD0EE113A064D -Dtests.multiplier=3 -Dtests.slow=true -Dtests.locale=en-NG -Dtests.timezone=Europe/Copenhagen -Dtests.asserts=true -Dtests.file.encoding=UTF-8
   [junit4] ERROR   0.91s J1 | InfixSuggestersTest.testShutdownDuringBuild <<<
   [junit4]    > Throwable #1: java.util.concurrent.ExecutionException: junit.framework.AssertionFailedError: Unexpected wrapped exception type, expected CoreIsClosedException
   [junit4]    > 	at __randomizedtesting.SeedInfo.seed([B97AD0EE113A064D:66F7B2512F53532F]:0)
   [junit4]    > 	at java.base/java.util.concurrent.FutureTask.report(FutureTask.java:122)
   [junit4]    > 	at java.base/java.util.concurrent.FutureTask.get(FutureTask.java:191)
   [junit4]    > 	at org.apache.solr.handler.component.InfixSuggestersTest.testShutdownDuringBuild(InfixSuggestersTest.java:130)
   [junit4]    > 	at java.base/jdk.internal.reflect.NativeMethodAccessorImpl.invoke0(Native Method)
   [junit4]    > 	at java.base/jdk.internal.reflect.NativeMethodAccessorImpl.invoke(NativeMethodAccessorImpl.java:62)
   [junit4]    > 	at java.base/jdk.internal.reflect.DelegatingMethodAccessorImpl.invoke(DelegatingMethodAccessorImpl.java:43)
   [junit4]    > 	at java.base/java.lang.reflect.Method.invoke(Method.java:564)
   [junit4]    > 	at java.base/java.lang.Thread.run(Thread.java:844)
   [junit4]    > Caused by: junit.framework.AssertionFailedError: Unexpected wrapped exception type, expected CoreIsClosedException
   [junit4]    > 	at org.apache.lucene.util.LuceneTestCase.expectThrows(LuceneTestCase.java:2696)
   [junit4]    > 	at org.apache.solr.handler.component.InfixSuggestersTest.lambda$testShutdownDuringBuild$3(InfixSuggestersTest.java:121)
   [junit4]    > 	at java.base/java.util.concurrent.FutureTask.run(FutureTask.java:264)
   [junit4]    > 	at org.apache.solr.common.util.ExecutorUtil$MDCAwareThreadPoolExecutor.lambda$execute$0(ExecutorUtil.java:209)
   [junit4]    > 	at java.base/java.util.concurrent.ThreadPoolExecutor.runWorker(ThreadPoolExecutor.java:1167)
   [junit4]    > 	at java.base/java.util.concurrent.ThreadPoolExecutor$Worker.run(ThreadPoolExecutor.java:641)
   [junit4]    > 	... 1 more
   [junit4]    > Caused by: java.lang.RuntimeException: Exception during query
   [junit4]    > 	at org.apache.solr.SolrTestCaseJ4.assertQ(SolrTestCaseJ4.java:917)
   [junit4]    > 	at org.apache.solr.SolrTestCaseJ4.assertQ(SolrTestCaseJ4.java:877)
   [junit4]    > 	at org.apache.solr.handler.component.InfixSuggestersTest.lambda$testShutdownDuringBuild$2(InfixSuggestersTest.java:122)
   [junit4]    > 	at org.apache.lucene.util.LuceneTestCase.expectThrows(LuceneTestCase.java:2688)
   [junit4]    > 	... 6 more
   [junit4]    > Caused by: org.apache.solr.common.SolrException: SolrCoreState already closed.
   [junit4]    > 	at org.apache.solr.update.DefaultSolrCoreState.lock(DefaultSolrCoreState.java:186)
   [junit4]    > 	at org.apache.solr.update.DefaultSolrCoreState.getIndexWriter(DefaultSolrCoreState.java:121)
   [junit4]    > 	at org.apache.solr.update.SolrCoreState.getTragicException(SolrCoreState.java:198)
   [junit4]    > 	at org.apache.solr.core.CoreContainer.checkTragicException(CoreContainer.java:1812)
   [junit4]    > 	at org.apache.solr.handler.RequestHandlerBase.handleRequest(RequestHandlerBase.java:212)
   [junit4]    > 	at org.apache.solr.core.SolrCore.execute(SolrCore.java:2541)
   [junit4]    > 	at org.apache.solr.util.TestHarness.query(TestHarness.java:337)
   [junit4]    > 	at org.apache.solr.util.TestHarness.query(TestHarness.java:319)
   [junit4]    > 	at org.apache.solr.SolrTestCaseJ4.assertQ(SolrTestCaseJ4.java:891)
   [junit4]    > 	... 9 more
   [junit4]   2> 836592 INFO  (TEST-InfixSuggestersTest.testBuildThen2xReload-seed#[B97AD0EE113A064D]) [    x:collection1] o.a.s.SolrTestCaseJ4 ###Starting testBuildThen2xReload
   [junit4]   2> 836592 INFO  (TEST-InfixSuggestersTest.testBuildThen2xReload-seed#[B97AD0EE113A064D]) [    x:collection1] o.a.s.h.c.SuggestComponent SuggestComponent prepare with : qt=/suggest_analyzing_infix_short_dictionary&suggest=true&suggest.buildAll=true&wt=xml&indent=off
   [junit4]   2> 836592 INFO  (TEST-InfixSuggestersTest.testBuildThen2xReload-seed#[B97AD0EE113A064D]) [    x:collection1] o.a.s.s.s.SolrSuggester SolrSuggester.build(shortRandomAnalyzingInfixSuggester)
   [junit4]   2> 836596 INFO  (TEST-InfixSuggestersTest.testBuildThen2xReload-seed#[B97AD0EE113A064D]) [    x:collection1] o.a.s.s.s.RandomTestDictionaryFactory org.apache.solr.spelling.suggest.RandomTestDictionaryFactory$RandomTestDictionary.enabled.shortRandomAnalyzingInfixSuggester disabled after emitting 100 items.
   [junit4]   2> 836775 INFO  (TEST-InfixSuggestersTest.testBuildThen2xReload-seed#[B97AD0EE113A064D]) [    x:collection1] o.a.s.h.c.SuggestComponent SuggestComponent process with : qt=/suggest_analyzing_infix_short_dictionary&suggest=true&suggest.buildAll=true&wt=xml&indent=off
   [junit4]   2> 836775 INFO  (TEST-InfixSuggestersTest.testBuildThen2xReload-seed#[B97AD0EE113A064D]) [    x:collection1] o.a.s.c.S.Request [collection1]  webapp=null path=null params={qt=/suggest_analyzing_infix_short_dictionary&suggest.buildAll=true&wt=xml} status=0 QTime=183
   [junit4]   2> 836776 ERROR (TEST-InfixSuggestersTest.testBuildThen2xReload-seed#[B97AD0EE113A064D]) [    x:collection1] o.a.s.c.CorePropertiesLocator Couldn't load core descriptor from /home/jenkins/workspace/Lucene-Solr-master-Linux/solr/core/src/test-files/solr/collection1/core.properties:java.nio.file.NoSuchFileException: /home/jenkins/workspace/Lucene-Solr-master-Linux/solr/core/src/test-files/solr/collection1/core.properties
   [junit4]   2> 836776 INFO  (TEST-InfixSuggestersTest.testBuildThen2xReload-seed#[B97AD0EE113A064D]) [    x:collection1] o.a.s.c.SolrResourceLoader [null] Added 2 libs to classloader, from paths: [/home/jenkins/workspace/Lucene-Solr-master-Linux/solr/core/src/test-files/solr/collection1/lib, /home/jenkins/workspace/Lucene-Solr-master-Linux/solr/core/src/test-files/solr/collection1/lib/classes]
   [junit4]   2> 836786 INFO  (TEST-InfixSuggestersTest.testBuildThen2xReload-seed#[B97AD0EE113A064D]) [    x:collection1] o.a.s.c.SolrConfig Using Lucene MatchVersion: 8.0.0
   [junit4]   2> 836792 INFO  (TEST-InfixSuggestersTest.testBuildThen2xReload-seed#[B97AD0EE113A064D]) [    x:collection1] o.a.s.s.IndexSchema [collection1] Schema name=test
   [junit4]   2> 836857 INFO  (TEST-InfixSuggestersTest.testBuildThen2xReload-seed#[B97AD0EE113A064D]) [    x:collection1] o.a.s.s.IndexSchema Loaded schema test/1.0 with uniqueid field id
   [junit4]   2> 836861 INFO  (TEST-InfixSuggestersTest.testBuildThen2xReload-seed#[B97AD0EE113A064D]) [    x:collection1] o.a.s.c.CoreContainer Reloading SolrCore 'collection1' using configuration from instancedir /home/jenkins/workspace/Lucene-Solr-master-Linux/solr/core/src/test-files/solr/collection1
   [junit4]   2> 836881 INFO  (TEST-InfixSuggestersTest.testBuildThen2xReload-seed#[B97AD0EE113A064D]) [    x:collection1] o.a.s.m.r.SolrJmxReporter JMX monitoring for 'solr.core.collection1' (registry 'solr.core.collection1') enabled at server: com.sun.jmx.mbeanserver.JmxMBeanServer@348f8a11
   [junit4]   2> 836881 INFO  (TEST-InfixSuggestersTest.testBuildThen2xReload-seed#[B97AD0EE113A064D]) [    x:collection1] o.a.s.c.SolrCore [[collection1] ] Opening new SolrCore at [/home/jenkins/workspace/Lucene-Solr-master-Linux/solr/core/src/test-files/solr/collection1], dataDir=[/home/jenkins/workspace/Lucene-Solr-master-Linux/solr/build/solr-core/test/J1/temp/solr.handler.component.InfixSuggestersTest_B97AD0EE113A064D-001/init-core-data-001/]
   [junit4]   2> 836917 INFO  (TEST-InfixSuggestersTest.testBuildThen2xReload-seed#[B97AD0EE113A064D]) [    x:collection1] o.a.s.u.CommitTracker Hard AutoCommit: disabled
   [junit4]   2> 836917 INFO  (TEST-InfixSuggestersTest.testBuildThen2xReload-seed#[B97AD0EE113A064D]) [    x:collection1] o.a.s.u.CommitTracker Soft AutoCommit: disabled
   [junit4]   2> 836918 INFO  (TEST-InfixSuggestersTest.testBuildThen2xReload-seed#[B97AD0EE113A064D]) [    x:collection1] o.a.s.s.SolrIndexSearcher Opening [Searcher@3a36ac5a[collection1] main]
   [junit4]   2> 836919 WARN  (TEST-InfixSuggestersTest.testBuildThen2xReload-seed#[B97AD0EE113A064D]) [    x:collection1] o.a.s.r.ManagedResourceStorage Cannot write to config directory /home/jenkins/workspace/Lucene-Solr-master-Linux/solr/core/src/test-files/solr/collection1/conf; switching to use InMemory storage instead.
   [junit4]   2> 836919 INFO  (TEST-InfixSuggestersTest.testBuildThen2xReload-seed#[B97AD0EE113A064D]) [    x:collection1] o.a.s.h.c.SuggestComponent Initializing SuggestComponent
   [junit4]   2> 836919 INFO  (TEST-InfixSuggestersTest.testBuildThen2xReload-seed#[B97AD0EE113A064D]) [    x:collection1] o.a.s.s.s.SolrSuggester init: {name=shortRandomAnalyzingInfixSuggester,lookupImpl=AnalyzingInfixLookupFactory,dictionaryImpl=RandomTestDictionaryFactory,randDictMaxItems=100,indexPath=short_random_analyzing_infix_suggester,suggestAnalyzerFieldType=text,buildOnCommit=false,buildOnStartup=false}
   [junit4]   2> 836920 INFO  (TEST-InfixSuggestersTest.testBuildThen2xReload-seed#[B97AD0EE113A064D]) [    x:collection1] o.a.s.s.s.SolrSuggester Dictionary loaded with params: {name=shortRandomAnalyzingInfixSuggester,lookupImpl=AnalyzingInfixLookupFactory,dictionaryImpl=RandomTestDictionaryFactory,randDictMaxItems=100,indexPath=short_random_analyzing_infix_suggester,suggestAnalyzerFieldType=text,buildOnCommit=false,buildOnStartup=false}
   [junit4]   2> 836920 INFO  (TEST-InfixSuggestersTest.testBuildThen2xReload-seed#[B97AD0EE113A064D]) [    x:collection1] o.a.s.h.c.SuggestComponent Initializing SuggestComponent
   [junit4]   2> 836920 INFO  (TEST-InfixSuggestersTest.testBuildThen2xReload-seed#[B97AD0EE113A064D]) [    x:collection1] o.a.s.s.s.SolrSuggester init: {name=longRandomAnalyzingInfixSuggester,lookupImpl=AnalyzingInfixLookupFactory,dictionaryImpl=RandomTestDictionaryFactory,randDictMaxItems=100000,indexPath=long_random_analyzing_infix_suggester,suggestAnalyzerFieldType=text,buildOnCommit=false,buildOnStartup=false}
   [junit4]   2> 836928 INFO  (TEST-InfixSuggestersTest.testBuildThen2xReload-seed#[B97AD0EE113A064D]) [    x:collection1] o.a.s.s.s.SolrSuggester Dictionary loaded with params: {name=longRandomAnalyzingInfixSuggester,lookupImpl=AnalyzingInfixLookupFactory,dictionaryImpl=RandomTestDictionaryFactory,randDictMaxItems=100000,indexPath=long_random_analyzing_infix_suggester,suggestAnalyzerFieldType=text,buildOnCommit=false,buildOnStartup=false}
   [junit4]   2> 836928 INFO  (TEST-InfixSuggestersTest.testBuildThen2xReload-seed#[B97AD0EE113A064D]) [    x:collection1] o.a.s.h.c.SuggestComponent Initializing SuggestComponent
   [junit4]   2> 836928 INFO  (TEST-InfixSuggestersTest.testBuildThen2xReload-seed#[B97AD0EE113A064D]) [    x:collection1] o.a.s.s.s.SolrSuggester init: {name=shortRandomBlendedInfixSuggester,lookupImpl=BlendedInfixLookupFactory,dictionaryImpl=RandomTestDictionaryFactory,randDictMaxItems=100,blenderType=position_linear,suggestAnalyzerFieldType=text,indexPath=short_random_blended_infix_suggester,highlight=true,buildOnStartup=false,buildOnCommit=false}
   [junit4]   2> 836928 INFO  (TEST-InfixSuggestersTest.testBuildThen2xReload-seed#[B97AD0EE113A064D]) [    x:collection1] o.a.s.s.s.SolrSuggester Dictionary loaded with params: {name=shortRandomBlendedInfixSuggester,lookupImpl=BlendedInfixLookupFactory,dictionaryImpl=RandomTestDictionaryFactory,randDictMaxItems=100,blenderType=position_linear,suggestAnalyzerFieldType=text,indexPath=short_random_blended_infix_suggester,highlight=true,buildOnStartup=false,buildOnCommit=false}
   [junit4]   2> 836928 INFO  (TEST-InfixSuggestersTest.testBuildThen2xReload-seed#[B97AD0EE113A064D]) [    x:collection1] o.a.s.h.ReplicationHandler Commits will be reserved for 10000ms.
   [junit4]   2> 836928 INFO  (TEST-InfixSuggestersTest.testBuildThen2xReload-seed#[B97AD0EE113A064D]) [    x:collection1] o.a.s.u.RandomMergePolicy RandomMergePolicy wrapping class org.apache.lucene.index.TieredMergePolicy: [TieredMergePolicy: maxMergeAtOnce=47, maxMergeAtOnceExplicit=32, maxMergedSegmentMB=12.779296875, floorSegmentMB=1.1416015625, forceMergeDeletesPctAllowed=12.522481127341091, segmentsPerTier=50.0, maxCFSSegmentSizeMB=8.796093022207999E12, noCFSRatio=0.0, reclaimDeletesWeight=0.5270724969053653
   [junit4]   2> 836929 INFO  (TEST-InfixSuggestersTest.testBuildThen2xReload-seed#[B97AD0EE113A064D]) [    x:collection1] o.a.s.u.DefaultSolrCoreState New IndexWriter is ready to be used.
   [junit4]   2> 836929 INFO  (searcherExecutor-5414-thread-1-processing-x:collection1) [    x:collection1] o.a.s.c.SolrCore [collection1] Registered new searcher Searcher@3a36ac5a[collection1] main{ExitableDirectoryReader(UninvertingDirectoryReader())}
   [junit4]   2> 836929 INFO  (TEST-InfixSuggestersTest.testBuildThen2xReload-seed#[B97AD0EE113A064D]) [    x:collection1] o.a.s.s.SolrIndexSearcher Opening [Searcher@72f5f354[collection1] main]
   [junit4]   2> 836930 INFO  (TEST-InfixSuggestersTest.testBuildThen2xReload-seed#[B97AD0EE113A064D]) [    x:collection1] o.a.s.c.SolrCore [collection1]  CLOSING SolrCore org.apache.solr.core.SolrCore@5c6fe1e2
   [junit4]   2> 836930 INFO  (TEST-InfixSuggestersTest.testBuildThen2xReload-seed#[B97AD0EE113A064D]) [    x:collection1] o.a.s.m.SolrMetricManager Closing metric reporters for registry=solr.core.collection1, tag=5c6fe1e2
   [junit4]   2> 836930 INFO  (TEST-InfixSuggestersTest.testBuildThen2xReload-seed#[B97AD0EE113A064D]) [    x:collection1] o.a.s.m.r.SolrJmxReporter Closing reporter [org.apache.solr.metrics.reporters.SolrJmxReporter@37e0540f: rootName = null, domain = solr.core.collection1, service url = null, agent id = null] for registry solr.core.collection1 / com.codahale.metrics.MetricRegistry@63bccf88
   [junit4]   2> 836930 INFO  (searcherExecutor-5414-thread-1-processing-x:collection1) [    x:collection1] o.a.s.c.SolrCore [collection1] Registered new searcher Searcher@72f5f354[collection1] main{ExitableDirectoryReader(UninvertingDirectoryReader())}
   [junit4]   2> 836936 ERROR (TEST-InfixSuggestersTest.testBuildThen2xReload-seed#[B97AD0EE113A064D]) [    x:collection1] o.a.s.c.CorePropertiesLocator Couldn't load core descriptor from /home/jenkins/workspace/Lucene-Solr-master-Linux/solr/core/src/test-files/solr/collection1/core.properties:java.nio.file.NoSuchFileException: /home/jenkins/workspace/Lucene-Solr-master-Linux/solr/core/src/test-files/solr/collection1/core.properties
   [junit4]   2> 836937 INFO  (TEST-InfixSuggestersTest.testBuildThen2xReload-seed#[B97AD0EE113A064D]) [    x:collection1] o.a.s.c.SolrResourceLoader [null] Added 2 libs to classloader, from paths: [/home/jenkins/workspace/Lucene-Solr-master-Linux/solr/core/src/test-files/solr/collection1/lib, /home/jenkins/workspace/Lucene-Solr-master-Linux/solr/core/src/test-files/solr/collection1/lib/classes]
   [junit4]   2> 836947 INFO  (TEST-InfixSuggestersTest.testBuildThen2xReload-seed#[B97AD0EE113A064D]) [    x:collection1] o.a.s.c.SolrConfig Using Lucene MatchVersion: 8.0.0
   [junit4]   2> 836953 INFO  (TEST-InfixSuggestersTest.testBuildThen2xReload-seed#[B97AD0EE113A064D]) [    x:collection1] o.a.s.s.IndexSchema [collection1] Schema name=test
   [junit4]   2> 837024 INFO  (TEST-InfixSuggestersTest.testBuildThen2xReload-seed#[B97AD0EE113A064D]) [    x:collection1] o.a.s.s.IndexSchema Loaded schema test/1.0 with uniqueid field id
   [junit4]   2> 837028 INFO  (TEST-InfixSuggestersTest.testBuildThen2xReload-seed#[B97AD0EE113A064D]) [    x:collection1] o.a.s.c.CoreContainer Reloading SolrCore 'collection1' using configuration from instancedir /home/jenkins/workspace/Lucene-Solr-master-Linux/solr/core/src/test-files/solr/collection1
   [junit4]   2> 837045 INFO  (TEST-InfixSuggestersTest.testBuildThen2xReload-seed#[B97AD0EE113A064D]) [    x:collection1] o.a.s.m.r.SolrJmxReporter JMX monitoring for 'solr.core.collection1' (registry 'solr.core.collection1') enabled at server: com.sun.jmx.mbeanserver.JmxMBeanServer@348f8a11
   [junit4]   2> 837045 INFO  (TEST-InfixSuggestersTest.testBuildThen2xReload-seed#[B97AD0EE113A064D]) [    x:collection1] o.a.s.c.SolrCore [[collection1] ] Opening new SolrCore at [/home/jenkins/workspace/Lucene-Solr-master-Linux/solr/core/src/test-files/solr/collection1], dataDir=[/home/jenkins/workspace/Lucene-Solr-master-Linux/solr/build/solr-core/test/J1/temp/solr.handler.component.InfixSuggestersTest_B97AD0EE113A064D-001/init-core-data-001/]
   [junit4]   2> 837073 INFO  (TEST-InfixSuggestersTest.testBuildThen2xReload-seed#[B97AD0EE113A064D]) [    x:collection1] o.a.s.u.CommitTracker Hard AutoCommit: disabled
   [junit4]   2> 837073 INFO  (TEST-InfixSuggestersTest.testBuildThen2xReload-seed#[B97AD0EE113A064D]) [    x:collection1] o.a.s.u.CommitTracker Soft AutoCommit: disabled
   [junit4]   2> 837074 INFO  (TEST-InfixSuggestersTest.testBuildThen2xReload-seed#[B97AD0EE113A064D]) [    x:collection1] o.a.s.s.SolrIndexSearcher Opening [Searcher@4658c3ce[collection1] main]
   [junit4]   2> 837074 WARN  (TEST-InfixSuggestersTest.testBuildThen2xReload-seed#[B97AD0EE113A064D]) [    x:collection1] o.a.s.r.ManagedResourceStorage Cannot write to config directory /home/jenkins/workspace/Lucene-Solr-master-Linux/solr/core/src/test-files/solr/collection1/conf; switching to use InMemory storage instead.
   [junit4]   2> 837074 INFO  (TEST-InfixSuggestersTest.testBuildThen2xReload-seed#[B97AD0EE113A064D]) [    x:collection1] o.a.s.h.c.SuggestComponent Initializing SuggestComponent
   [junit4]   2> 837074 INFO  (TEST-InfixSuggestersTest.testBuildThen2xReload-seed#[B97AD0EE113A064D]) [    x:collection1] o.a.s.s.s.SolrSuggester init: {name=shortRandomAnalyzingInfixSuggester,lookupImpl=AnalyzingInfixLookupFactory,dictionaryImpl=RandomTestDictionaryFactory,randDictMaxItems=100,indexPath=short_random_analyzing_infix_suggester,suggestAnalyzerFieldType=text,buildOnCommit=false,buildOnStartup=false}
   [junit4]   2> 837075 INFO  (TEST-InfixSuggestersTest.testBuildThen2xReload-seed#[B97AD0EE113A064D]) [    x:collection1] o.a.s.s.s.SolrSuggester Dictionary loaded with params: {name=shortRandomAnalyzingInfixSuggester,lookupImpl=AnalyzingInfixLookupFactory,dictionaryImpl=RandomTestDictionaryFactory,randDictMaxItems=100,indexPath=short_random_analyzing_infix_suggester,suggestAnalyzerFieldType=text,buildOnCommit=false,buildOnStartup=false}
   [junit4]   2> 837075 INFO  (TEST-InfixSuggestersTest.testBuildThen2xReload-seed#[B97AD0EE113A064D]) [    x:collection1] o.a.s.h.c.SuggestComponent Initializing SuggestComponent
   [junit4]   2> 837075 INFO  (TEST-InfixSuggestersTest.testBuildThen2xReload-seed#[B97AD0EE113A064D]) [    x:collection1] o.a.s.s.s.SolrSuggester init: {name=longRandomAnalyzingInfixSuggester,lookupImpl=AnalyzingInfixLookupFactory,dictionaryImpl=RandomTestDictionaryFactory,randDictMaxItems=100000,indexPath=long_random_analyzing_infix_suggester,suggestAnalyzerFieldType=text,buildOnCommit=false,buildOnStartup=false}
   [junit4]   2> 837080 INFO  (TEST-InfixSuggestersTest.testBuildThen2xReload-seed#[B97AD0EE113A064D]) [    x:collection1] o.a.s.s.s.SolrSuggester Dictionary loaded with params: {name=longRandomAnalyzingInfixSuggester,lookupImpl=AnalyzingInfixLookupFactory,dictionaryImpl=RandomTestDictionaryFactory,randDictMaxItems=100000,indexPath=long_random_analyzing_infix_suggester,suggestAnalyzerFieldType=text,buildOnCommit=false,buildOnStartup=false}
   [junit4]   2> 837080 INFO  (TEST-InfixSuggestersTest.testBuildThen2xReload-seed#[B97AD0EE113A064D]) [    x:collection1] o.a.s.h.c.SuggestComponent Initializing SuggestComponent
   [junit4]   2> 837080 INFO  (TEST-InfixSuggestersTest.testBuildThen2xReload-seed#[B97AD0EE113A064D]) [    x:collection1] o.a.s.s.s.SolrSuggester init: {name=shortRandomBlendedInfixSuggester,lookupImpl=BlendedInfixLookupFactory,dictionaryImpl=RandomTestDictionaryFactory,randDictMaxItems=100,blenderType=position_linear,suggestAnalyzerFieldType=text,indexPath=short_random_blended_infix_suggester,highlight=true,buildOnStartup=false,buildOnCommit=false}
   [junit4]   2> 837095 INFO  (TEST-InfixSuggestersTest.testBuildThen2xReload-seed#[B97AD0EE113A064D]) [    x:collection1] o.a.s.s.s.SolrSuggester Dictionary loaded with params: {name=shortRandomBlendedInfixSuggester,lookupImpl=BlendedInfixLookupFactory,dictionaryImpl=RandomTestDictionaryFactory,randDictMaxItems=100,blenderType=position_linear,suggestAnalyzerFieldType=text,indexPath=short_random_blended_infix_suggester,highlight=true,buildOnStartup=false,buildOnCommit=false}
   [junit4]   2> 837095 INFO  (TEST-InfixSuggestersTest.testBuildThen2xReload-seed#[B97AD0EE113A064D]) [    x:collection1] o.a.s.h.ReplicationHandler Commits will be reserved for 10000ms.
   [junit4]   2> 837096 INFO  (TEST-InfixSuggestersTest.testBuildThen2xReload-seed#[B97AD0EE113A064D]) [    x:collection1] o.a.s.u.RandomMergePolicy RandomMergePolicy wrapping class org.apache.lucene.index.TieredMergePolicy: [TieredMergePolicy: maxMergeAtOnce=47, maxMergeAtOnceExplicit=39, maxMergedSegmentMB=41.681640625, floorSegmentMB=0.41796875, forceMergeDeletesPctAllowed=11.49145143618859, segmentsPerTier=10.0, maxCFSSegmentSizeMB=8.796093022207999E12, noCFSRatio=0.47016189791698737, reclaimDeletesWeight=1.2364360387026427
   [junit4]   2> 837096 INFO  (TEST-InfixSuggestersTest.testBuildThen2xReload-seed#[B97AD0EE113A064D]) [    x:collection1] o.a.s.u.DefaultSolrCoreState New IndexWriter is ready to be used.
   [junit4]   2> 837097 INFO  (searcherExecutor-5418-thread-1-processing-x:collection1) [    x:collection1] o.a.s.c.SolrCore [collection1] Registered new searcher Searcher@4658c3ce[collection1] main{ExitableDirectoryReader(UninvertingDirectoryReader())}
   [junit4]   2> 837097 INFO  (TEST-InfixSuggestersTest.testBuildThen2xReload-seed#[B97AD0EE113A064D]) [    x:collection1] o.a.s.s.SolrIndexSearcher Opening [Searcher@37a8602[collection1] main]
   [junit4]   2> 837097 INFO  (TEST-InfixSuggestersTest.testBuildThen2xReload-seed#[B97AD0EE113A064D]) [    x:collection1] o.a.s.c.SolrCore [collection1]  CLOSING SolrCore org.apache.solr.core.SolrCore@1ac3816d
   [junit4]   2> 837098 INFO  (TEST-InfixSuggestersTest.testBuildThen2xReload-seed#[B97AD0EE113A064D]) [    x:collection1] o.a.s.m.SolrMetricManager Closing metric reporters for registry=solr.core.collection1, tag=1ac3816d
   [junit4]   2> 837098 INFO  (TEST-InfixSuggestersTest.testBuildThen2xReload-seed#[B97AD0EE113A064D]) [    x:collection1] o.a.s.m.r.SolrJmxReporter Closing reporter [org.apache.solr.metrics.reporters.SolrJmxReporter@657b3e99: rootName = null, domain = solr.core.collection1, service url = null, agent id = null] for registry solr.core.collection1 / com.codahale.metrics.MetricRegistry@63bccf88
   [junit4]   2> 837098 INFO  (searcherExecutor-5418-thread-1-processing-x:collection1) [    x:collection1] o.a.s.c.SolrCore [collection1] Registered new searcher Searcher@37a8602[collection1] main{ExitableDirectoryReader(UninvertingDirectoryReader())}
   [junit4]   2> 837108 INFO  (TEST-InfixSuggestersTest.testBuildThen2xReload-seed#[B97AD0EE113A064D]) [    x:collection1] o.a.s.SolrTestCaseJ4 ###Ending testBuildThen2xReload
   [junit4]   2> 837109 INFO  (TEST-InfixSuggestersTest.test2xBuildReload-seed#[B97AD0EE113A064D]) [    x:collection1] o.a.s.SolrTestCaseJ4 ###Starting test2xBuildReload
   [junit4]   2> 837109 INFO  (TEST-InfixSuggestersTest.test2xBuildReload-seed#[B97AD0EE113A064D]) [    x:collection1] o.a.s.h.c.SuggestComponent SuggestComponent prepare with : qt=/suggest_analyzing_infix_short_dictionary&suggest=true&suggest.buildAll=true&wt=xml&indent=off
   [junit4]   2> 837109 INFO  (TEST-InfixSuggestersTest.test2xBuildReload-seed#[B97AD0EE113A064D]) [    x:collection1] o.a.s.s.s.SolrSuggester SolrSuggester.build(shortRandomAnalyzingInfixSuggester)
   [junit4]   2> 837113 INFO  (TEST-InfixSuggestersTest.test2xBuildReload-seed#[B97AD0EE113A064D]) [    x:collection1] o.a.s.s.s.RandomTestDictionaryFactory org.apache.solr.spelling.suggest.RandomTestDictionaryFactory$RandomTestDictionary.enabled.shortRandomAnalyzingInfixSuggester disabled after emitting 100 items.
   [junit4]   2> 837265 INFO  (TEST-InfixSuggestersTest.test2xBuildReload-seed#[B97AD0EE113A064D]) [    x:collection1] o.a.s.h.c.SuggestComponent SuggestComponent process with : qt=/suggest_analyzing_infix_short_dictionary&suggest=true&suggest.buildAll=true&wt=xml&indent=off
   [junit4]   2> 837265 INFO  (TEST-InfixSuggestersTest.test2xBuildReload-seed#[B97AD0EE113A064D]) [    x:collection1] o.a.s.c.S.Request [collection1]  webapp=null path=null params={qt=/suggest_analyzing_infix_short_dictionary&suggest.buildAll=true&wt=xml} status=0 QTime=155
   [junit4]   2> 837265 ERROR (TEST-InfixSuggestersTest.test2xBuildReload-seed#[B97AD0EE113A064D]) [    x:collection1] o.a.s.c.CorePropertiesLocator Couldn't load core descriptor from /home/jenkins/workspace/Lucene-Solr-master-Linux/solr/core/src/test-files/solr/collection1/core.properties:java.nio.file.NoSuchFileException: /home/jenkins/workspace/Lucene-Solr-master-Linux/solr/core/src/test-files/solr/collection1/core.properties
   [junit4]   2> 837266 INFO  (TEST-InfixSuggestersTest.test2xBuildReload-seed#[B97AD0EE113A064D]) [    x:collection1] o.a.s.c.SolrResourceLoader [null] Added 2 libs to classloader, from paths: [/home/jenkins/workspace/Lucene-Solr-master-Linux/solr/core/src/test-files/solr/collection1/lib, /home/jenkins/workspace/Lucene-Solr-master-Linux/solr/core/src/test-files/solr/collection1/lib/classes]
   [junit4]   2> 837280 INFO  (TEST-InfixSuggestersTest.test2xBuildReload-seed#[B97AD0EE113A064D]) [    x:collection1] o.a.s.c.SolrConfig Using Lucene MatchVersion: 8.0.0
   [junit4]   2> 837289 INFO  (TEST-InfixSuggestersTest.test2xBuildReload-seed#[B97AD0EE113A064D]) [    x:collection1] o.a.s.s.IndexSchema [collection1] Schema name=test
   [junit4]   2> 837383 INFO  (TEST-InfixSuggestersTest.test2xBuildReload-seed#[B97AD0EE113A064D]) [    x:collection1] o.a.s.s.IndexSchema Loaded schema test/1.0 with uniqueid field id
   [junit4]   2> 837389 INFO  (TEST-InfixSuggestersTest.test2xBuildReload-seed#[B97AD0EE113A064D]) [    x:collection1] o.a.s.c.CoreContainer Reloading SolrCore 'collection1' using configuration from instancedir /home/jenkins/workspace/Lucene-Solr-master-Linux/solr/core/src/test-files/solr/collection1
   [junit4]   2> 837417 INFO  (TEST-InfixSuggestersTest.test2xBuildReload-seed#[B97AD0EE113A064D]) [    x:collection1] o.a.s.m.r.SolrJmxReporter JMX monitoring for 'solr.core.collection1' (registry 'solr.core.collection1') enabled at server: com.sun.jmx.mbeanserver.JmxMBeanServer@348f8a11
   [junit4]   2> 837417 INFO  (TEST-InfixSuggestersTest.test2xBuildReload-seed#[B97AD0EE113A064D]) [    x:collection1] o.a.s.c.SolrCore [[collection1] ] Opening new SolrCore at [/home/jenkins/workspace/Lucene-Solr-master-Linux/solr/core/src/test-files/solr/collection1], dataDir=[/home/jenkins/workspace/Lucene-Solr-master-Linux/solr/build/solr-core/test/J1/temp/solr.handler.component.InfixSuggestersTest_B97AD0EE113A064D-001/init-core-data-001/]
   [junit4]   2> 837459 INFO  (TEST-InfixSuggestersTest.test2xBuildReload-seed#[B97AD0EE113A064D]) [    x:collection1] o.a.s.u.CommitTracker Hard AutoCommit: disabled
   [junit4]   2> 837459 INFO  (TEST-InfixSuggestersTest.test2xBuildReload-seed#[B97AD0EE113A064D]) [    x:collection1] o.a.s.u.CommitTracker Soft AutoCommit: disabled
   [junit4]   2> 837461 INFO  (TEST-InfixSuggestersTest.test2xBuildReload-seed#[B97AD0EE113A064D]) [    x:collection1] o.a.s.s.SolrIndexSearcher Opening [Searcher@759e9242[collection1] main]
   [junit4]   2> 837461 WARN  (TEST-InfixSuggestersTest.test2xBuildReload-seed#[B97AD0EE113A064D]) [    x:collection1] o.a.s.r.ManagedResourceStorage Cannot write to config directory /home/jenkins/workspace/Lucene-Solr-master-Linux/solr/core/src/test-files/solr/collection1/conf; switching to use InMemory storage instead.
   [junit4]   2> 837462 INFO  (TEST-InfixSuggestersTest.test2xBuildReload-seed#[B97AD0EE113A064D]) [    x:collection1] o.a.s.h.c.SuggestComponent Initializing SuggestComponent
   [junit4]   2> 837462 INFO  (TEST-InfixSuggestersTest.test2xBuildReload-seed#[B97AD0EE113A064D]) [    x:collection1] o.a.s.s.s.SolrSuggester init: {name=shortRandomAnalyzingInfixSuggester,lookupImpl=AnalyzingInfixLookupFactory,dictionaryImpl=RandomTestDictionaryFactory,randDictMaxItems=100,indexPath=short_random_analyzing_infix_suggester,suggestAnalyzerFieldType=text,buildOnCommit=false,buildOnStartup=false}
   [junit4]   2> 837463 INFO  (TEST-InfixSuggestersTest.test2xBuildReload-seed#[B97AD0EE113A064D]) [    x:collection1] o.a.s.s.s.SolrSuggester Dictionary loaded with params: {name=shortRandomAnalyzingInfixSuggester,lookupImpl=AnalyzingInfixLookupFactory,dictionaryImpl=RandomTestDictionaryFactory,randDictMaxItems=100,indexPath=short_random_analyzing_infix_suggester,suggestAnalyzerFieldType=text,buildOnCommit=false,buildOnStartup=false}
   [junit4]   2> 837463 INFO  (TEST-InfixSuggestersTest.test2xBuildReload-seed#[B97AD0EE113A064D]) [    x:collection1] o.a.s.h.c.SuggestComponent Initializing SuggestComponent
   [junit4]   2> 837463 INFO  (TEST-InfixSuggestersTest.test2xBuildReload-seed#[B97AD0EE113A064D]) [    x:collection1] o.a.s.s.s.SolrSuggester init: {name=longRandomAnalyzingInfixSuggester,lookupImpl=AnalyzingInfixLookupFactory,dictionaryImpl=RandomTestDictionaryFactory,randDictMaxItems=100000,indexPath=long_random_analyzing_infix_suggester,suggestAnalyzerFieldType=text,buildOnCommit=false,buildOnStartup=false}
   [junit4]   2> 837469 INFO  (TEST-InfixSuggestersTest.test2xBuildReload-seed#[B97AD0EE113A064D]) [    x:collection1] o.a.s.s.s.SolrSuggester Dictionary loaded with params: {name=longRandomAnalyzingInfixSuggester,lookupImpl=AnalyzingInfixLookupFactory,dictionaryImpl=RandomTestDictionaryFactory,randDictMaxItems=100000,indexPath=long_random_analyzing_infix_suggester,suggestAnalyzerFieldType=text,buildOnCommit=false,buildOnStartup=false}
   [junit4]   2> 837469 INFO  (TEST-InfixSuggestersTest.test2xBuildReload-seed#[B97AD0EE113A064D]) [    x:collection1] o.a.s.h.c.SuggestComponent Initializing SuggestComponent
   [junit4]   2> 837469 INFO  (TEST-InfixSuggestersTest.test2xBuildReload-seed#[B97AD0EE113A064D]) [    x:collection1] o.a.s.s.s.SolrSuggester init: {name=shortRandomBlendedInfixSuggester,lookupImpl=BlendedInfixLookupFactory,dictionaryImpl=RandomTestDictionaryFactory,randDictMaxItems=100,blenderType=position_linear,suggestAnalyzerFieldType=text,indexPath=short_random_blended_infix_suggester,highlight=true,buildOnStartup=false,buildOnCommit=false}
   [junit4]   2> 837469 INFO  (TEST-InfixSuggestersTest.test2xBuildReload-seed#[B97AD0EE113A064D]) [    x:collection1] o.a.s.s.s.SolrSuggester Dictionary loaded with params: {name=shortRandomBlendedInfixSuggester,lookupImpl=BlendedInfixLookupFactory,dictionaryImpl=RandomTestDictionaryFactory,randDictMaxItems=100,blenderType=position_linear,suggestAnalyzerFieldType=text,indexPath=short_random_blended_infix_suggester,highlight=true,buildOnStartup=false,buildOnCommit=false}
   [junit4]   2> 837469 INFO  (TEST-InfixSuggestersTest.test2xBuildReload-seed#[B97AD0EE113A064D]) [    x:collection1] o.a.s.h.ReplicationHandler Commits will be reserved for 10000ms.
   [junit4]   2> 837470 INFO  (TEST-InfixSuggestersTest.test2xBuildReload-seed#[B97AD0EE113A064D]) [    x:collection1] o.a.s.u.RandomMergePolicy RandomMergePolicy wrapping class org.apache.lucene.index.TieredMergePolicy: [TieredMergePolicy: maxMergeAtOnce=12, maxMergeAtOnceExplicit=48, maxMergedSegmentMB=84.484375, floorSegmentMB=0.4384765625, forceMergeDeletesPctAllowed=5.4362914082942995, segmentsPerTier=26.0, maxCFSSegmentSizeMB=8.796093022207999E12, noCFSRatio=0.2701097784881725, reclaimDeletesWeight=0.12355201750897704
   [junit4]   2> 837470 INFO  (TEST-InfixSuggestersTest.test2xBuildReload-seed#[B97AD0EE113A064D]) [    x:collection1] o.a.s.u.DefaultSolrCoreState New IndexWriter is ready to be used.
   [junit4]   2> 837471 INFO  (searcherExecutor-5422-thread-1-processing-x:collection1) [    x:collection1] o.a.s.c.SolrCore [collection1] Registered new searcher Searcher@759e9242[collection1] main{ExitableDirectoryReader(UninvertingDirectoryReader())}
   [junit4]   2> 837471 INFO  (TEST-InfixSuggestersTest.test2xBuildReload-seed#[B97AD0EE113A064D]) [    x:collection1] o.a.s.s.SolrIndexSearcher Opening [Searcher@3170de[collection1] main]
   [junit4]   2> 837471 INFO  (TEST-InfixSuggestersTest.test2xBuildReload-seed#[B97AD0EE113A064D]) [    x:collection1] o.a.s.c.SolrCore [collection1]  CLOSING SolrCore org.apache.solr.core.SolrCore@4ff3ba6e
   [junit4]   2> 837471 INFO  (TEST-InfixSuggestersTest.test2xBuildReload-seed#[B97AD0EE113A064D]) [    x:collection1] o.a.s.m.SolrMetricManager Closing metric reporters for registry=solr.core.collection1, tag=4ff3ba6e
   [junit4]   2> 837471 INFO  (TEST-InfixSuggestersTest.test2xBuildReload-seed#[B97AD0EE113A064D]) [    x:collection1] o.a.s.m.r.SolrJmxReporter Closing reporter [org.apache.solr.metrics.reporters.SolrJmxReporter@59067c79: rootName = null, domain = solr.core.collection1, service url = null, agent id = null] for registry solr.core.collection1 / com.codahale.metrics.MetricRegistry@63bccf88
   [junit4]   2> 837472 INFO  (searcherExecutor-5422-thread-1-processing-x:collection1) [    x:collection1] o.a.s.c.SolrCore [collection1] Registered new searcher Searcher@3170de[collection1] main{ExitableDirectoryReader(UninvertingDirectoryReader())}
   [junit4]   2> 837482 INFO  (TEST-InfixSuggestersTest.test2xBuildReload-seed#[B97AD0EE113A064D]) [    x:collection1] o.a.s.h.c.SuggestComponent SuggestComponent prepare with : qt=/suggest_analyzing_infix_short_dictionary&suggest=true&suggest.buildAll=true&wt=xml&indent=off
   [junit4]   2> 837482 INFO  (TEST-InfixSuggestersTest.test2xBuildReload-seed#[B97AD0EE113A064D]) [    x:collection1] o.a.s.s.s.SolrSuggester SolrSuggester.build(shortRandomAnalyzingInfixSuggester)
   [junit4]   2> 837487 INFO  (TEST-InfixSuggestersTest.test2xBuildReload-seed#[B97AD0EE113A064D]) [    x:collection1] o.a.s.s.s.RandomTestDictionaryFactory org.apache.solr.spelling.suggest.RandomTestDictionaryFactory$RandomTestDictionary.enabled.shortRandomAnalyzingInfixSuggester disabled after emitting 100 items.
   [junit4]   2> 837530 INFO  (TEST-InfixSuggestersTest.test2xBuildReload-seed#[B97AD0EE113A064D]) [    x:collection1] o.a.s.h.c.SuggestComponent SuggestComponent process with : qt=/suggest_analyzing_infix_short_dictionary&suggest=true&suggest.buildAll=true&wt=xml&indent=off
   [junit4]   2> 837530 INFO  (TEST-InfixSuggestersTest.test2xBuildReload-seed#[B97AD0EE113A064D]) [    x:collection1] o.a.s.c.S.Request [collection1]  webapp=null path=null params={qt=/suggest_analyzing_infix_short_dictionary&suggest.buildAll=true&wt=xml} status=0 QTime=47
   [junit4]   2> 837530 ERROR (TEST-InfixSuggestersTest.test2xBuildReload-seed#[B97AD0EE113A064D]) [    x:collection1] o.a.s.c.CorePropertiesLocator Couldn't load core descriptor from /home/jenkins/workspace/Lucene-Solr-master-Linux/solr/core/src/test-files/solr/collection1/core.properties:java.nio.file.NoSuchFileException: /home/jenkins/workspace/Lucene-Solr-master-Linux/solr/core/src/test-files/solr/collection1/core.properties
   [junit4]   2> 837530 INFO  (TEST-InfixSuggestersTest.test2xBuildReload-seed#[B97AD0EE113A064D]) [    x:collection1] o.a.s.c.SolrResourceLoader [null] Added 2 libs to classloader, from paths: [/home/jenkins/workspace/Lucene-Solr-master-Linux/solr/core/src/test-files/solr/collection1/lib, /home/jenkins/workspace/Lucene-Solr-master-Linux/solr/core/src/test-files/solr/collection1/lib/classes]
   [junit4]   2> 837545 INFO  (TEST-InfixSuggestersTest.test2xBuildReload-seed#[B97AD0EE113A064D]) [    x:collection1] o.a.s.c.SolrConfig Using Lucene MatchVersion: 8.0.0
   [junit4]   2> 837564 INFO  (TEST-InfixSuggestersTest.test2xBuildReload-seed#[B97AD0EE113A064D]) [    x:collection1] o.a.s.s.IndexSchema [collection1] Schema name=test
   [junit4]   2> 837642 INFO  (TEST-InfixSuggestersTest.test2xBuildReload-seed#[B97AD0EE113A064D]) [    x:collection1] o.a.s.s.IndexSchema Loaded schema test/1.0 with uniqueid field id
   [junit4]   2> 837648 INFO  (TEST-InfixSuggestersTest.test2xBuildReload-seed#[B97AD0EE113A064D]) [    x:collection1] o.a.s.c.CoreContainer Reloading SolrCore 'collection1' using configuration from instancedir /home/jenkins/workspace/Lucene-Solr-master-Linux/solr/core/src/test-files/solr/collection1
   [junit4]   2> 837674 INFO  (TEST-InfixSuggestersTest.test2xBuildReload-seed#[B97AD0EE113A064D]) [    x:collection1] o.a.s.m.r.SolrJmxReporter JMX monitoring for 'solr.core.collection1' (registry 'solr.core.collection1') enabled at server: com.sun.jmx.mbeanserver.JmxMBeanServer@348f8a11
   [junit4]   2> 837674 INFO  (TEST-InfixSuggestersTest.test2xBuildReload-seed#[B97AD0EE113A064D]) [    x:collection1] o.a.s.c.SolrCore [[collection1] ] Opening new SolrCore at [/home/jenkins/workspace/Lucene-Solr-master-Linux/solr/core/src/test-files/solr/collection1], dataDir=[/home/jenkins/workspace/Lucene-Solr-master-Linux/solr/build/solr-core/test/J1/temp/solr.handler.component.InfixSuggestersTest_B97AD0EE113A064D-001/init-core-data-001/]
   [junit4]   2> 837715 INFO  (TEST-InfixSuggestersTest.test2xBuildReload-seed#[B97AD0EE113A064D]) [    x:collection1] o.a.s.u.CommitTracker Hard AutoCommit: disabled
   [junit4]   2> 837715 INFO  (TEST-InfixSuggestersTest.test2xBuildReload-seed#[B97AD0EE113A064D]) [    x:collection1] o.a.s.u.CommitTracker Soft AutoCommit: disabled
   [junit4]   2> 837716 INFO  (TEST-InfixSuggestersTest.test2xBuildReload-seed#[B97AD0EE113A064D]) [    x:collection1] o.a.s.s.SolrIndexSearcher Opening [Searcher@5cc10c51[collection1] main]
   [junit4]   2> 837717 WARN  (TEST-InfixSuggestersTest.test2xBuildReload-seed#[B97AD0EE113A064D]) [    x:collection1] o.a.s.r.ManagedResourceStorage Cannot write to config directory /home/jenkins/workspace/Lucene-Solr-master-Linux/solr/core/src/test-files/solr/collection1/conf; switching to use InMemory storage instead.
   [junit4]   2> 837717 INFO  (TEST-InfixSuggestersTest.test2xBuildReload-seed#[B97AD0EE113A064D]) [    x:collection1] o.a.s.h.c.SuggestComponent Initializing SuggestComponent
   [junit4]   2> 837717 INFO  (TEST-InfixSuggestersTest.test2xBuildReload-seed#[B97AD0EE113A064D]) [    x:collection1] o.a.s.s.s.SolrSuggester init: {name=shortRandomAnalyzingInfixSuggester,lookupImpl=AnalyzingInfixLookupFactory,dictionaryImpl=RandomTestDictionaryFactory,randDictMaxItems=100,indexPath=short_random_analyzing_infix_suggester,suggestAnalyzerFieldType=text,buildOnCommit=false,buildOnStartup=false}
   [junit4]   2> 837718 INFO  (TEST-InfixSuggestersTest.test2xBuildReload-seed#[B97AD0EE113A064D]) [    x:collection1] o.a.s.s.s.SolrSuggester Dictionary loaded with params: {name=shortRandomAnalyzingInfixSuggester,lookupImpl=AnalyzingInfixLookupFactory,dictionaryImpl=RandomTestDictionaryFactory,randDictMaxItems=100,indexPath=short_random_analyzing_infix_suggester,suggestAnalyzerFieldType=text,buildOnCommit=false,buildOnStartup=false}
   [junit4]   2> 837718 INFO  (TEST-InfixSuggestersTest.test2xBuildReload-seed#[B97AD0EE113A064D]) [    x:collection1] o.a.s.h.c.SuggestComponent Initializing SuggestComponent
   [junit4]   2> 837718 INFO  (TEST-InfixSuggestersTest.test2xBuildReload-seed#[B97AD0EE113A064D]) [    x:collection1] o.a.s.s.s.SolrSuggester init: {name=longRandomAnalyzingInfixSuggester,lookupImpl=AnalyzingInfixLookupFactory,dictionaryImpl=RandomTestDictionaryFactory,randDictMaxItems=100000,indexPath=long_random_analyzing_infix_suggester,suggestAnalyzerFieldType=text,buildOnCommit=false,buildOnStartup=false}
   [junit4]   2> 837721 INFO  (TEST-InfixSuggestersTest.test2xBuildReload-seed#[B97AD0EE113A064D]) [    x:collection1] o.a.s.s.s.SolrSuggester Dictionary loaded with params: {name=longRandomAnalyzingInfixSuggester,lookupImpl=AnalyzingInfixLookupFactory,dictionaryImpl=RandomTestDictionaryFactory,randDictMaxItems=100000,indexPath=long_random_analyzing_infix_suggester,suggestAnalyzerFieldType=text,buildOnCommit=false,buildOnStartup=false}
   [junit4]   2> 837721 INFO  (TEST-InfixSuggestersTest.test2xBuildReload-seed#[B97AD0EE113A064D]) [    x:collection1] o.a.s.h.c.SuggestComponent Initializing SuggestComponent
   [junit4]   2> 837721 INFO  (TEST-InfixSuggestersTest.test2xBuildReload-seed#[B97AD0EE113A064D]) [    x:collection1] o.a.s.s.s.SolrSuggester init: {name=shortRandomBlendedInfixSuggester,lookupImpl=BlendedInfixLookupFactory,dictionaryImpl=RandomTestDictionaryFactory,randDictMaxItems=100,blenderType=position_linear,suggestAnalyzerFieldType=text,indexPath=short_random_blended_infix_suggester,highlight=true,buildOnStartup=false,buildOnCommit=false}
   [junit4]   2> 837721 INFO  (TEST-InfixSuggestersTest.test2xBuildReload-seed#[B97AD0EE113A064D]) [    x:collection1] o.a.s.s.s.SolrSuggester Dictionary loaded with params: {name=shortRandomBlendedInfixSuggester,lookupImpl=BlendedInfixLookupFactory,dictionaryImpl=RandomTestDictionaryFactory,randDictMaxItems=100,blenderType=position_linear,suggestAnalyzerFieldType=text,indexPath=short_random_blended_infix_suggester,highlight=true,buildOnStartup=false,buildOnCommit=false}
   [junit4]   2> 837721 INFO  (TEST-InfixSuggestersTest.test2xBuildReload-seed#[B97AD0EE113A064D]) [    x:collection1] o.a.s.h.ReplicationHandler Commits will be reserved for 10000ms.
   [junit4]   2> 837722 INFO  (TEST-InfixSuggestersTest.test2xBuildReload-seed#[B97AD0EE113A064D]) [    x:collection1] o.a.s.u.RandomMergePolicy RandomMergePolicy wrapping class org.apache.lucene.index.AlcoholicMergePolicy: [AlcoholicMergePolicy: minMergeSize=0, mergeFactor=10, maxMergeSize=1850753923, maxMergeSizeForForcedMerge=9223372036854775807, calibrateSizeByDeletes=true, maxMergeDocs=2147483647, maxCFSSegmentSizeMB=8.796093022207999E12, noCFSRatio=0.1]
   [junit4]   2> 837722 INFO  (TEST-InfixSuggestersTest.test2xBuildReload-seed#[B97AD0EE113A064D]) [    x:collection1] o.a.s.u.DefaultSolrCoreState New IndexWriter is ready to be used.
   [junit4]   2> 837723 INFO  (searcherExecutor-5426-thread-1-processing-x:collection1) [    x:collection1] o.a.s.c.SolrCore [collection1] Registered new searcher Searcher@5cc10c51[collection1] main{ExitableDirectoryReader(UninvertingDirectoryReader())}
   [junit4]   2> 837723 INFO  (TEST-InfixSuggestersTest.test2xBuildReload-seed#[B97AD0EE113A064D]) [    x:collection1] o.a.s.s.SolrIndexSearcher Opening [Searcher@663cb554[collection1] main]
   [junit4]   2> 837723 INFO  (TEST-InfixSuggestersTest.test2xBuildReload-seed#[B97AD0EE113A064D]) [    x:collection1] o.a.s.c.SolrCore [collection1]  CLOSING SolrCore org.apache.solr.core.SolrCore@e5cf35b
   [junit4]   2> 837723 INFO  (TEST-InfixSuggestersTest.test2xBuildReload-seed#[B97AD0EE113A064D]) [    x:collection1] o.a.s.m.SolrMetricManager Closing metric reporters for registry=solr.core.collection1, tag=e5cf35b
   [junit4]   2> 837723 INFO  (TEST-InfixSuggestersTest.test2xBuildReload-seed#[B97AD0EE113A064D]) [    x:collection1] o.a.s.m.r.SolrJmxReporter Closing reporter [org.apache.solr.metrics.reporters.SolrJmxReporter@1fb7f7f0: rootName = null, domain = solr.core.collection1, service url = null, agent id = null] for registry solr.core.collection1 / com.codahale.metrics.MetricRegistry@63bccf88
   [junit4]   2> 837724 INFO  (searcherExecutor-5426-thread-1-processing-x:collection1) [    x:collection1] o.a.s.c.SolrCore [collection1] Registered new searcher Searcher@663cb554[collection1] main{ExitableDirectoryReader(UninvertingDirectoryReader())}
   [junit4]   2> 837730 INFO  (TEST-InfixSuggestersTest.test2xBuildReload-seed#[B97AD0EE113A064D]) [    x:collection1] o.a.s.SolrTestCaseJ4 ###Ending test2xBuildReload
   [junit4]   2> 837731 INFO  (TEST-InfixSuggestersTest.testReloadDuringBuild-seed#[B97AD0EE113A064D]) [    x:collection1] o.a.s.SolrTestCaseJ4 ###Starting testReloadDuringBuild
   [junit4]   2> 837732 ERROR (TEST-InfixSuggestersTest.testReloadDuringBuild-seed#[B97AD0EE113A064D]) [    x:collection1] o.a.s.c.CorePropertiesLocator Couldn't load core descriptor from /home/jenkins/workspace/Lucene-Solr-master-Linux/solr/core/src/test-files/solr/collection1/core.properties:java.nio.file.NoSuchFileException: /home/jenkins/workspace/Lucene-Solr-master-Linux/solr/core/src/test-files/solr/collection1/core.properties
   [junit4]   2> 837732 INFO  (AnalyzingInfixSuggesterTest-6921-thread-1-processing-x:collection1) [    x:collection1] o.a.s.h.c.SuggestComponent SuggestComponent prepare with : qt=/suggest_analyzing_infix_long_dictionary&suggest=true&suggest.buildAll=true&wt=xml&indent=off
   [junit4]   2> 837732 INFO  (AnalyzingInfixSuggesterTest-6921-thread-1-processing-x:collection1) [    x:collection1] o.a.s.s.s.SolrSuggester SolrSuggester.build(longRandomAnalyzingInfixSuggester)
   [junit4]   2> 837732 INFO  (TEST-InfixSuggestersTest.testReloadDuringBuild-seed#[B97AD0EE113A064D]) [    x:collection1] o.a.s.c.SolrResourceLoader [null] Added 2 libs to classloader, from paths: [/home/jenkins/workspace/Lucene-Solr-master-Linux/solr/core/src/test-files/solr/collection1/lib, /home/jenkins/workspace/Lucene-Solr-master-Linux/solr/core/src/test-files/solr/collection1/lib/classes]
   [junit4]   2> 837746 INFO  (TEST-InfixSuggestersTest.testReloadDuringBuild-seed#[B97AD0EE113A064D]) [    x:collection1] o.a.s.c.SolrConfig Using Lucene MatchVersion: 8.0.0
   [junit4]   2> 837754 INFO  (TEST-InfixSuggestersTest.testReloadDuringBuild-seed#[B97AD0EE113A064D]) [    x:collection1] o.a.s.s.IndexSchema [collection1] Schema name=test
   [junit4]   2> 837777 INFO  (AnalyzingInfixSuggesterTest-6921-thread-1-processing-x:collection1) [    x:collection1] o.a.s.s.s.RandomTestDictionaryFactory org.apache.solr.spelling.suggest.RandomTestDictionaryFactory$RandomTestDictionary.enabled.longRandomAnalyzingInfixSuggester emitted 1000 items.
   [junit4]   2> 837813 INFO  (AnalyzingInfixSuggesterTest-6921-thread-1-processing-x:collection1) [    x:collection1] o.a.s.s.s.RandomTestDictionaryFactory org.apache.solr.spelling.suggest.RandomTestDictionaryFactory$RandomTestDictionary.enabled.longRandomAnalyzingInfixSuggester emitted 2000 items.
   [junit4]   2> 837846 INFO  (TEST-InfixSuggestersTest.testReloadDuringBu

[...truncated too long message...]

pe=text,buildOnCommit=false,buildOnStartup=false}
   [junit4]   2> 19222 INFO  (TEST-InfixSuggestersTest.testTwoSuggestersBuildThenReload-seed#[B97AD0EE113A064D]) [    x:collection1] o.a.s.s.s.SolrSuggester Dictionary loaded with params: {name=longRandomAnalyzingInfixSuggester,lookupImpl=AnalyzingInfixLookupFactory,dictionaryImpl=RandomTestDictionaryFactory,randDictMaxItems=100000,indexPath=long_random_analyzing_infix_suggester,suggestAnalyzerFieldType=text,buildOnCommit=false,buildOnStartup=false}
   [junit4]   2> 19222 INFO  (TEST-InfixSuggestersTest.testTwoSuggestersBuildThenReload-seed#[B97AD0EE113A064D]) [    x:collection1] o.a.s.h.c.SuggestComponent Initializing SuggestComponent
   [junit4]   2> 19222 INFO  (TEST-InfixSuggestersTest.testTwoSuggestersBuildThenReload-seed#[B97AD0EE113A064D]) [    x:collection1] o.a.s.s.s.SolrSuggester init: {name=shortRandomBlendedInfixSuggester,lookupImpl=BlendedInfixLookupFactory,dictionaryImpl=RandomTestDictionaryFactory,randDictMaxItems=100,blenderType=position_linear,suggestAnalyzerFieldType=text,indexPath=short_random_blended_infix_suggester,highlight=true,buildOnStartup=false,buildOnCommit=false}
   [junit4]   2> 19225 INFO  (TEST-InfixSuggestersTest.testTwoSuggestersBuildThenReload-seed#[B97AD0EE113A064D]) [    x:collection1] o.a.s.s.s.SolrSuggester Dictionary loaded with params: {name=shortRandomBlendedInfixSuggester,lookupImpl=BlendedInfixLookupFactory,dictionaryImpl=RandomTestDictionaryFactory,randDictMaxItems=100,blenderType=position_linear,suggestAnalyzerFieldType=text,indexPath=short_random_blended_infix_suggester,highlight=true,buildOnStartup=false,buildOnCommit=false}
   [junit4]   2> 19225 INFO  (TEST-InfixSuggestersTest.testTwoSuggestersBuildThenReload-seed#[B97AD0EE113A064D]) [    x:collection1] o.a.s.h.ReplicationHandler Commits will be reserved for 10000ms.
   [junit4]   2> 19227 INFO  (searcherExecutor-61-thread-1-processing-x:collection1) [    x:collection1] o.a.s.c.SolrCore [collection1] Registered new searcher Searcher@2ec2f70e[collection1] main{ExitableDirectoryReader(UninvertingDirectoryReader())}
   [junit4]   2> 19229 INFO  (TEST-InfixSuggestersTest.testTwoSuggestersBuildThenReload-seed#[B97AD0EE113A064D]) [    x:collection1] o.a.s.u.RandomMergePolicy RandomMergePolicy wrapping class org.apache.lucene.index.LogByteSizeMergePolicy: [LogByteSizeMergePolicy: minMergeSize=1677721, mergeFactor=28, maxMergeSize=2147483648, maxMergeSizeForForcedMerge=9223372036854775807, calibrateSizeByDeletes=true, maxMergeDocs=2147483647, maxCFSSegmentSizeMB=2.0009765625, noCFSRatio=1.0]
   [junit4]   2> 19230 INFO  (TEST-InfixSuggestersTest.testTwoSuggestersBuildThenReload-seed#[B97AD0EE113A064D]) [    x:collection1] o.a.s.u.DefaultSolrCoreState New IndexWriter is ready to be used.
   [junit4]   2> 19232 INFO  (TEST-InfixSuggestersTest.testTwoSuggestersBuildThenReload-seed#[B97AD0EE113A064D]) [    x:collection1] o.a.s.s.SolrIndexSearcher Opening [Searcher@a4e73e6[collection1] main]
   [junit4]   2> 19235 INFO  (searcherExecutor-61-thread-1-processing-x:collection1) [    x:collection1] o.a.s.c.SolrCore [collection1] Registered new searcher Searcher@a4e73e6[collection1] main{ExitableDirectoryReader(UninvertingDirectoryReader())}
   [junit4]   2> 19236 INFO  (TEST-InfixSuggestersTest.testTwoSuggestersBuildThenReload-seed#[B97AD0EE113A064D]) [    x:collection1] o.a.s.c.SolrCore [collection1]  CLOSING SolrCore org.apache.solr.core.SolrCore@155e85f
   [junit4]   2> 19236 INFO  (TEST-InfixSuggestersTest.testTwoSuggestersBuildThenReload-seed#[B97AD0EE113A064D]) [    x:collection1] o.a.s.m.SolrMetricManager Closing metric reporters for registry=solr.core.collection1, tag=155e85f
   [junit4]   2> 19236 INFO  (TEST-InfixSuggestersTest.testTwoSuggestersBuildThenReload-seed#[B97AD0EE113A064D]) [    x:collection1] o.a.s.m.r.SolrJmxReporter Closing reporter [org.apache.solr.metrics.reporters.SolrJmxReporter@52493027: rootName = null, domain = solr.core.collection1, service url = null, agent id = null] for registry solr.core.collection1 / com.codahale.metrics.MetricRegistry@5dcf0fe5
   [junit4]   2> 19247 INFO  (TEST-InfixSuggestersTest.testTwoSuggestersBuildThenReload-seed#[B97AD0EE113A064D]) [    x:collection1] o.a.s.SolrTestCaseJ4 ###Ending testTwoSuggestersBuildThenReload
   [junit4] OK      1.40s J0 | InfixSuggestersTest.testTwoSuggestersBuildThenReload
   [junit4]   2> 19248 INFO  (SUITE-InfixSuggestersTest-seed#[B97AD0EE113A064D]-worker) [    x:collection1] o.a.s.SolrTestCaseJ4 ###deleteCore
   [junit4]   2> 19249 INFO  (SUITE-InfixSuggestersTest-seed#[B97AD0EE113A064D]-worker) [    x:collection1] o.a.s.c.CoreContainer Shutting down CoreContainer instance=2079744403
   [junit4]   2> 19249 INFO  (SUITE-InfixSuggestersTest-seed#[B97AD0EE113A064D]-worker) [    x:collection1] o.a.s.m.SolrMetricManager Closing metric reporters for registry=solr.node, tag=null
   [junit4]   2> 19249 INFO  (SUITE-InfixSuggestersTest-seed#[B97AD0EE113A064D]-worker) [    x:collection1] o.a.s.m.r.SolrJmxReporter Closing reporter [org.apache.solr.metrics.reporters.SolrJmxReporter@55e32f81: rootName = null, domain = solr.node, service url = null, agent id = null] for registry solr.node / com.codahale.metrics.MetricRegistry@7962a4b9
   [junit4]   2> 19255 INFO  (SUITE-InfixSuggestersTest-seed#[B97AD0EE113A064D]-worker) [    x:collection1] o.a.s.m.SolrMetricManager Closing metric reporters for registry=solr.jvm, tag=null
   [junit4]   2> 19255 INFO  (SUITE-InfixSuggestersTest-seed#[B97AD0EE113A064D]-worker) [    x:collection1] o.a.s.m.r.SolrJmxReporter Closing reporter [org.apache.solr.metrics.reporters.SolrJmxReporter@2f263647: rootName = null, domain = solr.jvm, service url = null, agent id = null] for registry solr.jvm / com.codahale.metrics.MetricRegistry@2c54037a
   [junit4]   2> 19255 INFO  (SUITE-InfixSuggestersTest-seed#[B97AD0EE113A064D]-worker) [    x:collection1] o.a.s.m.SolrMetricManager Closing metric reporters for registry=solr.jetty, tag=null
   [junit4]   2> 19256 INFO  (SUITE-InfixSuggestersTest-seed#[B97AD0EE113A064D]-worker) [    x:collection1] o.a.s.m.r.SolrJmxReporter Closing reporter [org.apache.solr.metrics.reporters.SolrJmxReporter@120b08c4: rootName = null, domain = solr.jetty, service url = null, agent id = null] for registry solr.jetty / com.codahale.metrics.MetricRegistry@ac319b
   [junit4]   2> 19257 INFO  (coreCloseExecutor-65-thread-1-processing-x:collection1) [    x:collection1] o.a.s.c.SolrCore [collection1]  CLOSING SolrCore org.apache.solr.core.SolrCore@58c6ab2b
   [junit4]   2> 19257 INFO  (coreCloseExecutor-65-thread-1-processing-x:collection1) [    x:collection1] o.a.s.m.SolrMetricManager Closing metric reporters for registry=solr.core.collection1, tag=58c6ab2b
   [junit4]   2> 19258 INFO  (coreCloseExecutor-65-thread-1-processing-x:collection1) [    x:collection1] o.a.s.m.r.SolrJmxReporter Closing reporter [org.apache.solr.metrics.reporters.SolrJmxReporter@13b88d55: rootName = null, domain = solr.core.collection1, service url = null, agent id = null] for registry solr.core.collection1 / com.codahale.metrics.MetricRegistry@5dcf0fe5
   [junit4]   2> NOTE: leaving temporary files on disk at: /home/jenkins/workspace/Lucene-Solr-master-Linux/solr/build/solr-core/test/J0/temp/solr.handler.component.InfixSuggestersTest_B97AD0EE113A064D-001
   [junit4]   2> NOTE: test params are: codec=Asserting(Lucene70): {textgrams=FST50, text=PostingsFormat(name=Direct), exacttext=PostingsFormat(name=LuceneFixedGap)}, docValues:{weight=DocValuesFormat(name=Direct), text=DocValuesFormat(name=Asserting)}, maxPointsInLeafNode=644, maxMBSortInHeap=5.429341934089964, sim=Asserting(org.apache.lucene.search.similarities.AssertingSimilarity@5c3dfb16), locale=en-NG, timezone=Europe/Copenhagen
   [junit4]   2> NOTE: Linux 4.15.0-24-generic amd64/Oracle Corporation 9.0.4 (64-bit)/cpus=8,threads=1,free=425261632,total=518979584
   [junit4]   2> NOTE: All tests run in this JVM: [InfixSuggestersTest]
   [junit4] Completed [1/5 (1!)] on J0 in 17.85s, 7 tests, 1 error <<< FAILURES!

[...truncated 52 lines...]
BUILD FAILED
/home/jenkins/workspace/Lucene-Solr-master-Linux/lucene/common-build.xml:1568: The following error occurred while executing this line:
/home/jenkins/workspace/Lucene-Solr-master-Linux/lucene/common-build.xml:1092: There were test failures: 5 suites, 35 tests, 1 error [seed: B97AD0EE113A064D]

Total time: 28 seconds

[repro] Setting last failure code to 256

[repro] Failures:
[repro]   1/5 failed: org.apache.solr.handler.component.InfixSuggestersTest
[repro] Exiting with code 256
+ mv lucene/build lucene/build.repro
+ mv solr/build solr/build.repro
+ mv lucene/build.orig lucene/build
+ mv solr/build.orig solr/build
Archiving artifacts
Setting ANT_1_8_2_HOME=/var/lib/jenkins/tools/hudson.tasks.Ant_AntInstallation/ANT_1.8.2
[WARNINGS] Parsing warnings in console log with parser Java Compiler (javac)
Setting ANT_1_8_2_HOME=/var/lib/jenkins/tools/hudson.tasks.Ant_AntInstallation/ANT_1.8.2
Setting ANT_1_8_2_HOME=/var/lib/jenkins/tools/hudson.tasks.Ant_AntInstallation/ANT_1.8.2
<Git Blamer> Using GitBlamer to create author and commit information for all warnings.
<Git Blamer> GIT_COMMIT=e56c81b452a77a4bd7538e5db951a010ddfe3c05, workspace=/var/lib/jenkins/workspace/Lucene-Solr-master-Linux
[WARNINGS] Computing warning deltas based on reference build #22454
Recording test results
Setting ANT_1_8_2_HOME=/var/lib/jenkins/tools/hudson.tasks.Ant_AntInstallation/ANT_1.8.2
Build step 'Publish JUnit test result report' changed build result to UNSTABLE
Email was triggered for: Unstable (Test Failures)
Sending email for trigger: Unstable (Test Failures)
Setting ANT_1_8_2_HOME=/var/lib/jenkins/tools/hudson.tasks.Ant_AntInstallation/ANT_1.8.2
Setting ANT_1_8_2_HOME=/var/lib/jenkins/tools/hudson.tasks.Ant_AntInstallation/ANT_1.8.2
Setting ANT_1_8_2_HOME=/var/lib/jenkins/tools/hudson.tasks.Ant_AntInstallation/ANT_1.8.2
Setting ANT_1_8_2_HOME=/var/lib/jenkins/tools/hudson.tasks.Ant_AntInstallation/ANT_1.8.2

Mime
View raw message