lucene-dev mailing list archives

Site index · List index
Message view « Date » · « Thread »
Top « Date » · « Thread »
From Policeman Jenkins Server <jenk...@thetaphi.de>
Subject [JENKINS] Lucene-Solr-7.x-MacOSX (64bit/jdk-9) - Build # 734 - Unstable!
Date Mon, 09 Jul 2018 18:03:58 GMT
Build: https://jenkins.thetaphi.de/job/Lucene-Solr-7.x-MacOSX/734/
Java: 64bit/jdk-9 -XX:+UseCompressedOops -XX:+UseG1GC

15 tests failed.
FAILED:  org.apache.solr.cloud.TestPullReplica.testKillLeader

Error Message:
Replica core_node4 not up to date after 10 seconds expected:<1> but was:<0>

Stack Trace:
java.lang.AssertionError: Replica core_node4 not up to date after 10 seconds expected:<1> but was:<0>
	at __randomizedtesting.SeedInfo.seed([89003455250E12D2:C016C0E147B58684]:0)
	at org.junit.Assert.fail(Assert.java:93)
	at org.junit.Assert.failNotEquals(Assert.java:647)
	at org.junit.Assert.assertEquals(Assert.java:128)
	at org.junit.Assert.assertEquals(Assert.java:472)
	at org.apache.solr.cloud.TestPullReplica.waitForNumDocsInAllReplicas(TestPullReplica.java:542)
	at org.apache.solr.cloud.TestPullReplica.doTestNoLeader(TestPullReplica.java:490)
	at org.apache.solr.cloud.TestPullReplica.testKillLeader(TestPullReplica.java:309)
	at java.base/jdk.internal.reflect.NativeMethodAccessorImpl.invoke0(Native Method)
	at java.base/jdk.internal.reflect.NativeMethodAccessorImpl.invoke(NativeMethodAccessorImpl.java:62)
	at java.base/jdk.internal.reflect.DelegatingMethodAccessorImpl.invoke(DelegatingMethodAccessorImpl.java:43)
	at java.base/java.lang.reflect.Method.invoke(Method.java:564)
	at com.carrotsearch.randomizedtesting.RandomizedRunner.invoke(RandomizedRunner.java:1737)
	at com.carrotsearch.randomizedtesting.RandomizedRunner$8.evaluate(RandomizedRunner.java:934)
	at com.carrotsearch.randomizedtesting.RandomizedRunner$9.evaluate(RandomizedRunner.java:970)
	at com.carrotsearch.randomizedtesting.RandomizedRunner$10.evaluate(RandomizedRunner.java:984)
	at com.carrotsearch.randomizedtesting.rules.SystemPropertiesRestoreRule$1.evaluate(SystemPropertiesRestoreRule.java:57)
	at org.apache.lucene.util.TestRuleSetupTeardownChained$1.evaluate(TestRuleSetupTeardownChained.java:49)
	at org.apache.lucene.util.AbstractBeforeAfterRule$1.evaluate(AbstractBeforeAfterRule.java:45)
	at org.apache.lucene.util.TestRuleThreadAndTestName$1.evaluate(TestRuleThreadAndTestName.java:48)
	at org.apache.lucene.util.TestRuleIgnoreAfterMaxFailures$1.evaluate(TestRuleIgnoreAfterMaxFailures.java:64)
	at org.apache.lucene.util.TestRuleMarkFailure$1.evaluate(TestRuleMarkFailure.java:47)
	at com.carrotsearch.randomizedtesting.rules.StatementAdapter.evaluate(StatementAdapter.java:36)
	at com.carrotsearch.randomizedtesting.ThreadLeakControl$StatementRunner.run(ThreadLeakControl.java:368)
	at com.carrotsearch.randomizedtesting.ThreadLeakControl.forkTimeoutingTask(ThreadLeakControl.java:817)
	at com.carrotsearch.randomizedtesting.ThreadLeakControl$3.evaluate(ThreadLeakControl.java:468)
	at com.carrotsearch.randomizedtesting.RandomizedRunner.runSingleTest(RandomizedRunner.java:943)
	at com.carrotsearch.randomizedtesting.RandomizedRunner$5.evaluate(RandomizedRunner.java:829)
	at com.carrotsearch.randomizedtesting.RandomizedRunner$6.evaluate(RandomizedRunner.java:879)
	at com.carrotsearch.randomizedtesting.RandomizedRunner$7.evaluate(RandomizedRunner.java:890)
	at com.carrotsearch.randomizedtesting.rules.StatementAdapter.evaluate(StatementAdapter.java:36)
	at com.carrotsearch.randomizedtesting.rules.SystemPropertiesRestoreRule$1.evaluate(SystemPropertiesRestoreRule.java:57)
	at org.apache.lucene.util.AbstractBeforeAfterRule$1.evaluate(AbstractBeforeAfterRule.java:45)
	at com.carrotsearch.randomizedtesting.rules.StatementAdapter.evaluate(StatementAdapter.java:36)
	at org.apache.lucene.util.TestRuleStoreClassName$1.evaluate(TestRuleStoreClassName.java:41)
	at com.carrotsearch.randomizedtesting.rules.NoShadowingOrOverridesOnMethodsRule$1.evaluate(NoShadowingOrOverridesOnMethodsRule.java:40)
	at com.carrotsearch.randomizedtesting.rules.NoShadowingOrOverridesOnMethodsRule$1.evaluate(NoShadowingOrOverridesOnMethodsRule.java:40)
	at com.carrotsearch.randomizedtesting.rules.StatementAdapter.evaluate(StatementAdapter.java:36)
	at com.carrotsearch.randomizedtesting.rules.StatementAdapter.evaluate(StatementAdapter.java:36)
	at org.apache.lucene.util.TestRuleAssertionsRequired$1.evaluate(TestRuleAssertionsRequired.java:53)
	at org.apache.lucene.util.TestRuleMarkFailure$1.evaluate(TestRuleMarkFailure.java:47)
	at org.apache.lucene.util.TestRuleIgnoreAfterMaxFailures$1.evaluate(TestRuleIgnoreAfterMaxFailures.java:64)
	at org.apache.lucene.util.TestRuleIgnoreTestSuites$1.evaluate(TestRuleIgnoreTestSuites.java:54)
	at com.carrotsearch.randomizedtesting.rules.StatementAdapter.evaluate(StatementAdapter.java:36)
	at com.carrotsearch.randomizedtesting.ThreadLeakControl$StatementRunner.run(ThreadLeakControl.java:368)
	at java.base/java.lang.Thread.run(Thread.java:844)


FAILED:  org.apache.solr.cloud.TestPullReplica.testRemoveAllWriterReplicas

Error Message:
Replica core_node4 not up to date after 10 seconds expected:<1> but was:<0>

Stack Trace:
java.lang.AssertionError: Replica core_node4 not up to date after 10 seconds expected:<1> but was:<0>
	at __randomizedtesting.SeedInfo.seed([89003455250E12D2:1A0EA86E31F0FB7B]:0)
	at org.junit.Assert.fail(Assert.java:93)
	at org.junit.Assert.failNotEquals(Assert.java:647)
	at org.junit.Assert.assertEquals(Assert.java:128)
	at org.junit.Assert.assertEquals(Assert.java:472)
	at org.apache.solr.cloud.TestPullReplica.waitForNumDocsInAllReplicas(TestPullReplica.java:542)
	at org.apache.solr.cloud.TestPullReplica.doTestNoLeader(TestPullReplica.java:490)
	at org.apache.solr.cloud.TestPullReplica.testRemoveAllWriterReplicas(TestPullReplica.java:303)
	at java.base/jdk.internal.reflect.NativeMethodAccessorImpl.invoke0(Native Method)
	at java.base/jdk.internal.reflect.NativeMethodAccessorImpl.invoke(NativeMethodAccessorImpl.java:62)
	at java.base/jdk.internal.reflect.DelegatingMethodAccessorImpl.invoke(DelegatingMethodAccessorImpl.java:43)
	at java.base/java.lang.reflect.Method.invoke(Method.java:564)
	at com.carrotsearch.randomizedtesting.RandomizedRunner.invoke(RandomizedRunner.java:1737)
	at com.carrotsearch.randomizedtesting.RandomizedRunner$8.evaluate(RandomizedRunner.java:934)
	at com.carrotsearch.randomizedtesting.RandomizedRunner$9.evaluate(RandomizedRunner.java:970)
	at com.carrotsearch.randomizedtesting.RandomizedRunner$10.evaluate(RandomizedRunner.java:984)
	at com.carrotsearch.randomizedtesting.rules.SystemPropertiesRestoreRule$1.evaluate(SystemPropertiesRestoreRule.java:57)
	at org.apache.lucene.util.TestRuleSetupTeardownChained$1.evaluate(TestRuleSetupTeardownChained.java:49)
	at org.apache.lucene.util.AbstractBeforeAfterRule$1.evaluate(AbstractBeforeAfterRule.java:45)
	at org.apache.lucene.util.TestRuleThreadAndTestName$1.evaluate(TestRuleThreadAndTestName.java:48)
	at org.apache.lucene.util.TestRuleIgnoreAfterMaxFailures$1.evaluate(TestRuleIgnoreAfterMaxFailures.java:64)
	at org.apache.lucene.util.TestRuleMarkFailure$1.evaluate(TestRuleMarkFailure.java:47)
	at com.carrotsearch.randomizedtesting.rules.StatementAdapter.evaluate(StatementAdapter.java:36)
	at com.carrotsearch.randomizedtesting.ThreadLeakControl$StatementRunner.run(ThreadLeakControl.java:368)
	at com.carrotsearch.randomizedtesting.ThreadLeakControl.forkTimeoutingTask(ThreadLeakControl.java:817)
	at com.carrotsearch.randomizedtesting.ThreadLeakControl$3.evaluate(ThreadLeakControl.java:468)
	at com.carrotsearch.randomizedtesting.RandomizedRunner.runSingleTest(RandomizedRunner.java:943)
	at com.carrotsearch.randomizedtesting.RandomizedRunner$5.evaluate(RandomizedRunner.java:829)
	at com.carrotsearch.randomizedtesting.RandomizedRunner$6.evaluate(RandomizedRunner.java:879)
	at com.carrotsearch.randomizedtesting.RandomizedRunner$7.evaluate(RandomizedRunner.java:890)
	at com.carrotsearch.randomizedtesting.rules.StatementAdapter.evaluate(StatementAdapter.java:36)
	at com.carrotsearch.randomizedtesting.rules.SystemPropertiesRestoreRule$1.evaluate(SystemPropertiesRestoreRule.java:57)
	at org.apache.lucene.util.AbstractBeforeAfterRule$1.evaluate(AbstractBeforeAfterRule.java:45)
	at com.carrotsearch.randomizedtesting.rules.StatementAdapter.evaluate(StatementAdapter.java:36)
	at org.apache.lucene.util.TestRuleStoreClassName$1.evaluate(TestRuleStoreClassName.java:41)
	at com.carrotsearch.randomizedtesting.rules.NoShadowingOrOverridesOnMethodsRule$1.evaluate(NoShadowingOrOverridesOnMethodsRule.java:40)
	at com.carrotsearch.randomizedtesting.rules.NoShadowingOrOverridesOnMethodsRule$1.evaluate(NoShadowingOrOverridesOnMethodsRule.java:40)
	at com.carrotsearch.randomizedtesting.rules.StatementAdapter.evaluate(StatementAdapter.java:36)
	at com.carrotsearch.randomizedtesting.rules.StatementAdapter.evaluate(StatementAdapter.java:36)
	at org.apache.lucene.util.TestRuleAssertionsRequired$1.evaluate(TestRuleAssertionsRequired.java:53)
	at org.apache.lucene.util.TestRuleMarkFailure$1.evaluate(TestRuleMarkFailure.java:47)
	at org.apache.lucene.util.TestRuleIgnoreAfterMaxFailures$1.evaluate(TestRuleIgnoreAfterMaxFailures.java:64)
	at org.apache.lucene.util.TestRuleIgnoreTestSuites$1.evaluate(TestRuleIgnoreTestSuites.java:54)
	at com.carrotsearch.randomizedtesting.rules.StatementAdapter.evaluate(StatementAdapter.java:36)
	at com.carrotsearch.randomizedtesting.ThreadLeakControl$StatementRunner.run(ThreadLeakControl.java:368)
	at java.base/java.lang.Thread.run(Thread.java:844)


FAILED:  org.apache.solr.cloud.TestPullReplica.testKillLeader

Error Message:
Replica core_node4 not up to date after 10 seconds expected:<1> but was:<0>

Stack Trace:
java.lang.AssertionError: Replica core_node4 not up to date after 10 seconds expected:<1> but was:<0>
	at __randomizedtesting.SeedInfo.seed([89003455250E12D2:C016C0E147B58684]:0)
	at org.junit.Assert.fail(Assert.java:93)
	at org.junit.Assert.failNotEquals(Assert.java:647)
	at org.junit.Assert.assertEquals(Assert.java:128)
	at org.junit.Assert.assertEquals(Assert.java:472)
	at org.apache.solr.cloud.TestPullReplica.waitForNumDocsInAllReplicas(TestPullReplica.java:542)
	at org.apache.solr.cloud.TestPullReplica.doTestNoLeader(TestPullReplica.java:490)
	at org.apache.solr.cloud.TestPullReplica.testKillLeader(TestPullReplica.java:309)
	at java.base/jdk.internal.reflect.NativeMethodAccessorImpl.invoke0(Native Method)
	at java.base/jdk.internal.reflect.NativeMethodAccessorImpl.invoke(NativeMethodAccessorImpl.java:62)
	at java.base/jdk.internal.reflect.DelegatingMethodAccessorImpl.invoke(DelegatingMethodAccessorImpl.java:43)
	at java.base/java.lang.reflect.Method.invoke(Method.java:564)
	at com.carrotsearch.randomizedtesting.RandomizedRunner.invoke(RandomizedRunner.java:1737)
	at com.carrotsearch.randomizedtesting.RandomizedRunner$8.evaluate(RandomizedRunner.java:934)
	at com.carrotsearch.randomizedtesting.RandomizedRunner$9.evaluate(RandomizedRunner.java:970)
	at com.carrotsearch.randomizedtesting.RandomizedRunner$10.evaluate(RandomizedRunner.java:984)
	at com.carrotsearch.randomizedtesting.rules.SystemPropertiesRestoreRule$1.evaluate(SystemPropertiesRestoreRule.java:57)
	at org.apache.lucene.util.TestRuleSetupTeardownChained$1.evaluate(TestRuleSetupTeardownChained.java:49)
	at org.apache.lucene.util.AbstractBeforeAfterRule$1.evaluate(AbstractBeforeAfterRule.java:45)
	at org.apache.lucene.util.TestRuleThreadAndTestName$1.evaluate(TestRuleThreadAndTestName.java:48)
	at org.apache.lucene.util.TestRuleIgnoreAfterMaxFailures$1.evaluate(TestRuleIgnoreAfterMaxFailures.java:64)
	at org.apache.lucene.util.TestRuleMarkFailure$1.evaluate(TestRuleMarkFailure.java:47)
	at com.carrotsearch.randomizedtesting.rules.StatementAdapter.evaluate(StatementAdapter.java:36)
	at com.carrotsearch.randomizedtesting.ThreadLeakControl$StatementRunner.run(ThreadLeakControl.java:368)
	at com.carrotsearch.randomizedtesting.ThreadLeakControl.forkTimeoutingTask(ThreadLeakControl.java:817)
	at com.carrotsearch.randomizedtesting.ThreadLeakControl$3.evaluate(ThreadLeakControl.java:468)
	at com.carrotsearch.randomizedtesting.RandomizedRunner.runSingleTest(RandomizedRunner.java:943)
	at com.carrotsearch.randomizedtesting.RandomizedRunner$5.evaluate(RandomizedRunner.java:829)
	at com.carrotsearch.randomizedtesting.RandomizedRunner$6.evaluate(RandomizedRunner.java:879)
	at com.carrotsearch.randomizedtesting.RandomizedRunner$7.evaluate(RandomizedRunner.java:890)
	at com.carrotsearch.randomizedtesting.rules.StatementAdapter.evaluate(StatementAdapter.java:36)
	at com.carrotsearch.randomizedtesting.rules.SystemPropertiesRestoreRule$1.evaluate(SystemPropertiesRestoreRule.java:57)
	at org.apache.lucene.util.AbstractBeforeAfterRule$1.evaluate(AbstractBeforeAfterRule.java:45)
	at com.carrotsearch.randomizedtesting.rules.StatementAdapter.evaluate(StatementAdapter.java:36)
	at org.apache.lucene.util.TestRuleStoreClassName$1.evaluate(TestRuleStoreClassName.java:41)
	at com.carrotsearch.randomizedtesting.rules.NoShadowingOrOverridesOnMethodsRule$1.evaluate(NoShadowingOrOverridesOnMethodsRule.java:40)
	at com.carrotsearch.randomizedtesting.rules.NoShadowingOrOverridesOnMethodsRule$1.evaluate(NoShadowingOrOverridesOnMethodsRule.java:40)
	at com.carrotsearch.randomizedtesting.rules.StatementAdapter.evaluate(StatementAdapter.java:36)
	at com.carrotsearch.randomizedtesting.rules.StatementAdapter.evaluate(StatementAdapter.java:36)
	at org.apache.lucene.util.TestRuleAssertionsRequired$1.evaluate(TestRuleAssertionsRequired.java:53)
	at org.apache.lucene.util.TestRuleMarkFailure$1.evaluate(TestRuleMarkFailure.java:47)
	at org.apache.lucene.util.TestRuleIgnoreAfterMaxFailures$1.evaluate(TestRuleIgnoreAfterMaxFailures.java:64)
	at org.apache.lucene.util.TestRuleIgnoreTestSuites$1.evaluate(TestRuleIgnoreTestSuites.java:54)
	at com.carrotsearch.randomizedtesting.rules.StatementAdapter.evaluate(StatementAdapter.java:36)
	at com.carrotsearch.randomizedtesting.ThreadLeakControl$StatementRunner.run(ThreadLeakControl.java:368)
	at java.base/java.lang.Thread.run(Thread.java:844)


FAILED:  org.apache.solr.cloud.TestPullReplica.testRemoveAllWriterReplicas

Error Message:
Replica core_node4 not up to date after 10 seconds expected:<1> but was:<0>

Stack Trace:
java.lang.AssertionError: Replica core_node4 not up to date after 10 seconds expected:<1> but was:<0>
	at __randomizedtesting.SeedInfo.seed([89003455250E12D2:1A0EA86E31F0FB7B]:0)
	at org.junit.Assert.fail(Assert.java:93)
	at org.junit.Assert.failNotEquals(Assert.java:647)
	at org.junit.Assert.assertEquals(Assert.java:128)
	at org.junit.Assert.assertEquals(Assert.java:472)
	at org.apache.solr.cloud.TestPullReplica.waitForNumDocsInAllReplicas(TestPullReplica.java:542)
	at org.apache.solr.cloud.TestPullReplica.doTestNoLeader(TestPullReplica.java:490)
	at org.apache.solr.cloud.TestPullReplica.testRemoveAllWriterReplicas(TestPullReplica.java:303)
	at java.base/jdk.internal.reflect.NativeMethodAccessorImpl.invoke0(Native Method)
	at java.base/jdk.internal.reflect.NativeMethodAccessorImpl.invoke(NativeMethodAccessorImpl.java:62)
	at java.base/jdk.internal.reflect.DelegatingMethodAccessorImpl.invoke(DelegatingMethodAccessorImpl.java:43)
	at java.base/java.lang.reflect.Method.invoke(Method.java:564)
	at com.carrotsearch.randomizedtesting.RandomizedRunner.invoke(RandomizedRunner.java:1737)
	at com.carrotsearch.randomizedtesting.RandomizedRunner$8.evaluate(RandomizedRunner.java:934)
	at com.carrotsearch.randomizedtesting.RandomizedRunner$9.evaluate(RandomizedRunner.java:970)
	at com.carrotsearch.randomizedtesting.RandomizedRunner$10.evaluate(RandomizedRunner.java:984)
	at com.carrotsearch.randomizedtesting.rules.SystemPropertiesRestoreRule$1.evaluate(SystemPropertiesRestoreRule.java:57)
	at org.apache.lucene.util.TestRuleSetupTeardownChained$1.evaluate(TestRuleSetupTeardownChained.java:49)
	at org.apache.lucene.util.AbstractBeforeAfterRule$1.evaluate(AbstractBeforeAfterRule.java:45)
	at org.apache.lucene.util.TestRuleThreadAndTestName$1.evaluate(TestRuleThreadAndTestName.java:48)
	at org.apache.lucene.util.TestRuleIgnoreAfterMaxFailures$1.evaluate(TestRuleIgnoreAfterMaxFailures.java:64)
	at org.apache.lucene.util.TestRuleMarkFailure$1.evaluate(TestRuleMarkFailure.java:47)
	at com.carrotsearch.randomizedtesting.rules.StatementAdapter.evaluate(StatementAdapter.java:36)
	at com.carrotsearch.randomizedtesting.ThreadLeakControl$StatementRunner.run(ThreadLeakControl.java:368)
	at com.carrotsearch.randomizedtesting.ThreadLeakControl.forkTimeoutingTask(ThreadLeakControl.java:817)
	at com.carrotsearch.randomizedtesting.ThreadLeakControl$3.evaluate(ThreadLeakControl.java:468)
	at com.carrotsearch.randomizedtesting.RandomizedRunner.runSingleTest(RandomizedRunner.java:943)
	at com.carrotsearch.randomizedtesting.RandomizedRunner$5.evaluate(RandomizedRunner.java:829)
	at com.carrotsearch.randomizedtesting.RandomizedRunner$6.evaluate(RandomizedRunner.java:879)
	at com.carrotsearch.randomizedtesting.RandomizedRunner$7.evaluate(RandomizedRunner.java:890)
	at com.carrotsearch.randomizedtesting.rules.StatementAdapter.evaluate(StatementAdapter.java:36)
	at com.carrotsearch.randomizedtesting.rules.SystemPropertiesRestoreRule$1.evaluate(SystemPropertiesRestoreRule.java:57)
	at org.apache.lucene.util.AbstractBeforeAfterRule$1.evaluate(AbstractBeforeAfterRule.java:45)
	at com.carrotsearch.randomizedtesting.rules.StatementAdapter.evaluate(StatementAdapter.java:36)
	at org.apache.lucene.util.TestRuleStoreClassName$1.evaluate(TestRuleStoreClassName.java:41)
	at com.carrotsearch.randomizedtesting.rules.NoShadowingOrOverridesOnMethodsRule$1.evaluate(NoShadowingOrOverridesOnMethodsRule.java:40)
	at com.carrotsearch.randomizedtesting.rules.NoShadowingOrOverridesOnMethodsRule$1.evaluate(NoShadowingOrOverridesOnMethodsRule.java:40)
	at com.carrotsearch.randomizedtesting.rules.StatementAdapter.evaluate(StatementAdapter.java:36)
	at com.carrotsearch.randomizedtesting.rules.StatementAdapter.evaluate(StatementAdapter.java:36)
	at org.apache.lucene.util.TestRuleAssertionsRequired$1.evaluate(TestRuleAssertionsRequired.java:53)
	at org.apache.lucene.util.TestRuleMarkFailure$1.evaluate(TestRuleMarkFailure.java:47)
	at org.apache.lucene.util.TestRuleIgnoreAfterMaxFailures$1.evaluate(TestRuleIgnoreAfterMaxFailures.java:64)
	at org.apache.lucene.util.TestRuleIgnoreTestSuites$1.evaluate(TestRuleIgnoreTestSuites.java:54)
	at com.carrotsearch.randomizedtesting.rules.StatementAdapter.evaluate(StatementAdapter.java:36)
	at com.carrotsearch.randomizedtesting.ThreadLeakControl$StatementRunner.run(ThreadLeakControl.java:368)
	at java.base/java.lang.Thread.run(Thread.java:844)


FAILED:  org.apache.solr.cloud.TestPullReplica.testKillLeader

Error Message:
Replica core_node4 not up to date after 10 seconds expected:<1> but was:<0>

Stack Trace:
java.lang.AssertionError: Replica core_node4 not up to date after 10 seconds expected:<1> but was:<0>
	at __randomizedtesting.SeedInfo.seed([89003455250E12D2:C016C0E147B58684]:0)
	at org.junit.Assert.fail(Assert.java:93)
	at org.junit.Assert.failNotEquals(Assert.java:647)
	at org.junit.Assert.assertEquals(Assert.java:128)
	at org.junit.Assert.assertEquals(Assert.java:472)
	at org.apache.solr.cloud.TestPullReplica.waitForNumDocsInAllReplicas(TestPullReplica.java:542)
	at org.apache.solr.cloud.TestPullReplica.doTestNoLeader(TestPullReplica.java:490)
	at org.apache.solr.cloud.TestPullReplica.testKillLeader(TestPullReplica.java:309)
	at java.base/jdk.internal.reflect.NativeMethodAccessorImpl.invoke0(Native Method)
	at java.base/jdk.internal.reflect.NativeMethodAccessorImpl.invoke(NativeMethodAccessorImpl.java:62)
	at java.base/jdk.internal.reflect.DelegatingMethodAccessorImpl.invoke(DelegatingMethodAccessorImpl.java:43)
	at java.base/java.lang.reflect.Method.invoke(Method.java:564)
	at com.carrotsearch.randomizedtesting.RandomizedRunner.invoke(RandomizedRunner.java:1737)
	at com.carrotsearch.randomizedtesting.RandomizedRunner$8.evaluate(RandomizedRunner.java:934)
	at com.carrotsearch.randomizedtesting.RandomizedRunner$9.evaluate(RandomizedRunner.java:970)
	at com.carrotsearch.randomizedtesting.RandomizedRunner$10.evaluate(RandomizedRunner.java:984)
	at com.carrotsearch.randomizedtesting.rules.SystemPropertiesRestoreRule$1.evaluate(SystemPropertiesRestoreRule.java:57)
	at org.apache.lucene.util.TestRuleSetupTeardownChained$1.evaluate(TestRuleSetupTeardownChained.java:49)
	at org.apache.lucene.util.AbstractBeforeAfterRule$1.evaluate(AbstractBeforeAfterRule.java:45)
	at org.apache.lucene.util.TestRuleThreadAndTestName$1.evaluate(TestRuleThreadAndTestName.java:48)
	at org.apache.lucene.util.TestRuleIgnoreAfterMaxFailures$1.evaluate(TestRuleIgnoreAfterMaxFailures.java:64)
	at org.apache.lucene.util.TestRuleMarkFailure$1.evaluate(TestRuleMarkFailure.java:47)
	at com.carrotsearch.randomizedtesting.rules.StatementAdapter.evaluate(StatementAdapter.java:36)
	at com.carrotsearch.randomizedtesting.ThreadLeakControl$StatementRunner.run(ThreadLeakControl.java:368)
	at com.carrotsearch.randomizedtesting.ThreadLeakControl.forkTimeoutingTask(ThreadLeakControl.java:817)
	at com.carrotsearch.randomizedtesting.ThreadLeakControl$3.evaluate(ThreadLeakControl.java:468)
	at com.carrotsearch.randomizedtesting.RandomizedRunner.runSingleTest(RandomizedRunner.java:943)
	at com.carrotsearch.randomizedtesting.RandomizedRunner$5.evaluate(RandomizedRunner.java:829)
	at com.carrotsearch.randomizedtesting.RandomizedRunner$6.evaluate(RandomizedRunner.java:879)
	at com.carrotsearch.randomizedtesting.RandomizedRunner$7.evaluate(RandomizedRunner.java:890)
	at com.carrotsearch.randomizedtesting.rules.StatementAdapter.evaluate(StatementAdapter.java:36)
	at com.carrotsearch.randomizedtesting.rules.SystemPropertiesRestoreRule$1.evaluate(SystemPropertiesRestoreRule.java:57)
	at org.apache.lucene.util.AbstractBeforeAfterRule$1.evaluate(AbstractBeforeAfterRule.java:45)
	at com.carrotsearch.randomizedtesting.rules.StatementAdapter.evaluate(StatementAdapter.java:36)
	at org.apache.lucene.util.TestRuleStoreClassName$1.evaluate(TestRuleStoreClassName.java:41)
	at com.carrotsearch.randomizedtesting.rules.NoShadowingOrOverridesOnMethodsRule$1.evaluate(NoShadowingOrOverridesOnMethodsRule.java:40)
	at com.carrotsearch.randomizedtesting.rules.NoShadowingOrOverridesOnMethodsRule$1.evaluate(NoShadowingOrOverridesOnMethodsRule.java:40)
	at com.carrotsearch.randomizedtesting.rules.StatementAdapter.evaluate(StatementAdapter.java:36)
	at com.carrotsearch.randomizedtesting.rules.StatementAdapter.evaluate(StatementAdapter.java:36)
	at org.apache.lucene.util.TestRuleAssertionsRequired$1.evaluate(TestRuleAssertionsRequired.java:53)
	at org.apache.lucene.util.TestRuleMarkFailure$1.evaluate(TestRuleMarkFailure.java:47)
	at org.apache.lucene.util.TestRuleIgnoreAfterMaxFailures$1.evaluate(TestRuleIgnoreAfterMaxFailures.java:64)
	at org.apache.lucene.util.TestRuleIgnoreTestSuites$1.evaluate(TestRuleIgnoreTestSuites.java:54)
	at com.carrotsearch.randomizedtesting.rules.StatementAdapter.evaluate(StatementAdapter.java:36)
	at com.carrotsearch.randomizedtesting.ThreadLeakControl$StatementRunner.run(ThreadLeakControl.java:368)
	at java.base/java.lang.Thread.run(Thread.java:844)


FAILED:  org.apache.solr.cloud.TestPullReplica.testRemoveAllWriterReplicas

Error Message:
Replica core_node4 not up to date after 10 seconds expected:<1> but was:<0>

Stack Trace:
java.lang.AssertionError: Replica core_node4 not up to date after 10 seconds expected:<1> but was:<0>
	at __randomizedtesting.SeedInfo.seed([89003455250E12D2:1A0EA86E31F0FB7B]:0)
	at org.junit.Assert.fail(Assert.java:93)
	at org.junit.Assert.failNotEquals(Assert.java:647)
	at org.junit.Assert.assertEquals(Assert.java:128)
	at org.junit.Assert.assertEquals(Assert.java:472)
	at org.apache.solr.cloud.TestPullReplica.waitForNumDocsInAllReplicas(TestPullReplica.java:542)
	at org.apache.solr.cloud.TestPullReplica.doTestNoLeader(TestPullReplica.java:490)
	at org.apache.solr.cloud.TestPullReplica.testRemoveAllWriterReplicas(TestPullReplica.java:303)
	at java.base/jdk.internal.reflect.NativeMethodAccessorImpl.invoke0(Native Method)
	at java.base/jdk.internal.reflect.NativeMethodAccessorImpl.invoke(NativeMethodAccessorImpl.java:62)
	at java.base/jdk.internal.reflect.DelegatingMethodAccessorImpl.invoke(DelegatingMethodAccessorImpl.java:43)
	at java.base/java.lang.reflect.Method.invoke(Method.java:564)
	at com.carrotsearch.randomizedtesting.RandomizedRunner.invoke(RandomizedRunner.java:1737)
	at com.carrotsearch.randomizedtesting.RandomizedRunner$8.evaluate(RandomizedRunner.java:934)
	at com.carrotsearch.randomizedtesting.RandomizedRunner$9.evaluate(RandomizedRunner.java:970)
	at com.carrotsearch.randomizedtesting.RandomizedRunner$10.evaluate(RandomizedRunner.java:984)
	at com.carrotsearch.randomizedtesting.rules.SystemPropertiesRestoreRule$1.evaluate(SystemPropertiesRestoreRule.java:57)
	at org.apache.lucene.util.TestRuleSetupTeardownChained$1.evaluate(TestRuleSetupTeardownChained.java:49)
	at org.apache.lucene.util.AbstractBeforeAfterRule$1.evaluate(AbstractBeforeAfterRule.java:45)
	at org.apache.lucene.util.TestRuleThreadAndTestName$1.evaluate(TestRuleThreadAndTestName.java:48)
	at org.apache.lucene.util.TestRuleIgnoreAfterMaxFailures$1.evaluate(TestRuleIgnoreAfterMaxFailures.java:64)
	at org.apache.lucene.util.TestRuleMarkFailure$1.evaluate(TestRuleMarkFailure.java:47)
	at com.carrotsearch.randomizedtesting.rules.StatementAdapter.evaluate(StatementAdapter.java:36)
	at com.carrotsearch.randomizedtesting.ThreadLeakControl$StatementRunner.run(ThreadLeakControl.java:368)
	at com.carrotsearch.randomizedtesting.ThreadLeakControl.forkTimeoutingTask(ThreadLeakControl.java:817)
	at com.carrotsearch.randomizedtesting.ThreadLeakControl$3.evaluate(ThreadLeakControl.java:468)
	at com.carrotsearch.randomizedtesting.RandomizedRunner.runSingleTest(RandomizedRunner.java:943)
	at com.carrotsearch.randomizedtesting.RandomizedRunner$5.evaluate(RandomizedRunner.java:829)
	at com.carrotsearch.randomizedtesting.RandomizedRunner$6.evaluate(RandomizedRunner.java:879)
	at com.carrotsearch.randomizedtesting.RandomizedRunner$7.evaluate(RandomizedRunner.java:890)
	at com.carrotsearch.randomizedtesting.rules.StatementAdapter.evaluate(StatementAdapter.java:36)
	at com.carrotsearch.randomizedtesting.rules.SystemPropertiesRestoreRule$1.evaluate(SystemPropertiesRestoreRule.java:57)
	at org.apache.lucene.util.AbstractBeforeAfterRule$1.evaluate(AbstractBeforeAfterRule.java:45)
	at com.carrotsearch.randomizedtesting.rules.StatementAdapter.evaluate(StatementAdapter.java:36)
	at org.apache.lucene.util.TestRuleStoreClassName$1.evaluate(TestRuleStoreClassName.java:41)
	at com.carrotsearch.randomizedtesting.rules.NoShadowingOrOverridesOnMethodsRule$1.evaluate(NoShadowingOrOverridesOnMethodsRule.java:40)
	at com.carrotsearch.randomizedtesting.rules.NoShadowingOrOverridesOnMethodsRule$1.evaluate(NoShadowingOrOverridesOnMethodsRule.java:40)
	at com.carrotsearch.randomizedtesting.rules.StatementAdapter.evaluate(StatementAdapter.java:36)
	at com.carrotsearch.randomizedtesting.rules.StatementAdapter.evaluate(StatementAdapter.java:36)
	at org.apache.lucene.util.TestRuleAssertionsRequired$1.evaluate(TestRuleAssertionsRequired.java:53)
	at org.apache.lucene.util.TestRuleMarkFailure$1.evaluate(TestRuleMarkFailure.java:47)
	at org.apache.lucene.util.TestRuleIgnoreAfterMaxFailures$1.evaluate(TestRuleIgnoreAfterMaxFailures.java:64)
	at org.apache.lucene.util.TestRuleIgnoreTestSuites$1.evaluate(TestRuleIgnoreTestSuites.java:54)
	at com.carrotsearch.randomizedtesting.rules.StatementAdapter.evaluate(StatementAdapter.java:36)
	at com.carrotsearch.randomizedtesting.ThreadLeakControl$StatementRunner.run(ThreadLeakControl.java:368)
	at java.base/java.lang.Thread.run(Thread.java:844)


FAILED:  org.apache.solr.cloud.TestPullReplica.testKillLeader

Error Message:
Replica core_node4 not up to date after 10 seconds expected:<1> but was:<0>

Stack Trace:
java.lang.AssertionError: Replica core_node4 not up to date after 10 seconds expected:<1> but was:<0>
	at __randomizedtesting.SeedInfo.seed([89003455250E12D2:C016C0E147B58684]:0)
	at org.junit.Assert.fail(Assert.java:93)
	at org.junit.Assert.failNotEquals(Assert.java:647)
	at org.junit.Assert.assertEquals(Assert.java:128)
	at org.junit.Assert.assertEquals(Assert.java:472)
	at org.apache.solr.cloud.TestPullReplica.waitForNumDocsInAllReplicas(TestPullReplica.java:542)
	at org.apache.solr.cloud.TestPullReplica.doTestNoLeader(TestPullReplica.java:490)
	at org.apache.solr.cloud.TestPullReplica.testKillLeader(TestPullReplica.java:309)
	at java.base/jdk.internal.reflect.NativeMethodAccessorImpl.invoke0(Native Method)
	at java.base/jdk.internal.reflect.NativeMethodAccessorImpl.invoke(NativeMethodAccessorImpl.java:62)
	at java.base/jdk.internal.reflect.DelegatingMethodAccessorImpl.invoke(DelegatingMethodAccessorImpl.java:43)
	at java.base/java.lang.reflect.Method.invoke(Method.java:564)
	at com.carrotsearch.randomizedtesting.RandomizedRunner.invoke(RandomizedRunner.java:1737)
	at com.carrotsearch.randomizedtesting.RandomizedRunner$8.evaluate(RandomizedRunner.java:934)
	at com.carrotsearch.randomizedtesting.RandomizedRunner$9.evaluate(RandomizedRunner.java:970)
	at com.carrotsearch.randomizedtesting.RandomizedRunner$10.evaluate(RandomizedRunner.java:984)
	at com.carrotsearch.randomizedtesting.rules.SystemPropertiesRestoreRule$1.evaluate(SystemPropertiesRestoreRule.java:57)
	at org.apache.lucene.util.TestRuleSetupTeardownChained$1.evaluate(TestRuleSetupTeardownChained.java:49)
	at org.apache.lucene.util.AbstractBeforeAfterRule$1.evaluate(AbstractBeforeAfterRule.java:45)
	at org.apache.lucene.util.TestRuleThreadAndTestName$1.evaluate(TestRuleThreadAndTestName.java:48)
	at org.apache.lucene.util.TestRuleIgnoreAfterMaxFailures$1.evaluate(TestRuleIgnoreAfterMaxFailures.java:64)
	at org.apache.lucene.util.TestRuleMarkFailure$1.evaluate(TestRuleMarkFailure.java:47)
	at com.carrotsearch.randomizedtesting.rules.StatementAdapter.evaluate(StatementAdapter.java:36)
	at com.carrotsearch.randomizedtesting.ThreadLeakControl$StatementRunner.run(ThreadLeakControl.java:368)
	at com.carrotsearch.randomizedtesting.ThreadLeakControl.forkTimeoutingTask(ThreadLeakControl.java:817)
	at com.carrotsearch.randomizedtesting.ThreadLeakControl$3.evaluate(ThreadLeakControl.java:468)
	at com.carrotsearch.randomizedtesting.RandomizedRunner.runSingleTest(RandomizedRunner.java:943)
	at com.carrotsearch.randomizedtesting.RandomizedRunner$5.evaluate(RandomizedRunner.java:829)
	at com.carrotsearch.randomizedtesting.RandomizedRunner$6.evaluate(RandomizedRunner.java:879)
	at com.carrotsearch.randomizedtesting.RandomizedRunner$7.evaluate(RandomizedRunner.java:890)
	at com.carrotsearch.randomizedtesting.rules.StatementAdapter.evaluate(StatementAdapter.java:36)
	at com.carrotsearch.randomizedtesting.rules.SystemPropertiesRestoreRule$1.evaluate(SystemPropertiesRestoreRule.java:57)
	at org.apache.lucene.util.AbstractBeforeAfterRule$1.evaluate(AbstractBeforeAfterRule.java:45)
	at com.carrotsearch.randomizedtesting.rules.StatementAdapter.evaluate(StatementAdapter.java:36)
	at org.apache.lucene.util.TestRuleStoreClassName$1.evaluate(TestRuleStoreClassName.java:41)
	at com.carrotsearch.randomizedtesting.rules.NoShadowingOrOverridesOnMethodsRule$1.evaluate(NoShadowingOrOverridesOnMethodsRule.java:40)
	at com.carrotsearch.randomizedtesting.rules.NoShadowingOrOverridesOnMethodsRule$1.evaluate(NoShadowingOrOverridesOnMethodsRule.java:40)
	at com.carrotsearch.randomizedtesting.rules.StatementAdapter.evaluate(StatementAdapter.java:36)
	at com.carrotsearch.randomizedtesting.rules.StatementAdapter.evaluate(StatementAdapter.java:36)
	at org.apache.lucene.util.TestRuleAssertionsRequired$1.evaluate(TestRuleAssertionsRequired.java:53)
	at org.apache.lucene.util.TestRuleMarkFailure$1.evaluate(TestRuleMarkFailure.java:47)
	at org.apache.lucene.util.TestRuleIgnoreAfterMaxFailures$1.evaluate(TestRuleIgnoreAfterMaxFailures.java:64)
	at org.apache.lucene.util.TestRuleIgnoreTestSuites$1.evaluate(TestRuleIgnoreTestSuites.java:54)
	at com.carrotsearch.randomizedtesting.rules.StatementAdapter.evaluate(StatementAdapter.java:36)
	at com.carrotsearch.randomizedtesting.ThreadLeakControl$StatementRunner.run(ThreadLeakControl.java:368)
	at java.base/java.lang.Thread.run(Thread.java:844)


FAILED:  org.apache.solr.cloud.TestPullReplica.testKillLeader

Error Message:
Replica core_node4 not up to date after 10 seconds expected:<1> but was:<0>

Stack Trace:
java.lang.AssertionError: Replica core_node4 not up to date after 10 seconds expected:<1> but was:<0>
	at __randomizedtesting.SeedInfo.seed([89003455250E12D2:C016C0E147B58684]:0)
	at org.junit.Assert.fail(Assert.java:93)
	at org.junit.Assert.failNotEquals(Assert.java:647)
	at org.junit.Assert.assertEquals(Assert.java:128)
	at org.junit.Assert.assertEquals(Assert.java:472)
	at org.apache.solr.cloud.TestPullReplica.waitForNumDocsInAllReplicas(TestPullReplica.java:542)
	at org.apache.solr.cloud.TestPullReplica.doTestNoLeader(TestPullReplica.java:490)
	at org.apache.solr.cloud.TestPullReplica.testKillLeader(TestPullReplica.java:309)
	at java.base/jdk.internal.reflect.NativeMethodAccessorImpl.invoke0(Native Method)
	at java.base/jdk.internal.reflect.NativeMethodAccessorImpl.invoke(NativeMethodAccessorImpl.java:62)
	at java.base/jdk.internal.reflect.DelegatingMethodAccessorImpl.invoke(DelegatingMethodAccessorImpl.java:43)
	at java.base/java.lang.reflect.Method.invoke(Method.java:564)
	at com.carrotsearch.randomizedtesting.RandomizedRunner.invoke(RandomizedRunner.java:1737)
	at com.carrotsearch.randomizedtesting.RandomizedRunner$8.evaluate(RandomizedRunner.java:934)
	at com.carrotsearch.randomizedtesting.RandomizedRunner$9.evaluate(RandomizedRunner.java:970)
	at com.carrotsearch.randomizedtesting.RandomizedRunner$10.evaluate(RandomizedRunner.java:984)
	at com.carrotsearch.randomizedtesting.rules.SystemPropertiesRestoreRule$1.evaluate(SystemPropertiesRestoreRule.java:57)
	at org.apache.lucene.util.TestRuleSetupTeardownChained$1.evaluate(TestRuleSetupTeardownChained.java:49)
	at org.apache.lucene.util.AbstractBeforeAfterRule$1.evaluate(AbstractBeforeAfterRule.java:45)
	at org.apache.lucene.util.TestRuleThreadAndTestName$1.evaluate(TestRuleThreadAndTestName.java:48)
	at org.apache.lucene.util.TestRuleIgnoreAfterMaxFailures$1.evaluate(TestRuleIgnoreAfterMaxFailures.java:64)
	at org.apache.lucene.util.TestRuleMarkFailure$1.evaluate(TestRuleMarkFailure.java:47)
	at com.carrotsearch.randomizedtesting.rules.StatementAdapter.evaluate(StatementAdapter.java:36)
	at com.carrotsearch.randomizedtesting.ThreadLeakControl$StatementRunner.run(ThreadLeakControl.java:368)
	at com.carrotsearch.randomizedtesting.ThreadLeakControl.forkTimeoutingTask(ThreadLeakControl.java:817)
	at com.carrotsearch.randomizedtesting.ThreadLeakControl$3.evaluate(ThreadLeakControl.java:468)
	at com.carrotsearch.randomizedtesting.RandomizedRunner.runSingleTest(RandomizedRunner.java:943)
	at com.carrotsearch.randomizedtesting.RandomizedRunner$5.evaluate(RandomizedRunner.java:829)
	at com.carrotsearch.randomizedtesting.RandomizedRunner$6.evaluate(RandomizedRunner.java:879)
	at com.carrotsearch.randomizedtesting.RandomizedRunner$7.evaluate(RandomizedRunner.java:890)
	at com.carrotsearch.randomizedtesting.rules.StatementAdapter.evaluate(StatementAdapter.java:36)
	at com.carrotsearch.randomizedtesting.rules.SystemPropertiesRestoreRule$1.evaluate(SystemPropertiesRestoreRule.java:57)
	at org.apache.lucene.util.AbstractBeforeAfterRule$1.evaluate(AbstractBeforeAfterRule.java:45)
	at com.carrotsearch.randomizedtesting.rules.StatementAdapter.evaluate(StatementAdapter.java:36)
	at org.apache.lucene.util.TestRuleStoreClassName$1.evaluate(TestRuleStoreClassName.java:41)
	at com.carrotsearch.randomizedtesting.rules.NoShadowingOrOverridesOnMethodsRule$1.evaluate(NoShadowingOrOverridesOnMethodsRule.java:40)
	at com.carrotsearch.randomizedtesting.rules.NoShadowingOrOverridesOnMethodsRule$1.evaluate(NoShadowingOrOverridesOnMethodsRule.java:40)
	at com.carrotsearch.randomizedtesting.rules.StatementAdapter.evaluate(StatementAdapter.java:36)
	at com.carrotsearch.randomizedtesting.rules.StatementAdapter.evaluate(StatementAdapter.java:36)
	at org.apache.lucene.util.TestRuleAssertionsRequired$1.evaluate(TestRuleAssertionsRequired.java:53)
	at org.apache.lucene.util.TestRuleMarkFailure$1.evaluate(TestRuleMarkFailure.java:47)
	at org.apache.lucene.util.TestRuleIgnoreAfterMaxFailures$1.evaluate(TestRuleIgnoreAfterMaxFailures.java:64)
	at org.apache.lucene.util.TestRuleIgnoreTestSuites$1.evaluate(TestRuleIgnoreTestSuites.java:54)
	at com.carrotsearch.randomizedtesting.rules.StatementAdapter.evaluate(StatementAdapter.java:36)
	at com.carrotsearch.randomizedtesting.ThreadLeakControl$StatementRunner.run(ThreadLeakControl.java:368)
	at java.base/java.lang.Thread.run(Thread.java:844)


FAILED:  org.apache.solr.cloud.TestPullReplica.testRemoveAllWriterReplicas

Error Message:
Replica core_node4 not up to date after 10 seconds expected:<1> but was:<0>

Stack Trace:
java.lang.AssertionError: Replica core_node4 not up to date after 10 seconds expected:<1> but was:<0>
	at __randomizedtesting.SeedInfo.seed([89003455250E12D2:1A0EA86E31F0FB7B]:0)
	at org.junit.Assert.fail(Assert.java:93)
	at org.junit.Assert.failNotEquals(Assert.java:647)
	at org.junit.Assert.assertEquals(Assert.java:128)
	at org.junit.Assert.assertEquals(Assert.java:472)
	at org.apache.solr.cloud.TestPullReplica.waitForNumDocsInAllReplicas(TestPullReplica.java:542)
	at org.apache.solr.cloud.TestPullReplica.doTestNoLeader(TestPullReplica.java:490)
	at org.apache.solr.cloud.TestPullReplica.testRemoveAllWriterReplicas(TestPullReplica.java:303)
	at java.base/jdk.internal.reflect.NativeMethodAccessorImpl.invoke0(Native Method)
	at java.base/jdk.internal.reflect.NativeMethodAccessorImpl.invoke(NativeMethodAccessorImpl.java:62)
	at java.base/jdk.internal.reflect.DelegatingMethodAccessorImpl.invoke(DelegatingMethodAccessorImpl.java:43)
	at java.base/java.lang.reflect.Method.invoke(Method.java:564)
	at com.carrotsearch.randomizedtesting.RandomizedRunner.invoke(RandomizedRunner.java:1737)
	at com.carrotsearch.randomizedtesting.RandomizedRunner$8.evaluate(RandomizedRunner.java:934)
	at com.carrotsearch.randomizedtesting.RandomizedRunner$9.evaluate(RandomizedRunner.java:970)
	at com.carrotsearch.randomizedtesting.RandomizedRunner$10.evaluate(RandomizedRunner.java:984)
	at com.carrotsearch.randomizedtesting.rules.SystemPropertiesRestoreRule$1.evaluate(SystemPropertiesRestoreRule.java:57)
	at org.apache.lucene.util.TestRuleSetupTeardownChained$1.evaluate(TestRuleSetupTeardownChained.java:49)
	at org.apache.lucene.util.AbstractBeforeAfterRule$1.evaluate(AbstractBeforeAfterRule.java:45)
	at org.apache.lucene.util.TestRuleThreadAndTestName$1.evaluate(TestRuleThreadAndTestName.java:48)
	at org.apache.lucene.util.TestRuleIgnoreAfterMaxFailures$1.evaluate(TestRuleIgnoreAfterMaxFailures.java:64)
	at org.apache.lucene.util.TestRuleMarkFailure$1.evaluate(TestRuleMarkFailure.java:47)
	at com.carrotsearch.randomizedtesting.rules.StatementAdapter.evaluate(StatementAdapter.java:36)
	at com.carrotsearch.randomizedtesting.ThreadLeakControl$StatementRunner.run(ThreadLeakControl.java:368)
	at com.carrotsearch.randomizedtesting.ThreadLeakControl.forkTimeoutingTask(ThreadLeakControl.java:817)
	at com.carrotsearch.randomizedtesting.ThreadLeakControl$3.evaluate(ThreadLeakControl.java:468)
	at com.carrotsearch.randomizedtesting.RandomizedRunner.runSingleTest(RandomizedRunner.java:943)
	at com.carrotsearch.randomizedtesting.RandomizedRunner$5.evaluate(RandomizedRunner.java:829)
	at com.carrotsearch.randomizedtesting.RandomizedRunner$6.evaluate(RandomizedRunner.java:879)
	at com.carrotsearch.randomizedtesting.RandomizedRunner$7.evaluate(RandomizedRunner.java:890)
	at com.carrotsearch.randomizedtesting.rules.StatementAdapter.evaluate(StatementAdapter.java:36)
	at com.carrotsearch.randomizedtesting.rules.SystemPropertiesRestoreRule$1.evaluate(SystemPropertiesRestoreRule.java:57)
	at org.apache.lucene.util.AbstractBeforeAfterRule$1.evaluate(AbstractBeforeAfterRule.java:45)
	at com.carrotsearch.randomizedtesting.rules.StatementAdapter.evaluate(StatementAdapter.java:36)
	at org.apache.lucene.util.TestRuleStoreClassName$1.evaluate(TestRuleStoreClassName.java:41)
	at com.carrotsearch.randomizedtesting.rules.NoShadowingOrOverridesOnMethodsRule$1.evaluate(NoShadowingOrOverridesOnMethodsRule.java:40)
	at com.carrotsearch.randomizedtesting.rules.NoShadowingOrOverridesOnMethodsRule$1.evaluate(NoShadowingOrOverridesOnMethodsRule.java:40)
	at com.carrotsearch.randomizedtesting.rules.StatementAdapter.evaluate(StatementAdapter.java:36)
	at com.carrotsearch.randomizedtesting.rules.StatementAdapter.evaluate(StatementAdapter.java:36)
	at org.apache.lucene.util.TestRuleAssertionsRequired$1.evaluate(TestRuleAssertionsRequired.java:53)
	at org.apache.lucene.util.TestRuleMarkFailure$1.evaluate(TestRuleMarkFailure.java:47)
	at org.apache.lucene.util.TestRuleIgnoreAfterMaxFailures$1.evaluate(TestRuleIgnoreAfterMaxFailures.java:64)
	at org.apache.lucene.util.TestRuleIgnoreTestSuites$1.evaluate(TestRuleIgnoreTestSuites.java:54)
	at com.carrotsearch.randomizedtesting.rules.StatementAdapter.evaluate(StatementAdapter.java:36)
	at com.carrotsearch.randomizedtesting.ThreadLeakControl$StatementRunner.run(ThreadLeakControl.java:368)
	at java.base/java.lang.Thread.run(Thread.java:844)


FAILED:  org.apache.solr.client.solrj.embedded.TestSolrProperties.testProperties

Error Message:
Test abandoned because suite timeout was reached.

Stack Trace:
java.lang.Exception: Test abandoned because suite timeout was reached.
	at __randomizedtesting.SeedInfo.seed([6C23B20742966736]:0)


FAILED:  junit.framework.TestSuite.org.apache.solr.client.solrj.embedded.TestSolrProperties

Error Message:
Suite timeout exceeded (>= 7200000 msec).

Stack Trace:
java.lang.Exception: Suite timeout exceeded (>= 7200000 msec).
	at __randomizedtesting.SeedInfo.seed([6C23B20742966736]:0)


FAILED:  org.apache.solr.client.solrj.embedded.TestSolrProperties.testProperties

Error Message:
Test abandoned because suite timeout was reached.

Stack Trace:
java.lang.Exception: Test abandoned because suite timeout was reached.
	at __randomizedtesting.SeedInfo.seed([6C23B20742966736]:0)


FAILED:  junit.framework.TestSuite.org.apache.solr.client.solrj.embedded.TestSolrProperties

Error Message:
Suite timeout exceeded (>= 7200000 msec).

Stack Trace:
java.lang.Exception: Suite timeout exceeded (>= 7200000 msec).
	at __randomizedtesting.SeedInfo.seed([6C23B20742966736]:0)


FAILED:  org.apache.solr.client.solrj.embedded.TestSolrProperties.testProperties

Error Message:
Test abandoned because suite timeout was reached.

Stack Trace:
java.lang.Exception: Test abandoned because suite timeout was reached.
	at __randomizedtesting.SeedInfo.seed([6C23B20742966736]:0)


FAILED:  junit.framework.TestSuite.org.apache.solr.client.solrj.embedded.TestSolrProperties

Error Message:
Suite timeout exceeded (>= 7200000 msec).

Stack Trace:
java.lang.Exception: Suite timeout exceeded (>= 7200000 msec).
	at __randomizedtesting.SeedInfo.seed([6C23B20742966736]:0)




Build Log:
[...truncated 14032 lines...]
   [junit4] Suite: org.apache.solr.cloud.TestPullReplica
   [junit4]   2> Creating dataDir: /Users/jenkins/workspace/Lucene-Solr-7.x-MacOSX/solr/build/solr-core/test/J1/temp/solr.cloud.TestPullReplica_89003455250E12D2-001/init-core-data-001
   [junit4]   2> 2059904 WARN  (SUITE-TestPullReplica-seed#[89003455250E12D2]-worker) [    ] o.a.s.SolrTestCaseJ4 startTrackingSearchers: numOpens=30 numCloses=30
   [junit4]   2> 2059905 INFO  (SUITE-TestPullReplica-seed#[89003455250E12D2]-worker) [    ] o.a.s.SolrTestCaseJ4 Using TrieFields (NUMERIC_POINTS_SYSPROP=false) w/NUMERIC_DOCVALUES_SYSPROP=true
   [junit4]   2> 2059905 INFO  (SUITE-TestPullReplica-seed#[89003455250E12D2]-worker) [    ] o.a.s.SolrTestCaseJ4 Randomized ssl (true) and clientAuth (false) via: @org.apache.solr.util.RandomizeSSL(reason="", value=0.0/0.0, ssl=0.0/0.0, clientAuth=0.0/0.0) w/ MAC_OS_X supressed clientAuth
   [junit4]   2> 2059906 INFO  (SUITE-TestPullReplica-seed#[89003455250E12D2]-worker) [    ] o.a.s.SolrTestCaseJ4 SecureRandom sanity checks: test.solr.allowed.securerandom=null & java.security.egd=file:/dev/./urandom
   [junit4]   2> 2059906 INFO  (SUITE-TestPullReplica-seed#[89003455250E12D2]-worker) [    ] o.a.s.c.MiniSolrCloudCluster Starting cluster of 2 servers in /Users/jenkins/workspace/Lucene-Solr-7.x-MacOSX/solr/build/solr-core/test/J1/temp/solr.cloud.TestPullReplica_89003455250E12D2-001/tempDir-001
   [junit4]   2> 2059906 INFO  (SUITE-TestPullReplica-seed#[89003455250E12D2]-worker) [    ] o.a.s.c.ZkTestServer STARTING ZK TEST SERVER
   [junit4]   2> 2059907 INFO  (Thread-4185) [    ] o.a.s.c.ZkTestServer client port:0.0.0.0/0.0.0.0:0
   [junit4]   2> 2059907 INFO  (Thread-4185) [    ] o.a.s.c.ZkTestServer Starting server
   [junit4]   2> 2059910 ERROR (Thread-4185) [    ] o.a.z.s.ZooKeeperServer ZKShutdownHandler is not registered, so ZooKeeper server won't take any action on ERROR or SHUTDOWN server state changes
   [junit4]   2> 2060007 INFO  (SUITE-TestPullReplica-seed#[89003455250E12D2]-worker) [    ] o.a.s.c.ZkTestServer start zk server on port:57165
   [junit4]   2> 2060022 INFO  (zkConnectionManagerCallback-7548-thread-1) [    ] o.a.s.c.c.ConnectionManager zkClient has connected
   [junit4]   2> 2060030 INFO  (jetty-launcher-7545-thread-2) [    ] o.e.j.s.Server jetty-9.4.11.v20180605; built: 2018-06-05T18:24:03.829Z; git: d5fc0523cfa96bfebfbda19606cad384d772f04c; jvm 9+181
   [junit4]   2> 2060030 INFO  (jetty-launcher-7545-thread-1) [    ] o.e.j.s.Server jetty-9.4.11.v20180605; built: 2018-06-05T18:24:03.829Z; git: d5fc0523cfa96bfebfbda19606cad384d772f04c; jvm 9+181
   [junit4]   2> 2060032 INFO  (jetty-launcher-7545-thread-2) [    ] o.e.j.s.session DefaultSessionIdManager workerName=node0
   [junit4]   2> 2060032 INFO  (jetty-launcher-7545-thread-2) [    ] o.e.j.s.session No SessionScavenger set, using defaults
   [junit4]   2> 2060032 INFO  (jetty-launcher-7545-thread-2) [    ] o.e.j.s.session node0 Scavenging every 600000ms
   [junit4]   2> 2060032 INFO  (jetty-launcher-7545-thread-1) [    ] o.e.j.s.session DefaultSessionIdManager workerName=node0
   [junit4]   2> 2060032 INFO  (jetty-launcher-7545-thread-1) [    ] o.e.j.s.session No SessionScavenger set, using defaults
   [junit4]   2> 2060033 INFO  (jetty-launcher-7545-thread-1) [    ] o.e.j.s.session node0 Scavenging every 600000ms
   [junit4]   2> 2060033 INFO  (jetty-launcher-7545-thread-2) [    ] o.e.j.s.h.ContextHandler Started o.e.j.s.ServletContextHandler@20e88d3e{/solr,null,AVAILABLE}
   [junit4]   2> 2060033 INFO  (jetty-launcher-7545-thread-1) [    ] o.e.j.s.h.ContextHandler Started o.e.j.s.ServletContextHandler@3dad85b6{/solr,null,AVAILABLE}
   [junit4]   2> 2060035 INFO  (jetty-launcher-7545-thread-2) [    ] o.e.j.s.AbstractConnector Started ServerConnector@2fdb0a2e{SSL,[ssl, http/1.1]}{127.0.0.1:57167}
   [junit4]   2> 2060035 INFO  (jetty-launcher-7545-thread-2) [    ] o.e.j.s.Server Started @2060107ms
   [junit4]   2> 2060035 INFO  (jetty-launcher-7545-thread-2) [    ] o.a.s.c.s.e.JettySolrRunner Jetty properties: {hostContext=/solr, hostPort=57167}
   [junit4]   2> 2060035 INFO  (jetty-launcher-7545-thread-1) [    ] o.e.j.s.AbstractConnector Started ServerConnector@76ef9a27{SSL,[ssl, http/1.1]}{127.0.0.1:57168}
   [junit4]   2> 2060035 INFO  (jetty-launcher-7545-thread-1) [    ] o.e.j.s.Server Started @2060108ms
   [junit4]   2> 2060035 INFO  (jetty-launcher-7545-thread-1) [    ] o.a.s.c.s.e.JettySolrRunner Jetty properties: {hostContext=/solr, hostPort=57168}
   [junit4]   2> 2060035 ERROR (jetty-launcher-7545-thread-2) [    ] o.a.s.u.StartupLoggingUtils Missing Java Option solr.log.dir. Logging may be missing or incomplete.
   [junit4]   2> 2060035 INFO  (jetty-launcher-7545-thread-2) [    ] o.a.s.s.SolrDispatchFilter Using logger factory org.apache.logging.slf4j.Log4jLoggerFactory
   [junit4]   2> 2060035 ERROR (jetty-launcher-7545-thread-1) [    ] o.a.s.u.StartupLoggingUtils Missing Java Option solr.log.dir. Logging may be missing or incomplete.
   [junit4]   2> 2060035 INFO  (jetty-launcher-7545-thread-1) [    ] o.a.s.s.SolrDispatchFilter Using logger factory org.apache.logging.slf4j.Log4jLoggerFactory
   [junit4]   2> 2060035 INFO  (jetty-launcher-7545-thread-2) [    ] o.a.s.s.SolrDispatchFilter  ___      _       Welcome to Apache Solr? version 7.5.0
   [junit4]   2> 2060035 INFO  (jetty-launcher-7545-thread-1) [    ] o.a.s.s.SolrDispatchFilter  ___      _       Welcome to Apache Solr? version 7.5.0
   [junit4]   2> 2060035 INFO  (jetty-launcher-7545-thread-2) [    ] o.a.s.s.SolrDispatchFilter / __| ___| |_ _   Starting in cloud mode on port null
   [junit4]   2> 2060035 INFO  (jetty-launcher-7545-thread-2) [    ] o.a.s.s.SolrDispatchFilter \__ \/ _ \ | '_|  Install dir: null
   [junit4]   2> 2060035 INFO  (jetty-launcher-7545-thread-1) [    ] o.a.s.s.SolrDispatchFilter / __| ___| |_ _   Starting in cloud mode on port null
   [junit4]   2> 2060036 INFO  (jetty-launcher-7545-thread-2) [    ] o.a.s.s.SolrDispatchFilter |___/\___/_|_|    Start time: 2018-07-09T13:22:10.860994Z
   [junit4]   2> 2060036 INFO  (jetty-launcher-7545-thread-1) [    ] o.a.s.s.SolrDispatchFilter \__ \/ _ \ | '_|  Install dir: null
   [junit4]   2> 2060036 INFO  (jetty-launcher-7545-thread-1) [    ] o.a.s.s.SolrDispatchFilter |___/\___/_|_|    Start time: 2018-07-09T13:22:10.861024Z
   [junit4]   2> 2060037 INFO  (zkConnectionManagerCallback-7552-thread-1) [    ] o.a.s.c.c.ConnectionManager zkClient has connected
   [junit4]   2> 2060037 INFO  (zkConnectionManagerCallback-7551-thread-1) [    ] o.a.s.c.c.ConnectionManager zkClient has connected
   [junit4]   2> 2060038 INFO  (jetty-launcher-7545-thread-1) [    ] o.a.s.s.SolrDispatchFilter solr.xml found in ZooKeeper. Loading...
   [junit4]   2> 2060038 INFO  (jetty-launcher-7545-thread-2) [    ] o.a.s.s.SolrDispatchFilter solr.xml found in ZooKeeper. Loading...
   [junit4]   2> 2060095 INFO  (jetty-launcher-7545-thread-1) [    ] o.a.s.c.ZkContainer Zookeeper client=127.0.0.1:57165/solr
   [junit4]   2> 2060097 INFO  (zkConnectionManagerCallback-7556-thread-1) [    ] o.a.s.c.c.ConnectionManager zkClient has connected
   [junit4]   2> 2060100 INFO  (zkConnectionManagerCallback-7558-thread-1) [    ] o.a.s.c.c.ConnectionManager zkClient has connected
   [junit4]   2> 2060136 INFO  (jetty-launcher-7545-thread-2) [    ] o.a.s.c.ZkContainer Zookeeper client=127.0.0.1:57165/solr
   [junit4]   2> 2060138 INFO  (zkConnectionManagerCallback-7564-thread-1) [    ] o.a.s.c.c.ConnectionManager zkClient has connected
   [junit4]   2> 2060140 INFO  (zkConnectionManagerCallback-7566-thread-1) [    ] o.a.s.c.c.ConnectionManager zkClient has connected
   [junit4]   2> 2060158 INFO  (jetty-launcher-7545-thread-2) [n:127.0.0.1:57167_solr    ] o.a.s.c.Overseer Overseer (id=null) closing
   [junit4]   2> 2060163 INFO  (jetty-launcher-7545-thread-2) [n:127.0.0.1:57167_solr    ] o.a.s.c.OverseerElectionContext I am going to be the leader 127.0.0.1:57167_solr
   [junit4]   2> 2060165 INFO  (jetty-launcher-7545-thread-2) [n:127.0.0.1:57167_solr    ] o.a.s.c.Overseer Overseer (id=72340655697690630-127.0.0.1:57167_solr-n_0000000000) starting
   [junit4]   2> 2060177 INFO  (zkConnectionManagerCallback-7573-thread-1) [    ] o.a.s.c.c.ConnectionManager zkClient has connected
   [junit4]   2> 2060180 INFO  (jetty-launcher-7545-thread-2) [n:127.0.0.1:57167_solr    ] o.a.s.c.s.i.ZkClientClusterStateProvider Cluster at 127.0.0.1:57165/solr ready
   [junit4]   2> 2060181 INFO  (jetty-launcher-7545-thread-2) [n:127.0.0.1:57167_solr    ] o.a.s.c.ZkController Register node as live in ZooKeeper:/live_nodes/127.0.0.1:57167_solr
   [junit4]   2> 2060184 INFO  (OverseerStateUpdate-72340655697690630-127.0.0.1:57167_solr-n_0000000000) [    ] o.a.s.c.c.ZkStateReader Updated live nodes from ZooKeeper... (0) -> (1)
   [junit4]   2> 2060184 INFO  (zkCallback-7572-thread-1) [    ] o.a.s.c.c.ZkStateReader Updated live nodes from ZooKeeper... (0) -> (1)
   [junit4]   2> 2060199 INFO  (jetty-launcher-7545-thread-2) [n:127.0.0.1:57167_solr    ] o.a.s.h.a.MetricsHistoryHandler No .system collection, keeping metrics history in memory.
   [junit4]   2> 2060216 INFO  (jetty-launcher-7545-thread-2) [n:127.0.0.1:57167_solr    ] o.a.s.m.r.SolrJmxReporter JMX monitoring for 'solr_57167.solr.node' (registry 'solr.node') enabled at server: com.sun.jmx.mbeanserver.JmxMBeanServer@6215fba6
   [junit4]   2> 2060224 INFO  (jetty-launcher-7545-thread-2) [n:127.0.0.1:57167_solr    ] o.a.s.m.r.SolrJmxReporter JMX monitoring for 'solr_57167.solr.jvm' (registry 'solr.jvm') enabled at server: com.sun.jmx.mbeanserver.JmxMBeanServer@6215fba6
   [junit4]   2> 2060224 INFO  (jetty-launcher-7545-thread-2) [n:127.0.0.1:57167_solr    ] o.a.s.m.r.SolrJmxReporter JMX monitoring for 'solr_57167.solr.jetty' (registry 'solr.jetty') enabled at server: com.sun.jmx.mbeanserver.JmxMBeanServer@6215fba6
   [junit4]   2> 2060225 INFO  (jetty-launcher-7545-thread-2) [n:127.0.0.1:57167_solr    ] o.a.s.c.CorePropertiesLocator Found 0 core definitions underneath /Users/jenkins/workspace/Lucene-Solr-7.x-MacOSX/solr/build/solr-core/test/J1/temp/solr.cloud.TestPullReplica_89003455250E12D2-001/tempDir-001/node2/.
   [junit4]   2> 2060256 INFO  (jetty-launcher-7545-thread-1) [n:127.0.0.1:57168_solr    ] o.a.s.c.c.ZkStateReader Updated live nodes from ZooKeeper... (0) -> (1)
   [junit4]   2> 2060260 INFO  (jetty-launcher-7545-thread-1) [n:127.0.0.1:57168_solr    ] o.a.s.c.Overseer Overseer (id=null) closing
   [junit4]   2> 2060263 INFO  (jetty-launcher-7545-thread-1) [n:127.0.0.1:57168_solr    ] o.a.s.c.TransientSolrCoreCacheDefault Allocating transient cache for 2147483647 transient cores
   [junit4]   2> 2060263 INFO  (jetty-launcher-7545-thread-1) [n:127.0.0.1:57168_solr    ] o.a.s.c.ZkController Register node as live in ZooKeeper:/live_nodes/127.0.0.1:57168_solr
   [junit4]   2> 2060265 INFO  (zkCallback-7572-thread-1) [    ] o.a.s.c.c.ZkStateReader Updated live nodes from ZooKeeper... (1) -> (2)
   [junit4]   2> 2060265 INFO  (zkCallback-7565-thread-1) [    ] o.a.s.c.c.ZkStateReader Updated live nodes from ZooKeeper... (1) -> (2)
   [junit4]   2> 2060265 INFO  (zkCallback-7557-thread-1) [    ] o.a.s.c.c.ZkStateReader Updated live nodes from ZooKeeper... (1) -> (2)
   [junit4]   2> 2060280 INFO  (zkConnectionManagerCallback-7579-thread-1) [    ] o.a.s.c.c.ConnectionManager zkClient has connected
   [junit4]   2> 2060282 INFO  (jetty-launcher-7545-thread-1) [n:127.0.0.1:57168_solr    ] o.a.s.c.c.ZkStateReader Updated live nodes from ZooKeeper... (0) -> (2)
   [junit4]   2> 2060284 INFO  (jetty-launcher-7545-thread-1) [n:127.0.0.1:57168_solr    ] o.a.s.c.s.i.ZkClientClusterStateProvider Cluster at 127.0.0.1:57165/solr ready
   [junit4]   2> 2060284 INFO  (jetty-launcher-7545-thread-1) [n:127.0.0.1:57168_solr    ] o.a.s.h.a.MetricsHistoryHandler No .system collection, keeping metrics history in memory.
   [junit4]   2> 2060296 INFO  (jetty-launcher-7545-thread-1) [n:127.0.0.1:57168_solr    ] o.a.s.m.r.SolrJmxReporter JMX monitoring for 'solr_57168.solr.node' (registry 'solr.node') enabled at server: com.sun.jmx.mbeanserver.JmxMBeanServer@6215fba6
   [junit4]   2> 2060303 INFO  (jetty-launcher-7545-thread-1) [n:127.0.0.1:57168_solr    ] o.a.s.m.r.SolrJmxReporter JMX monitoring for 'solr_57168.solr.jvm' (registry 'solr.jvm') enabled at server: com.sun.jmx.mbeanserver.JmxMBeanServer@6215fba6
   [junit4]   2> 2060303 INFO  (jetty-launcher-7545-thread-1) [n:127.0.0.1:57168_solr    ] o.a.s.m.r.SolrJmxReporter JMX monitoring for 'solr_57168.solr.jetty' (registry 'solr.jetty') enabled at server: com.sun.jmx.mbeanserver.JmxMBeanServer@6215fba6
   [junit4]   2> 2060304 INFO  (jetty-launcher-7545-thread-1) [n:127.0.0.1:57168_solr    ] o.a.s.c.CorePropertiesLocator Found 0 core definitions underneath /Users/jenkins/workspace/Lucene-Solr-7.x-MacOSX/solr/build/solr-core/test/J1/temp/solr.cloud.TestPullReplica_89003455250E12D2-001/tempDir-001/node1/.
   [junit4]   2> 2060322 INFO  (zkConnectionManagerCallback-7582-thread-1) [    ] o.a.s.c.c.ConnectionManager zkClient has connected
   [junit4]   2> 2060326 INFO  (zkConnectionManagerCallback-7587-thread-1) [    ] o.a.s.c.c.ConnectionManager zkClient has connected
   [junit4]   2> 2060328 INFO  (SUITE-TestPullReplica-seed#[89003455250E12D2]-worker) [    ] o.a.s.c.c.ZkStateReader Updated live nodes from ZooKeeper... (0) -> (2)
   [junit4]   2> 2060330 INFO  (SUITE-TestPullReplica-seed#[89003455250E12D2]-worker) [    ] o.a.s.c.s.i.ZkClientClusterStateProvider Cluster at 127.0.0.1:57165/solr ready
   [junit4]   2> 2060335 INFO  (SUITE-TestPullReplica-seed#[89003455250E12D2]-worker) [    ] o.a.s.c.TestPullReplica Using legacyCloud?: false
   [junit4]   2> 2060345 INFO  (qtp1702230401-25480) [n:127.0.0.1:57168_solr    ] o.a.s.h.a.CollectionsHandler Invoked Collection Action :clusterprop with params val=false&name=legacyCloud&action=CLUSTERPROP&wt=javabin&version=2 and sendToOCPQueue=true
   [junit4]   2> 2060347 INFO  (qtp1702230401-25480) [n:127.0.0.1:57168_solr    ] o.a.s.s.HttpSolrCall [admin] webapp=null path=/admin/collections params={val=false&name=legacyCloud&action=CLUSTERPROP&wt=javabin&version=2} status=0 QTime=1
   [junit4]   2> 2060364 INFO  (TEST-TestPullReplica.testKillLeader-seed#[89003455250E12D2]) [    ] o.a.s.SolrTestCaseJ4 ###Starting testKillLeader
   [junit4]   2> 2060366 INFO  (qtp1702230401-25475) [n:127.0.0.1:57168_solr    ] o.a.s.h.a.CollectionsHandler Invoked Collection Action :create with params pullReplicas=1&collection.configName=conf&maxShardsPerNode=100&name=pull_replica_test_kill_leader&nrtReplicas=1&action=CREATE&numShards=1&tlogReplicas=0&wt=javabin&version=2 and sendToOCPQueue=true
   [junit4]   2> 2060368 INFO  (OverseerThreadFactory-10013-thread-1) [    ] o.a.s.c.a.c.CreateCollectionCmd Create collection pull_replica_test_kill_leader
   [junit4]   2> 2060491 INFO  (OverseerStateUpdate-72340655697690630-127.0.0.1:57167_solr-n_0000000000) [    ] o.a.s.c.o.SliceMutator createReplica() {
   [junit4]   2>   "operation":"ADDREPLICA",
   [junit4]   2>   "collection":"pull_replica_test_kill_leader",
   [junit4]   2>   "shard":"shard1",
   [junit4]   2>   "core":"pull_replica_test_kill_leader_shard1_replica_n1",
   [junit4]   2>   "state":"down",
   [junit4]   2>   "base_url":"https://127.0.0.1:57168/solr",
   [junit4]   2>   "type":"NRT",
   [junit4]   2>   "waitForFinalState":"false"} 
   [junit4]   2> 2060495 INFO  (OverseerStateUpdate-72340655697690630-127.0.0.1:57167_solr-n_0000000000) [    ] o.a.s.c.o.SliceMutator createReplica() {
   [junit4]   2>   "operation":"ADDREPLICA",
   [junit4]   2>   "collection":"pull_replica_test_kill_leader",
   [junit4]   2>   "shard":"shard1",
   [junit4]   2>   "core":"pull_replica_test_kill_leader_shard1_replica_p2",
   [junit4]   2>   "state":"down",
   [junit4]   2>   "base_url":"https://127.0.0.1:57167/solr",
   [junit4]   2>   "type":"PULL",
   [junit4]   2>   "waitForFinalState":"false"} 
   [junit4]   2> 2060721 INFO  (qtp1702230401-25481) [n:127.0.0.1:57168_solr    x:pull_replica_test_kill_leader_shard1_replica_n1] o.a.s.h.a.CoreAdminOperation core create command qt=/admin/cores&coreNodeName=core_node3&collection.configName=conf&newCollection=true&name=pull_replica_test_kill_leader_shard1_replica_n1&action=CREATE&numShards=1&collection=pull_replica_test_kill_leader&shard=shard1&wt=javabin&version=2&replicaType=NRT
   [junit4]   2> 2060730 INFO  (qtp691777470-25468) [n:127.0.0.1:57167_solr    x:pull_replica_test_kill_leader_shard1_replica_p2] o.a.s.h.a.CoreAdminOperation core create command qt=/admin/cores&coreNodeName=core_node4&collection.configName=conf&newCollection=true&name=pull_replica_test_kill_leader_shard1_replica_p2&action=CREATE&numShards=1&collection=pull_replica_test_kill_leader&shard=shard1&wt=javabin&version=2&replicaType=PULL
   [junit4]   2> 2060730 INFO  (qtp691777470-25468) [n:127.0.0.1:57167_solr    x:pull_replica_test_kill_leader_shard1_replica_p2] o.a.s.c.TransientSolrCoreCacheDefault Allocating transient cache for 2147483647 transient cores
   [junit4]   2> 2061744 INFO  (qtp691777470-25468) [n:127.0.0.1:57167_solr c:pull_replica_test_kill_leader s:shard1 r:core_node4 x:pull_replica_test_kill_leader_shard1_replica_p2] o.a.s.c.SolrConfig Using Lucene MatchVersion: 7.5.0
   [junit4]   2> 2061744 INFO  (qtp1702230401-25481) [n:127.0.0.1:57168_solr c:pull_replica_test_kill_leader s:shard1 r:core_node3 x:pull_replica_test_kill_leader_shard1_replica_n1] o.a.s.c.SolrConfig Using Lucene MatchVersion: 7.5.0
   [junit4]   2> 2061768 INFO  (qtp1702230401-25481) [n:127.0.0.1:57168_solr c:pull_replica_test_kill_leader s:shard1 r:core_node3 x:pull_replica_test_kill_leader_shard1_replica_n1] o.a.s.s.IndexSchema [pull_replica_test_kill_leader_shard1_replica_n1] Schema name=minimal
   [junit4]   2> 2061768 INFO  (qtp691777470-25468) [n:127.0.0.1:57167_solr c:pull_replica_test_kill_leader s:shard1 r:core_node4 x:pull_replica_test_kill_leader_shard1_replica_p2] o.a.s.s.IndexSchema [pull_replica_test_kill_leader_shard1_replica_p2] Schema name=minimal
   [junit4]   2> 2061770 INFO  (qtp1702230401-25481) [n:127.0.0.1:57168_solr c:pull_replica_test_kill_leader s:shard1 r:core_node3 x:pull_replica_test_kill_leader_shard1_replica_n1] o.a.s.s.IndexSchema Loaded schema minimal/1.1 with uniqueid field id
   [junit4]   2> 2061770 INFO  (qtp691777470-25468) [n:127.0.0.1:57167_solr c:pull_replica_test_kill_leader s:shard1 r:core_node4 x:pull_replica_test_kill_leader_shard1_replica_p2] o.a.s.s.IndexSchema Loaded schema minimal/1.1 with uniqueid field id
   [junit4]   2> 2061770 INFO  (qtp1702230401-25481) [n:127.0.0.1:57168_solr c:pull_replica_test_kill_leader s:shard1 r:core_node3 x:pull_replica_test_kill_leader_shard1_replica_n1] o.a.s.c.CoreContainer Creating SolrCore 'pull_replica_test_kill_leader_shard1_replica_n1' using configuration from collection pull_replica_test_kill_leader, trusted=true
   [junit4]   2> 2061770 INFO  (qtp691777470-25468) [n:127.0.0.1:57167_solr c:pull_replica_test_kill_leader s:shard1 r:core_node4 x:pull_replica_test_kill_leader_shard1_replica_p2] o.a.s.c.CoreContainer Creating SolrCore 'pull_replica_test_kill_leader_shard1_replica_p2' using configuration from collection pull_replica_test_kill_leader, trusted=true
   [junit4]   2> 2061770 INFO  (qtp1702230401-25481) [n:127.0.0.1:57168_solr c:pull_replica_test_kill_leader s:shard1 r:core_node3 x:pull_replica_test_kill_leader_shard1_replica_n1] o.a.s.m.r.SolrJmxReporter JMX monitoring for 'solr_57168.solr.core.pull_replica_test_kill_leader.shard1.replica_n1' (registry 'solr.core.pull_replica_test_kill_leader.shard1.replica_n1') enabled at server: com.sun.jmx.mbeanserver.JmxMBeanServer@6215fba6
   [junit4]   2> 2061770 INFO  (qtp691777470-25468) [n:127.0.0.1:57167_solr c:pull_replica_test_kill_leader s:shard1 r:core_node4 x:pull_replica_test_kill_leader_shard1_replica_p2] o.a.s.m.r.SolrJmxReporter JMX monitoring for 'solr_57167.solr.core.pull_replica_test_kill_leader.shard1.replica_p2' (registry 'solr.core.pull_replica_test_kill_leader.shard1.replica_p2') enabled at server: com.sun.jmx.mbeanserver.JmxMBeanServer@6215fba6
   [junit4]   2> 2061770 INFO  (qtp1702230401-25481) [n:127.0.0.1:57168_solr c:pull_replica_test_kill_leader s:shard1 r:core_node3 x:pull_replica_test_kill_leader_shard1_replica_n1] o.a.s.c.SolrCore solr.RecoveryStrategy.Builder
   [junit4]   2> 2061770 INFO  (qtp691777470-25468) [n:127.0.0.1:57167_solr c:pull_replica_test_kill_leader s:shard1 r:core_node4 x:pull_replica_test_kill_leader_shard1_replica_p2] o.a.s.c.SolrCore solr.RecoveryStrategy.Builder
   [junit4]   2> 2061770 INFO  (qtp1702230401-25481) [n:127.0.0.1:57168_solr c:pull_replica_test_kill_leader s:shard1 r:core_node3 x:pull_replica_test_kill_leader_shard1_replica_n1] o.a.s.c.SolrCore [[pull_replica_test_kill_leader_shard1_replica_n1] ] Opening new SolrCore at [/Users/jenkins/workspace/Lucene-Solr-7.x-MacOSX/solr/build/solr-core/test/J1/temp/solr.cloud.TestPullReplica_89003455250E12D2-001/tempDir-001/node1/pull_replica_test_kill_leader_shard1_replica_n1], dataDir=[/Users/jenkins/workspace/Lucene-Solr-7.x-MacOSX/solr/build/solr-core/test/J1/temp/solr.cloud.TestPullReplica_89003455250E12D2-001/tempDir-001/node1/./pull_replica_test_kill_leader_shard1_replica_n1/data/]
   [junit4]   2> 2061770 INFO  (qtp691777470-25468) [n:127.0.0.1:57167_solr c:pull_replica_test_kill_leader s:shard1 r:core_node4 x:pull_replica_test_kill_leader_shard1_replica_p2] o.a.s.c.SolrCore [[pull_replica_test_kill_leader_shard1_replica_p2] ] Opening new SolrCore at [/Users/jenkins/workspace/Lucene-Solr-7.x-MacOSX/solr/build/solr-core/test/J1/temp/solr.cloud.TestPullReplica_89003455250E12D2-001/tempDir-001/node2/pull_replica_test_kill_leader_shard1_replica_p2], dataDir=[/Users/jenkins/workspace/Lucene-Solr-7.x-MacOSX/solr/build/solr-core/test/J1/temp/solr.cloud.TestPullReplica_89003455250E12D2-001/tempDir-001/node2/./pull_replica_test_kill_leader_shard1_replica_p2/data/]
   [junit4]   2> 2061822 INFO  (qtp691777470-25468) [n:127.0.0.1:57167_solr c:pull_replica_test_kill_leader s:shard1 r:core_node4 x:pull_replica_test_kill_leader_shard1_replica_p2] o.a.s.u.CommitTracker Hard AutoCommit: disabled
   [junit4]   2> 2061822 INFO  (qtp691777470-25468) [n:127.0.0.1:57167_solr c:pull_replica_test_kill_leader s:shard1 r:core_node4 x:pull_replica_test_kill_leader_shard1_replica_p2] o.a.s.u.CommitTracker Soft AutoCommit: disabled
   [junit4]   2> 2061905 INFO  (qtp1702230401-25481) [n:127.0.0.1:57168_solr c:pull_replica_test_kill_leader s:shard1 r:core_node3 x:pull_replica_test_kill_leader_shard1_replica_n1] o.a.s.u.UpdateHandler Using UpdateLog implementation: org.apache.solr.update.UpdateLog
   [junit4]   2> 2061905 INFO  (qtp1702230401-25481) [n:127.0.0.1:57168_solr c:pull_replica_test_kill_leader s:shard1 r:core_node3 x:pull_replica_test_kill_leader_shard1_replica_n1] o.a.s.u.UpdateLog Initializing UpdateLog: dataDir=null defaultSyncLevel=FLUSH numRecordsToKeep=100 maxNumLogsToKeep=10 numVersionBuckets=65536
   [junit4]   2> 2061907 INFO  (qtp1702230401-25481) [n:127.0.0.1:57168_solr c:pull_replica_test_kill_leader s:shard1 r:core_node3 x:pull_replica_test_kill_leader_shard1_replica_n1] o.a.s.u.CommitTracker Hard AutoCommit: disabled
   [junit4]   2> 2061907 INFO  (qtp1702230401-25481) [n:127.0.0.1:57168_solr c:pull_replica_test_kill_leader s:shard1 r:core_node3 x:pull_replica_test_kill_leader_shard1_replica_n1] o.a.s.u.CommitTracker Soft AutoCommit: disabled
   [junit4]   2> 2061908 INFO  (qtp691777470-25468) [n:127.0.0.1:57167_solr c:pull_replica_test_kill_leader s:shard1 r:core_node4 x:pull_replica_test_kill_leader_shard1_replica_p2] o.a.s.s.SolrIndexSearcher Opening [Searcher@6a711574[pull_replica_test_kill_leader_shard1_replica_p2] main]
   [junit4]   2> 2061908 INFO  (qtp1702230401-25481) [n:127.0.0.1:57168_solr c:pull_replica_test_kill_leader s:shard1 r:core_node3 x:pull_replica_test_kill_leader_shard1_replica_n1] o.a.s.s.SolrIndexSearcher Opening [Searcher@1494e819[pull_replica_test_kill_leader_shard1_replica_n1] main]
   [junit4]   2> 2061910 INFO  (qtp691777470-25468) [n:127.0.0.1:57167_solr c:pull_replica_test_kill_leader s:shard1 r:core_node4 x:pull_replica_test_kill_leader_shard1_replica_p2] o.a.s.r.ManagedResourceStorage Configured ZooKeeperStorageIO with znodeBase: /configs/conf
   [junit4]   2> 2061910 INFO  (qtp1702230401-25481) [n:127.0.0.1:57168_solr c:pull_replica_test_kill_leader s:shard1 r:core_node3 x:pull_replica_test_kill_leader_shard1_replica_n1] o.a.s.r.ManagedResourceStorage Configured ZooKeeperStorageIO with znodeBase: /configs/conf
   [junit4]   2> 2061911 INFO  (qtp691777470-25468) [n:127.0.0.1:57167_solr c:pull_replica_test_kill_leader s:shard1 r:core_node4 x:pull_replica_test_kill_leader_shard1_replica_p2] o.a.s.r.ManagedResourceStorage Loaded null at path _rest_managed.json using ZooKeeperStorageIO:path=/configs/conf
   [junit4]   2> 2061911 INFO  (qtp1702230401-25481) [n:127.0.0.1:57168_solr c:pull_replica_test_kill_leader s:shard1 r:core_node3 x:pull_replica_test_kill_leader_shard1_replica_n1] o.a.s.r.ManagedResourceStorage Loaded null at path _rest_managed.json using ZooKeeperStorageIO:path=/configs/conf
   [junit4]   2> 2061911 INFO  (qtp691777470-25468) [n:127.0.0.1:57167_solr c:pull_replica_test_kill_leader s:shard1 r:core_node4 x:pull_replica_test_kill_leader_shard1_replica_p2] o.a.s.h.ReplicationHandler Commits will be reserved for 10000ms.
   [junit4]   2> 2061912 INFO  (searcherExecutor-10023-thread-1-processing-n:127.0.0.1:57167_solr x:pull_replica_test_kill_leader_shard1_replica_p2 c:pull_replica_test_kill_leader s:shard1 r:core_node4) [n:127.0.0.1:57167_solr c:pull_replica_test_kill_leader s:shard1 r:core_node4 x:pull_replica_test_kill_leader_shard1_replica_p2] o.a.s.c.SolrCore [pull_replica_test_kill_leader_shard1_replica_p2] Registered new searcher Searcher@6a711574[pull_replica_test_kill_leader_shard1_replica_p2] main{ExitableDirectoryReader(UninvertingDirectoryReader())}
   [junit4]   2> 2061912 INFO  (qtp1702230401-25481) [n:127.0.0.1:57168_solr c:pull_replica_test_kill_leader s:shard1 r:core_node3 x:pull_replica_test_kill_leader_shard1_replica_n1] o.a.s.h.ReplicationHandler Commits will be reserved for 10000ms.
   [junit4]   2> 2061913 INFO  (searcherExecutor-10022-thread-1-processing-n:127.0.0.1:57168_solr x:pull_replica_test_kill_leader_shard1_replica_n1 c:pull_replica_test_kill_leader s:shard1 r:core_node3) [n:127.0.0.1:57168_solr c:pull_replica_test_kill_leader s:shard1 r:core_node3 x:pull_replica_test_kill_leader_shard1_replica_n1] o.a.s.c.SolrCore [pull_replica_test_kill_leader_shard1_replica_n1] Registered new searcher Searcher@1494e819[pull_replica_test_kill_leader_shard1_replica_n1] main{ExitableDirectoryReader(UninvertingDirectoryReader())}
   [junit4]   2> 2061913 INFO  (qtp1702230401-25481) [n:127.0.0.1:57168_solr c:pull_replica_test_kill_leader s:shard1 r:core_node3 x:pull_replica_test_kill_leader_shard1_replica_n1] o.a.s.u.UpdateLog Could not find max version in index or recent updates, using new clock 1605519312408281088
   [junit4]   2> 2061918 INFO  (qtp691777470-25468) [n:127.0.0.1:57167_solr c:pull_replica_test_kill_leader s:shard1 r:core_node4 x:pull_replica_test_kill_leader_shard1_replica_p2] o.a.s.c.ZkController pull_replica_test_kill_leader_shard1_replica_p2 starting background replication from leader
   [junit4]   2> 2061918 INFO  (qtp691777470-25468) [n:127.0.0.1:57167_solr c:pull_replica_test_kill_leader s:shard1 r:core_node4 x:pull_replica_test_kill_leader_shard1_replica_p2] o.a.s.c.ReplicateFromLeader Will start replication from leader with poll interval: 00:00:03
   [junit4]   2> 2061919 INFO  (qtp691777470-25468) [n:127.0.0.1:57167_solr c:pull_replica_test_kill_leader s:shard1 r:core_node4 x:pull_replica_test_kill_leader_shard1_replica_p2] o.a.s.h.ReplicationHandler Poll scheduled at an interval of 3000ms
   [junit4]   2> 2061919 INFO  (qtp691777470-25468) [n:127.0.0.1:57167_solr c:pull_replica_test_kill_leader s:shard1 r:core_node4 x:pull_replica_test_kill_leader_shard1_replica_p2] o.a.s.h.ReplicationHandler Commits will be reserved for 10000ms.
   [junit4]   2> 2061923 INFO  (qtp1702230401-25481) [n:127.0.0.1:57168_solr c:pull_replica_test_kill_leader s:shard1 r:core_node3 x:pull_replica_test_kill_leader_shard1_replica_n1] o.a.s.c.ZkShardTerms Successful update of terms at /collections/pull_replica_test_kill_leader/terms/shard1 to Terms{values={core_node3=0}, version=0}
   [junit4]   2> 2061932 INFO  (qtp1702230401-25481) [n:127.0.0.1:57168_solr c:pull_replica_test_kill_leader s:shard1 r:core_node3 x:pull_replica_test_kill_leader_shard1_replica_n1] o.a.s.c.ShardLeaderElectionContext Enough replicas found to continue.
   [junit4]   2> 2061932 INFO  (qtp1702230401-25481) [n:127.0.0.1:57168_solr c:pull_replica_test_kill_leader s:shard1 r:core_node3 x:pull_replica_test_kill_leader_shard1_replica_n1] o.a.s.c.ShardLeaderElectionContext I may be the new leader - try and sync
   [junit4]   2> 2061932 INFO  (qtp1702230401-25481) [n:127.0.0.1:57168_solr c:pull_replica_test_kill_leader s:shard1 r:core_node3 x:pull_replica_test_kill_leader_shard1_replica_n1] o.a.s.c.SyncStrategy Sync replicas to https://127.0.0.1:57168/solr/pull_replica_test_kill_leader_shard1_replica_n1/
   [junit4]   2> 2061932 INFO  (qtp1702230401-25481) [n:127.0.0.1:57168_solr c:pull_replica_test_kill_leader s:shard1 r:core_node3 x:pull_replica_test_kill_leader_shard1_replica_n1] o.a.s.c.SyncStrategy Sync Success - now sync replicas to me
   [junit4]   2> 2061933 INFO  (qtp1702230401-25481) [n:127.0.0.1:57168_solr c:pull_replica_test_kill_leader s:shard1 r:core_node3 x:pull_replica_test_kill_leader_shard1_replica_n1] o.a.s.c.SyncStrategy https://127.0.0.1:57168/solr/pull_replica_test_kill_leader_shard1_replica_n1/ has no replicas
   [junit4]   2> 2061933 INFO  (qtp1702230401-25481) [n:127.0.0.1:57168_solr c:pull_replica_test_kill_leader s:shard1 r:core_node3 x:pull_replica_test_kill_leader_shard1_replica_n1] o.a.s.c.ShardLeaderElectionContext Found all replicas participating in election, clear LIR
   [junit4]   2> 2061939 INFO  (qtp1702230401-25481) [n:127.0.0.1:57168_solr c:pull_replica_test_kill_leader s:shard1 r:core_node3 x:pull_replica_test_kill_leader_shard1_replica_n1] o.a.s.c.ShardLeaderElectionContext I am the new leader: https://127.0.0.1:57168/solr/pull_replica_test_kill_leader_shard1_replica_n1/ shard1
   [junit4]   2> 2062053 INFO  (qtp1702230401-25481) [n:127.0.0.1:57168_solr c:pull_replica_test_kill_leader s:shard1 r:core_node3 x:pull_replica_test_kill_leader_shard1_replica_n1] o.a.s.c.ZkController I am the leader, no recovery necessary
   [junit4]   2> 2062055 INFO  (qtp1702230401-25481) [n:127.0.0.1:57168_solr c:pull_replica_test_kill_leader s:shard1 r:core_node3 x:pull_replica_test_kill_leader_shard1_replica_n1] o.a.s.s.HttpSolrCall [admin] webapp=null path=/admin/cores params={qt=/admin/cores&coreNodeName=core_node3&collection.configName=conf&newCollection=true&name=pull_replica_test_kill_leader_shard1_replica_n1&action=CREATE&numShards=1&collection=pull_replica_test_kill_leader&shard=shard1&wt=javabin&version=2&replicaType=NRT} status=0 QTime=1334
   [junit4]   2> 2062089 INFO  (indexFetcher-10032-thread-1) [    ] o.a.s.h.IndexFetcher Replica core_node3 is leader but it's state is down, skipping replication
   [junit4]   2> 2062165 INFO  (zkCallback-7557-thread-1) [    ] o.a.s.c.c.ZkStateReader A cluster state change: [WatchedEvent state:SyncConnected type:NodeDataChanged path:/collections/pull_replica_test_kill_leader/state.json] for collection [pull_replica_test_kill_leader] has occurred - updating... (live nodes size: [2])
   [junit4]   2> 2062930 INFO  (qtp691777470-25468) [n:127.0.0.1:57167_solr c:pull_replica_test_kill_leader s:shard1 r:core_node4 x:pull_replica_test_kill_leader_shard1_replica_p2] o.a.s.s.HttpSolrCall [admin] webapp=null path=/admin/cores params={qt=/admin/cores&coreNodeName=core_node4&collection.configName=conf&newCollection=true&name=pull_replica_test_kill_leader_shard1_replica_p2&action=CREATE&numShards=1&collection=pull_replica_test_kill_leader&shard=shard1&wt=javabin&version=2&replicaType=PULL} status=0 QTime=2201
   [junit4]   2> 2062933 INFO  (qtp1702230401-25475) [n:127.0.0.1:57168_solr    ] o.a.s.h.a.CollectionsHandler Wait for new collection to be active for at most 30 seconds. Check all shard replicas
   [junit4]   2> 2063041 INFO  (zkCallback-7557-thread-1) [    ] o.a.s.c.c.ZkStateReader A cluster state change: [WatchedEvent state:SyncConnected type:NodeDataChanged path:/collections/pull_replica_test_kill_leader/state.json] for collection [pull_replica_test_kill_leader] has occurred - updating... (live nodes size: [2])
   [junit4]   2> 2063041 INFO  (zkCallback-7565-thread-1) [    ] o.a.s.c.c.ZkStateReader A cluster state change: [WatchedEvent state:SyncConnected type:NodeDataChanged path:/collections/pull_replica_test_kill_leader/state.json] for collection [pull_replica_test_kill_leader] has occurred - updating... (live nodes size: [2])
   [junit4]   2> 2063940 INFO  (qtp1702230401-25475) [n:127.0.0.1:57168_solr    ] o.a.s.s.HttpSolrCall [admin] webapp=null path=/admin/collections params={pullReplicas=1&collection.configName=conf&maxShardsPerNode=100&name=pull_replica_test_kill_leader&nrtReplicas=1&action=CREATE&numShards=1&tlogReplicas=0&wt=javabin&version=2} status=0 QTime=3574
   [junit4]   2> 2063947 INFO  (qtp1702230401-25480) [n:127.0.0.1:57168_solr c:pull_replica_test_kill_leader s:shard1 r:core_node3 x:pull_replica_test_kill_leader_shard1_replica_n1] o.a.s.c.ZkShardTerms Successful update of terms at /collections/pull_replica_test_kill_leader/terms/shard1 to Terms{values={core_node3=1}, version=1}
   [junit4]   2> 2063947 INFO  (qtp1702230401-25480) [n:127.0.0.1:57168_solr c:pull_replica_test_kill_leader s:shard1 r:core_node3 x:pull_replica_test_kill_leader_shard1_replica_n1] o.a.s.u.p.LogUpdateProcessorFactory [pull_replica_test_kill_leader_shard1_replica_n1]  webapp=/solr path=/update params={wt=javabin&version=2}{add=[1 (1605519314538987520)]} 0 2
   [junit4]   2> 2063948 INFO  (qtp1702230401-25475) [n:127.0.0.1:57168_solr c:pull_replica_test_kill_leader s:shard1 r:core_node3 x:pull_replica_test_kill_leader_shard1_replica_n1] o.a.s.u.DirectUpdateHandler2 start commit{_version_=1605519314542133248,optimize=false,openSearcher=true,waitSearcher=true,expungeDeletes=false,softCommit=false,prepareCommit=false}
   [junit4]   2> 2063948 INFO  (qtp1702230401-25475) [n:127.0.0.1:57168_solr c:pull_replica_test_kill_leader s:shard1 r:core_node3 x:pull_replica_test_kill_leader_shard1_replica_n1] o.a.s.u.SolrIndexWriter Calling setCommitData with IW:org.apache.solr.update.SolrIndexWriter@330443ba commitCommandVersion:1605519314542133248
   [junit4]   2> 2063952 INFO  (qtp1702230401-25475) [n:127.0.0.1:57168_solr c:pull_replica_test_kill_leader s:shard1 r:core_node3 x:pull_replica_test_kill_leader_shard1_replica_n1] o.a.s.s.SolrIndexSearcher Opening [Searcher@36ed8a6d[pull_replica_test_kill_leader_shard1_replica_n1] main]
   [junit4]   2> 2063953 INFO  (qtp1702230401-25475) [n:127.0.0.1:57168_solr c:pull_replica_test_kill_leader s:shard1 r:core_node3 x:pull_replica_test_kill_leader_shard1_replica_n1] o.a.s.u.DirectUpdateHandler2 end_commit_flush
   [junit4]   2> 2063954 INFO  (searcherExecutor-10022-thread-1-processing-n:127.0.0.1:57168_solr x:pull_replica_test_kill_leader_shard1_replica_n1 c:pull_replica_test_kill_leader s:shard1 r:core_node3) [n:127.0.0.1:57168_solr c:pull_replica_test_kill_leader s:shard1 r:core_node3 x:pull_replica_test_kill_leader_shard1_replica_n1] o.a.s.c.SolrCore [pull_replica_test_kill_leader_shard1_replica_n1] Registered new searcher Searcher@36ed8a6d[pull_replica_test_kill_leader_shard1_replica_n1] main{ExitableDirectoryReader(UninvertingDirectoryReader(Uninverting(_0(7.5.0):C1)))}
   [junit4]   2> 2063954 INFO  (qtp1702230401-25475) [n:127.0.0.1:57168_solr c:pull_replica_test_kill_leader s:shard1 r:core_node3 x:pull_replica_test_kill_leader_shard1_replica_n1] o.a.s.u.p.LogUpdateProcessorFactory [pull_replica_test_kill_leader_shard1_replica_n1]  webapp=/solr path=/update params={_stateVer_=pull_replica_test_kill_leader:5&waitSearcher=true&commit=true&softCommit=false&wt=javabin&version=2}{commit=} 0 5
   [junit4]   2> 2063958 INFO  (qtp1702230401-25475) [n:127.0.0.1:57168_solr c:pull_replica_test_kill_leader s:shard1 r:core_node3 x:pull_replica_test_kill_leader_shard1_replica_n1] o.a.s.c.S.Request [pull_replica_test_kill_leader_shard1_replica_n1]  webapp=/solr path=/select params={q=*:*&wt=javabin&version=2} hits=1 status=0 QTime=0
   [junit4]   2> 2063962 INFO  (qtp691777470-25478) [n:127.0.0.1:57167_solr c:pull_replica_test_kill_leader s:shard1 r:core_node4 x:pull_replica_test_kill_leader_shard1_replica_p2] o.a.s.c.S.Request [pull_replica_test_kill_leader_shard1_replica_p2]  webapp=/solr path=/select params={q=*:*&wt=javabin&version=2} hits=0 status=0 QTime=0
   [junit4]   2> 2064074 INFO  (qtp691777470-25472) [n:127.0.0.1:57167_solr c:pull_replica_test_kill_leader s:shard1 r:core_node4 x:pull_replica_test_kill_leader_shard1_replica_p2] o.a.s.c.S.Request [pull_replica_test_kill_leader_shard1_replica_p2]  webapp=/solr path=/select params={q=*:*&wt=javabin&version=2} hits=0 status=0 QTime=0
   [junit4]   2> 2064180 INFO  (qtp691777470-25478) [n:127.0.0.1:57167_solr c:pull_replica_test_kill_leader s:shard1 r:core_node4 x:pull_replica_test_kill_leader_shard1_replica_p2] o.a.s.c.S.Request [pull_replica_test_kill_leader_shard1_replica_p2]  webapp=/solr path=/select params={q=*:*&wt=javabin&version=2} hits=0 status=0 QTime=0
   [junit4]   2> 2064282 INFO  (qtp691777470-25472) [n:127.0.0.1:57167_solr c:pull_replica_test_kill_leader s:shard1 r:core_node4 x:pull_replica_test_kill_leader_shard1_replica_p2] o.a.s.c.S.Request [pull_replica_test_kill_leader_shard1_replica_p2]  webapp=/solr path=/select params={q=*:*&wt=javabin&version=2} hits=0 status=0 QTime=0
   [junit4]   2> 2064389 INFO  (qtp691777470-25478) [n:127.0.0.1:57167_solr c:pull_replica_test_kill_leader s:shard1 r:core_node4 x:pull_replica_test_kill_leader_shard1_replica_p2] o.a.s.c.S.Request [pull_replica_test_kill_leader_shard1_replica_p2]  webapp=/solr path=/select params={q=*:*&wt=javabin&version=2} hits=0 status=0 QTime=0
   [junit4]   2> 2064389 INFO  (OverseerCollectionConfigSetProcessor-72340655697690630-127.0.0.1:57167_solr-n_0000000000) [    ] o.a.s.c.OverseerTaskQueue Response ZK path: /overseer/collection-queue-work/qnr-0000000000 doesn't exist.  Requestor may have disconnected from ZooKeeper
   [junit4]   2> 2064494 INFO  (qtp691777470-25472) [n:127.0.0.1:57167_solr c:pull_replica_test_kill_leader s:shard1 r:core_node4 x:pull_replica_test_kill_leader_shard1_replica_p2] o.a.s.c.S.Request [pull_replica_test_kill_leader_shard1_replica_p2]  webapp=/solr path=/select params={q=*:*&wt=javabin&version=2} hits=0 status=0 QTime=0
   [junit4]   2> 2064605 INFO  (qtp691777470-25478) [n:127.0.0.1:57167_solr c:pull_replica_test_kill_leader s:shard1 r:core_node4 x:pull_replica_test_kill_leader_shard1_replica_p2] o.a.s.c.S.Request [pull_replica_test_kill_leader_shard1_replica_p2]  webapp=/solr path=/select params={q=*:*&wt=javabin&version=2} hits=0 status=0 QTime=0
   [junit4]   2> 2064715 INFO  (qtp691777470-25472) [n:127.0.0.1:57167_solr c:pull_replica_test_kill_leader s:shard1 r:core_node4 x:pull_replica_test_kill_leader_shard1_replica_p2] o.a.s.c.S.Request [pull_replica_test_kill_leader_shard1_replica_p2]  webapp=/solr path=/select params={q=*:*&wt=javabin&version=2} hits=0 status=0 QTime=0
   [junit4]   2> 2064826 INFO  (qtp691777470-25478) [n:127.0.0.1:57167_solr c:pull_replica_test_kill_leader s:shard1 r:core_node4 x:pull_replica_test_kill_leader_shard1_replica_p2] o.a.s.c.S.Request [pull_replica_test_kill_leader_shard1_replica_p2]  webapp=/solr path=/select params={q=*:*&wt=javabin&version=2} hits=0 status=0 QTime=0
   [junit4]   2> 2064929 INFO  (indexFetcher-10032-thread-1) [    ] o.a.s.h.IndexFetcher Last replication failed, so I'll force replication
   [junit4]   2> 2064929 INFO  (indexFetcher-10032-thread-1) [    ] o.a.s.h.IndexFetcher Updated masterUrl to https://127.0.0.1:57168/solr/pull_replica_test_kill_leader_shard1_replica_n1/
   [junit4]   2> 2064930 INFO  (qtp691777470-25472) [n:127.0.0.1:57167_solr c:pull_replica_test_kill_leader s:shard1 r:core_node4 x:pull_replica_test_kill_leader_shard1_replica_p2] o.a.s.c.S.Request [pull_replica_test_kill_leader_shard1_replica_p2]  webapp=/solr path=/select params={q=*:*&wt=javabin&version=2} hits=0 status=0 QTime=0
   [junit4]   2> 2064932 INFO  (qtp1702230401-25475) [n:127.0.0.1:57168_solr c:pull_replica_test_kill_leader s:shard1 r:core_node3 x:pull_replica_test_kill_leader_shard1_replica_n1] o.a.s.c.S.Request [pull_replica_test_kill_leader_shard1_replica_n1]  webapp=/solr path=/replication params={qt=/replication&wt=javabin&version=2&command=indexversion} status=0 QTime=0
   [junit4]   2> 2064932 INFO  (indexFetcher-10032-thread-1) [    ] o.a.s.h.IndexFetcher Master's generation: 2
   [junit4]   2> 2064932 INFO  (indexFetcher-10032-thread-1) [    ] o.a.s.h.IndexFetcher Master's version: 1531142534773
   [junit4]   2> 2064932 INFO  (indexFetcher-10032-thread-1) [    ] o.a.s.h.IndexFetcher Slave's generation: 1
   [junit4]   2> 2064932 INFO  (indexFetcher-10032-thread-1) [    ] o.a.s.h.IndexFetcher Slave's version: 0
   [junit4]   2> 2064932 INFO  (indexFetcher-10032-thread-1) [    ] o.a.s.h.IndexFetcher Starting replication process
   [junit4]   2> 2064933 INFO  (qtp1702230401-25480) [n:127.0.0.1:57168_solr c:pull_replica_test_kill_leader s:shard1 r:core_node3 x:pull_replica_test_kill_leader_shard1_replica_n1] o.a.s.c.S.Request [pull_replica_test_kill_leader_shard1_replica_n1]  webapp=/solr path=/replication params={generation=2&qt=/replication&tlogFiles=false&wt=javabin&version=2&command=filelist} status=0 QTime=0
   [junit4]   2> 2064933 INFO  (indexFetcher-10032-thread-1) [    ] o.a.s.h.IndexFetcher Number of files in latest index in master: 13
   [junit4]   2> 2064934 INFO  (indexFetcher-10032-thread-1) [    ] o.a.s.h.IndexFetcher Starting download (fullCopy=true) to MockDirectoryWrapper(RAMDirectory@2a29adad lockFactory=org.apache.lucene.store.SingleInstanceLockFactory@1236a891)
   [junit4]   2> 2064935 INFO  (qtp1702230401-25475) [n:127.0.0.1:57168_solr c:pull_replica_test_kill_leader s:shard1 r:core_node3 x:pull_replica_test_kill_leader_shard1_replica_n1] o.a.s.c.S.Request [pull_replica_test_kill_leader_shard1_replica_n1]  webapp=/solr path=/replication params={generation=2&qt=/replication&file=_0.si&checksum=true&wt=filestream&command=filecontent} status=0 QTime=0
   [junit4]   2> 2064936 INFO  (qtp1702230401-25480) [n:127.0.0.1:57168_solr c:pull_replica_test_kill_leader s:shard1 r:core_node3 x:pull_replica_test_kill_leader_shard1_replica_n1] o.a.s.c.S.Request [pull_replica_test_kill_leader_shard1_replica_n1]  webapp=/solr path=/replication params={generation=2&qt=/replication&file=_0_Lucene50_0.doc&checksum=true&wt=filestream&command=filecontent} status=0 QTime=0
   [junit4]   2> 2064937 INFO  (qtp1702230401-25475) [n:127.0.0.1:57168_solr c:pull_replica_test_kill_leader s:shard1 r:core_node3 x:pull_replica_test_kill_leader_shard1_replica_n1] o.a.s.c.S.Request [pull_replica_test_kill_leader_shard1_replica_n1]  webapp=/solr path=/replication params={generation=2&qt=/replication&file=_0_Lucene50_0.tim&checksum=true&wt=filestream&command=filecontent} status=0 QTime=0
   [junit4]   2> 2064938 INFO  (qtp1702230401-25480) [n:127.0.0.1:57168_solr c:pull_replica_test_kill_leader s:shard1 r:core_node3 x:pull_replica_test_kill_leader_shard1_replica_n1] o.a.s.c.S.Request [pull_replica_test_kill_leader_shard1_replica_n1]  webapp=/solr path=/replication params={generation=2&qt=/replication&file=_0_Lucene50_0.pos&checksum=true&wt=filestream&command=filecontent} status=0 QTime=0
   [junit4]   2> 2064939 INFO  (qtp1702230401-25475) [n:127.0.0.1:57168_solr c:pull_replica_test_kill_leader s:shard1 r:core_node3 x:pull_replica_test_kill_leader_shard1_replica_n1] o.a.s.c.S.Request [pull_replica_test_kill_leader_shard1_replica_n1]  webapp=/solr path=/replication params={generation=2&qt=/replication&file=_0.nvd&checksum=true&wt=filestream&command=filecontent} status=0 QTime=0
   [junit4]   2> 2064940 INFO  (qtp1702230401-25480) [n:127.0.0.1:57168_solr c:pull_replica_test_kill_leader s:shard1 r:core_node3 x:pull_replica_test_kill_leader_shard1_replica_n1] o.a.s.c.S.Request [pull_replica_test_kill_leader_shard1_replica_n1]  webapp=/solr path=/replication params={generation=2&qt=/replication&file=_0.fdx&checksum=true&wt=filestream&command=filecontent} status=0 QTime=0
   [junit4]   2> 2064941 INFO  (qtp1702230401-25475) [n:127.0.0.1:57168_solr c:pull_replica_test_kill_leader s:shard1 r:core_node3 x:pull_replica_test_kill_leader_shard1_replica_n1] o.a.s.c.S.Request [pull_replica_test_kill_leader_shard1_replica_n1]  webapp=/solr path=/replication params={generation=2&qt=/replication&file=_0_Lucene50_0.tip&checksum=true&wt=filestream&command=filecontent} status=0 QTime=0
   [junit4]   2> 2064942 INFO  (qtp1702230401-25480) [n:127.0.0.1:57168_solr c:pull_replica_test_kill_leader s:shard1 r:core_node3 x:pull_replica_test_kill_leader_shard1_replica_n1] o.a.s.c.S.Request [pull_replica_test_kill_leader_shard1_replica_n1]  webapp=/solr path=/replication params={generation=2&qt=/replication&file=_0.fdt&checksum=true&wt=filestream&command=filecontent} status=0 QTime=0
   [junit4]   2> 2064945 INFO  (qtp1702230401-25475) [n:127.0.0.1:57168_solr c:pull_replica_test_kill_leader s:shard1 r:core_node3 x:pull_replica_test_kill_leader_shard1_replica_n1] o.a.s.c.S.Request [pull_replica_test_kill_leader_shard1_replica_n1]  webapp=/solr path=/replication params={generation=2&qt=/replication&file=_0_Lucene70_0.dvm&checksum=true&wt=filestream&command=filecontent} status=0 QTime=0
   [junit4]   2> 2064948 INFO  (qtp1702230401-25480) [n:127.0.0.1:57168_solr c:pull_replica_test_kill_leader s:shard1 r:core_node3 x:pull_replica_test_kill_leader_shard1_replica_n1] o.a.s.c.S.Request [pull_replica_test_kill_leader_shard1_replica_n1]  webapp=/solr path=/replication params={generation=2&qt=/replication&file=_0_Lucene70_0.dvd&checksum=true&wt=filestream&command=filecontent} status=0 QTime=0
   [junit4]   2> 2064951 INFO  (qtp1702230401-25475) [n:127.0.0.1:57168_solr c:pull_replica_test_kill_leader s:shard1 r:core_node3 x:pull_replica_test_kill_leader_shard1_replica_n1] o.a.s.c.S.Request [pull_replica_test_kill_leader_shard1_replica_n1]  webapp=/solr path=/replication params={generation=2&qt=/replication&file=_0.nvm&checksum=true&wt=filestream&command=filecontent} status=0 QTime=0
   [junit4]   2> 2064954 INFO  (qtp1702230401-25480) [n:127.0.0.1:57168_solr c:pull_replica_test_kill_leader s:shard1 r:core_node3 x:pull_replica_test_kill_leader_shard1_replica_n1] o.a.s.c.S.Request [pull_repli

[...truncated too long message...]

eContainer instance=176027561
   [junit4]   2> 323038 INFO  (jetty-closer-154-thread-2) [    ] o.a.s.m.SolrMetricManager Closing metric reporters for registry=solr.node, tag=null
   [junit4]   2> 323038 INFO  (jetty-closer-154-thread-2) [    ] o.a.s.m.r.SolrJmxReporter Closing reporter [org.apache.solr.metrics.reporters.SolrJmxReporter@20bead17: rootName = solr_50908, domain = solr.node, service url = null, agent id = null] for registry solr.node / com.codahale.metrics.MetricRegistry@71d4d4ba
   [junit4]   2> 323043 INFO  (jetty-closer-154-thread-1) [    ] o.a.s.m.SolrMetricManager Closing metric reporters for registry=solr.jvm, tag=null
   [junit4]   2> 323043 INFO  (jetty-closer-154-thread-1) [    ] o.a.s.m.r.SolrJmxReporter Closing reporter [org.apache.solr.metrics.reporters.SolrJmxReporter@7ddfad95: rootName = solr_50909, domain = solr.jvm, service url = null, agent id = null] for registry solr.jvm / com.codahale.metrics.MetricRegistry@2c1e57e8
   [junit4]   2> 323043 INFO  (jetty-closer-154-thread-2) [    ] o.a.s.m.SolrMetricManager Closing metric reporters for registry=solr.jvm, tag=null
   [junit4]   2> 323043 INFO  (jetty-closer-154-thread-2) [    ] o.a.s.m.r.SolrJmxReporter Closing reporter [org.apache.solr.metrics.reporters.SolrJmxReporter@789bd49d: rootName = solr_50908, domain = solr.jvm, service url = null, agent id = null] for registry solr.jvm / com.codahale.metrics.MetricRegistry@2c1e57e8
   [junit4]   2> 323046 INFO  (jetty-closer-154-thread-1) [    ] o.a.s.m.SolrMetricManager Closing metric reporters for registry=solr.jetty, tag=null
   [junit4]   2> 323046 INFO  (jetty-closer-154-thread-2) [    ] o.a.s.m.SolrMetricManager Closing metric reporters for registry=solr.jetty, tag=null
   [junit4]   2> 323046 INFO  (jetty-closer-154-thread-1) [    ] o.a.s.m.r.SolrJmxReporter Closing reporter [org.apache.solr.metrics.reporters.SolrJmxReporter@5c90716f: rootName = solr_50909, domain = solr.jetty, service url = null, agent id = null] for registry solr.jetty / com.codahale.metrics.MetricRegistry@7d67d6a0
   [junit4]   2> 323046 INFO  (jetty-closer-154-thread-2) [    ] o.a.s.m.r.SolrJmxReporter Closing reporter [org.apache.solr.metrics.reporters.SolrJmxReporter@31889123: rootName = solr_50908, domain = solr.jetty, service url = null, agent id = null] for registry solr.jetty / com.codahale.metrics.MetricRegistry@7d67d6a0
   [junit4]   2> 323049 INFO  (jetty-closer-154-thread-1) [    ] o.a.s.c.ZkController Remove node as live in ZooKeeper:/live_nodes/127.0.0.1:50909_solr
   [junit4]   2> 323049 INFO  (jetty-closer-154-thread-2) [    ] o.a.s.c.ZkController Remove node as live in ZooKeeper:/live_nodes/127.0.0.1:50908_solr
   [junit4]   2> 323050 INFO  (jetty-closer-154-thread-1) [    ] o.a.s.m.SolrMetricManager Closing metric reporters for registry=solr.cluster, tag=null
   [junit4]   2> 323050 INFO  (jetty-closer-154-thread-2) [    ] o.a.s.m.SolrMetricManager Closing metric reporters for registry=solr.cluster, tag=null
   [junit4]   2> 323052 INFO  (zkCallback-210-thread-1) [    ] o.a.s.c.c.ZkStateReader Updated live nodes from ZooKeeper... (2) -> (0)
   [junit4]   2> 323053 INFO  (zkCallback-203-thread-3) [    ] o.a.s.c.c.ZkStateReader Updated live nodes from ZooKeeper... (2) -> (0)
   [junit4]   2> 323053 INFO  (zkCallback-165-thread-2) [    ] o.a.s.c.c.ZkStateReader Updated live nodes from ZooKeeper... (2) -> (0)
   [junit4]   2> 323053 INFO  (zkCallback-178-thread-1) [    ] o.a.s.c.c.ZkStateReader Updated live nodes from ZooKeeper... (2) -> (0)
   [junit4]   2> 323057 INFO  (jetty-closer-154-thread-1) [    ] o.a.s.c.Overseer Overseer (id=72341751884873732-127.0.0.1:50909_solr-n_0000000000) closing
   [junit4]   2> 323057 INFO  (OverseerStateUpdate-72341751884873732-127.0.0.1:50909_solr-n_0000000000) [    ] o.a.s.c.Overseer Overseer Loop exiting : 127.0.0.1:50909_solr
   [junit4]   2> 323058 WARN  (OverseerAutoScalingTriggerThread-72341751884873732-127.0.0.1:50909_solr-n_0000000000) [    ] o.a.s.c.a.OverseerTriggerThread OverseerTriggerThread woken up but we are closed, exiting.
   [junit4]   2> 323062 INFO  (jetty-closer-154-thread-2) [    ] o.e.j.s.h.ContextHandler Stopped o.e.j.s.ServletContextHandler@4918f8fa{/solr,null,UNAVAILABLE}
   [junit4]   2> 323062 INFO  (jetty-closer-154-thread-2) [    ] o.e.j.s.session node0 Stopped scavenging
   [junit4]   2> 323066 INFO  (jetty-closer-154-thread-1) [    ] o.e.j.s.h.ContextHandler Stopped o.e.j.s.ServletContextHandler@5bb7ae27{/solr,null,UNAVAILABLE}
   [junit4]   2> 323066 INFO  (jetty-closer-154-thread-1) [    ] o.e.j.s.session node0 Stopped scavenging
   [junit4]   2> 323067 ERROR (SUITE-TestPullReplica-seed#[89003455250E12D2]-worker) [    ] o.a.z.s.ZooKeeperServer ZKShutdownHandler is not registered, so ZooKeeper server won't take any action on ERROR or SHUTDOWN server state changes
   [junit4]   2> 323067 INFO  (SUITE-TestPullReplica-seed#[89003455250E12D2]-worker) [    ] o.a.s.c.ZkTestServer connecting to 127.0.0.1:50906 50906
   [junit4]   2> 323085 INFO  (Thread-87) [    ] o.a.s.c.ZkTestServer connecting to 127.0.0.1:50906 50906
   [junit4]   2> 323303 WARN  (Thread-87) [    ] o.a.s.c.ZkTestServer Watch limit violations: 
   [junit4]   2> Maximum concurrent create/delete watches above limit:
   [junit4]   2> 
   [junit4]   2> 	10	/solr/collections/pull_replica_test_kill_leader/terms/shard1
   [junit4]   2> 	7	/solr/aliases.json
   [junit4]   2> 	3	/solr/security.json
   [junit4]   2> 	3	/solr/configs/conf
   [junit4]   2> 
   [junit4]   2> Maximum concurrent data watches above limit:
   [junit4]   2> 
   [junit4]   2> 	10	/solr/collections/pull_replica_test_kill_leader/state.json
   [junit4]   2> 	7	/solr/clusterstate.json
   [junit4]   2> 	7	/solr/clusterprops.json
   [junit4]   2> 	2	/solr/overseer_elect/election/72341751884873732-127.0.0.1:50909_solr-n_0000000000
   [junit4]   2> 
   [junit4]   2> Maximum concurrent children watches above limit:
   [junit4]   2> 
   [junit4]   2> 	7	/solr/live_nodes
   [junit4]   2> 	7	/solr/collections
   [junit4]   2> 
   [junit4]   2> NOTE: leaving temporary files on disk at: /Users/jenkins/workspace/Lucene-Solr-7.x-MacOSX/solr/build/solr-core/test/J0/temp/solr.cloud.TestPullReplica_89003455250E12D2-003
   [junit4]   2> NOTE: test params are: codec=HighCompressionCompressingStoredFields(storedFieldsFormat=CompressingStoredFieldsFormat(compressionMode=HIGH_COMPRESSION, chunkSize=8218, maxDocsPerChunk=6, blockSize=10), termVectorsFormat=CompressingTermVectorsFormat(compressionMode=HIGH_COMPRESSION, chunkSize=8218, blockSize=10)), sim=RandomSimilarity(queryNorm=true): {}, locale=lg, timezone=America/Rainy_River
   [junit4]   2> NOTE: Mac OS X 10.11.6 x86_64/Oracle Corporation 9 (64-bit)/cpus=3,threads=1,free=101678144,total=219152384
   [junit4]   2> NOTE: All tests run in this JVM: [TestPullReplica, TestPullReplica, TestPullReplica]
   [junit4] Completed [5/5 (5!)] on J0 in 62.54s, 10 tests, 1 failure, 9 skipped <<< FAILURES!
   [junit4] 
   [junit4] 
   [junit4] Tests with failures [seed: 89003455250E12D2]:
   [junit4]   - org.apache.solr.cloud.TestPullReplica.testKillLeader
   [junit4]   - org.apache.solr.cloud.TestPullReplica.testKillLeader
   [junit4]   - org.apache.solr.cloud.TestPullReplica.testRemoveAllWriterReplicas
   [junit4]   - org.apache.solr.cloud.TestPullReplica.testRemoveAllWriterReplicas
   [junit4]   - org.apache.solr.cloud.TestPullReplica.testKillLeader
   [junit4]   - org.apache.solr.cloud.TestPullReplica.testKillLeader
   [junit4]   - org.apache.solr.cloud.TestPullReplica.testRemoveAllWriterReplicas
   [junit4]   - org.apache.solr.cloud.TestPullReplica.testRemoveAllWriterReplicas
   [junit4]   - org.apache.solr.cloud.TestPullReplica.testKillLeader
   [junit4] 
   [junit4] 
   [junit4] JVM J0:     0.93 ..   324.02 =   323.10s
   [junit4] JVM J1:     0.92 ..   263.38 =   262.46s
   [junit4] Execution time total: 5 minutes 24 seconds
   [junit4] Tests summary: 5 suites, 50 tests, 9 failures, 13 ignored (8 assumptions)

BUILD FAILED
/Users/jenkins/workspace/Lucene-Solr-7.x-MacOSX/lucene/common-build.xml:1568: The following error occurred while executing this line:
/Users/jenkins/workspace/Lucene-Solr-7.x-MacOSX/lucene/common-build.xml:1092: There were test failures: 5 suites, 50 tests, 9 failures, 13 ignored (8 assumptions) [seed: 89003455250E12D2]

Total time: 5 minutes 26 seconds

[repro] Setting last failure code to 256

[repro] Failures:
[repro]   2/5 failed: org.apache.solr.client.solrj.embedded.TestSolrProperties
[repro]   5/5 failed: org.apache.solr.cloud.TestPullReplica
[repro] Exiting with code 256
+ mv lucene/build lucene/build.repro
+ mv solr/build solr/build.repro
+ mv lucene/build.orig lucene/build
+ mv solr/build.orig solr/build
Archiving artifacts
Setting ANT_1_8_2_HOME=/Users/jenkins/tools/hudson.tasks.Ant_AntInstallation/ANT_1.8.2
[WARNINGS] Parsing warnings in console log with parser Java Compiler (javac)
Setting ANT_1_8_2_HOME=/Users/jenkins/tools/hudson.tasks.Ant_AntInstallation/ANT_1.8.2
Setting ANT_1_8_2_HOME=/Users/jenkins/tools/hudson.tasks.Ant_AntInstallation/ANT_1.8.2
<Git Blamer> Using GitBlamer to create author and commit information for all warnings.
<Git Blamer> GIT_COMMIT=80eb5da7393dd25c8cb566194eb9158de212bfb2, workspace=/Users/jenkins/workspace/Lucene-Solr-7.x-MacOSX
[WARNINGS] Computing warning deltas based on reference build #733
Recording test results
Setting ANT_1_8_2_HOME=/Users/jenkins/tools/hudson.tasks.Ant_AntInstallation/ANT_1.8.2
Build step 'Publish JUnit test result report' changed build result to UNSTABLE
Email was triggered for: Unstable (Test Failures)
Sending email for trigger: Unstable (Test Failures)
Setting ANT_1_8_2_HOME=/Users/jenkins/tools/hudson.tasks.Ant_AntInstallation/ANT_1.8.2
Setting ANT_1_8_2_HOME=/Users/jenkins/tools/hudson.tasks.Ant_AntInstallation/ANT_1.8.2
Setting ANT_1_8_2_HOME=/Users/jenkins/tools/hudson.tasks.Ant_AntInstallation/ANT_1.8.2
Setting ANT_1_8_2_HOME=/Users/jenkins/tools/hudson.tasks.Ant_AntInstallation/ANT_1.8.2

Mime
View raw message