lucene-dev mailing list archives

Site index · List index
Message view « Date » · « Thread »
Top « Date » · « Thread »
From Policeman Jenkins Server <jenk...@thetaphi.de>
Subject [JENKINS] Lucene-Solr-master-Linux (64bit/jdk1.8.0_172) - Build # 22393 - Unstable!
Date Thu, 05 Jul 2018 19:48:22 GMT
Build: https://jenkins.thetaphi.de/job/Lucene-Solr-master-Linux/22393/
Java: 64bit/jdk1.8.0_172 -XX:-UseCompressedOops -XX:+UseG1GC

1 tests failed.
FAILED:  org.apache.solr.cloud.MoveReplicaHDFSTest.testFailedMove

Error Message:
No live SolrServers available to handle this request:[http://127.0.0.1:36035/solr/MoveReplicaHDFSTest_failed_coll_true, http://127.0.0.1:40343/solr/MoveReplicaHDFSTest_failed_coll_true]

Stack Trace:
org.apache.solr.client.solrj.SolrServerException: No live SolrServers available to handle this request:[http://127.0.0.1:36035/solr/MoveReplicaHDFSTest_failed_coll_true, http://127.0.0.1:40343/solr/MoveReplicaHDFSTest_failed_coll_true]
	at __randomizedtesting.SeedInfo.seed([B1ACEDADA04992E9:1B613E5F179A4739]:0)
	at org.apache.solr.client.solrj.impl.LBHttpSolrClient.request(LBHttpSolrClient.java:462)
	at org.apache.solr.client.solrj.impl.CloudSolrClient.sendRequest(CloudSolrClient.java:1106)
	at org.apache.solr.client.solrj.impl.CloudSolrClient.requestWithRetryOnStaleState(CloudSolrClient.java:886)
	at org.apache.solr.client.solrj.impl.CloudSolrClient.requestWithRetryOnStaleState(CloudSolrClient.java:993)
	at org.apache.solr.client.solrj.impl.CloudSolrClient.request(CloudSolrClient.java:819)
	at org.apache.solr.client.solrj.SolrRequest.process(SolrRequest.java:194)
	at org.apache.solr.client.solrj.SolrClient.query(SolrClient.java:942)
	at org.apache.solr.cloud.MoveReplicaTest.testFailedMove(MoveReplicaTest.java:290)
	at sun.reflect.NativeMethodAccessorImpl.invoke0(Native Method)
	at sun.reflect.NativeMethodAccessorImpl.invoke(NativeMethodAccessorImpl.java:62)
	at sun.reflect.DelegatingMethodAccessorImpl.invoke(DelegatingMethodAccessorImpl.java:43)
	at java.lang.reflect.Method.invoke(Method.java:498)
	at com.carrotsearch.randomizedtesting.RandomizedRunner.invoke(RandomizedRunner.java:1737)
	at com.carrotsearch.randomizedtesting.RandomizedRunner$8.evaluate(RandomizedRunner.java:934)
	at com.carrotsearch.randomizedtesting.RandomizedRunner$9.evaluate(RandomizedRunner.java:970)
	at com.carrotsearch.randomizedtesting.RandomizedRunner$10.evaluate(RandomizedRunner.java:984)
	at com.carrotsearch.randomizedtesting.rules.SystemPropertiesRestoreRule$1.evaluate(SystemPropertiesRestoreRule.java:57)
	at org.apache.lucene.util.TestRuleSetupTeardownChained$1.evaluate(TestRuleSetupTeardownChained.java:49)
	at org.apache.lucene.util.AbstractBeforeAfterRule$1.evaluate(AbstractBeforeAfterRule.java:45)
	at org.apache.lucene.util.TestRuleThreadAndTestName$1.evaluate(TestRuleThreadAndTestName.java:48)
	at org.apache.lucene.util.TestRuleIgnoreAfterMaxFailures$1.evaluate(TestRuleIgnoreAfterMaxFailures.java:64)
	at org.apache.lucene.util.TestRuleMarkFailure$1.evaluate(TestRuleMarkFailure.java:47)
	at com.carrotsearch.randomizedtesting.rules.StatementAdapter.evaluate(StatementAdapter.java:36)
	at com.carrotsearch.randomizedtesting.ThreadLeakControl$StatementRunner.run(ThreadLeakControl.java:368)
	at com.carrotsearch.randomizedtesting.ThreadLeakControl.forkTimeoutingTask(ThreadLeakControl.java:817)
	at com.carrotsearch.randomizedtesting.ThreadLeakControl$3.evaluate(ThreadLeakControl.java:468)
	at com.carrotsearch.randomizedtesting.RandomizedRunner.runSingleTest(RandomizedRunner.java:943)
	at com.carrotsearch.randomizedtesting.RandomizedRunner$5.evaluate(RandomizedRunner.java:829)
	at com.carrotsearch.randomizedtesting.RandomizedRunner$6.evaluate(RandomizedRunner.java:879)
	at com.carrotsearch.randomizedtesting.RandomizedRunner$7.evaluate(RandomizedRunner.java:890)
	at com.carrotsearch.randomizedtesting.rules.StatementAdapter.evaluate(StatementAdapter.java:36)
	at com.carrotsearch.randomizedtesting.rules.SystemPropertiesRestoreRule$1.evaluate(SystemPropertiesRestoreRule.java:57)
	at org.apache.lucene.util.AbstractBeforeAfterRule$1.evaluate(AbstractBeforeAfterRule.java:45)
	at com.carrotsearch.randomizedtesting.rules.StatementAdapter.evaluate(StatementAdapter.java:36)
	at org.apache.lucene.util.TestRuleStoreClassName$1.evaluate(TestRuleStoreClassName.java:41)
	at com.carrotsearch.randomizedtesting.rules.NoShadowingOrOverridesOnMethodsRule$1.evaluate(NoShadowingOrOverridesOnMethodsRule.java:40)
	at com.carrotsearch.randomizedtesting.rules.NoShadowingOrOverridesOnMethodsRule$1.evaluate(NoShadowingOrOverridesOnMethodsRule.java:40)
	at com.carrotsearch.randomizedtesting.rules.StatementAdapter.evaluate(StatementAdapter.java:36)
	at com.carrotsearch.randomizedtesting.rules.StatementAdapter.evaluate(StatementAdapter.java:36)
	at com.carrotsearch.randomizedtesting.rules.StatementAdapter.evaluate(StatementAdapter.java:36)
	at org.apache.lucene.util.TestRuleAssertionsRequired$1.evaluate(TestRuleAssertionsRequired.java:53)
	at org.apache.lucene.util.TestRuleMarkFailure$1.evaluate(TestRuleMarkFailure.java:47)
	at org.apache.lucene.util.TestRuleIgnoreAfterMaxFailures$1.evaluate(TestRuleIgnoreAfterMaxFailures.java:64)
	at org.apache.lucene.util.TestRuleIgnoreTestSuites$1.evaluate(TestRuleIgnoreTestSuites.java:54)
	at com.carrotsearch.randomizedtesting.rules.StatementAdapter.evaluate(StatementAdapter.java:36)
	at com.carrotsearch.randomizedtesting.ThreadLeakControl$StatementRunner.run(ThreadLeakControl.java:368)
	at java.lang.Thread.run(Thread.java:748)
Caused by: org.apache.solr.client.solrj.impl.HttpSolrClient$RemoteSolrException: Error from server at http://127.0.0.1:36035/solr/MoveReplicaHDFSTest_failed_coll_true: no servers hosting shard: shard1
	at org.apache.solr.client.solrj.impl.HttpSolrClient.executeMethod(HttpSolrClient.java:643)
	at org.apache.solr.client.solrj.impl.HttpSolrClient.request(HttpSolrClient.java:255)
	at org.apache.solr.client.solrj.impl.HttpSolrClient.request(HttpSolrClient.java:244)
	at org.apache.solr.client.solrj.impl.LBHttpSolrClient.doRequest(LBHttpSolrClient.java:483)
	at org.apache.solr.client.solrj.impl.LBHttpSolrClient.request(LBHttpSolrClient.java:436)
	... 46 more




Build Log:
[...truncated 13032 lines...]
   [junit4] Suite: org.apache.solr.cloud.MoveReplicaHDFSTest
   [junit4]   2> Creating dataDir: /home/jenkins/workspace/Lucene-Solr-master-Linux/solr/build/solr-core/test/J2/temp/solr.cloud.MoveReplicaHDFSTest_B1ACEDADA04992E9-001/init-core-data-001
   [junit4]   2> 286658 INFO  (SUITE-MoveReplicaHDFSTest-seed#[B1ACEDADA04992E9]-worker) [    ] o.a.s.c.MiniSolrCloudCluster Starting cluster of 4 servers in /home/jenkins/workspace/Lucene-Solr-master-Linux/solr/build/solr-core/test/J2/temp/solr.cloud.MoveReplicaHDFSTest_B1ACEDADA04992E9-001/tempDir-001
   [junit4]   2> 286658 INFO  (SUITE-MoveReplicaHDFSTest-seed#[B1ACEDADA04992E9]-worker) [    ] o.a.s.c.ZkTestServer STARTING ZK TEST SERVER
   [junit4]   2> 286659 INFO  (Thread-827) [    ] o.a.s.c.ZkTestServer client port:0.0.0.0/0.0.0.0:0
   [junit4]   2> 286659 INFO  (Thread-827) [    ] o.a.s.c.ZkTestServer Starting server
   [junit4]   2> 286661 ERROR (Thread-827) [    ] o.a.z.s.ZooKeeperServer ZKShutdownHandler is not registered, so ZooKeeper server won't take any action on ERROR or SHUTDOWN server state changes
   [junit4]   2> 286759 INFO  (SUITE-MoveReplicaHDFSTest-seed#[B1ACEDADA04992E9]-worker) [    ] o.a.s.c.ZkTestServer start zk server on port:39615
   [junit4]   2> 286760 INFO  (zkConnectionManagerCallback-1356-thread-1) [    ] o.a.s.c.c.ConnectionManager zkClient has connected
   [junit4]   2> 286763 INFO  (jetty-launcher-1353-thread-2) [    ] o.e.j.s.Server jetty-9.4.11.v20180605; built: 2018-06-05T18:24:03.829Z; git: d5fc0523cfa96bfebfbda19606cad384d772f04c; jvm 1.8.0_172-b11
   [junit4]   2> 286763 INFO  (jetty-launcher-1353-thread-3) [    ] o.e.j.s.Server jetty-9.4.11.v20180605; built: 2018-06-05T18:24:03.829Z; git: d5fc0523cfa96bfebfbda19606cad384d772f04c; jvm 1.8.0_172-b11
   [junit4]   2> 286763 INFO  (jetty-launcher-1353-thread-1) [    ] o.e.j.s.Server jetty-9.4.11.v20180605; built: 2018-06-05T18:24:03.829Z; git: d5fc0523cfa96bfebfbda19606cad384d772f04c; jvm 1.8.0_172-b11
   [junit4]   2> 286764 INFO  (jetty-launcher-1353-thread-4) [    ] o.e.j.s.Server jetty-9.4.11.v20180605; built: 2018-06-05T18:24:03.829Z; git: d5fc0523cfa96bfebfbda19606cad384d772f04c; jvm 1.8.0_172-b11
   [junit4]   2> 286776 INFO  (jetty-launcher-1353-thread-3) [    ] o.e.j.s.session DefaultSessionIdManager workerName=node0
   [junit4]   2> 286776 INFO  (jetty-launcher-1353-thread-3) [    ] o.e.j.s.session No SessionScavenger set, using defaults
   [junit4]   2> 286776 INFO  (jetty-launcher-1353-thread-3) [    ] o.e.j.s.session node0 Scavenging every 600000ms
   [junit4]   2> 286780 INFO  (jetty-launcher-1353-thread-3) [    ] o.e.j.s.h.ContextHandler Started o.e.j.s.ServletContextHandler@3a233c5c{/solr,null,AVAILABLE}
   [junit4]   2> 286788 INFO  (jetty-launcher-1353-thread-2) [    ] o.e.j.s.session DefaultSessionIdManager workerName=node0
   [junit4]   2> 286788 INFO  (jetty-launcher-1353-thread-2) [    ] o.e.j.s.session No SessionScavenger set, using defaults
   [junit4]   2> 286788 INFO  (jetty-launcher-1353-thread-2) [    ] o.e.j.s.session node0 Scavenging every 600000ms
   [junit4]   2> 286788 INFO  (jetty-launcher-1353-thread-3) [    ] o.e.j.s.AbstractConnector Started ServerConnector@7c46b7bf{HTTP/1.1,[http/1.1]}{127.0.0.1:33003}
   [junit4]   2> 286788 INFO  (jetty-launcher-1353-thread-3) [    ] o.e.j.s.Server Started @286817ms
   [junit4]   2> 286788 INFO  (jetty-launcher-1353-thread-3) [    ] o.a.s.c.s.e.JettySolrRunner Jetty properties: {hostContext=/solr, hostPort=33003}
   [junit4]   2> 286788 ERROR (jetty-launcher-1353-thread-3) [    ] o.a.s.u.StartupLoggingUtils Missing Java Option solr.log.dir. Logging may be missing or incomplete.
   [junit4]   2> 286788 INFO  (jetty-launcher-1353-thread-3) [    ] o.a.s.s.SolrDispatchFilter Using logger factory org.apache.logging.slf4j.Log4jLoggerFactory
   [junit4]   2> 286788 INFO  (jetty-launcher-1353-thread-3) [    ] o.a.s.s.SolrDispatchFilter  ___      _       Welcome to Apache Solr™ version 8.0.0
   [junit4]   2> 286788 INFO  (jetty-launcher-1353-thread-3) [    ] o.a.s.s.SolrDispatchFilter / __| ___| |_ _   Starting in cloud mode on port null
   [junit4]   2> 286788 INFO  (jetty-launcher-1353-thread-3) [    ] o.a.s.s.SolrDispatchFilter \__ \/ _ \ | '_|  Install dir: null
   [junit4]   2> 286788 INFO  (jetty-launcher-1353-thread-3) [    ] o.a.s.s.SolrDispatchFilter |___/\___/_|_|    Start time: 2018-07-05T18:58:25.283Z
   [junit4]   2> 286791 INFO  (jetty-launcher-1353-thread-1) [    ] o.e.j.s.session DefaultSessionIdManager workerName=node0
   [junit4]   2> 286791 INFO  (jetty-launcher-1353-thread-1) [    ] o.e.j.s.session No SessionScavenger set, using defaults
   [junit4]   2> 286791 INFO  (jetty-launcher-1353-thread-1) [    ] o.e.j.s.session node0 Scavenging every 660000ms
   [junit4]   2> 286793 INFO  (jetty-launcher-1353-thread-2) [    ] o.e.j.s.h.ContextHandler Started o.e.j.s.ServletContextHandler@3024baca{/solr,null,AVAILABLE}
   [junit4]   2> 286793 INFO  (jetty-launcher-1353-thread-1) [    ] o.e.j.s.h.ContextHandler Started o.e.j.s.ServletContextHandler@39e961b5{/solr,null,AVAILABLE}
   [junit4]   2> 286796 INFO  (zkConnectionManagerCallback-1358-thread-1) [    ] o.a.s.c.c.ConnectionManager zkClient has connected
   [junit4]   2> 286796 INFO  (jetty-launcher-1353-thread-2) [    ] o.e.j.s.AbstractConnector Started ServerConnector@5fcfe7a7{HTTP/1.1,[http/1.1]}{127.0.0.1:45743}
   [junit4]   2> 286796 INFO  (jetty-launcher-1353-thread-2) [    ] o.e.j.s.Server Started @286825ms
   [junit4]   2> 286796 INFO  (jetty-launcher-1353-thread-2) [    ] o.a.s.c.s.e.JettySolrRunner Jetty properties: {hostContext=/solr, hostPort=45743}
   [junit4]   2> 286796 ERROR (jetty-launcher-1353-thread-2) [    ] o.a.s.u.StartupLoggingUtils Missing Java Option solr.log.dir. Logging may be missing or incomplete.
   [junit4]   2> 286796 INFO  (jetty-launcher-1353-thread-2) [    ] o.a.s.s.SolrDispatchFilter Using logger factory org.apache.logging.slf4j.Log4jLoggerFactory
   [junit4]   2> 286796 INFO  (jetty-launcher-1353-thread-3) [    ] o.a.s.s.SolrDispatchFilter solr.xml found in ZooKeeper. Loading...
   [junit4]   2> 286796 INFO  (jetty-launcher-1353-thread-2) [    ] o.a.s.s.SolrDispatchFilter  ___      _       Welcome to Apache Solr™ version 8.0.0
   [junit4]   2> 286796 INFO  (jetty-launcher-1353-thread-2) [    ] o.a.s.s.SolrDispatchFilter / __| ___| |_ _   Starting in cloud mode on port null
   [junit4]   2> 286796 INFO  (jetty-launcher-1353-thread-2) [    ] o.a.s.s.SolrDispatchFilter \__ \/ _ \ | '_|  Install dir: null
   [junit4]   2> 286796 INFO  (jetty-launcher-1353-thread-2) [    ] o.a.s.s.SolrDispatchFilter |___/\___/_|_|    Start time: 2018-07-05T18:58:25.291Z
   [junit4]   2> 286799 INFO  (jetty-launcher-1353-thread-4) [    ] o.e.j.s.session DefaultSessionIdManager workerName=node0
   [junit4]   2> 286799 INFO  (jetty-launcher-1353-thread-4) [    ] o.e.j.s.session No SessionScavenger set, using defaults
   [junit4]   2> 286800 INFO  (jetty-launcher-1353-thread-4) [    ] o.e.j.s.session node0 Scavenging every 600000ms
   [junit4]   2> 286800 INFO  (jetty-launcher-1353-thread-1) [    ] o.e.j.s.AbstractConnector Started ServerConnector@7ee5faf9{HTTP/1.1,[http/1.1]}{127.0.0.1:36035}
   [junit4]   2> 286800 INFO  (jetty-launcher-1353-thread-1) [    ] o.e.j.s.Server Started @286829ms
   [junit4]   2> 286800 INFO  (jetty-launcher-1353-thread-1) [    ] o.a.s.c.s.e.JettySolrRunner Jetty properties: {hostContext=/solr, hostPort=36035}
   [junit4]   2> 286800 ERROR (jetty-launcher-1353-thread-1) [    ] o.a.s.u.StartupLoggingUtils Missing Java Option solr.log.dir. Logging may be missing or incomplete.
   [junit4]   2> 286800 INFO  (jetty-launcher-1353-thread-1) [    ] o.a.s.s.SolrDispatchFilter Using logger factory org.apache.logging.slf4j.Log4jLoggerFactory
   [junit4]   2> 286800 INFO  (jetty-launcher-1353-thread-1) [    ] o.a.s.s.SolrDispatchFilter  ___      _       Welcome to Apache Solr™ version 8.0.0
   [junit4]   2> 286800 INFO  (jetty-launcher-1353-thread-1) [    ] o.a.s.s.SolrDispatchFilter / __| ___| |_ _   Starting in cloud mode on port null
   [junit4]   2> 286800 INFO  (jetty-launcher-1353-thread-1) [    ] o.a.s.s.SolrDispatchFilter \__ \/ _ \ | '_|  Install dir: null
   [junit4]   2> 286800 INFO  (jetty-launcher-1353-thread-1) [    ] o.a.s.s.SolrDispatchFilter |___/\___/_|_|    Start time: 2018-07-05T18:58:25.295Z
   [junit4]   2> 286812 INFO  (jetty-launcher-1353-thread-4) [    ] o.e.j.s.h.ContextHandler Started o.e.j.s.ServletContextHandler@48183fa9{/solr,null,AVAILABLE}
   [junit4]   2> 286812 INFO  (zkConnectionManagerCallback-1362-thread-1) [    ] o.a.s.c.c.ConnectionManager zkClient has connected
   [junit4]   2> 286812 INFO  (jetty-launcher-1353-thread-4) [    ] o.e.j.s.AbstractConnector Started ServerConnector@6d364545{HTTP/1.1,[http/1.1]}{127.0.0.1:40343}
   [junit4]   2> 286812 INFO  (jetty-launcher-1353-thread-4) [    ] o.e.j.s.Server Started @286842ms
   [junit4]   2> 286812 INFO  (zkConnectionManagerCallback-1360-thread-1) [    ] o.a.s.c.c.ConnectionManager zkClient has connected
   [junit4]   2> 286812 INFO  (jetty-launcher-1353-thread-4) [    ] o.a.s.c.s.e.JettySolrRunner Jetty properties: {hostContext=/solr, hostPort=40343}
   [junit4]   2> 286813 INFO  (jetty-launcher-1353-thread-1) [    ] o.a.s.s.SolrDispatchFilter solr.xml found in ZooKeeper. Loading...
   [junit4]   2> 286813 INFO  (jetty-launcher-1353-thread-2) [    ] o.a.s.s.SolrDispatchFilter solr.xml found in ZooKeeper. Loading...
   [junit4]   2> 286813 ERROR (jetty-launcher-1353-thread-4) [    ] o.a.s.u.StartupLoggingUtils Missing Java Option solr.log.dir. Logging may be missing or incomplete.
   [junit4]   2> 286813 INFO  (jetty-launcher-1353-thread-4) [    ] o.a.s.s.SolrDispatchFilter Using logger factory org.apache.logging.slf4j.Log4jLoggerFactory
   [junit4]   2> 286813 INFO  (jetty-launcher-1353-thread-4) [    ] o.a.s.s.SolrDispatchFilter  ___      _       Welcome to Apache Solr™ version 8.0.0
   [junit4]   2> 286813 INFO  (jetty-launcher-1353-thread-4) [    ] o.a.s.s.SolrDispatchFilter / __| ___| |_ _   Starting in cloud mode on port null
   [junit4]   2> 286813 INFO  (jetty-launcher-1353-thread-4) [    ] o.a.s.s.SolrDispatchFilter \__ \/ _ \ | '_|  Install dir: null
   [junit4]   2> 286813 INFO  (jetty-launcher-1353-thread-4) [    ] o.a.s.s.SolrDispatchFilter |___/\___/_|_|    Start time: 2018-07-05T18:58:25.308Z
   [junit4]   2> 286816 INFO  (zkConnectionManagerCallback-1364-thread-1) [    ] o.a.s.c.c.ConnectionManager zkClient has connected
   [junit4]   2> 286816 INFO  (jetty-launcher-1353-thread-4) [    ] o.a.s.s.SolrDispatchFilter solr.xml found in ZooKeeper. Loading...
   [junit4]   2> 286912 INFO  (jetty-launcher-1353-thread-4) [    ] o.a.s.c.ZkContainer Zookeeper client=127.0.0.1:39615/solr
   [junit4]   2> 286916 INFO  (zkConnectionManagerCallback-1368-thread-1) [    ] o.a.s.c.c.ConnectionManager zkClient has connected
   [junit4]   2> 286917 DEBUG (jetty-launcher-1353-thread-4) [n:127.0.0.1:40343_solr    ] o.a.s.c.ZkController Added new OnReconnect listener org.apache.solr.cloud.ZkController$$Lambda$49/1303541376@72b948ba
   [junit4]   2> 286921 INFO  (zkConnectionManagerCallback-1370-thread-1) [    ] o.a.s.c.c.ConnectionManager zkClient has connected
   [junit4]   2> 286922 INFO  (jetty-launcher-1353-thread-2) [    ] o.a.s.c.ZkContainer Zookeeper client=127.0.0.1:39615/solr
   [junit4]   2> 286924 INFO  (zkConnectionManagerCallback-1374-thread-1) [    ] o.a.s.c.c.ConnectionManager zkClient has connected
   [junit4]   2> 286924 DEBUG (jetty-launcher-1353-thread-2) [n:127.0.0.1:45743_solr    ] o.a.s.c.ZkController Added new OnReconnect listener org.apache.solr.cloud.ZkController$$Lambda$49/1303541376@6c519955
   [junit4]   2> 286935 INFO  (zkConnectionManagerCallback-1376-thread-1) [    ] o.a.s.c.c.ConnectionManager zkClient has connected
   [junit4]   2> 286942 DEBUG (SyncThread:0) [    ] o.a.s.c.ZkTestServer Watch added: create/delete: /solr/clusterprops.json
   [junit4]   2> 286942 DEBUG (SyncThread:0) [    ] o.a.s.c.ZkTestServer Watch added: children: /solr/live_nodes
   [junit4]   2> 286942 DEBUG (SyncThread:0) [    ] o.a.s.c.ZkTestServer Watch added: data: /solr/clusterstate.json
   [junit4]   2> 286942 DEBUG (SyncThread:0) [    ] o.a.s.c.ZkTestServer Watch added: children: /solr/collections
   [junit4]   2> 286942 DEBUG (SyncThread:0) [    ] o.a.s.c.ZkTestServer Watch added: create/delete: /solr/aliases.json
   [junit4]   2> 286942 DEBUG (SyncThread:0) [    ] o.a.s.c.ZkTestServer Watch added: create/delete: /solr/security.json
   [junit4]   2> 286943 INFO  (jetty-launcher-1353-thread-2) [n:127.0.0.1:45743_solr    ] o.a.s.c.Overseer Overseer (id=null) closing
   [junit4]   2> 286944 DEBUG (jetty-launcher-1353-thread-2) [n:127.0.0.1:45743_solr    ] o.a.s.c.LeaderElector Joined leadership election with path: /overseer_elect/election/72076355814817800-127.0.0.1:45743_solr-n_0000000000
   [junit4]   2> 286944 INFO  (jetty-launcher-1353-thread-2) [n:127.0.0.1:45743_solr    ] o.a.s.c.OverseerElectionContext I am going to be the leader 127.0.0.1:45743_solr
   [junit4]   2> 286944 INFO  (jetty-launcher-1353-thread-2) [n:127.0.0.1:45743_solr    ] o.a.s.c.Overseer Overseer (id=72076355814817800-127.0.0.1:45743_solr-n_0000000000) starting
   [junit4]   2> 286952 DEBUG (SyncThread:0) [    ] o.a.s.c.ZkTestServer Watch added: create/delete: /solr/clusterprops.json
   [junit4]   2> 286952 DEBUG (SyncThread:0) [    ] o.a.s.c.ZkTestServer Watch added: children: /solr/live_nodes
   [junit4]   2> 286952 DEBUG (SyncThread:0) [    ] o.a.s.c.ZkTestServer Watch added: data: /solr/clusterstate.json
   [junit4]   2> 286952 DEBUG (SyncThread:0) [    ] o.a.s.c.ZkTestServer Watch added: children: /solr/collections
   [junit4]   2> 286953 DEBUG (SyncThread:0) [    ] o.a.s.c.ZkTestServer Watch added: create/delete: /solr/aliases.json
   [junit4]   2> 286953 DEBUG (SyncThread:0) [    ] o.a.s.c.ZkTestServer Watch added: create/delete: /solr/security.json
   [junit4]   2> 286953 INFO  (jetty-launcher-1353-thread-4) [n:127.0.0.1:40343_solr    ] o.a.s.c.Overseer Overseer (id=null) closing
   [junit4]   2> 286953 DEBUG (jetty-launcher-1353-thread-4) [n:127.0.0.1:40343_solr    ] o.a.s.c.LeaderElector Joined leadership election with path: /overseer_elect/election/72076355814817798-127.0.0.1:40343_solr-n_0000000001
   [junit4]   2> 286954 DEBUG (SyncThread:0) [    ] o.a.s.c.ZkTestServer Watch added: data: /solr/overseer_elect/election/72076355814817800-127.0.0.1:45743_solr-n_0000000000
   [junit4]   2> 286954 DEBUG (jetty-launcher-1353-thread-4) [n:127.0.0.1:40343_solr    ] o.a.s.c.LeaderElector Watching path /overseer_elect/election/72076355814817800-127.0.0.1:45743_solr-n_0000000000 to know if I could be the leader
   [junit4]   2> 286954 INFO  (jetty-launcher-1353-thread-4) [n:127.0.0.1:40343_solr    ] o.a.s.c.ZkController Register node as live in ZooKeeper:/live_nodes/127.0.0.1:40343_solr
   [junit4]   2> 286954 DEBUG (SyncThread:0) [    ] o.a.s.c.ZkTestServer Watch fired: children: /solr/live_nodes
   [junit4]   2> 286954 DEBUG (SyncThread:0) [    ] o.a.s.c.ZkTestServer Watch fired: children: /solr/live_nodes
   [junit4]   2> 286959 DEBUG (SyncThread:0) [    ] o.a.s.c.ZkTestServer Watch added: children: /solr/live_nodes
   [junit4]   2> 286959 INFO  (zkCallback-1369-thread-1) [    ] o.a.s.c.c.ZkStateReader Updated live nodes from ZooKeeper... (0) -> (1)
   [junit4]   2> 286959 INFO  (zkConnectionManagerCallback-1385-thread-1) [    ] o.a.s.c.c.ConnectionManager zkClient has connected
   [junit4]   2> 286960 DEBUG (SyncThread:0) [    ] o.a.s.c.ZkTestServer Watch added: create/delete: /solr/clusterprops.json
   [junit4]   2> 286960 DEBUG (SyncThread:0) [    ] o.a.s.c.ZkTestServer Watch added: children: /solr/live_nodes
   [junit4]   2> 286960 INFO  (jetty-launcher-1353-thread-2) [n:127.0.0.1:45743_solr    ] o.a.s.c.c.ZkStateReader Updated live nodes from ZooKeeper... (0) -> (1)
   [junit4]   2> 286960 DEBUG (SyncThread:0) [    ] o.a.s.c.ZkTestServer Watch added: data: /solr/clusterstate.json
   [junit4]   2> 286960 DEBUG (SyncThread:0) [    ] o.a.s.c.ZkTestServer Watch added: children: /solr/collections
   [junit4]   2> 286960 DEBUG (SyncThread:0) [    ] o.a.s.c.ZkTestServer Watch added: create/delete: /solr/aliases.json
   [junit4]   2> 286961 INFO  (jetty-launcher-1353-thread-2) [n:127.0.0.1:45743_solr    ] o.a.s.c.s.i.ZkClientClusterStateProvider Cluster at 127.0.0.1:39615/solr ready
   [junit4]   2> 286968 DEBUG (SyncThread:0) [    ] o.a.s.c.ZkTestServer Watch added: children: /solr/live_nodes
   [junit4]   2> 286968 INFO  (zkCallback-1375-thread-1) [    ] o.a.s.c.c.ZkStateReader Updated live nodes from ZooKeeper... (0) -> (1)
   [junit4]   2> 286970 DEBUG (OverseerCollectionConfigSetProcessor-72076355814817800-127.0.0.1:45743_solr-n_0000000000) [    ] o.a.s.c.OverseerTaskProcessor Process current queue of overseer operations
   [junit4]   2> 286970 DEBUG (OverseerStateUpdate-72076355814817800-127.0.0.1:45743_solr-n_0000000000) [    ] o.a.s.c.Overseer Starting to work on the main queue
   [junit4]   2> 286970 DEBUG (jetty-launcher-1353-thread-2) [n:127.0.0.1:45743_solr    ] o.a.s.c.ZkController Publish node=127.0.0.1:45743_solr as DOWN
   [junit4]   2> 286971 DEBUG (OverseerAutoScalingTriggerThread-72076355814817800-127.0.0.1:45743_solr-n_0000000000) [    ] o.a.s.c.a.OverseerTriggerThread Adding .auto_add_replicas and .scheduled_maintenance triggers
   [junit4]   2> 286971 DEBUG (OverseerCollectionConfigSetProcessor-72076355814817800-127.0.0.1:45743_solr-n_0000000000) [    ] o.a.s.c.OverseerTaskProcessor Cleaning up work-queue. #Running tasks: 0
   [junit4]   2> 286971 DEBUG (OverseerCollectionConfigSetProcessor-72076355814817800-127.0.0.1:45743_solr-n_0000000000) [    ] o.a.s.c.OverseerTaskProcessor RunningTasks: []
   [junit4]   2> 286971 DEBUG (OverseerCollectionConfigSetProcessor-72076355814817800-127.0.0.1:45743_solr-n_0000000000) [    ] o.a.s.c.OverseerTaskProcessor BlockedTasks: []
   [junit4]   2> 286971 DEBUG (OverseerCollectionConfigSetProcessor-72076355814817800-127.0.0.1:45743_solr-n_0000000000) [    ] o.a.s.c.OverseerTaskProcessor CompletedTasks: []
   [junit4]   2> 286971 DEBUG (OverseerCollectionConfigSetProcessor-72076355814817800-127.0.0.1:45743_solr-n_0000000000) [    ] o.a.s.c.OverseerTaskProcessor RunningZKTasks: []
   [junit4]   2> 286971 DEBUG (OverseerCollectionConfigSetProcessor-72076355814817800-127.0.0.1:45743_solr-n_0000000000) [    ] o.a.s.c.OverseerTaskQueue Peeking for top 100 elements. ExcludeSet: []
   [junit4]   2> 286971 DEBUG (SyncThread:0) [    ] o.a.s.c.ZkTestServer Watch added: data: /solr/autoscaling.json
   [junit4]   2> 286971 INFO  (jetty-launcher-1353-thread-2) [n:127.0.0.1:45743_solr    ] o.a.s.c.TransientSolrCoreCacheDefault Allocating transient cache for 2147483647 transient cores
   [junit4]   2> 286971 DEBUG (SyncThread:0) [    ] o.a.s.c.ZkTestServer Watch added: children: /solr/overseer/collection-queue-work
   [junit4]   2> 286971 INFO  (jetty-launcher-1353-thread-2) [n:127.0.0.1:45743_solr    ] o.a.s.c.ZkController Register node as live in ZooKeeper:/live_nodes/127.0.0.1:45743_solr
   [junit4]   2> 286971 DEBUG (SyncThread:0) [    ] o.a.s.c.ZkTestServer Watch added: children: /solr/overseer/queue-work
   [junit4]   2> 286971 DEBUG (OverseerAutoScalingTriggerThread-72076355814817800-127.0.0.1:45743_solr-n_0000000000) [    ] o.a.s.c.a.OverseerTriggerThread Refreshing /autoscaling.json with znode version 1
   [junit4]   2> 286971 DEBUG (SyncThread:0) [    ] o.a.s.c.ZkTestServer Watch added: children: /solr/overseer/queue
   [junit4]   2> 286971 DEBUG (SyncThread:0) [    ] o.a.s.c.ZkTestServer Watch fired: children: /solr/live_nodes
   [junit4]   2> 286971 DEBUG (SyncThread:0) [    ] o.a.s.c.ZkTestServer Watch fired: children: /solr/live_nodes
   [junit4]   2> 286971 DEBUG (SyncThread:0) [    ] o.a.s.c.ZkTestServer Watch fired: children: /solr/live_nodes
   [junit4]   2> 286971 DEBUG (OverseerStateUpdate-72076355814817800-127.0.0.1:45743_solr-n_0000000000) [    ] o.a.s.c.Overseer processMessage: queueSize: 1, message = {
   [junit4]   2>   "operation":"downnode",
   [junit4]   2>   "node_name":"127.0.0.1:45743_solr"} current state version: 0
   [junit4]   2> 286972 DEBUG (OverseerStateUpdate-72076355814817800-127.0.0.1:45743_solr-n_0000000000) [    ] o.a.s.c.o.NodeMutator DownNode state invoked for node: 127.0.0.1:45743_solr
   [junit4]   2> 286972 DEBUG (OverseerAutoScalingTriggerThread-72076355814817800-127.0.0.1:45743_solr-n_0000000000) [    ] o.a.s.c.a.OverseerTriggerThread Current znodeVersion 1, lastZnodeVersion -1
   [junit4]   2> 286972 DEBUG (OverseerAutoScalingTriggerThread-72076355814817800-127.0.0.1:45743_solr-n_0000000000) [    ] o.a.s.c.a.OverseerTriggerThread Processed trigger updates upto znodeVersion 1
   [junit4]   2> 286990 DEBUG (SyncThread:0) [    ] o.a.s.c.ZkTestServer Watch added: children: /solr/live_nodes
   [junit4]   2> 286990 INFO  (zkCallback-1375-thread-1) [    ] o.a.s.c.c.ZkStateReader Updated live nodes from ZooKeeper... (1) -> (2)
   [junit4]   2> 286992 DEBUG (SyncThread:0) [    ] o.a.s.c.ZkTestServer Watch added: children: /solr/live_nodes
   [junit4]   2> 286992 INFO  (zkCallback-1369-thread-1) [    ] o.a.s.c.c.ZkStateReader Updated live nodes from ZooKeeper... (1) -> (2)
   [junit4]   2> 287009 DEBUG (SyncThread:0) [    ] o.a.s.c.ZkTestServer Watch added: children: /solr/autoscaling/events/.scheduled_maintenance
   [junit4]   2> 287012 DEBUG (OverseerAutoScalingTriggerThread-72076355814817800-127.0.0.1:45743_solr-n_0000000000) [    ] o.a.s.c.a.NodeLostTrigger NodeLostTrigger .auto_add_replicas - Initial livenodes: [127.0.0.1:40343_solr]
   [junit4]   2> 287017 INFO  (zkConnectionManagerCallback-1390-thread-1) [    ] o.a.s.c.c.ConnectionManager zkClient has connected
   [junit4]   2> 287017 DEBUG (SyncThread:0) [    ] o.a.s.c.ZkTestServer Watch added: children: /solr/live_nodes
   [junit4]   2> 287017 INFO  (jetty-launcher-1353-thread-2) [n:127.0.0.1:45743_solr    ] o.a.s.h.a.MetricsHistoryHandler No .system collection, keeping metrics history in memory.
   [junit4]   2> 287017 INFO  (zkCallback-1384-thread-1) [    ] o.a.s.c.c.ZkStateReader Updated live nodes from ZooKeeper... (1) -> (2)
   [junit4]   2> 287018 DEBUG (OverseerAutoScalingTriggerThread-72076355814817800-127.0.0.1:45743_solr-n_0000000000) [    ] o.a.s.c.a.OverseerTriggerThread -- clean old nodeAdded markers
   [junit4]   2> 287027 DEBUG (SyncThread:0) [    ] o.a.s.c.ZkTestServer Watch added: children: /solr/autoscaling/events/.auto_add_replicas
   [junit4]   2> 287028 DEBUG (SyncThread:0) [    ] o.a.s.c.ZkTestServer Watch added: create/delete: /solr/clusterprops.json
   [junit4]   2> 287028 DEBUG (SyncThread:0) [    ] o.a.s.c.ZkTestServer Watch added: children: /solr/live_nodes
   [junit4]   2> 287028 INFO  (jetty-launcher-1353-thread-4) [n:127.0.0.1:40343_solr    ] o.a.s.c.c.ZkStateReader Updated live nodes from ZooKeeper... (0) -> (2)
   [junit4]   2> 287028 DEBUG (SyncThread:0) [    ] o.a.s.c.ZkTestServer Watch added: data: /solr/clusterstate.json
   [junit4]   2> 287028 DEBUG (SyncThread:0) [    ] o.a.s.c.ZkTestServer Watch added: children: /solr/collections
   [junit4]   2> 287028 DEBUG (SyncThread:0) [    ] o.a.s.c.ZkTestServer Watch added: create/delete: /solr/aliases.json
   [junit4]   2> 287029 INFO  (jetty-launcher-1353-thread-4) [n:127.0.0.1:40343_solr    ] o.a.s.c.s.i.ZkClientClusterStateProvider Cluster at 127.0.0.1:39615/solr ready
   [junit4]   2> 287029 DEBUG (ScheduledTrigger-1939-thread-1) [    ] o.a.s.c.a.NodeLostTrigger Running NodeLostTrigger: .auto_add_replicas with currently live nodes: 2
   [junit4]   2> 287035 DEBUG (OverseerAutoScalingTriggerThread-72076355814817800-127.0.0.1:45743_solr-n_0000000000) [    ] o.a.s.c.a.OverseerTriggerThread Current znodeVersion 1, lastZnodeVersion 1
   [junit4]   2> 287044 INFO  (jetty-launcher-1353-thread-2) [n:127.0.0.1:45743_solr    ] o.a.s.m.r.SolrJmxReporter JMX monitoring for 'solr_45743.solr.node' (registry 'solr.node') enabled at server: com.sun.jmx.mbeanserver.JmxMBeanServer@2aa02c07
   [junit4]   2> 287049 INFO  (jetty-launcher-1353-thread-2) [n:127.0.0.1:45743_solr    ] o.a.s.m.r.SolrJmxReporter JMX monitoring for 'solr_45743.solr.jvm' (registry 'solr.jvm') enabled at server: com.sun.jmx.mbeanserver.JmxMBeanServer@2aa02c07
   [junit4]   2> 287049 INFO  (jetty-launcher-1353-thread-2) [n:127.0.0.1:45743_solr    ] o.a.s.m.r.SolrJmxReporter JMX monitoring for 'solr_45743.solr.jetty' (registry 'solr.jetty') enabled at server: com.sun.jmx.mbeanserver.JmxMBeanServer@2aa02c07
   [junit4]   2> 287050 INFO  (jetty-launcher-1353-thread-2) [n:127.0.0.1:45743_solr    ] o.a.s.c.CorePropertiesLocator Found 0 core definitions underneath /home/jenkins/workspace/Lucene-Solr-master-Linux/solr/build/solr-core/test/J2/temp/solr.cloud.MoveReplicaHDFSTest_B1ACEDADA04992E9-001/tempDir-001/node2/.
   [junit4]   2> 287051 INFO  (jetty-launcher-1353-thread-3) [    ] o.a.s.c.ZkContainer Zookeeper client=127.0.0.1:39615/solr
   [junit4]   2> 287069 INFO  (jetty-launcher-1353-thread-4) [n:127.0.0.1:40343_solr    ] o.a.s.h.a.MetricsHistoryHandler No .system collection, keeping metrics history in memory.
   [junit4]   2> 287084 DEBUG (SyncThread:0) [    ] o.a.s.c.ZkTestServer Watch fired: children: /solr/overseer/queue
   [junit4]   2> 287084 DEBUG (SyncThread:0) [    ] o.a.s.c.ZkTestServer Watch added: children: /solr/overseer/queue
   [junit4]   2> 287089 INFO  (zkConnectionManagerCallback-1396-thread-1) [    ] o.a.s.c.c.ConnectionManager zkClient has connected
   [junit4]   2> 287090 INFO  (jetty-launcher-1353-thread-4) [n:127.0.0.1:40343_solr    ] o.a.s.m.r.SolrJmxReporter JMX monitoring for 'solr_40343.solr.node' (registry 'solr.node') enabled at server: com.sun.jmx.mbeanserver.JmxMBeanServer@2aa02c07
   [junit4]   2> 287091 DEBUG (jetty-launcher-1353-thread-3) [n:127.0.0.1:33003_solr    ] o.a.s.c.ZkController Added new OnReconnect listener org.apache.solr.cloud.ZkController$$Lambda$49/1303541376@7207d983
   [junit4]   2> 287097 INFO  (jetty-launcher-1353-thread-4) [n:127.0.0.1:40343_solr    ] o.a.s.m.r.SolrJmxReporter JMX monitoring for 'solr_40343.solr.jvm' (registry 'solr.jvm') enabled at server: com.sun.jmx.mbeanserver.JmxMBeanServer@2aa02c07
   [junit4]   2> 287097 INFO  (jetty-launcher-1353-thread-4) [n:127.0.0.1:40343_solr    ] o.a.s.m.r.SolrJmxReporter JMX monitoring for 'solr_40343.solr.jetty' (registry 'solr.jetty') enabled at server: com.sun.jmx.mbeanserver.JmxMBeanServer@2aa02c07
   [junit4]   2> 287098 INFO  (jetty-launcher-1353-thread-4) [n:127.0.0.1:40343_solr    ] o.a.s.c.CorePropertiesLocator Found 0 core definitions underneath /home/jenkins/workspace/Lucene-Solr-master-Linux/solr/build/solr-core/test/J2/temp/solr.cloud.MoveReplicaHDFSTest_B1ACEDADA04992E9-001/tempDir-001/node4/.
   [junit4]   2> 287106 INFO  (zkConnectionManagerCallback-1398-thread-1) [    ] o.a.s.c.c.ConnectionManager zkClient has connected
   [junit4]   2> 287109 DEBUG (SyncThread:0) [    ] o.a.s.c.ZkTestServer Watch added: create/delete: /solr/clusterprops.json
   [junit4]   2> 287109 DEBUG (SyncThread:0) [    ] o.a.s.c.ZkTestServer Watch added: children: /solr/live_nodes
   [junit4]   2> 287109 INFO  (jetty-launcher-1353-thread-3) [n:127.0.0.1:33003_solr    ] o.a.s.c.c.ZkStateReader Updated live nodes from ZooKeeper... (0) -> (2)
   [junit4]   2> 287109 DEBUG (SyncThread:0) [    ] o.a.s.c.ZkTestServer Watch added: data: /solr/clusterstate.json
   [junit4]   2> 287109 DEBUG (SyncThread:0) [    ] o.a.s.c.ZkTestServer Watch added: children: /solr/collections
   [junit4]   2> 287109 DEBUG (SyncThread:0) [    ] o.a.s.c.ZkTestServer Watch added: create/delete: /solr/aliases.json
   [junit4]   2> 287110 DEBUG (SyncThread:0) [    ] o.a.s.c.ZkTestServer Watch added: create/delete: /solr/security.json
   [junit4]   2> 287110 INFO  (jetty-launcher-1353-thread-3) [n:127.0.0.1:33003_solr    ] o.a.s.c.Overseer Overseer (id=null) closing
   [junit4]   2> 287110 DEBUG (jetty-launcher-1353-thread-3) [n:127.0.0.1:33003_solr    ] o.a.s.c.LeaderElector Joined leadership election with path: /overseer_elect/election/72076355814817804-127.0.0.1:33003_solr-n_0000000002
   [junit4]   2> 287111 DEBUG (SyncThread:0) [    ] o.a.s.c.ZkTestServer Watch added: data: /solr/overseer_elect/election/72076355814817798-127.0.0.1:40343_solr-n_0000000001
   [junit4]   2> 287111 DEBUG (jetty-launcher-1353-thread-3) [n:127.0.0.1:33003_solr    ] o.a.s.c.LeaderElector Watching path /overseer_elect/election/72076355814817798-127.0.0.1:40343_solr-n_0000000001 to know if I could be the leader
   [junit4]   2> 287111 DEBUG (jetty-launcher-1353-thread-3) [n:127.0.0.1:33003_solr    ] o.a.s.c.ZkController Publish node=127.0.0.1:33003_solr as DOWN
   [junit4]   2> 287111 DEBUG (SyncThread:0) [    ] o.a.s.c.ZkTestServer Watch fired: children: /solr/overseer/queue
   [junit4]   2> 287111 INFO  (jetty-launcher-1353-thread-3) [n:127.0.0.1:33003_solr    ] o.a.s.c.TransientSolrCoreCacheDefault Allocating transient cache for 2147483647 transient cores
   [junit4]   2> 287111 INFO  (jetty-launcher-1353-thread-3) [n:127.0.0.1:33003_solr    ] o.a.s.c.ZkController Register node as live in ZooKeeper:/live_nodes/127.0.0.1:33003_solr
   [junit4]   2> 287111 DEBUG (SyncThread:0) [    ] o.a.s.c.ZkTestServer Watch added: children: /solr/overseer/queue
   [junit4]   2> 287111 DEBUG (OverseerStateUpdate-72076355814817800-127.0.0.1:45743_solr-n_0000000000) [    ] o.a.s.c.Overseer processMessage: queueSize: 1, message = {
   [junit4]   2>   "operation":"downnode",
   [junit4]   2>   "node_name":"127.0.0.1:33003_solr"} current state version: 0
   [junit4]   2> 287111 DEBUG (OverseerStateUpdate-72076355814817800-127.0.0.1:45743_solr-n_0000000000) [    ] o.a.s.c.o.NodeMutator DownNode state invoked for node: 127.0.0.1:33003_solr
   [junit4]   2> 287112 DEBUG (SyncThread:0) [    ] o.a.s.c.ZkTestServer Watch fired: children: /solr/live_nodes
   [junit4]   2> 287112 DEBUG (SyncThread:0) [    ] o.a.s.c.ZkTestServer Watch fired: children: /solr/live_nodes
   [junit4]   2> 287112 DEBUG (SyncThread:0) [    ] o.a.s.c.ZkTestServer Watch fired: children: /solr/live_nodes
   [junit4]   2> 287112 DEBUG (SyncThread:0) [    ] o.a.s.c.ZkTestServer Watch fired: children: /solr/live_nodes
   [junit4]   2> 287112 DEBUG (SyncThread:0) [    ] o.a.s.c.ZkTestServer Watch fired: children: /solr/live_nodes
   [junit4]   2> 287112 DEBUG (SyncThread:0) [    ] o.a.s.c.ZkTestServer Watch added: children: /solr/live_nodes
   [junit4]   2> 287112 DEBUG (SyncThread:0) [    ] o.a.s.c.ZkTestServer Watch added: children: /solr/live_nodes
   [junit4]   2> 287112 INFO  (zkCallback-1375-thread-1) [    ] o.a.s.c.c.ZkStateReader Updated live nodes from ZooKeeper... (2) -> (3)
   [junit4]   2> 287112 INFO  (zkCallback-1369-thread-1) [    ] o.a.s.c.c.ZkStateReader Updated live nodes from ZooKeeper... (2) -> (3)
   [junit4]   2> 287115 DEBUG (SyncThread:0) [    ] o.a.s.c.ZkTestServer Watch added: children: /solr/live_nodes
   [junit4]   2> 287115 DEBUG (SyncThread:0) [    ] o.a.s.c.ZkTestServer Watch added: children: /solr/live_nodes
   [junit4]   2> 287115 INFO  (zkCallback-1384-thread-1) [    ] o.a.s.c.c.ZkStateReader Updated live nodes from ZooKeeper... (2) -> (3)
   [junit4]   2> 287115 INFO  (zkCallback-1397-thread-1) [    ] o.a.s.c.c.ZkStateReader Updated live nodes from ZooKeeper... (2) -> (3)
   [junit4]   2> 287116 DEBUG (SyncThread:0) [    ] o.a.s.c.ZkTestServer Watch added: children: /solr/live_nodes
   [junit4]   2> 287116 INFO  (zkCallback-1389-thread-1) [    ] o.a.s.c.c.ZkStateReader Updated live nodes from ZooKeeper... (2) -> (3)
   [junit4]   2> 287124 INFO  (zkConnectionManagerCallback-1405-thread-1) [    ] o.a.s.c.c.ConnectionManager zkClient has connected
   [junit4]   2> 287125 DEBUG (SyncThread:0) [    ] o.a.s.c.ZkTestServer Watch added: create/delete: /solr/clusterprops.json
   [junit4]   2> 287125 DEBUG (SyncThread:0) [    ] o.a.s.c.ZkTestServer Watch added: children: /solr/live_nodes
   [junit4]   2> 287125 INFO  (jetty-launcher-1353-thread-3) [n:127.0.0.1:33003_solr    ] o.a.s.c.c.ZkStateReader Updated live nodes from ZooKeeper... (0) -> (3)
   [junit4]   2> 287125 DEBUG (SyncThread:0) [    ] o.a.s.c.ZkTestServer Watch added: data: /solr/clusterstate.json
   [junit4]   2> 287125 DEBUG (SyncThread:0) [    ] o.a.s.c.ZkTestServer Watch added: children: /solr/collections
   [junit4]   2> 287125 DEBUG (SyncThread:0) [    ] o.a.s.c.ZkTestServer Watch added: create/delete: /solr/aliases.json
   [junit4]   2> 287125 INFO  (jetty-launcher-1353-thread-3) [n:127.0.0.1:33003_solr    ] o.a.s.c.s.i.ZkClientClusterStateProvider Cluster at 127.0.0.1:39615/solr ready
   [junit4]   2> 287126 INFO  (jetty-launcher-1353-thread-3) [n:127.0.0.1:33003_solr    ] o.a.s.h.a.MetricsHistoryHandler No .system collection, keeping metrics history in memory.
   [junit4]   2> 287141 INFO  (jetty-launcher-1353-thread-3) [n:127.0.0.1:33003_solr    ] o.a.s.m.r.SolrJmxReporter JMX monitoring for 'solr_33003.solr.node' (registry 'solr.node') enabled at server: com.sun.jmx.mbeanserver.JmxMBeanServer@2aa02c07
   [junit4]   2> 287146 INFO  (jetty-launcher-1353-thread-3) [n:127.0.0.1:33003_solr    ] o.a.s.m.r.SolrJmxReporter JMX monitoring for 'solr_33003.solr.jvm' (registry 'solr.jvm') enabled at server: com.sun.jmx.mbeanserver.JmxMBeanServer@2aa02c07
   [junit4]   2> 287146 INFO  (jetty-launcher-1353-thread-3) [n:127.0.0.1:33003_solr    ] o.a.s.m.r.SolrJmxReporter JMX monitoring for 'solr_33003.solr.jetty' (registry 'solr.jetty') enabled at server: com.sun.jmx.mbeanserver.JmxMBeanServer@2aa02c07
   [junit4]   2> 287147 INFO  (jetty-launcher-1353-thread-3) [n:127.0.0.1:33003_solr    ] o.a.s.c.CorePropertiesLocator Found 0 core definitions underneath /home/jenkins/workspace/Lucene-Solr-master-Linux/solr/build/solr-core/test/J2/temp/solr.cloud.MoveReplicaHDFSTest_B1ACEDADA04992E9-001/tempDir-001/node3/.
   [junit4]   2> 287212 DEBUG (SyncThread:0) [    ] o.a.s.c.ZkTestServer Watch fired: children: /solr/overseer/queue
   [junit4]   2> 287213 DEBUG (SyncThread:0) [    ] o.a.s.c.ZkTestServer Watch added: children: /solr/overseer/queue
   [junit4]   2> 287228 INFO  (jetty-launcher-1353-thread-1) [    ] o.a.s.c.ZkContainer Zookeeper client=127.0.0.1:39615/solr
   [junit4]   2> 287229 INFO  (zkConnectionManagerCallback-1410-thread-1) [    ] o.a.s.c.c.ConnectionManager zkClient has connected
   [junit4]   2> 287230 DEBUG (jetty-launcher-1353-thread-1) [n:127.0.0.1:36035_solr    ] o.a.s.c.ZkController Added new OnReconnect listener org.apache.solr.cloud.ZkController$$Lambda$49/1303541376@673f81e5
   [junit4]   2> 287231 INFO  (zkConnectionManagerCallback-1412-thread-1) [    ] o.a.s.c.c.ConnectionManager zkClient has connected
   [junit4]   2> 287234 DEBUG (SyncThread:0) [    ] o.a.s.c.ZkTestServer Watch added: create/delete: /solr/clusterprops.json
   [junit4]   2> 287234 DEBUG (SyncThread:0) [    ] o.a.s.c.ZkTestServer Watch added: children: /solr/live_nodes
   [junit4]   2> 287234 INFO  (jetty-launcher-1353-thread-1) [n:127.0.0.1:36035_solr    ] o.a.s.c.c.ZkStateReader Updated live nodes from ZooKeeper... (0) -> (3)
   [junit4]   2> 287234 DEBUG (SyncThread:0) [    ] o.a.s.c.ZkTestServer Watch added: data: /solr/clusterstate.json
   [junit4]   2> 287234 DEBUG (SyncThread:0) [    ] o.a.s.c.ZkTestServer Watch added: children: /solr/collections
   [junit4]   2> 287235 DEBUG (SyncThread:0) [    ] o.a.s.c.ZkTestServer Watch added: create/delete: /solr/aliases.json
   [junit4]   2> 287235 DEBUG (SyncThread:0) [    ] o.a.s.c.ZkTestServer Watch added: create/delete: /solr/security.json
   [junit4]   2> 287235 INFO  (jetty-launcher-1353-thread-1) [n:127.0.0.1:36035_solr    ] o.a.s.c.Overseer Overseer (id=null) closing
   [junit4]   2> 287235 DEBUG (jetty-launcher-1353-thread-1) [n:127.0.0.1:36035_solr    ] o.a.s.c.LeaderElector Joined leadership election with path: /overseer_elect/election/72076355814817807-127.0.0.1:36035_solr-n_0000000003
   [junit4]   2> 287236 DEBUG (SyncThread:0) [    ] o.a.s.c.ZkTestServer Watch added: data: /solr/overseer_elect/election/72076355814817804-127.0.0.1:33003_solr-n_0000000002
   [junit4]   2> 287236 DEBUG (jetty-launcher-1353-thread-1) [n:127.0.0.1:36035_solr    ] o.a.s.c.LeaderElector Watching path /overseer_elect/election/72076355814817804-127.0.0.1:33003_solr-n_0000000002 to know if I could be the leader
   [junit4]   2> 287236 DEBUG (jetty-launcher-1353-thread-1) [n:127.0.0.1:36035_solr    ] o.a.s.c.ZkController Publish node=127.0.0.1:36035_solr as DOWN
   [junit4]   2> 287236 DEBUG (SyncThread:0) [    ] o.a.s.c.ZkTestServer Watch fired: children: /solr/overseer/queue
   [junit4]   2> 287236 INFO  (jetty-launcher-1353-thread-1) [n:127.0.0.1:36035_solr    ] o.a.s.c.TransientSolrCoreCacheDefault Allocating transient cache for 2147483647 transient cores
   [junit4]   2> 287236 INFO  (jetty-launcher-1353-thread-1) [n:127.0.0.1:36035_solr    ] o.a.s.c.ZkController Register node as live in ZooKeeper:/live_nodes/127.0.0.1:36035_solr
   [junit4]   2> 287236 DEBUG (SyncThread:0) [    ] o.a.s.c.ZkTestServer Watch added: children: /solr/overseer/queue
   [junit4]   2> 287236 DEBUG (OverseerStateUpdate-72076355814817800-127.0.0.1:45743_solr-n_0000000000) [    ] o.a.s.c.Overseer processMessage: queueSize: 1, message = {
   [junit4]   2>   "operation":"downnode",
   [junit4]   2>   "node_name":"127.0.0.1:36035_solr"} current state version: 0
   [junit4]   2> 287237 DEBUG (OverseerStateUpdate-72076355814817800-127.0.0.1:45743_solr-n_0000000000) [    ] o.a.s.c.o.NodeMutator DownNode state invoked for node: 127.0.0.1:36035_solr
   [junit4]   2> 287237 DEBUG (SyncThread:0) [    ] o.a.s.c.ZkTestServer Watch fired: children: /solr/live_nodes
   [junit4]   2> 287237 DEBUG (SyncThread:0) [    ] o.a.s.c.ZkTestServer Watch fired: children: /solr/live_nodes
   [junit4]   2> 287237 DEBUG (SyncThread:0) [    ] o.a.s.c.ZkTestServer Watch fired: children: /solr/live_nodes
   [junit4]   2> 287237 DEBUG (SyncThread:0) [    ] o.a.s.c.ZkTestServer Watch fired: children: /solr/live_nodes
   [junit4]   2> 287237 DEBUG (SyncThread:0) [    ] o.a.s.c.ZkTestServer Watch fired: children: /solr/live_nodes
   [junit4]   2> 287237 DEBUG (SyncThread:0) [    ] o.a.s.c.ZkTestServer Watch fired: children: /solr/live_nodes
   [junit4]   2> 287237 DEBUG (SyncThread:0) [    ] o.a.s.c.ZkTestServer Watch fired: children: /solr/live_nodes
   [junit4]   2> 287237 DEBUG (SyncThread:0) [    ] o.a.s.c.ZkTestServer Watch added: children: /solr/live_nodes
   [junit4]   2> 287237 INFO  (zkCallback-1369-thread-1) [    ] o.a.s.c.c.ZkStateReader Updated live nodes from ZooKeeper... (3) -> (4)
   [junit4]   2> 287237 DEBUG (SyncThread:0) [    ] o.a.s.c.ZkTestServer Watch added: children: /solr/live_nodes
   [junit4]   2> 287237 DEBUG (SyncThread:0) [    ] o.a.s.c.ZkTestServer Watch added: children: /solr/live_nodes
   [junit4]   2> 287237 DEBUG (SyncThread:0) [    ] o.a.s.c.ZkTestServer Watch added: children: /solr/live_nodes
   [junit4]   2> 287237 INFO  (zkCallback-1389-thread-1) [    ] o.a.s.c.c.ZkStateReader Updated live nodes from ZooKeeper... (3) -> (4)
   [junit4]   2> 287237 DEBUG (SyncThread:0) [    ] o.a.s.c.ZkTestServer Watch added: children: /solr/live_nodes
   [junit4]   2> 287237 INFO  (zkCallback-1397-thread-1) [    ] o.a.s.c.c.ZkStateReader Updated live nodes from ZooKeeper... (3) -> (4)
   [junit4]   2> 287237 INFO  (zkCallback-1375-thread-1) [    ] o.a.s.c.c.ZkStateReader Updated live nodes from ZooKeeper... (3) -> (4)
   [junit4]   2> 287237 INFO  (zkCallback-1384-thread-1) [    ] o.a.s.c.c.ZkStateReader Updated live nodes from ZooKeeper... (3) -> (4)
   [junit4]   2> 287237 DEBUG (SyncThread:0) [    ] o.a.s.c.ZkTestServer Watch added: children: /solr/live_nodes
   [junit4]   2> 287237 INFO  (zkCallback-1411-thread-1) [    ] o.a.s.c.c.ZkStateReader Updated live nodes from ZooKeeper... (3) -> (4)
   [junit4]   2> 287237 DEBUG (SyncThread:0) [    ] o.a.s.c.ZkTestServer Watch added: children: /solr/live_nodes
   [junit4]   2> 287237 INFO  (zkCallback-1404-thread-1) [    ] o.a.s.c.c.ZkStateReader Updated live nodes from ZooKeeper... (3) -> (4)
   [junit4]   2> 287248 INFO  (zkConnectionManagerCallback-1419-thread-1) [    ] o.a.s.c.c.ConnectionManager zkClient has connected
   [junit4]   2> 287249 DEBUG (SyncThread:0) [    ] o.a.s.c.ZkTestServer Watch added: create/delete: /solr/clusterprops.json
   [junit4]   2> 287249 DEBUG (SyncThread:0) [    ] o.a.s.c.ZkTestServer Watch added: children: /solr/live_nodes
   [junit4]   2> 287249 INFO  (jetty-launcher-1353-thread-1) [n:127.0.0.1:36035_solr    ] o.a.s.c.c.ZkStateReader Updated live nodes from ZooKeeper... (0) -> (4)
   [junit4]   2> 287249 DEBUG (SyncThread:0) [    ] o.a.s.c.ZkTestServer Watch added: data: /solr/clusterstate.json
   [junit4]   2> 287249 DEBUG (SyncThread:0) [    ] o.a.s.c.ZkTestServer Watch added: children: /solr/collections
   [junit4]   2> 287249 DEBUG (SyncThread:0) [    ] o.a.s.c.ZkTestServer Watch added: create/delete: /solr/aliases.json
   [junit4]   2> 287249 INFO  (jetty-launcher-1353-thread-1) [n:127.0.0.1:36035_solr    ] o.a.s.c.s.i.ZkClientClusterStateProvider Cluster at 127.0.0.1:39615/solr ready
   [junit4]   2> 287250 INFO  (jetty-launcher-1353-thread-1) [n:127.0.0.1:36035_solr    ] o.a.s.h.a.MetricsHistoryHandler No .system collection, keeping metrics history in memory.
   [junit4]   2> 287259 INFO  (jetty-launcher-1353-thread-1) [n:127.0.0.1:36035_solr    ] o.a.s.m.r.SolrJmxReporter JMX monitoring for 'solr_36035.solr.node' (registry 'solr.node') enabled at server: com.sun.jmx.mbeanserver.JmxMBeanServer@2aa02c07
   [junit4]   2> 287263 INFO  (jetty-launcher-1353-thread-1) [n:127.0.0.1:36035_solr    ] o.a.s.m.r.SolrJmxReporter JMX monitoring for 'solr_36035.solr.jvm' (registry 'solr.jvm') enabled at server: com.sun.jmx.mbeanserver.JmxMBeanServer@2aa02c07
   [junit4]   2> 287263 INFO  (jetty-launcher-1353-thread-1) [n:127.0.0.1:36035_solr    ] o.a.s.m.r.SolrJmxReporter JMX monitoring for 'solr_36035.solr.jetty' (registry 'solr.jetty') enabled at server: com.sun.jmx.mbeanserver.JmxMBeanServer@2aa02c07
   [junit4]   2> 287264 INFO  (jetty-launcher-1353-thread-1) [n:127.0.0.1:36035_solr    ] o.a.s.c.CorePropertiesLocator Found 0 core definitions underneath /home/jenkins/workspace/Lucene-Solr-master-Linux/solr/build/solr-core/test/J2/temp/solr.cloud.MoveReplicaHDFSTest_B1ACEDADA04992E9-001/tempDir-001/node1/.
   [junit4]   2> 287286 INFO  (zkConnectionManagerCallback-1422-thread-1) [    ] o.a.s.c.c.ConnectionManager zkClient has connected
   [junit4]   2> 287289 INFO  (zkConnectionManagerCallback-1427-thread-1) [    ] o.a.s.c.c.ConnectionManager zkClient has connected
   [junit4]   2> 287289 DEBUG (SyncThread:0) [    ] o.a.s.c.ZkTestServer Watch added: create/delete: /solr/clusterprops.json
   [junit4]   2> 287289 DEBUG (SyncThread:0) [    ] o.a.s.c.ZkTestServer Watch added: children: /solr/live_nodes
   [junit4]   2> 287290 INFO  (SUITE-MoveReplicaHDFSTest-seed#[B1ACEDADA04992E9]-worker) [    ] o.a.s.c.c.ZkStateReader Updated live nodes from ZooKeeper... (0) -> (4)
   [junit4]   2> 287290 DEBUG (SyncThread:0) [    ] o.a.s.c.ZkTestServer Watch added: data: /solr/clusterstate.json
   [junit4]   2> 287290 DEBUG (SyncThread:0) [    ] o.a.s.c.ZkTestServer Watch added: children: /solr/collections
   [junit4]   2> 287290 DEBUG (SyncThread:0) [    ] o.a.s.c.ZkTestServer Watch added: create/delete: /solr/aliases.json
   [junit4]   2> 287290 INFO  (SUITE-MoveReplicaHDFSTest-seed#[B1ACEDADA04992E9]-worker) [    ] o.a.s.c.s.i.ZkClientClusterStateProvider Cluster at 127.0.0.1:39615/solr ready
   [junit4]   2> 287292 INFO  (qtp1605043186-4434) [n:127.0.0.1:45743_solr    ] o.a.s.h.a.CollectionsHandler Invoked Collection Action :overseerstatus with params action=OVERSEERSTATUS&wt=javabin&version=2 and sendToOCPQueue=true
   [junit4]   2> 287292 DEBUG (SyncThread:0) [    ] o.a.s.c.ZkTestServer Watch fired: children: /solr/overseer/collection-queue-work
   [junit4]   2> 287293 DEBUG (SyncThread:0) [    ] o.a.s.c.ZkTestServer Watch added: children: /solr/overseer/collection-queue-work
   [junit4]   2> 287293 DEBUG (SyncThread:0) [    ] o.a.s.c.ZkTestServer Watch added: create/delete: /solr/overseer/collection-queue-work/qnr-0000000000
   [junit4]   2> 287293 DEBUG (OverseerCollectionConfigSetProcessor-72076355814817800-127.0.0.1:45743_solr-n_0000000000) [    ] o.a.s.c.ZkDistributedQueue Found child node with improper name: qnr-0000000000
   [junit4]   2> 287293 DEBUG (SyncThread:0) [    ] o.a.s.c.ZkTestServer Watch fired: children: /solr/overseer/collection-queue-work
   [junit4]   2> 287293 DEBUG (SyncThread:0) [    ] o.a.s.c.ZkTestServer Watch added: children: /solr/overseer/collection-queue-work
   [junit4]   2> 287293 DEBUG (OverseerCollectionConfigSetProcessor-72076355814817800-127.0.0.1:45743_solr-n_0000000000) [    ] o.a.s.c.ZkDistributedQueue Found child node with improper name: qnr-0000000000
   [junit4]   2> 287293 DEBUG (OverseerCollectionConfigSetProcessor-72076355814817800-127.0.0.1:45743_solr-n_0000000000) [    ] o.a.s.c.OverseerTaskQueue Returning topN elements: [/overseer/collection-queue-work/qn-0000000000, ]
   [junit4]   2> 287293 DEBUG (OverseerCollectionConfigSetProcessor-72076355814817800-127.0.0.1:45743_solr-n_0000000000) [    ] o.a.s.c.OverseerTaskProcessor Got 1 tasks from work-queue : [[org.apache.solr.cloud.OverseerTaskQueue$QueueEvent@2e684ecf]]
   [junit4]   2> 287293 DEBUG (OverseerCollectionConfigSetProcessor-72076355814817800-127.0.0.1:45743_solr-n_0000000000) [    ] o.a.s.c.OverseerTaskProcessor Marked task [/overseer/collection-queue-work/qn-0000000000] as running
   [junit4]   2> 287293 DEBUG (OverseerCollectionConfigSetProcessor-72076355814817800-127.0.0.1:45743_solr-n_0000000000) [    ] o.a.s.c.OverseerTaskProcessor Overseer Collection Message Handler: Get the message id:/overseer/collection-queue-work/qn-0000000000 message:{"operation":"overseerstatus"}
   [junit4]   2> 287293 DEBUG (OverseerThreadFactory-1941-thread-1) [    ] o.a.s.c.OverseerTaskProcessor Runner processing /overseer/collection-queue-work/qn-0000000000
   [junit4]   2> 287293 DEBUG (OverseerThreadFactory-1941-thread-1) [    ] o.a.s.c.a.c.OverseerCollectionMessageHandler OverseerCollectionMessageHandler.processMessage : overseerstatus , {"operation":"overseerstatus"}
   [junit4]   2> 287294 DEBUG (OverseerCollectionConfigSetProcessor-72076355814817800-127.0.0.1:45743_solr-n_0000000000) [    ] o.a.s.c.OverseerTaskProcessor Cleaning up work-queue. #Running tasks: 1
   [junit4]   2> 287294 DEBUG (OverseerCollectionConfigSetProcessor-72076355814817800-127.0.0.1:45743_solr-n_0000000000) [    ] o.a.s.c.OverseerTaskProcessor RunningTasks: [/overseer/collection-queue-work/qn-0000000000]
   [junit4]   2> 287294 DEBUG (OverseerCollectionConfigSetProcessor-72076355814817800-127.0.0.1:45743_solr-n_0000000000) [    ] o.a.s.c.OverseerTaskProcessor BlockedTasks: []
   [junit4]   2> 287294 DEBUG (OverseerCollectionConfigSetProcessor-72076355814817800-127.0.0.1:45743_solr-n_0000000000) [    ] o.a.s.c.OverseerTaskProcessor CompletedTasks: []
   [junit4]   2> 287294 DEBUG (OverseerCollectionConfigSetProcessor-72076355814817800-127.0.0.1:45743_solr-n_0000000000) [    ] o.a.s.c.OverseerTaskProcessor RunningZKTasks: [/overseer/collection-queue-work/qn-0000000000]
   [junit4]   2> 287294 DEBUG (OverseerCollectionConfigSetProcessor-72076355814817800-127.0.0.1:45743_solr-n_0000000000) [    ] o.a.s.c.OverseerTaskQueue Peeking for top 99 elements. ExcludeSet: [/overseer/collection-queue-work/qn-0000000000],[]
   [junit4]   2> 287294 DEBUG (OverseerThreadFactory-1941-thread-1) [    ] o.a.s.c.OverseerTaskProcessor Completed task:[/overseer/collection-queue-work/qn-0000000000]
   [junit4]   2> 287295 DEBUG (SyncThread:0) [    ] o.a.s.c.ZkTestServer Watch fired: data: /solr/overseer/collection-queue-work/qnr-0000000000
   [junit4]   2> 287295 DEBUG (zkCallback-1375-thread-1) [    ] o.a.s.c.OverseerTaskQueue NodeDataChanged fired on path /overseer/collection-queue-work/qnr-0000000000 state SyncConnected latchEventType null
   [junit4]   2> 287295 DEBUG (SyncThread:0) [    ] o.a.s.c.ZkTestServer Watch fired: children: /solr/overseer/collection-queue-work
   [junit4]   2> 287295 DEBUG (OverseerThreadFactory-1941-thread-1) [    ] o.a.s.c.OverseerTaskProcessor Marked task [/overseer/collection-queue-work/qn-0000000000] as completed.
   [junit4]   2> 287295 DEBUG (OverseerThreadFactory-1941-thread-1) [    ] o.a.s.c.OverseerTaskProcessor RunningTasks: []
   [junit4]   2> 287295 DEBUG (SyncThread:0) [    ] o.a.s.c.ZkTestServer Watch added: children: /solr/overseer/collection-queue-work
   [junit4]   2> 287295 DEBUG (OverseerThreadFactory-1941-thread-1) [    ] o.a.s.c.OverseerTaskProcessor BlockedTasks: []
   [junit4]   2> 287295 DEBUG (OverseerThreadFactory-1941-thread-1) [    ] o.a.s.c.OverseerTaskProcessor CompletedTasks: [/overseer/collection-queue-work/qn-0000000000]
   [junit4]   2> 287295 DEBUG (OverseerThreadFactory-1941-thread-1) [    ] o.a.s.c.OverseerTaskProcessor RunningZKTasks: [/overseer/collection-queue-work/qn-0000000000]
   [junit4]   2> 287295 DEBUG (SyncThread:0) [    ] o.a.s.c.ZkTestServer Watch fired: children: /solr/overseer/collection-queue-work
   [junit4]   2> 287295 DEBUG (OverseerCollectionConfigSetProcessor-72076355814817800-127.0.0.1:45743_solr-n_0000000000) [    ] o.a.s.c.ZkDistributedQueue Found child node with improper name: qnr-0000000000
   [junit4]   2> 287295 DEBUG (OverseerThreadFactory-1941-thread-1) [    ] o.a.s.c.OverseerTaskProcessor Overseer Collection Message Handler: Message id:/overseer/collection-queue-work/qn-0000000000 complete, response:{leader=127.0.0.1:45743_solr,overseer_queue_size=1,overseer_work_queue_size=0,overseer_collection_queue_size=2,overseer_operations={am_i_leader={requests=4,errors=0,avgRequestsPerSecond=12.346531837600388,5minRateRequestsPerSecond=0.0,15minRateRequestsPerSecond=0.0,avgTimePerRequest=0.2642495,medianRequestTime=0.38227,75thPcRequestTime=0.402086,95thPcRequestTime=0.402086,99thPcRequestTime=0.402086,999thPcRequestTime=0.402086},downnode={requests=3,errors=0,avgRequestsPerSecond=9.300906046832461,5minRateRequestsPerSecond=0.0,15minRateRequestsPerSecond=0.0,avgTimePerRequest=0.030722,medianRequestTime=0.024698,75thPcRequestTime=0.043738,95thPcRequestTime=0.043738,99thPcRequestTime=0.043738,999thPcRequestTime=0.043738}},collection_operations={am_i_leader={requests=3,errors=0,avgRequestsPerSecond=9.265657596197356,5minRateRequestsPerSecond=0.0,15minRateRequestsPerSecond=0.0,avgTimePerRequest=0.10083866666666666,medianRequestTime=0.084692,75thPcRequestTime=0.139048,95thPcRequestTime=0.139048,99thPcRequestTime=0.139048,999thPcRequestTime=0.139048},overseerstatus={requests=0,errors=0,avgRequestsPerSecond=0.0,5minRateRequestsPerSecond=0.0,15minRateRequestsPerSecond=0.0,avgTimePerRequest=0.0,medianRequestTime=0.0,75thPcRequestTime=0.0,95thPcRequestTime=0.0,99thPcRequestTime=0.0,999thPcRequestTime=0.0}},overseer_queue={},overseer_internal_queue={peek={avgRequestsPerSecond=3.0956427716653057,5minRateRequestsPerSecond=0.0,15minRateRequestsPerSecond=0.0,avgTimePerRequest=0.105088,medianRequestTime=0.105088,75thPcRequestTime=0.105088,95thPcRequestTime=0.105088,99thPcRequestTime=0.105088,999thPcRequestTime=0.105088}},collection_queue={peektopn_wait2000={avgRequestsPerSecond=3.0947088734946515,5minRateRequestsPerSecond=0.0,15minRateRequestsPerSecond=0.0,avgTimePerRequest=322.337875,medianRequestTime=322.337875,75thPcRequestTime=322.337875,95thPcRequestTime=322.337875,99thPcRequestTime=322.337875,999thPcRequestTime=322.337875}}}
   [junit4]   2> 287295 DEBUG (SyncThread:0) [    ] o.a.s.c.ZkTestServer Watch added: children: /solr/overseer/collection-queue-work
   [junit4]   2> 287296 INFO  (qtp1605043186-4434) [n:127.0.0.1:45743_solr    ] o.a.s.s.HttpSolrCall [admin] webapp=null path=/admin/collections params={action=OVERSEERSTATUS&wt=javabin&version=2} status=0 QTime=3
   [junit4]   1> Formatting using clusterid: testClusterID
   [junit4]   2> 287337 DEBUG (SyncThread:0) [    ] o.a.s.c.ZkTestServer Watch fired: children: /solr/overseer/queue
   [junit4]   2> 287337 DEBUG (SyncThread:0) [    ] o.a.s.c.ZkTestServer Watch added: children: /solr/overseer/queue
   [junit4]   2> 287362 WARN  (SUITE-MoveReplicaHDFSTest-seed#[B1ACEDADA04992E9]-worker) [    ] o.a.h.m.i.MetricsConfig Cannot locate configuration: tried hadoop-metrics2-namenode.properties,hadoop-metrics2.properties
   [junit4]   2> 287367 WARN  (SUITE-MoveReplicaHDFSTest-seed#[B1ACEDADA04992E9]-worker) [    ] o.a.h.h.HttpRequestLog Jetty request log can only be enabled using Log4j
   [junit4]   2> 287368 INFO  (SUITE-MoveReplicaHDFSTest-seed#[B1ACEDADA04992E9]-worker) [    ] o.m.log jetty-6.1.26
   [junit4]   2> 287376 INFO  (SUITE-MoveReplicaHDFSTest-seed#[B1ACEDADA04992E9]-worker) [    ] o.m.log Extract jar:file:/home/jenkins/.ivy2/cache/org.apache.hadoop/hadoop-hdfs/tests/hadoop-hdfs-2.7.4-tests.jar!/webapps/hdfs to ./temp/Jetty_localhost_localdomain_36235_hdfs____.crmlw5/webapp
   [junit4]   2> 287817 INFO  (SUITE-MoveReplicaHDFSTest-seed#[B1ACEDADA04992E9]-worker) [    ] o.m.log Started HttpServer2$SelectChannelConnectorWithSafeStartup@localhost.localdomain:36235
   [junit4]   2> 287915 WARN  (SUITE-MoveReplicaHDFSTest-seed#[B1ACEDADA04992E9]-worker) [    ] o.a.h.h.HttpRequestLog Jetty request log can only be enabled using Log4j
   [junit4]   2> 287916 INFO  (SUITE-MoveReplicaHDFSTest-seed#[B1ACEDADA04992E9]-worker) [    ] o.m.log jetty-6.1.26
   [junit4]   2> 287925 INFO  (SUITE-MoveReplicaHDFSTest-seed#[B1ACEDADA04992E9]-worker) [    ] o.m.log Extract jar:file:/home/jenkins/.ivy2/cache/org.apache.hadoop/hadoop-hdfs/tests/hadoop-hdfs-2.7.4-tests.jar!/webapps/datanode to ./temp/Jetty_localhost_33939_datanode____.kzxnru/webapp
   [junit4]   2> 288030 DEBUG (ScheduledTrigger-1939-thread-2) [    ] o.a.s.c.a.NodeLostTrigger Running NodeLostTrigger: .auto_add_replicas with currently live nodes: 4
   [junit4]   2> 288359 INFO  (SUITE-MoveReplicaHDFSTest-seed#[B1ACEDADA04992E9]-worker) [    ] o.m.log Started HttpServer2$SelectChannelConnectorWithSafeStartup@localhost:33939
   [junit4]   2> 288393 WARN  (SUITE-MoveReplicaHDFSTest-seed#[B1ACEDADA04992E9]-worker) [    ] o.a.h.h.HttpRequestLog Jetty request log can only be enabled using Log4j
   [junit4]   2> 288394 INFO  (SUITE-MoveReplicaHDFSTest-seed#[B1ACEDADA04992E9]-worker) [    ] o.m.log jetty-6.1.26
   [junit4]   2> 288402 INFO  (SUITE-MoveReplicaHDFSTest-seed#[B1ACEDADA04992E9]-worker) [    ] o.m.log Extract jar:file:/home/jenkins/.ivy2/cache/org.apache.hadoop/hadoop-hdfs/tests/hadoop-hdfs-2.7.4-tests.jar!/webapps/datanode to ./temp/Jetty_localhost_39323_datanode____tbeq9h/webapp
   [junit4]   2> 288486 ERROR (DataNode: [[[DISK]file:/home/jenkins/workspace/Lucene-Solr-master-Linux/solr/build/solr-core/test/J2/temp/solr.cloud.MoveReplicaHDFSTest_B1ACEDADA04992E9-001/tempDir-002/hdfsBaseDir/data/data1/, [DISK]file:/home/jenkins/workspace/Lucene-Solr-master-Linux/solr/build/solr-core/test/J2/temp/solr.cloud.MoveReplicaHDFSTest_B1ACEDADA04992E9-001/tempDir-002/hdfsBaseDir/data/data2/]]  heartbeating to localhost.localdomain/127.0.0.1:44491) [    ] o.a.h.h.s.d.DirectoryScanner dfs.datanode.directoryscan.throttle.limit.ms.per.sec set to value below 1 ms/sec. Assuming default value of 1000
   [junit4]   2> 288490 INFO  (Block report processor) [    ] BlockStateChange BLOCK* processReport 0x1045fa5c37b83: from storage DS-195cb8c3-0d93-4768-b924-2ce23198da25 node DatanodeRegistration(127.0.0.1:35787, datanodeUuid=e1e889e3-69ed-4605-a95d-eae4760b3e71, infoPort=38123, infoSecurePort=0, ipcPort=40869, storageInfo=lv=-56;cid=testClusterID;nsid=1573049007;c=0), blocks: 0, hasStaleStorage: true, processing time: 0 msecs
   [junit4]   2> 288490 INFO  (Block report processor) [    ] BlockStateChange BLOCK* processReport 0x1045fa5c37b83: from storage DS-6509a07e-ca3a-4005-aef4-e457c36b9889 node DatanodeRegistration(127.0.0.1:35787, datanodeUuid=e1e889e3-69ed-4605-a95d-eae4760b3e71, infoPort=38123, infoSecurePort=0, ipcPort=40869, storageInfo=lv=-56;cid=testClusterID;nsid=1573049007;c=0), blocks: 0, hasStaleStorage: false, processing time: 0 msecs
   [junit4]   2> 288853 INFO  (SUITE-MoveReplicaHDFSTest-seed#[B1ACEDADA04992E9]-worker) [    ] o.m.log Started HttpServer2$SelectChannelConnectorWithSafeStartup@localhost:39323
   [junit4]   2> 289024 ERROR (DataNode: [[[DISK]file:/home/jenkins/workspace/Lucene-Solr-master-Linux/solr/build/solr-core/test/J2/temp/solr.cloud.MoveReplicaHDFSTest_B1ACEDADA04992E9-001/tempDir-002/hdfsBaseDir/data/data3/, [DISK]file:/home/jenkins/workspace/Lucene-Solr-master-Linux/solr/build/solr-core/test/J2/temp/solr.cloud.MoveReplicaHDFSTest_B1ACEDADA04992E9-001/tempDir-002/hdfsBaseDir/data/data4/]]  heartbeating to localhost.localdomain/127.0.0.1:44491) [    ] o.a.h.h.s.d.DirectoryScanner dfs.datanode.directoryscan.throttle.limit.ms.per.sec set to value below 1 ms/sec. Assuming default value of 1000
   [junit4]   2> 289028 INFO  (Block report processor) [    ] BlockStateChange BLOCK* processReport 0x1045fc5d1518e: from storage DS-96f79d17-1e74-4ea5-a5ef-49271d04a3c4 node DatanodeRegistration(127.0.0.1:43857, datanodeUuid=4a392711-a2d0-4f12-8110-1f9ddc30ab5d, infoPort=46651, infoSecurePort=0, ipcPort=35169, storageInfo=lv=-56;cid=testClusterID;nsid=1573049007;c=0), blocks: 0, hasStaleStorage: true, processing time: 0 msecs
   [junit4]   2> 289028 INFO  (Block report processor) [    ] BlockStateChange BLOCK* processReport 0x1045fc5d1518e: from storage DS-443e8adc-4259-49fe-b1ad-e8e60b42c323 node DatanodeRegistration(127.0.0.1:43857, datanodeUuid=4a392711-a2d0-4f12-8110-1f9ddc30ab5d, infoPort=46651, infoSecurePort=0, ipcPort=35169, storageInfo=lv=-56;cid=testClusterID;nsid=1573049007;c=0), blocks: 0, hasStaleStorage: false, processing time: 0 msecs
   [junit4]   2> 289031 DEBUG (ScheduledTrigger-1939-thread-4) [    ] o.a.s.c.a.NodeLostTrigger Running NodeLostTrigger: .auto_add_replicas with currently live nodes: 4
   [junit4]   2> 289139 DEBUG (SyncThread:0) [    ] o.a.s.c.ZkTestServer Watch added: create/delete: /solr/clusterprops.json
   [junit4]   2> 289139 DEBUG (SyncThread:0) [    ] o.a.s.c.ZkTestServer Watch added: children: /solr/live_nodes
   [junit4]   2> 289139 INFO  (TEST-MoveReplicaHDFSTest.test-seed#[B1ACEDADA04992E9]) [    ] o.a.s.c.c.ZkStateReader Updated live nodes from ZooKeeper... (0) -> (4)
   [junit4]   2> 289139 DEBUG (SyncThread:0) [    ] o.a.s.c.ZkTestServer Watch added: data: /solr/clusterstate.json
   [junit4]   2> 289139 DEBUG (SyncThread:0) [    ] o.a.s.c.ZkTestServer Watch added: children: /solr/collections
   [junit4]   2> 289140 DEBUG (SyncThread:0) [    ] o.a.s.c.ZkTestServer Watch added: create/delete: /solr/aliases.json
   [junit4]   2> 289140 DEBUG (SyncThread:0) [    ] o.a.s.c.ZkTestServer Watch fired: data: /solr/aliases.json
   [junit4]   2> 289140 DEBUG (SyncThread:0) [    ] o.a.s.c.ZkTestServer Watch fired: data: /solr/aliases.json
   [junit4]   2> 289140 DEBUG (SyncThread:0) [    ] o.a.s.c.ZkTestServer Watch fired: data: /solr/aliases.json
   [junit4]   2> 289140 DEBUG (SyncThread:0) [    ] o.a.s.c.ZkTestServer Watch fired: data: /solr/aliases.json
   [junit4]   2> 289140 DEBUG (SyncThread:0) [    ] o.a.s.c.ZkTestServer Watch fired: data: /solr/aliases.json
   [junit4]   2> 289140 DEBUG (SyncThread:0) [    ] o.a.s.c.ZkTestServer Watch fired: data: /solr/aliases.json
   [junit4]   2> 289140 DEBUG (SyncThread:0) [    ] o.a.s.c.ZkTestServer Watch fired: data: /solr/aliases.json
   [junit4]   2> 289140 DEBUG (SyncThread:0) [    ] o.a.s.c.ZkTestServer Watch fired: data: /solr/aliases.json
   [junit4]   2> 289140 DEBUG (SyncThread:0) [    ] o.a.s.c.ZkTestServer Watch fired: data: /solr/aliases.json
   [junit4]   2> 289140 DEBUG (SyncThread:0) [    ] o.a.s.c.ZkTestServer Watch added: data: /solr/aliases.json
   [junit4]   2> 289140 DEBUG (SyncThread:0) [    ] o.a.s.c.ZkTestServer Watch added: data: /solr/aliases.json
   [junit4]   2> 289140 DEBUG (SyncThread:0) [    ] o.a.s.c.ZkTestServer Watch added: data: /solr/aliases.json
   [junit4]   2> 289140 DEBUG (SyncThread:0) [    ] o.a.s.c.ZkTestServer Watch added: data: /solr/aliases.json
   [junit4]   2> 289140 DEBUG (SyncThread:0) [    ] o.a.s.c.ZkTestServer Watch added: data: /solr/aliases.json
   [junit4]   2> 289140 DEBUG (SyncThread:0) [    ] o.a.s.c.ZkTestServer Watch added: data: /solr/aliases.json
   [junit4]   2> 289140 DEBUG (SyncThread:0) [    ] o.a.s.c.ZkTestServer Watch added: data: /solr/aliases.json
   [junit4]   2> 289141 DEBUG (SyncThread:0) [    ] o.a.s.c.ZkTestServer Watch added: data: /solr/aliases.json
   [junit4]   2> 289141 INFO  (TEST-MoveReplicaHDFSTest.test-seed#[B1ACEDADA04992E9]) [    ] o.e.j.s.Server jetty-9.4.11.v20180605; built: 2018-06-05T18:24:03.829Z; git: d5fc0523cfa96bfebfbda19606cad384d772f04c; jvm 1.8.0_172-b11
   [junit4]   2> 289141 DEBUG (SyncThread:0) [    ] o.a.s.c.ZkTestServer Watch added: data: /solr/aliases.json
   [junit4]   2> 289144 DEBUG (SyncThread:0) [    ] o.a.s.c.ZkTestServer Watch added: data: /solr/aliases.json
   [junit4]   2> 289148 INFO  (TEST-MoveReplicaHDFSTest.test-seed#[B1ACEDADA04992E9]) [    ] o.e.j.s.session DefaultSessionIdManager workerName=node0
   [junit4]   2> 289148 INFO  (TEST-MoveReplicaHDFSTest.test-seed#[B1ACEDADA04992E9]) [    ] o.e.j.s.session No SessionScavenger set, using defaults
   [junit4]   2> 289148 INFO  (TEST-MoveReplicaHDFSTest.test-seed#[B1ACEDADA04992E9]) [    ] o.e.j.s.session node0 Scavenging every 600000ms
   [junit4]   2> 289148 INFO  (TEST-MoveReplicaHDFSTest.test-seed#[B1ACEDADA04992E9]) [    ] o.e.j.s.h.ContextHandler Started o.e.j.s.ServletContextHandler@66170e57{/solr,null,AVAILABLE}
   [junit4]   2> 289148 INFO  (TEST-MoveReplicaHDFSTest.test-seed#[B1ACEDADA04992E9]) [    ] o.e.j.s.AbstractConnector Started ServerConnector@39583908{HTTP/1.1,[http/1.1]}{127.0.0.1:43957}
   [junit4]   2> 289148 INFO  (TEST-MoveReplicaHDFSTest.test-seed#[B1ACEDADA04992E9]) [    ] o.e.j.s.Server Started @289178ms
   [junit4]   2> 289148 INFO  (TEST-MoveReplicaHDFSTest.test-seed#[B1ACEDADA04992E9]) [    ] o.a.s.c.s.e.JettySolrRunner Jetty properties: {hostContext=/solr, hostPort=43957}
   [junit4]   2> 289149 ERROR (TEST-MoveReplicaHDFSTest.test-seed#[B1ACEDADA04992E9]) [    ] o.a.s.u.StartupLoggingUtils Missing Java Option solr.log.dir. Logging may be missing or incomplete.
   [junit4]   2> 289149 INFO  (TEST-MoveReplicaHDFSTest.test-seed#[B1ACEDADA04992E9]) [    ] o.a.s.s.SolrDispatchFilter Using logger factory org.apache.logging.slf4j.Log4jLoggerFactory
   [junit4]   2> 289149 INFO  (TEST-MoveReplicaHDFSTest.test-seed#[B1ACEDADA04992E9]) [    ] o.a.s.s.SolrDispatchFilter  ___      _       Welcome to Apache Solr™ version 8.0.0
   [junit4]   2> 289149 INFO  (TEST-MoveReplicaHDFSTest.test-seed#[B1ACEDADA04992E9]) [    ] o.a.s.s.SolrDispatchFilter / __| ___| |_ _   Starting in cloud mode on port null
   [junit4]   2> 289149 INFO  (TEST-MoveReplicaHDFSTest.test-seed#[B1ACEDADA04992E9]) [    ] o.a.s.s.SolrDispatchFilter \__ \/ _ \ | '_|  Install dir: null
   [junit4]   2> 289149 INFO  (TEST-MoveReplicaHDFSTest.test-seed#[B1ACEDADA04992E9]) [    ] o.a.s.s.SolrDispatchFilter |___/\___/_|_|    Start time: 2018-07-05T18:58:27.644Z
   [junit4]   2> 289150 INFO  (zkConnectionManagerCallback-1431-thread-1) [    ] o.a.s.c.c.ConnectionManager zkClient has connected
   [junit4]   2> 289151 INFO  (TEST-MoveReplicaHDFSTest.test-seed#[B1ACEDADA04992E9]) [    ] o.a.s.s.SolrDispatchFilter solr.xml found in ZooKeeper. Loading...
   [junit4]   2> 289294 DEBUG (OverseerCollectionConfigSetProcessor-72076355814817800-127.0.0.1:45743_solr-n_0000000000) [    ] o.a.s.c.OverseerTaskProcessor Got 0 tasks from work-queue : [[]]
   [junit4]   2> 289295 DEBUG (OverseerCollectionConfigSetProcessor-72076355814817800-127.0.0.1:45743_solr-n_0000000000) [    ] o.a.s.c.OverseerTaskProcessor Cleaning up work-queue. #Running tasks: 0
   [junit4]   2> 289295 INFO  (OverseerCollectionConfigSetProcessor-72076355814817800-127.0.0.1:45743_solr-n_0000000000) [    ] o.a.s.c.OverseerTaskQueue Response ZK path: /overseer/collection-queue-work/qnr-0000000000 doesn't exist.  Requestor may have disconnected from ZooKeeper
   [junit4]   2> 289295 DEBUG (OverseerCollectionConfigSetProcessor-72076355814817800-127.0.0.1:45743_solr-n_0000000000) [    ] o.a.s.c.OverseerTaskProcessor RunningTasks: []
   [junit4]   2> 289295 DEBUG (OverseerCollectionConfigSetProcessor-72076355814817800-127.0.0.1:45743_solr-n_0000000000) [    ] o.a.s.c.OverseerTaskProcessor BlockedTasks: []
   [junit4]   2> 289295 DEBUG (OverseerCollectionConfigSetProcessor-72076355814817800-127.0.0.1:45743_solr-n_0000000000) [    ] o.a.s.c.OverseerTaskProcessor CompletedTasks: []
   [junit4]   2> 289295 DEBUG (OverseerCollectionConfigSetProcessor-72076355814817800-127.0.0.1:45743_solr-n_0000000000) [    ] o.a.s.c.OverseerTaskProcessor RunningZKTasks: []
   [junit4]   2> 289295 DEBUG (OverseerCollectionConfigSetProcessor-72076355814817800-127.0.0.1:45743_solr-n_0000000000) [    ] o.a.s.c.OverseerTaskQueue Peeking for top 100 elements. ExcludeSet: []
   [junit4]   2> 289603 INFO  (TEST-MoveReplicaHDFSTest.test-seed#[B1ACEDADA04992E9]) [    ] o.a.s.c.ZkContainer Zookeeper client=127.0.0.1:39615/solr
   [junit4]   2> 289608 INFO  (zkConnectionManagerCallback-1435-thread-1) [    ] o.a.s.c.c.ConnectionManager zkClient has connected
   [junit4]   2> 289609 DEBUG (TEST-MoveReplicaHDFSTest.test-seed#[B1ACEDADA04992E9]) [n:127.0.0.1:43957_solr    ] o.a.s.c.ZkController Added new OnReconnect listener org.apache.solr.cloud.ZkController$$Lambda$49/1303541376@82bcdbb
   [junit4]   2> 289610 INFO  (zkConnectionManagerCallback-1437-thread-1) [    ] o.a.s.c.c.ConnectionManager zkClient has connected
   [junit4]   2> 289614 DEBUG (SyncThread:0) [    ] o.a.s.c.ZkTestServer Watch added: create/delete: /solr/clusterprops.json
   [junit4]   2> 289614 DEBUG (SyncThread:0) [    ] o.a.s.c.ZkTestServer Watch added: children: /solr/live_nodes
   [junit4]   2> 289614 INFO  (TEST-MoveReplicaHDFSTest.test-seed#[B1ACEDADA04992E9]) [n:127.0.0.1:43957_solr    ] o.a.s.c.c.ZkStateReader Updated live nodes from ZooKeeper... (0) -> (4)
   [junit4]   2> 289614 DEBUG (SyncThread:0) [    ] o.a.s.c.ZkTestServer Watch added: data: /solr/clusterstate.json
   [junit4]   2> 289614 DEBUG (SyncThread:0) [    ] o.a.s.c.ZkTestServer Watch added: children: /solr/collections
   [junit4]   2> 289615 DEBUG (SyncThread:0) [    ] o.a.s.c.ZkTestServer Watch added: create/delete: /solr/aliases.json
   [junit4]   2> 289615 DEBUG (SyncThread:0) [    ] o.a.s.c.ZkTestServer Watch added: create/delete: /solr/security.json
   [junit4]   2> 289615 INFO  (TEST-MoveReplicaHDFSTest.test-seed#[B1ACEDADA04992E9]) [n:127.0.0.1:43957_solr    ] o.a.s.c.Overseer Overseer (id=null) closing
   [junit4]   2> 289616 DEBUG (TEST-MoveReplicaHDFSTest.test-seed#[B1ACEDADA04992E9]) [n:127.0.0.1:43957_solr    ] o.a.s.c.LeaderElector Joined leadership election with path: /overseer_elect/election/72076355814817813-127.0.0.1:43957_solr-n_0000000004
   [junit4]   2> 289616 DEBUG (SyncThread:0) [    ] o.a.s.c.ZkTestServer Watch added: data: /solr/overseer_elect/election/72076355814817807-127.0.0.1:36035_solr-n_0000000003
   [junit4]   2> 289616 DEBUG (TEST-MoveReplicaHDFSTest.test-seed#[B1ACEDADA04992E9]) [n:127.0.0.1:43957_solr    ] o.a.s.c.LeaderElector Watching path /overseer_elect/election/72076355814817807-127.0.0.1:36035_solr-n_0000000003 to know if I could be the leader
   [junit4]   2> 289616 DEBUG (TEST-MoveReplicaHDFSTest.test-seed#[B1ACEDADA04992E9]) [n:127.0.0.1:43957_solr    ] o.a.s.c.ZkController Publish node=127.0.0.1:43957_solr as DOWN
   [junit4]   2> 289617 DEBUG (SyncThread:0) [    ] o.a.s.c.ZkTestServer Watch fired: children: /solr/overseer/queue
   [junit4]   2> 289617 INFO  (TEST-MoveReplicaHDFSTest.test-seed#[B1ACEDADA04992E9]) [n:127.0.0.1:43957_solr    ] o.a.s.c.TransientSolrCoreCacheDefault Allocating transient cache for 2147483647 transient cores
   [junit4]   2> 289617 INFO  (TEST-MoveReplicaHDFSTest.test-seed#[B1ACEDADA04992E9]) [n:127.0.0.1:43957_solr    ] o.a.s.c.ZkController Register node as live in ZooKeeper:/live_nodes/127.0.0.1:43957_solr
   [junit4]   2> 289617 DEBUG (SyncThread:0) [    ] o.a.s.c.ZkTestServer Watch added: children: /solr/overseer/queue
   [junit4]   2> 289617 DEBUG (OverseerStateUpdate-72076355814817800-127.0.0.1:45743_solr-n_0000000000) [    ] o.a.s.c.Overseer processMessage: queueSize: 1, message = {
   [junit4]   2>   "operation":"downnode",
   [junit4]   2>   "node_name":"127.0.0.1:43957_solr"} current state version: 0
   [junit4]   2> 289617 DEBUG (OverseerStateUpdate-72076355814817800-127.0.0.1:45743_solr-n_0000000000) [    ] o.a.s.c.o.NodeMutator DownNode state invoked for node: 127.0.0.1:43957_solr
   [junit4]   2> 289617 DEBUG (SyncThread:0) [    ] o.a.s.c.ZkTestServer Watch fired: children: /solr/live_nodes
   [junit4]   2> 289617 DEBUG (SyncThread:0) [    ] o.a.s.c.ZkTestServer Watch fired: children: /solr/live_nodes
   [junit4]   2> 289617 DEBUG (SyncThread:0) [    ] o.a.s.c.ZkTestServer Watch fired: children: /solr/live_nodes
   [junit4]   2> 289617 DEBUG (SyncThread:0) [    ] o.a.s.c.ZkTestServer Watch fired: children: /solr/live_nodes
   [junit4]   2> 289617 DEBUG (SyncThread:0) [    ] o.a.s.c.ZkTestServer Watch fired: children: /solr/live_nodes
   [junit4]   2> 289617 DEBUG (SyncThread:0) [    ] o.a.s.c.ZkTestServer Watch fired: children: /solr/live_nodes
   [junit4]   2> 289617 DEBUG (SyncThread:0) [    ] o.a.s.c.ZkTestServer Watch fired: children: /solr/live_nodes
   [junit4]   2> 289617 DEBUG (SyncThread:0) [    ] o.a.s.c.ZkTestServer Watch fired: children: /solr/live_nodes
   [junit4]   2> 289617 DEBUG (SyncThread:0) [    ] o.a.s.c.ZkTestServer Watch fired: children: /solr/live_nodes
   [junit4]   2> 289617 DEBUG (SyncThread:0) [    ] o.a.s.c.ZkTestServer Watch fired: children: /solr/live_nodes
   [junit4]   2> 289617 DEBUG (SyncThread:0) [    ] o.a.s.c.ZkTestServer Watch added: children: /solr/live_nodes
   [junit4]   2> 289617 DEBUG (SyncThread:0) [    ] o.a.s.c.ZkTestServer Watch added: children: /solr/live_nodes
   [junit4]   2> 289617 DEBUG (SyncThread:0) [    ] o.a.s.c.ZkTestServer Watch added: children: /solr/live_nodes
   [junit4]   2> 289617 INFO  (zkCallback-1369-thread-1) [    ] o.a.s.c.c.ZkStateReader Updated live nodes from ZooKeeper... (4) -> (5)
   [junit4]   2> 289618 DEBUG (SyncThread:0) [    ] o.a.s.c.ZkTestServer Watch added: children: /solr/live_nodes
   [junit4]   2> 289618 DEBUG (SyncThread:0) [    ] o.a.s.c.ZkTestServer Watch added: children: /solr/live_nodes
   [junit4]   2> 289617 INFO  (zkCallback-1404-thread-1) [    ] o.a.s.c.c.ZkStateReader Updated live nodes from ZooKeeper... (4) -> (5)
   [junit4]   2> 289618 DEBUG (SyncThread:0) [    ] o.a.s.c.ZkTestServer Watch added: children: /solr/live_nodes
   [junit4]   2> 289618 INFO  (zkCallback-1426-thread-2) [    ] o.a.s.c.c.ZkStateReader Updated live nodes from ZooKeeper... (4) -> (5)
   [junit4]   2> 289618 INFO  (zkCallback-1426-thread-1) [    ] o.a.s.c.c.ZkStateReader Updated live nodes from ZooKeeper... (4) -> (5)
   [junit4]   2> 289618 INFO  (zkCallback-1397-thread-1) [    ] o.a.s.c.c.ZkStateReader Updated live nodes from ZooKeeper... (4) -> (5)
   [junit4]   2> 289620 INFO  (zkCallback-1418-thread-1) [    ] o.a.s.c.c.ZkStateReader Updated live nodes from ZooKeeper... (4) -> (5)
   [junit4]   2> 289620 DEBUG (SyncThread:0) [    ] o.a.s.c.ZkTestServer Watch added: children: /solr/live_nodes
   [junit4]   2> 289620 DEBUG (SyncThread:0) [    ] o.a.s.c.ZkTestServer Watch added: children: /solr/live_nodes
   [junit4]   2> 289620 DEBUG (SyncThread:0) [    ] o.a.s.c.ZkTestServer Watch added: children: /solr/live_nodes
   [junit4]   2> 289620 INFO  (zkCallback-1384-thread-1) [    ] o.a.s.c.c.ZkStateReader Updated live nodes from ZooKeeper... (4) -> (5)
   [junit4]   2> 289620 DEBUG (SyncThread:0) [    ] o.a.s.c.ZkTestServer Watch added: children: /solr/live_nodes
   [junit4]   2> 289620 INFO  (zkCallback-1375-thread-1) [    ] o.a.s.c.c.ZkStateReader Updated live nodes from ZooKeeper... (4) -> (5)
   [junit4]   2> 289620 INFO  (zkCallback-1389-thread-1) [    ] o.a.s.c.c.ZkStateReader Updated live nodes from ZooKeeper... (4) -> (5)
   [junit4]   2> 289621 INFO  (zkCallback-1411-thread-1) [    ] o.a.s.c.c.ZkStateReader Updated live nodes from ZooKeeper... (4) -> (5)
   [junit4]   2> 289624 DEBUG (SyncThread:0) [    ] o.a.s.c.ZkTestServer Watch added: children: /solr/live_nodes
   [junit4]   2> 289624 INFO  (zkCallback-1436-thread-1) [    ] o.a.s.c.c.ZkStateReader Updated live nodes from ZooKeeper... (4) -> (5)
   [junit4]   2> 289636 INFO  (zkConnectionManagerCallback-1444-thread-1) [    ] o.a.s.c.c.ConnectionManager zkClient has connected
   [junit4]   2> 289642 DEBUG (SyncThread:0) [    ] o.a.s.c.ZkTestServer Watch added: create/delete: /solr/clusterprops.json
   [junit4]   2> 289643 DEBUG (SyncThread:0) [    ] o.a.s.c.ZkTestServer Watch added: children: /solr/live_nodes
   [junit4]   2> 289643 INFO  (TEST-MoveReplicaHDFSTest.test-seed#[B1ACEDADA04992E9]) [n:127.0.0.1:43957_solr    ] o.a.s.c.c.ZkStateReader Updated live nodes from ZooKeeper... (0) -> (5)
   [junit4]   2> 289643 DEBUG (SyncThread:0) [    ] o.a.s.c.ZkTestServer Watch added: data: /solr/clusterstate.json
   [junit4]   2> 289643 DEBUG (SyncThread:0) [    ] o.a.s.c.ZkTestServer Watch added: children: /solr/collections
   [junit4]   2> 289643 DEBUG (SyncThread:0) [    ] o.a.s.c.ZkTestServer Watch added: create/delete: /solr/aliases.json
   [junit4]   2> 289643 INFO  (TEST-MoveReplicaHDFSTest.test-seed#[B1ACEDADA04992E9]) [n:127.0.0.1:43957_solr    ] o.a.s.c.s.i.ZkClientClusterStateProvider Cluster at 127.0.0.1:39615/solr ready
   [junit4]   2> 289644 INFO  (TEST-MoveReplicaHDFSTest.test-seed#[B1ACEDADA04992E9]) [n:127.0.0.1:43957_solr    ] o.a.s.h.a.MetricsHistoryHandler No .system collection, keeping metrics history in memory.
   [junit4]   2> 289656 INFO  (TEST-MoveReplicaHDFSTest.test-seed#[B1ACEDADA04992E9]) [n:127.0.0.1:43957_solr    ] o.a.s.m.r.SolrJmxReporter JMX monitoring for 'solr_43957.solr.node' (registry 'solr.node') enabled at server: com.sun.jmx.mbeanserver.JmxMBeanServer@2aa02c07
   [junit4]   2> 289665 INFO  (TEST-MoveReplicaHDFSTest.test-seed#[B1ACEDADA04992E9]) [n:127.0.0.1:43957_solr    ] o.a.s.m.r.SolrJmxReporter JMX monitoring for 'solr_43957.solr.jvm' (registry 'solr.jvm') enabled at server: com.sun.jmx.mbeanserver.JmxMBeanServer@2aa02c07
   [junit4]   2> 289665 INFO  (TEST-MoveReplicaHDFSTest.test-seed#[B1ACEDADA04992E9]) [n:127.0.0.1:43957_solr    ] o.a.s.m.r.SolrJmxReporter JMX monitoring for 'solr_43957.solr.jetty' (registry 'solr.jetty') enabled at server: com.sun.jmx.mbeanserver.JmxMBeanServer@2aa02c07
   [junit4]   2> 289666 INFO  (TEST-MoveReplicaHDFSTest.test-seed#[B1ACEDADA04992E9]) [n:127.0.0.1:43957_solr    ] o.a.s.c.CorePropertiesLocator Found 0 core definitions underneath /home/jenkins/workspace/Lucene-Solr-master-Linux/solr/build/solr-core/test/J2/temp/solr.cloud.MoveReplicaHDFSTest_B1ACEDADA04992E9-001/tempDir-001/node5/.
   [junit4]   2> 289717 DEBUG (SyncThread:0) [    ] o.a.s.c.ZkTestServer Watch fired: children: /solr/overseer/queue
   [junit4]   2> 289718 DEBUG (SyncThread:0) [    ] o.a.s.c.ZkTestServer Watch added: children: /solr/overseer/queue
   [junit4]   2> 289746 INFO  (zkConnectionManagerCallback-1447-thread-1) [    ] o.a.s.c.c.ConnectionManager zkClient has connected
   [junit4]   2> 289746 INFO  (TEST-MoveReplicaHDFSTest.test-seed#[B1ACEDADA04992E9]) [    ] o.a.s.c.MoveReplicaTest total_jettys: 5
   [junit4]   2> 289748 INFO  (qtp849748009-4423) [n:127.0.0.1:33003_solr    ] o.a.s.h.a.CollectionsHandler Invoked Collection Action :create with params collection.configName=conf1&maxShardsPerNode=2&autoAddReplicas=false&name=MoveReplicaHDFSTest_coll_true&nrtReplicas=2&action=CREATE&numShards=2&wt=javabin&version=2 and sendToOCPQueue=true
   [junit4]   2> 289748 DEBUG (SyncThread:0) [    ] o.a.s.c.ZkTestServer Watch fired: children: /solr/overseer/collection-queue-work
   [junit4]   2> 289748 DEBUG (SyncThread:0) [    ] o.a.s.c.ZkTestServer Watch added: create/delete: /solr/overseer/collection-queue-work/qnr-0000000002
   [junit4]   2> 289748 DEBUG (SyncThread:0) [    ] o.a.s.c.ZkTestServer Watch added: children: /solr/overseer/collection-queue-work
   [junit4]   2> 289748 DEBUG (OverseerCollectionConfigSetProcessor-72076355814817800-127.0.0.1:45743_solr-n_0000000000) [    ] o.a.s.c.ZkDistributedQueue Found child node with improper name: qnr-0000000002
   [junit4]   2> 289749 DEBUG (SyncThread:0) [    ] o.a.s.c.ZkTestServer Watch fired: children: /solr/overseer/collection-queue-work
   [junit4]   2> 289749 DEBUG (SyncThread:0) [    ] o.a.s.c.ZkTestServer Watch added: children: /solr/overseer/collection-queue-work
   [junit4]   2> 289749 DEBUG (OverseerCollectionConfigSetProcessor-72076355814817800-127.0.0.1:45743_solr-n_0000000000) [    ] o.a.s.c.ZkDistributedQueue Found child node with improper name: qnr-0000000002
   [junit4]   2> 289749 DEBUG (OverseerCollectionConfigSetProcessor-72076355814817800-127.0.0.1:45743_solr-n_0000000000) [    ] o.a.s.c.OverseerTaskQueue Returning topN elements: [/overseer/collection-queue-work/qn-0000000002, ]
   [junit4]   2> 289749 DEBUG (OverseerCollectionConfigSetProcessor-72076355814817800-127.0.0.1:45743_solr-n_0000000000) [    ] o.a.s.c.OverseerTaskProcessor Got 1 tasks from work-queue : [[org.apache.solr.cloud.OverseerTaskQueue$QueueEvent@2e684ed1]]
   [junit4]   2> 289749 DEBUG (OverseerCollectionConfigSetProcessor-72076355814817800-127.0.0.1:45743_solr-n_0000000000) [    ] o.a.s.c.OverseerTaskProcessor Marked task [/overseer/collection-queue-work/qn-0000000002] as running
   [junit4]   2> 289749 DEBUG (OverseerCollectionConfigSetProcessor-72076355814817800-127.0.0.1:45743_solr-n_0000000000) [    ] o.a.s.c.OverseerTaskProcessor Overseer Collection Message Handler: Get the message id:/overseer/collection-queue-work/qn-0000000002 message:{
   [junit4]   2>   "name":"MoveReplicaHDFSTest_coll_true",
   [junit4]   2>   "fromApi":"true",
   [junit4]   2>   "collection.configName":"conf1",
   [junit4]   2>   "numShards":"2",
   [junit4]   2>   "maxShardsPerNode":"2",
   [junit4]   2>   "autoAddReplicas":"false",
   [junit4]   2>   "nrtReplicas":"2",
   [junit4]   2>   "stateFormat":"2",
   [junit4]   2>   "replicationFactor":"2",
   [junit4]   2>   "operation":"create"}
   [junit4]   2> 289749 DEBUG (OverseerThreadFactory-1941-thread-2) [    ] o.a.s.c.OverseerTaskProcessor Runner processing /overseer/collection-queue-work/qn-0000000002
   [junit4]   2> 289749 DEBUG (OverseerCollectionConfigSetProcessor-72076355814817800-127.0.0.1:45743_solr-n_0000000000) [    ] o.a.s.c.OverseerTaskProcessor Cleaning up work-queue. #Running tasks: 1
   [junit4]   2> 289749 DEBUG (OverseerThreadFactory-1941-thread-2) [    ] o.a.s.c.a.c.OverseerCollectionMessageHandler OverseerCollectionMessageHandler.processMessage : create , {
   [junit4]   2>   "name":"MoveReplicaHDFSTest_coll_true",
   [junit4]   2>   "fromApi":"true",
   [junit4]   2>   "collection.configName":"conf1",
   [junit4]   2>   "numShards":"2",
   [junit4]   2>   "maxShardsPerNode":"2",
   [junit4]   2>   "autoAddReplicas":"false",
   [junit4]   2>   "nrtReplicas":"2",
   [junit4]   2>   "stateFormat":"2",
   [junit4]   2>   "replicationFactor":"2",
   [junit4]   2>   "operation":"create"}
   [junit4]   2> 289749 DEBUG (OverseerCollectionConfigSetProcessor-72076355814817800-127.0.0.1:45743_solr-n_0000000000) [    ] o.a.s.c.OverseerTaskProcessor RunningTasks: [/overseer/collection-queue-work/qn-0000000002]
   [junit4]   2> 289749 DEBUG (OverseerCollectionConfigSetProcessor-72076355814817800-127.0.0.1:45743_solr-n_0000000000) [    ] o.a.s.c.OverseerTaskProcessor BlockedTasks: []
   [junit4]   2> 289749 INFO  (OverseerThreadFactory-1941-thread-2) [    ] o.a.s.c.a.c.CreateCollectionCmd Create collection MoveReplicaHDFSTest_coll_true
   [junit4]   2> 289749 DEBUG (OverseerCollectionConfigSetProcessor-72076355814817800-127.0.0.1:45743_solr-n_0000000000) [    ] o.a.s.c.OverseerTaskProcessor CompletedTasks: []
   [junit4]   2> 289749 DEBUG (OverseerCollectionConfigSetProcessor-72076355814817800-127.0.0.1:45743_solr-n_0000000000) [    ] o.a.s.c.OverseerTaskProcessor RunningZKTasks: [/overseer/collection-queue-work/qn-0000000002]
   [junit4]   2> 289749 DEBUG (OverseerCollectionConfigSetProcessor-72076355814817800-127.0.0.1:45743_solr-n_0000000000) [    ] o.a.s.c.OverseerTaskQueue Peeking for top 99 elements. ExcludeSet: [/overseer/collection-queue-work/qn-0000000002],[]
   [junit4]   2> 289750 DEBUG (OverseerThreadFactory-1941-thread-2) [    ] o.a.s.c.a.c.Assign Identify nodes using default
   [junit4]   2> 289750 DEBUG (OverseerThreadFactory-1941-thread-2) [    ] o.a.s.c.a.c.OverseerCollectionMessageHandler creating collections conf node /collections/MoveReplicaHDFSTest_coll_true 
   [junit4]   2> 289750 DEBUG (SyncThread:0) [    ] o.a.s.c.ZkTestServer Watch fired: children: /solr/collections
   [junit4]   2> 289750 DEBUG (SyncThread:0) [    ] o.a.s.c.ZkTestServer Watch fired: children: /solr/collections
   [junit4]   2> 289750 DEBUG (SyncThread:0) [    ] o.a.s.c.ZkTestServer Watch fired: children: /solr/collections
   [junit4]   2> 289750 DEBUG (SyncThread:0) [    ] o.a.s.c.ZkTestServer Watch fired: children: /solr/collections
   [junit4]   2> 289750 DEBUG (SyncThread:0) [    ] o.a.s.c.ZkTestServer Watch fired: children: /solr/collections
   [junit4]   2> 289750 DEBUG (SyncThread:0) [    ] o.a.s.c.ZkTestServer Watch fired: children: /solr/collections
   [junit4]   2> 289750 DEBUG (SyncThread:0) [    ] o.a.s.c.ZkTestServer Watch fired: children: /solr/collections
   [junit4]   2> 289750 DEBUG (SyncThread:0) [    ] o.a.s.c.ZkTestServer Watch fired: children: /solr/collections
   [junit4]   2> 289750 DEBUG (SyncThread:0) [    ] o.a.s.c.ZkTestServer Watch fired: children: /solr/collections
   [junit4]   2> 289750 DEBUG (SyncThread:0) [    ] o.a.s.c.ZkTestServer Watch fired: children: /solr/collections
   [junit4]   2> 289750 DEBUG (SyncThread:0) [    ] o.a.s.c.ZkTestServer Watch fired: children: /solr/collections
   [junit4]   2> 289750 DEBUG (SyncThread:0) [    ] o.a.s.c.ZkTestServer Watch added: children: /solr/collections
   [junit4]   2> 289751 DEBUG (SyncThread:0) [    ] o.a.s.c.ZkTestServer Watch added: children: /solr/collections
   [junit4]   2> 289751 DEBUG (SyncThread:0) [    ] o.a.s.c.ZkTestServer Watch added: children: /solr/collections
   [junit4]   2> 289751 DEBUG (SyncThread:0) [    ] o.a.s.c.ZkTestServer Watch added: children: /solr/collections
   [junit4]   2> 289751 DEBUG (SyncThread:0) [    ] o.a.s.c.ZkTestServer Watch added: children: /solr/collections
   [junit4]   2> 289751 DEBUG (SyncThread:0) [    ] o.a.s.c.ZkTestServer Watch added: children: /solr/collections
   [junit4]   2> 289751 DEBUG (SyncThread:0) [    ] o.a.s.c.ZkTestServer Watch added: children: /solr/collections
   [junit4]   2> 289751 DEBUG (SyncThread:0) [    ] o.a.s.c.ZkTestServer Watch added: children: /solr/collections
   [junit4]   2> 289751 DEBUG (SyncThread:0) [    ] o.a.s.c.ZkTestServer Watch added: children: /solr/collections
   [junit4]   2> 289751 DEBUG (OverseerThreadFactory-1941-thread-2) [    ] o.a.s.c.a.c.CreateCollectionCmd Check for collection zkNode:MoveReplicaHDFSTest_coll_true
   [junit4]   2> 289751 DEBUG (SyncThread:0) [    ] o.a.s.c.ZkTestServer Watch added: children: /solr/collections
   [junit4]   2> 289751 DEBUG (SyncThread:0) [    ] o.a.s.c.ZkTestServer Watch added: children: /solr/collections
   [junit4]   2> 289751 DEBUG (OverseerThreadFactory-1941-thread-2) [    ] o.a.s.c.a.c.CreateCollectionCmd Collection zkNode exists
   [junit4]   2> 289751 DEBUG (SyncThread:0) [    ] o.a.s.c.ZkTestServer Watch fired: children: /solr/overseer/queue
 

[...truncated too long message...]


ivy-fail:

ivy-configure:
[ivy:configure] :: loading settings :: file = /home/jenkins/workspace/Lucene-Solr-master-Linux/lucene/top-level-ivy-settings.xml

resolve:

common.init:

compile-lucene-core:

init:

-clover.disable:

-clover.load:

-clover.classpath:

-clover.setup:

clover:

compile-core:

-clover.disable:

-clover.load:

-clover.classpath:

-clover.setup:

clover:

common.compile-core:

compile-core:

common.compile-test:
    [mkdir] Created dir: /home/jenkins/workspace/Lucene-Solr-master-Linux/solr/build/solr-core/classes/test
    [javac] Compiling 919 source files to /home/jenkins/workspace/Lucene-Solr-master-Linux/solr/build/solr-core/classes/test
    [javac] Note: Some input files use or override a deprecated API.
    [javac] Note: Recompile with -Xlint:deprecation for details.
    [javac] Note: Some input files use unchecked or unsafe operations.
    [javac] Note: Recompile with -Xlint:unchecked for details.
    [javac] Creating empty /home/jenkins/workspace/Lucene-Solr-master-Linux/solr/build/solr-core/classes/test/org/apache/solr/cloud/autoscaling/sim/package-info.class
     [copy] Copying 1 file to /home/jenkins/workspace/Lucene-Solr-master-Linux/solr/build/solr-core/classes/test

common-solr.compile-test:

compile-test:

BUILD SUCCESSFUL
Total time: 48 seconds
[repro] ant test-nocompile -Dtests.dups=5 -Dtests.maxfailures=5 -Dtests.class="*.MoveReplicaHDFSTest" -Dtests.showOutput=onerror "-Dargs=-XX:-UseCompressedOops -XX:+UseG1GC" -Dtests.seed=B1ACEDADA04992E9 -Dtests.multiplier=3 -Dtests.slow=true -Dtests.locale=th-TH -Dtests.timezone=Antarctica/DumontDUrville -Dtests.asserts=true -Dtests.file.encoding=UTF-8
Buildfile: /home/jenkins/workspace/Lucene-Solr-master-Linux/solr/core/build.xml

-clover.disable:

ivy-configure:
[ivy:configure] :: Apache Ivy 2.4.0 - 20141213170938 :: http://ant.apache.org/ivy/ ::
[ivy:configure] :: loading settings :: file = /home/jenkins/workspace/Lucene-Solr-master-Linux/lucene/top-level-ivy-settings.xml

install-junit4-taskdef:

ivy-availability-check:
[loadresource] Do not set property disallowed.ivy.jars.list as its length is 0.

-ivy-fail-disallowed-ivy-version:

ivy-fail:

resolve-groovy:
[ivy:cachepath] :: resolving dependencies :: org.codehaus.groovy#groovy-all-caller;working
[ivy:cachepath] 	confs: [default]
[ivy:cachepath] 	found org.codehaus.groovy#groovy-all;2.4.15 in public
[ivy:cachepath] :: resolution report :: resolve 13ms :: artifacts dl 0ms
	---------------------------------------------------------------------
	|                  |            modules            ||   artifacts   |
	|       conf       | number| search|dwnlded|evicted|| number|dwnlded|
	---------------------------------------------------------------------
	|      default     |   1   |   0   |   0   |   0   ||   1   |   0   |
	---------------------------------------------------------------------

-init-totals:

-test:
    [mkdir] Created dir: /home/jenkins/workspace/Lucene-Solr-master-Linux/solr/build/solr-core/test
[junit4:pickseed] Seed property 'tests.seed' already defined: B1ACEDADA04992E9
    [mkdir] Created dir: /home/jenkins/workspace/Lucene-Solr-master-Linux/solr/build/solr-core/test/temp
   [junit4] <JUnit4> says kaixo! Master seed: B1ACEDADA04992E9
   [junit4] Executing 5 suites with 3 JVMs.
   [junit4] 
   [junit4] Started J1 PID(14507@serv1.sd-datasolutions.de).
   [junit4] Started J2 PID(14506@serv1.sd-datasolutions.de).
   [junit4] Started J0 PID(14508@serv1.sd-datasolutions.de).
   [junit4] Suite: org.apache.solr.cloud.MoveReplicaHDFSTest
   [junit4] OK      28.9s J0 | MoveReplicaHDFSTest.test
   [junit4] OK      17.4s J0 | MoveReplicaHDFSTest.testNormalMove
   [junit4] OK      15.7s J0 | MoveReplicaHDFSTest.testFailedMove
   [junit4] OK      11.4s J0 | MoveReplicaHDFSTest.testNormalFailedMove
   [junit4] Completed [1/5] on J0 in 95.74s, 4 tests
   [junit4] 
   [junit4] Suite: org.apache.solr.cloud.MoveReplicaHDFSTest
   [junit4] OK      30.5s J1 | MoveReplicaHDFSTest.test
   [junit4] OK      17.3s J1 | MoveReplicaHDFSTest.testNormalMove
   [junit4] OK      16.3s J1 | MoveReplicaHDFSTest.testFailedMove
   [junit4] OK      12.2s J1 | MoveReplicaHDFSTest.testNormalFailedMove
   [junit4] Completed [2/5] on J1 in 100.43s, 4 tests
   [junit4] 
   [junit4] Duplicate suite name used with XML reports: org.apache.solr.cloud.MoveReplicaHDFSTest. This may confuse tools that process XML reports. Set 'ignoreDuplicateSuites' to true to skip this message.
   [junit4] Suite: org.apache.solr.cloud.MoveReplicaHDFSTest
   [junit4] OK      30.4s J2 | MoveReplicaHDFSTest.test
   [junit4] OK      21.1s J2 | MoveReplicaHDFSTest.testNormalMove
   [junit4] OK      13.0s J2 | MoveReplicaHDFSTest.testFailedMove
   [junit4] OK      12.1s J2 | MoveReplicaHDFSTest.testNormalFailedMove
   [junit4] Completed [3/5] on J2 in 100.58s, 4 tests
   [junit4] 
   [junit4] Suite: org.apache.solr.cloud.MoveReplicaHDFSTest
   [junit4] OK      29.0s J0 | MoveReplicaHDFSTest.test
   [junit4] OK      17.1s J0 | MoveReplicaHDFSTest.testNormalMove
   [junit4] OK      32.9s J0 | MoveReplicaHDFSTest.testFailedMove
   [junit4] OK      11.0s J0 | MoveReplicaHDFSTest.testNormalFailedMove
   [junit4] Completed [4/5] on J0 in 104.19s, 4 tests
   [junit4] 
   [junit4] Suite: org.apache.solr.cloud.MoveReplicaHDFSTest
   [junit4] OK      28.8s J1 | MoveReplicaHDFSTest.test
   [junit4] OK      18.9s J1 | MoveReplicaHDFSTest.testNormalMove
   [junit4] OK      32.9s J1 | MoveReplicaHDFSTest.testFailedMove
   [junit4] OK      11.0s J1 | MoveReplicaHDFSTest.testNormalFailedMove
   [junit4] Completed [5/5] on J1 in 106.01s, 4 tests
   [junit4] 
   [junit4] JVM J0:     0.39 ..   201.52 =   201.13s
   [junit4] JVM J1:     0.38 ..   207.96 =   207.57s
   [junit4] JVM J2:     0.38 ..   101.64 =   101.25s
   [junit4] Execution time total: 3 minutes 27 seconds
   [junit4] Tests summary: 5 suites, 20 tests
   [junit4] Could not remove temporary path: /home/jenkins/workspace/Lucene-Solr-master-Linux/solr/build/solr-core/test/J1 (java.nio.file.DirectoryNotEmptyException: Remaining files: [/home/jenkins/workspace/Lucene-Solr-master-Linux/solr/build/solr-core/test/J1/temp])
   [junit4] Could not remove temporary path: /home/jenkins/workspace/Lucene-Solr-master-Linux/solr/build/solr-core/test/J0 (java.nio.file.DirectoryNotEmptyException: Remaining files: [/home/jenkins/workspace/Lucene-Solr-master-Linux/solr/build/solr-core/test/J0/temp])
   [junit4] Could not remove temporary path: /home/jenkins/workspace/Lucene-Solr-master-Linux/solr/build/solr-core/test/J2 (java.nio.file.DirectoryNotEmptyException: Remaining files: [/home/jenkins/workspace/Lucene-Solr-master-Linux/solr/build/solr-core/test/J2/temp])
     [echo] 5 slowest tests:
[junit4:tophints] 127.97s | org.apache.solr.search.TestStressRecovery
[junit4:tophints] 116.41s | org.apache.solr.update.SoftAutoCommitTest
[junit4:tophints] 111.25s | org.apache.solr.cloud.ZkFailoverTest
[junit4:tophints]  98.06s | org.apache.solr.cloud.MoveReplicaHDFSTest
[junit4:tophints]  97.97s | org.apache.solr.cloud.TestTlogReplica

-check-totals:

test-nocompile:

BUILD SUCCESSFUL
Total time: 3 minutes 29 seconds
[repro] Failures:
[repro]   0/5 failed: org.apache.solr.cloud.MoveReplicaHDFSTest
[repro] Exiting with code 0
+ mv lucene/build lucene/build.repro
+ mv solr/build solr/build.repro
+ mv lucene/build.orig lucene/build
+ mv solr/build.orig solr/build
Archiving artifacts
Setting ANT_1_8_2_HOME=/var/lib/jenkins/tools/hudson.tasks.Ant_AntInstallation/ANT_1.8.2
java.lang.InterruptedException: no matches found within 10000
	at hudson.FilePath$ValidateAntFileMask.hasMatch(FilePath.java:2843)
	at hudson.FilePath$ValidateAntFileMask.invoke(FilePath.java:2722)
	at hudson.FilePath$ValidateAntFileMask.invoke(FilePath.java:2703)
	at hudson.FilePath.act(FilePath.java:1095)
	at hudson.FilePath.act(FilePath.java:1078)
	at hudson.FilePath.validateAntFileMask(FilePath.java:2701)
	at hudson.tasks.ArtifactArchiver.perform(ArtifactArchiver.java:243)
	at hudson.tasks.BuildStepCompatibilityLayer.perform(BuildStepCompatibilityLayer.java:81)
	at hudson.tasks.BuildStepMonitor$1.perform(BuildStepMonitor.java:20)
	at hudson.model.AbstractBuild$AbstractBuildExecution.perform(AbstractBuild.java:744)
	at hudson.model.AbstractBuild$AbstractBuildExecution.performAllBuildSteps(AbstractBuild.java:690)
	at hudson.model.Build$BuildExecution.post2(Build.java:186)
	at hudson.model.AbstractBuild$AbstractBuildExecution.post(AbstractBuild.java:635)
	at hudson.model.Run.execute(Run.java:1840)
	at hudson.model.FreeStyleBuild.run(FreeStyleBuild.java:43)
	at hudson.model.ResourceController.execute(ResourceController.java:97)
	at hudson.model.Executor.run(Executor.java:429)
No artifacts found that match the file pattern "**/*.events,heapdumps/**,**/*_pid*.log". Configuration error?
[WARNINGS] Parsing warnings in console log with parser Java Compiler (javac)
Setting ANT_1_8_2_HOME=/var/lib/jenkins/tools/hudson.tasks.Ant_AntInstallation/ANT_1.8.2
Setting ANT_1_8_2_HOME=/var/lib/jenkins/tools/hudson.tasks.Ant_AntInstallation/ANT_1.8.2
<Git Blamer> Using GitBlamer to create author and commit information for all warnings.
<Git Blamer> GIT_COMMIT=fa3cd86de8fa11a2cfb5b3db0a46c83c5b6a980b, workspace=/var/lib/jenkins/workspace/Lucene-Solr-master-Linux
[WARNINGS] Computing warning deltas based on reference build #22392
Recording test results
Setting ANT_1_8_2_HOME=/var/lib/jenkins/tools/hudson.tasks.Ant_AntInstallation/ANT_1.8.2
Build step 'Publish JUnit test result report' changed build result to UNSTABLE
Email was triggered for: Unstable (Test Failures)
Sending email for trigger: Unstable (Test Failures)
Setting ANT_1_8_2_HOME=/var/lib/jenkins/tools/hudson.tasks.Ant_AntInstallation/ANT_1.8.2
Setting ANT_1_8_2_HOME=/var/lib/jenkins/tools/hudson.tasks.Ant_AntInstallation/ANT_1.8.2
Setting ANT_1_8_2_HOME=/var/lib/jenkins/tools/hudson.tasks.Ant_AntInstallation/ANT_1.8.2
Setting ANT_1_8_2_HOME=/var/lib/jenkins/tools/hudson.tasks.Ant_AntInstallation/ANT_1.8.2

Mime
View raw message