lucene-dev mailing list archives

Site index · List index
Message view « Date » · « Thread »
Top « Date » · « Thread »
From Policeman Jenkins Server <jenk...@thetaphi.de>
Subject [JENKINS-EA] Lucene-Solr-master-Windows (64bit/jdk-11-ea+22) - Build # 7418 - Still Unstable!
Date Sun, 15 Jul 2018 09:01:27 GMT
Build: https://jenkins.thetaphi.de/job/Lucene-Solr-master-Windows/7418/
Java: 64bit/jdk-11-ea+22 -XX:-UseCompressedOops -XX:+UseG1GC

17 tests failed.
FAILED:  junit.framework.TestSuite.org.apache.solr.OutputWriterTest

Error Message:
Could not remove the following files (in the order of attempts):    C:\Users\jenkins\workspace\Lucene-Solr-master-Windows\solr\build\solr-core\test\J1\temp\solr.OutputWriterTest_46E036155C41E5C0-001\init-core-data-001: java.nio.file.AccessDeniedException: C:\Users\jenkins\workspace\Lucene-Solr-master-Windows\solr\build\solr-core\test\J1\temp\solr.OutputWriterTest_46E036155C41E5C0-001\init-core-data-001 

Stack Trace:
java.io.IOException: Could not remove the following files (in the order of attempts):
   C:\Users\jenkins\workspace\Lucene-Solr-master-Windows\solr\build\solr-core\test\J1\temp\solr.OutputWriterTest_46E036155C41E5C0-001\init-core-data-001: java.nio.file.AccessDeniedException: C:\Users\jenkins\workspace\Lucene-Solr-master-Windows\solr\build\solr-core\test\J1\temp\solr.OutputWriterTest_46E036155C41E5C0-001\init-core-data-001

	at __randomizedtesting.SeedInfo.seed([46E036155C41E5C0]:0)
	at org.apache.lucene.util.IOUtils.rm(IOUtils.java:318)
	at org.apache.lucene.util.TestRuleTemporaryFilesCleanup.afterAlways(TestRuleTemporaryFilesCleanup.java:216)
	at com.carrotsearch.randomizedtesting.rules.TestRuleAdapter$1.afterAlways(TestRuleAdapter.java:31)
	at com.carrotsearch.randomizedtesting.rules.StatementAdapter.evaluate(StatementAdapter.java:43)
	at com.carrotsearch.randomizedtesting.rules.StatementAdapter.evaluate(StatementAdapter.java:36)
	at org.apache.lucene.util.TestRuleAssertionsRequired$1.evaluate(TestRuleAssertionsRequired.java:53)
	at org.apache.lucene.util.TestRuleMarkFailure$1.evaluate(TestRuleMarkFailure.java:47)
	at org.apache.lucene.util.TestRuleIgnoreAfterMaxFailures$1.evaluate(TestRuleIgnoreAfterMaxFailures.java:64)
	at org.apache.lucene.util.TestRuleIgnoreTestSuites$1.evaluate(TestRuleIgnoreTestSuites.java:54)
	at com.carrotsearch.randomizedtesting.rules.StatementAdapter.evaluate(StatementAdapter.java:36)
	at com.carrotsearch.randomizedtesting.ThreadLeakControl$StatementRunner.run(ThreadLeakControl.java:368)
	at java.base/java.lang.Thread.run(Thread.java:834)


FAILED:  org.apache.solr.TestDistributedSearch.test

Error Message:
Expected to find shardAddress in the up shard info: {error=org.apache.solr.client.solrj.SolrServerException: Time allowed to handle this request exceeded,trace=org.apache.solr.client.solrj.SolrServerException: Time allowed to handle this request exceeded  at org.apache.solr.client.solrj.impl.LBHttpSolrClient.request(LBHttpSolrClient.java:460)  at org.apache.solr.handler.component.HttpShardHandlerFactory.makeLoadBalancedRequest(HttpShardHandlerFactory.java:279)  at org.apache.solr.handler.component.HttpShardHandler.lambda$submit$0(HttpShardHandler.java:175)  at java.base/java.util.concurrent.FutureTask.run(FutureTask.java:264)  at java.base/java.util.concurrent.Executors$RunnableAdapter.call(Executors.java:515)  at java.base/java.util.concurrent.FutureTask.run(FutureTask.java:264)  at com.codahale.metrics.InstrumentedExecutorService$InstrumentedRunnable.run(InstrumentedExecutorService.java:176)  at org.apache.solr.common.util.ExecutorUtil$MDCAwareThreadPoolExecutor.lambda$execute$0(ExecutorUtil.java:209)  at java.base/java.util.concurrent.ThreadPoolExecutor.runWorker(ThreadPoolExecutor.java:1128)  at java.base/java.util.concurrent.ThreadPoolExecutor$Worker.run(ThreadPoolExecutor.java:628)  at java.base/java.lang.Thread.run(Thread.java:834) ,time=1}

Stack Trace:
java.lang.AssertionError: Expected to find shardAddress in the up shard info: {error=org.apache.solr.client.solrj.SolrServerException: Time allowed to handle this request exceeded,trace=org.apache.solr.client.solrj.SolrServerException: Time allowed to handle this request exceeded
	at org.apache.solr.client.solrj.impl.LBHttpSolrClient.request(LBHttpSolrClient.java:460)
	at org.apache.solr.handler.component.HttpShardHandlerFactory.makeLoadBalancedRequest(HttpShardHandlerFactory.java:279)
	at org.apache.solr.handler.component.HttpShardHandler.lambda$submit$0(HttpShardHandler.java:175)
	at java.base/java.util.concurrent.FutureTask.run(FutureTask.java:264)
	at java.base/java.util.concurrent.Executors$RunnableAdapter.call(Executors.java:515)
	at java.base/java.util.concurrent.FutureTask.run(FutureTask.java:264)
	at com.codahale.metrics.InstrumentedExecutorService$InstrumentedRunnable.run(InstrumentedExecutorService.java:176)
	at org.apache.solr.common.util.ExecutorUtil$MDCAwareThreadPoolExecutor.lambda$execute$0(ExecutorUtil.java:209)
	at java.base/java.util.concurrent.ThreadPoolExecutor.runWorker(ThreadPoolExecutor.java:1128)
	at java.base/java.util.concurrent.ThreadPoolExecutor$Worker.run(ThreadPoolExecutor.java:628)
	at java.base/java.lang.Thread.run(Thread.java:834)
,time=1}
	at __randomizedtesting.SeedInfo.seed([46E036155C41E5C0:CEB409CFF2BD8838]:0)
	at org.junit.Assert.fail(Assert.java:93)
	at org.junit.Assert.assertTrue(Assert.java:43)
	at org.apache.solr.TestDistributedSearch.comparePartialResponses(TestDistributedSearch.java:1192)
	at org.apache.solr.TestDistributedSearch.queryPartialResults(TestDistributedSearch.java:1133)
	at org.apache.solr.TestDistributedSearch.test(TestDistributedSearch.java:993)
	at java.base/jdk.internal.reflect.NativeMethodAccessorImpl.invoke0(Native Method)
	at java.base/jdk.internal.reflect.NativeMethodAccessorImpl.invoke(NativeMethodAccessorImpl.java:62)
	at java.base/jdk.internal.reflect.DelegatingMethodAccessorImpl.invoke(DelegatingMethodAccessorImpl.java:43)
	at java.base/java.lang.reflect.Method.invoke(Method.java:566)
	at com.carrotsearch.randomizedtesting.RandomizedRunner.invoke(RandomizedRunner.java:1737)
	at com.carrotsearch.randomizedtesting.RandomizedRunner$8.evaluate(RandomizedRunner.java:934)
	at com.carrotsearch.randomizedtesting.RandomizedRunner$9.evaluate(RandomizedRunner.java:970)
	at com.carrotsearch.randomizedtesting.RandomizedRunner$10.evaluate(RandomizedRunner.java:984)
	at org.apache.solr.BaseDistributedSearchTestCase$ShardsRepeatRule$ShardsRepeatStatement.callStatement(BaseDistributedSearchTestCase.java:1034)
	at org.apache.solr.BaseDistributedSearchTestCase$ShardsRepeatRule$ShardsStatement.evaluate(BaseDistributedSearchTestCase.java:983)
	at com.carrotsearch.randomizedtesting.rules.SystemPropertiesRestoreRule$1.evaluate(SystemPropertiesRestoreRule.java:57)
	at org.apache.lucene.util.TestRuleSetupTeardownChained$1.evaluate(TestRuleSetupTeardownChained.java:49)
	at org.apache.lucene.util.AbstractBeforeAfterRule$1.evaluate(AbstractBeforeAfterRule.java:45)
	at org.apache.lucene.util.TestRuleThreadAndTestName$1.evaluate(TestRuleThreadAndTestName.java:48)
	at org.apache.lucene.util.TestRuleIgnoreAfterMaxFailures$1.evaluate(TestRuleIgnoreAfterMaxFailures.java:64)
	at org.apache.lucene.util.TestRuleMarkFailure$1.evaluate(TestRuleMarkFailure.java:47)
	at com.carrotsearch.randomizedtesting.rules.StatementAdapter.evaluate(StatementAdapter.java:36)
	at com.carrotsearch.randomizedtesting.ThreadLeakControl$StatementRunner.run(ThreadLeakControl.java:368)
	at com.carrotsearch.randomizedtesting.ThreadLeakControl.forkTimeoutingTask(ThreadLeakControl.java:817)
	at com.carrotsearch.randomizedtesting.ThreadLeakControl$3.evaluate(ThreadLeakControl.java:468)
	at com.carrotsearch.randomizedtesting.RandomizedRunner.runSingleTest(RandomizedRunner.java:943)
	at com.carrotsearch.randomizedtesting.RandomizedRunner$5.evaluate(RandomizedRunner.java:829)
	at com.carrotsearch.randomizedtesting.RandomizedRunner$6.evaluate(RandomizedRunner.java:879)
	at com.carrotsearch.randomizedtesting.RandomizedRunner$7.evaluate(RandomizedRunner.java:890)
	at com.carrotsearch.randomizedtesting.rules.StatementAdapter.evaluate(StatementAdapter.java:36)
	at com.carrotsearch.randomizedtesting.rules.SystemPropertiesRestoreRule$1.evaluate(SystemPropertiesRestoreRule.java:57)
	at org.apache.lucene.util.AbstractBeforeAfterRule$1.evaluate(AbstractBeforeAfterRule.java:45)
	at com.carrotsearch.randomizedtesting.rules.StatementAdapter.evaluate(StatementAdapter.java:36)
	at org.apache.lucene.util.TestRuleStoreClassName$1.evaluate(TestRuleStoreClassName.java:41)
	at com.carrotsearch.randomizedtesting.rules.NoShadowingOrOverridesOnMethodsRule$1.evaluate(NoShadowingOrOverridesOnMethodsRule.java:40)
	at com.carrotsearch.randomizedtesting.rules.NoShadowingOrOverridesOnMethodsRule$1.evaluate(NoShadowingOrOverridesOnMethodsRule.java:40)
	at com.carrotsearch.randomizedtesting.rules.StatementAdapter.evaluate(StatementAdapter.java:36)
	at com.carrotsearch.randomizedtesting.rules.StatementAdapter.evaluate(StatementAdapter.java:36)
	at org.apache.lucene.util.TestRuleAssertionsRequired$1.evaluate(TestRuleAssertionsRequired.java:53)
	at org.apache.lucene.util.TestRuleMarkFailure$1.evaluate(TestRuleMarkFailure.java:47)
	at org.apache.lucene.util.TestRuleIgnoreAfterMaxFailures$1.evaluate(TestRuleIgnoreAfterMaxFailures.java:64)
	at org.apache.lucene.util.TestRuleIgnoreTestSuites$1.evaluate(TestRuleIgnoreTestSuites.java:54)
	at com.carrotsearch.randomizedtesting.rules.StatementAdapter.evaluate(StatementAdapter.java:36)
	at com.carrotsearch.randomizedtesting.ThreadLeakControl$StatementRunner.run(ThreadLeakControl.java:368)
	at java.base/java.lang.Thread.run(Thread.java:834)


FAILED:  junit.framework.TestSuite.org.apache.solr.core.TestConfigSetImmutable

Error Message:
Could not remove the following files (in the order of attempts):    C:\Users\jenkins\workspace\Lucene-Solr-master-Windows\solr\build\solr-core\test\J0\temp\solr.core.TestConfigSetImmutable_46E036155C41E5C0-001\tempDir-009\cores\core: java.nio.file.DirectoryNotEmptyException: C:\Users\jenkins\workspace\Lucene-Solr-master-Windows\solr\build\solr-core\test\J0\temp\solr.core.TestConfigSetImmutable_46E036155C41E5C0-001\tempDir-009\cores\core    C:\Users\jenkins\workspace\Lucene-Solr-master-Windows\solr\build\solr-core\test\J0\temp\solr.core.TestConfigSetImmutable_46E036155C41E5C0-001\tempDir-009\cores: java.nio.file.DirectoryNotEmptyException: C:\Users\jenkins\workspace\Lucene-Solr-master-Windows\solr\build\solr-core\test\J0\temp\solr.core.TestConfigSetImmutable_46E036155C41E5C0-001\tempDir-009\cores    C:\Users\jenkins\workspace\Lucene-Solr-master-Windows\solr\build\solr-core\test\J0\temp\solr.core.TestConfigSetImmutable_46E036155C41E5C0-001\tempDir-009: java.nio.file.DirectoryNotEmptyException: C:\Users\jenkins\workspace\Lucene-Solr-master-Windows\solr\build\solr-core\test\J0\temp\solr.core.TestConfigSetImmutable_46E036155C41E5C0-001\tempDir-009 

Stack Trace:
java.io.IOException: Could not remove the following files (in the order of attempts):
   C:\Users\jenkins\workspace\Lucene-Solr-master-Windows\solr\build\solr-core\test\J0\temp\solr.core.TestConfigSetImmutable_46E036155C41E5C0-001\tempDir-009\cores\core: java.nio.file.DirectoryNotEmptyException: C:\Users\jenkins\workspace\Lucene-Solr-master-Windows\solr\build\solr-core\test\J0\temp\solr.core.TestConfigSetImmutable_46E036155C41E5C0-001\tempDir-009\cores\core
   C:\Users\jenkins\workspace\Lucene-Solr-master-Windows\solr\build\solr-core\test\J0\temp\solr.core.TestConfigSetImmutable_46E036155C41E5C0-001\tempDir-009\cores: java.nio.file.DirectoryNotEmptyException: C:\Users\jenkins\workspace\Lucene-Solr-master-Windows\solr\build\solr-core\test\J0\temp\solr.core.TestConfigSetImmutable_46E036155C41E5C0-001\tempDir-009\cores
   C:\Users\jenkins\workspace\Lucene-Solr-master-Windows\solr\build\solr-core\test\J0\temp\solr.core.TestConfigSetImmutable_46E036155C41E5C0-001\tempDir-009: java.nio.file.DirectoryNotEmptyException: C:\Users\jenkins\workspace\Lucene-Solr-master-Windows\solr\build\solr-core\test\J0\temp\solr.core.TestConfigSetImmutable_46E036155C41E5C0-001\tempDir-009

	at __randomizedtesting.SeedInfo.seed([46E036155C41E5C0]:0)
	at org.apache.lucene.util.IOUtils.rm(IOUtils.java:318)
	at org.apache.lucene.util.TestRuleTemporaryFilesCleanup.afterAlways(TestRuleTemporaryFilesCleanup.java:216)
	at com.carrotsearch.randomizedtesting.rules.TestRuleAdapter$1.afterAlways(TestRuleAdapter.java:31)
	at com.carrotsearch.randomizedtesting.rules.StatementAdapter.evaluate(StatementAdapter.java:43)
	at com.carrotsearch.randomizedtesting.rules.StatementAdapter.evaluate(StatementAdapter.java:36)
	at org.apache.lucene.util.TestRuleAssertionsRequired$1.evaluate(TestRuleAssertionsRequired.java:53)
	at org.apache.lucene.util.TestRuleMarkFailure$1.evaluate(TestRuleMarkFailure.java:47)
	at org.apache.lucene.util.TestRuleIgnoreAfterMaxFailures$1.evaluate(TestRuleIgnoreAfterMaxFailures.java:64)
	at org.apache.lucene.util.TestRuleIgnoreTestSuites$1.evaluate(TestRuleIgnoreTestSuites.java:54)
	at com.carrotsearch.randomizedtesting.rules.StatementAdapter.evaluate(StatementAdapter.java:36)
	at com.carrotsearch.randomizedtesting.ThreadLeakControl$StatementRunner.run(ThreadLeakControl.java:368)
	at java.base/java.lang.Thread.run(Thread.java:834)


FAILED:  org.apache.solr.handler.TestSQLHandler.doTest

Error Message:
--> http://127.0.0.1:64529/s_toi/po/collection1_shard2_replica_n41:Failed to execute sqlQuery 'select id, field_i, str_s from collection1 where (text='(XXXX)' OR text='XXXX') AND text='XXXX' order by field_i desc' against JDBC connection 'jdbc:calcitesolr:'. Error while executing SQL "select id, field_i, str_s from collection1 where (text='(XXXX)' OR text='XXXX') AND text='XXXX' order by field_i desc": java.io.IOException: java.util.concurrent.ExecutionException: java.io.IOException: --> http://127.0.0.1:64529/s_toi/po/collection1_shard2_replica_n41/:id must have DocValues to use this feature.

Stack Trace:
java.io.IOException: --> http://127.0.0.1:64529/s_toi/po/collection1_shard2_replica_n41:Failed to execute sqlQuery 'select id, field_i, str_s from collection1 where (text='(XXXX)' OR text='XXXX') AND text='XXXX' order by field_i desc' against JDBC connection 'jdbc:calcitesolr:'.
Error while executing SQL "select id, field_i, str_s from collection1 where (text='(XXXX)' OR text='XXXX') AND text='XXXX' order by field_i desc": java.io.IOException: java.util.concurrent.ExecutionException: java.io.IOException: --> http://127.0.0.1:64529/s_toi/po/collection1_shard2_replica_n41/:id must have DocValues to use this feature.
	at __randomizedtesting.SeedInfo.seed([46E036155C41E5C0:E1A48EB131FAF679]:0)
	at org.apache.solr.client.solrj.io.stream.SolrStream.read(SolrStream.java:217)
	at org.apache.solr.handler.TestSQLHandler.getTuples(TestSQLHandler.java:2523)
	at org.apache.solr.handler.TestSQLHandler.testBasicSelect(TestSQLHandler.java:125)
	at org.apache.solr.handler.TestSQLHandler.doTest(TestSQLHandler.java:83)
	at java.base/jdk.internal.reflect.NativeMethodAccessorImpl.invoke0(Native Method)
	at java.base/jdk.internal.reflect.NativeMethodAccessorImpl.invoke(NativeMethodAccessorImpl.java:62)
	at java.base/jdk.internal.reflect.DelegatingMethodAccessorImpl.invoke(DelegatingMethodAccessorImpl.java:43)
	at java.base/java.lang.reflect.Method.invoke(Method.java:566)
	at com.carrotsearch.randomizedtesting.RandomizedRunner.invoke(RandomizedRunner.java:1737)
	at com.carrotsearch.randomizedtesting.RandomizedRunner$8.evaluate(RandomizedRunner.java:934)
	at com.carrotsearch.randomizedtesting.RandomizedRunner$9.evaluate(RandomizedRunner.java:970)
	at com.carrotsearch.randomizedtesting.RandomizedRunner$10.evaluate(RandomizedRunner.java:984)
	at org.apache.solr.BaseDistributedSearchTestCase$ShardsRepeatRule$ShardsFixedStatement.callStatement(BaseDistributedSearchTestCase.java:1008)
	at org.apache.solr.BaseDistributedSearchTestCase$ShardsRepeatRule$ShardsStatement.evaluate(BaseDistributedSearchTestCase.java:983)
	at com.carrotsearch.randomizedtesting.rules.SystemPropertiesRestoreRule$1.evaluate(SystemPropertiesRestoreRule.java:57)
	at org.apache.lucene.util.TestRuleSetupTeardownChained$1.evaluate(TestRuleSetupTeardownChained.java:49)
	at org.apache.lucene.util.AbstractBeforeAfterRule$1.evaluate(AbstractBeforeAfterRule.java:45)
	at org.apache.lucene.util.TestRuleThreadAndTestName$1.evaluate(TestRuleThreadAndTestName.java:48)
	at org.apache.lucene.util.TestRuleIgnoreAfterMaxFailures$1.evaluate(TestRuleIgnoreAfterMaxFailures.java:64)
	at org.apache.lucene.util.TestRuleMarkFailure$1.evaluate(TestRuleMarkFailure.java:47)
	at com.carrotsearch.randomizedtesting.rules.StatementAdapter.evaluate(StatementAdapter.java:36)
	at com.carrotsearch.randomizedtesting.ThreadLeakControl$StatementRunner.run(ThreadLeakControl.java:368)
	at com.carrotsearch.randomizedtesting.ThreadLeakControl.forkTimeoutingTask(ThreadLeakControl.java:817)
	at com.carrotsearch.randomizedtesting.ThreadLeakControl$3.evaluate(ThreadLeakControl.java:468)
	at com.carrotsearch.randomizedtesting.RandomizedRunner.runSingleTest(RandomizedRunner.java:943)
	at com.carrotsearch.randomizedtesting.RandomizedRunner$5.evaluate(RandomizedRunner.java:829)
	at com.carrotsearch.randomizedtesting.RandomizedRunner$6.evaluate(RandomizedRunner.java:879)
	at com.carrotsearch.randomizedtesting.RandomizedRunner$7.evaluate(RandomizedRunner.java:890)
	at com.carrotsearch.randomizedtesting.rules.StatementAdapter.evaluate(StatementAdapter.java:36)
	at com.carrotsearch.randomizedtesting.rules.SystemPropertiesRestoreRule$1.evaluate(SystemPropertiesRestoreRule.java:57)
	at org.apache.lucene.util.AbstractBeforeAfterRule$1.evaluate(AbstractBeforeAfterRule.java:45)
	at com.carrotsearch.randomizedtesting.rules.StatementAdapter.evaluate(StatementAdapter.java:36)
	at org.apache.lucene.util.TestRuleStoreClassName$1.evaluate(TestRuleStoreClassName.java:41)
	at com.carrotsearch.randomizedtesting.rules.NoShadowingOrOverridesOnMethodsRule$1.evaluate(NoShadowingOrOverridesOnMethodsRule.java:40)
	at com.carrotsearch.randomizedtesting.rules.NoShadowingOrOverridesOnMethodsRule$1.evaluate(NoShadowingOrOverridesOnMethodsRule.java:40)
	at com.carrotsearch.randomizedtesting.rules.StatementAdapter.evaluate(StatementAdapter.java:36)
	at com.carrotsearch.randomizedtesting.rules.StatementAdapter.evaluate(StatementAdapter.java:36)
	at org.apache.lucene.util.TestRuleAssertionsRequired$1.evaluate(TestRuleAssertionsRequired.java:53)
	at org.apache.lucene.util.TestRuleMarkFailure$1.evaluate(TestRuleMarkFailure.java:47)
	at org.apache.lucene.util.TestRuleIgnoreAfterMaxFailures$1.evaluate(TestRuleIgnoreAfterMaxFailures.java:64)
	at org.apache.lucene.util.TestRuleIgnoreTestSuites$1.evaluate(TestRuleIgnoreTestSuites.java:54)
	at com.carrotsearch.randomizedtesting.rules.StatementAdapter.evaluate(StatementAdapter.java:36)
	at com.carrotsearch.randomizedtesting.ThreadLeakControl$StatementRunner.run(ThreadLeakControl.java:368)
	at java.base/java.lang.Thread.run(Thread.java:834)


FAILED:  junit.framework.TestSuite.org.apache.solr.handler.TestSQLHandler

Error Message:
1 thread leaked from SUITE scope at org.apache.solr.handler.TestSQLHandler:     1) Thread[id=4214, name=Connection evictor, state=TIMED_WAITING, group=TGRP-TestSQLHandler]         at java.base@11-ea/java.lang.Thread.sleep(Native Method)         at app//org.apache.http.impl.client.IdleConnectionEvictor$1.run(IdleConnectionEvictor.java:66)         at java.base@11-ea/java.lang.Thread.run(Thread.java:834)

Stack Trace:
com.carrotsearch.randomizedtesting.ThreadLeakError: 1 thread leaked from SUITE scope at org.apache.solr.handler.TestSQLHandler: 
   1) Thread[id=4214, name=Connection evictor, state=TIMED_WAITING, group=TGRP-TestSQLHandler]
        at java.base@11-ea/java.lang.Thread.sleep(Native Method)
        at app//org.apache.http.impl.client.IdleConnectionEvictor$1.run(IdleConnectionEvictor.java:66)
        at java.base@11-ea/java.lang.Thread.run(Thread.java:834)
	at __randomizedtesting.SeedInfo.seed([46E036155C41E5C0]:0)


FAILED:  org.apache.solr.handler.TestSQLHandler.doTest

Error Message:
--> http://127.0.0.1:54275/s_toi/po/collection1_shard2_replica_n41:Failed to execute sqlQuery 'select id, field_i, str_s from collection1 where (text='(XXXX)' OR text='XXXX') AND text='XXXX' order by field_i desc' against JDBC connection 'jdbc:calcitesolr:'. Error while executing SQL "select id, field_i, str_s from collection1 where (text='(XXXX)' OR text='XXXX') AND text='XXXX' order by field_i desc": java.io.IOException: java.util.concurrent.ExecutionException: java.io.IOException: --> http://127.0.0.1:54275/s_toi/po/collection1_shard2_replica_n41/:id must have DocValues to use this feature.

Stack Trace:
java.io.IOException: --> http://127.0.0.1:54275/s_toi/po/collection1_shard2_replica_n41:Failed to execute sqlQuery 'select id, field_i, str_s from collection1 where (text='(XXXX)' OR text='XXXX') AND text='XXXX' order by field_i desc' against JDBC connection 'jdbc:calcitesolr:'.
Error while executing SQL "select id, field_i, str_s from collection1 where (text='(XXXX)' OR text='XXXX') AND text='XXXX' order by field_i desc": java.io.IOException: java.util.concurrent.ExecutionException: java.io.IOException: --> http://127.0.0.1:54275/s_toi/po/collection1_shard2_replica_n41/:id must have DocValues to use this feature.
	at __randomizedtesting.SeedInfo.seed([46E036155C41E5C0:E1A48EB131FAF679]:0)
	at org.apache.solr.client.solrj.io.stream.SolrStream.read(SolrStream.java:217)
	at org.apache.solr.handler.TestSQLHandler.getTuples(TestSQLHandler.java:2523)
	at org.apache.solr.handler.TestSQLHandler.testBasicSelect(TestSQLHandler.java:125)
	at org.apache.solr.handler.TestSQLHandler.doTest(TestSQLHandler.java:83)
	at java.base/jdk.internal.reflect.NativeMethodAccessorImpl.invoke0(Native Method)
	at java.base/jdk.internal.reflect.NativeMethodAccessorImpl.invoke(NativeMethodAccessorImpl.java:62)
	at java.base/jdk.internal.reflect.DelegatingMethodAccessorImpl.invoke(DelegatingMethodAccessorImpl.java:43)
	at java.base/java.lang.reflect.Method.invoke(Method.java:566)
	at com.carrotsearch.randomizedtesting.RandomizedRunner.invoke(RandomizedRunner.java:1737)
	at com.carrotsearch.randomizedtesting.RandomizedRunner$8.evaluate(RandomizedRunner.java:934)
	at com.carrotsearch.randomizedtesting.RandomizedRunner$9.evaluate(RandomizedRunner.java:970)
	at com.carrotsearch.randomizedtesting.RandomizedRunner$10.evaluate(RandomizedRunner.java:984)
	at org.apache.solr.BaseDistributedSearchTestCase$ShardsRepeatRule$ShardsFixedStatement.callStatement(BaseDistributedSearchTestCase.java:1008)
	at org.apache.solr.BaseDistributedSearchTestCase$ShardsRepeatRule$ShardsStatement.evaluate(BaseDistributedSearchTestCase.java:983)
	at com.carrotsearch.randomizedtesting.rules.SystemPropertiesRestoreRule$1.evaluate(SystemPropertiesRestoreRule.java:57)
	at org.apache.lucene.util.TestRuleSetupTeardownChained$1.evaluate(TestRuleSetupTeardownChained.java:49)
	at org.apache.lucene.util.AbstractBeforeAfterRule$1.evaluate(AbstractBeforeAfterRule.java:45)
	at org.apache.lucene.util.TestRuleThreadAndTestName$1.evaluate(TestRuleThreadAndTestName.java:48)
	at org.apache.lucene.util.TestRuleIgnoreAfterMaxFailures$1.evaluate(TestRuleIgnoreAfterMaxFailures.java:64)
	at org.apache.lucene.util.TestRuleMarkFailure$1.evaluate(TestRuleMarkFailure.java:47)
	at com.carrotsearch.randomizedtesting.rules.StatementAdapter.evaluate(StatementAdapter.java:36)
	at com.carrotsearch.randomizedtesting.ThreadLeakControl$StatementRunner.run(ThreadLeakControl.java:368)
	at com.carrotsearch.randomizedtesting.ThreadLeakControl.forkTimeoutingTask(ThreadLeakControl.java:817)
	at com.carrotsearch.randomizedtesting.ThreadLeakControl$3.evaluate(ThreadLeakControl.java:468)
	at com.carrotsearch.randomizedtesting.RandomizedRunner.runSingleTest(RandomizedRunner.java:943)
	at com.carrotsearch.randomizedtesting.RandomizedRunner$5.evaluate(RandomizedRunner.java:829)
	at com.carrotsearch.randomizedtesting.RandomizedRunner$6.evaluate(RandomizedRunner.java:879)
	at com.carrotsearch.randomizedtesting.RandomizedRunner$7.evaluate(RandomizedRunner.java:890)
	at com.carrotsearch.randomizedtesting.rules.StatementAdapter.evaluate(StatementAdapter.java:36)
	at com.carrotsearch.randomizedtesting.rules.SystemPropertiesRestoreRule$1.evaluate(SystemPropertiesRestoreRule.java:57)
	at org.apache.lucene.util.AbstractBeforeAfterRule$1.evaluate(AbstractBeforeAfterRule.java:45)
	at com.carrotsearch.randomizedtesting.rules.StatementAdapter.evaluate(StatementAdapter.java:36)
	at org.apache.lucene.util.TestRuleStoreClassName$1.evaluate(TestRuleStoreClassName.java:41)
	at com.carrotsearch.randomizedtesting.rules.NoShadowingOrOverridesOnMethodsRule$1.evaluate(NoShadowingOrOverridesOnMethodsRule.java:40)
	at com.carrotsearch.randomizedtesting.rules.NoShadowingOrOverridesOnMethodsRule$1.evaluate(NoShadowingOrOverridesOnMethodsRule.java:40)
	at com.carrotsearch.randomizedtesting.rules.StatementAdapter.evaluate(StatementAdapter.java:36)
	at com.carrotsearch.randomizedtesting.rules.StatementAdapter.evaluate(StatementAdapter.java:36)
	at org.apache.lucene.util.TestRuleAssertionsRequired$1.evaluate(TestRuleAssertionsRequired.java:53)
	at org.apache.lucene.util.TestRuleMarkFailure$1.evaluate(TestRuleMarkFailure.java:47)
	at org.apache.lucene.util.TestRuleIgnoreAfterMaxFailures$1.evaluate(TestRuleIgnoreAfterMaxFailures.java:64)
	at org.apache.lucene.util.TestRuleIgnoreTestSuites$1.evaluate(TestRuleIgnoreTestSuites.java:54)
	at com.carrotsearch.randomizedtesting.rules.StatementAdapter.evaluate(StatementAdapter.java:36)
	at com.carrotsearch.randomizedtesting.ThreadLeakControl$StatementRunner.run(ThreadLeakControl.java:368)
	at java.base/java.lang.Thread.run(Thread.java:834)


FAILED:  junit.framework.TestSuite.org.apache.solr.handler.TestSQLHandler

Error Message:
1 thread leaked from SUITE scope at org.apache.solr.handler.TestSQLHandler:     1) Thread[id=6823, name=Connection evictor, state=TIMED_WAITING, group=TGRP-TestSQLHandler]         at java.base@11-ea/java.lang.Thread.sleep(Native Method)         at app//org.apache.http.impl.client.IdleConnectionEvictor$1.run(IdleConnectionEvictor.java:66)         at java.base@11-ea/java.lang.Thread.run(Thread.java:834)

Stack Trace:
com.carrotsearch.randomizedtesting.ThreadLeakError: 1 thread leaked from SUITE scope at org.apache.solr.handler.TestSQLHandler: 
   1) Thread[id=6823, name=Connection evictor, state=TIMED_WAITING, group=TGRP-TestSQLHandler]
        at java.base@11-ea/java.lang.Thread.sleep(Native Method)
        at app//org.apache.http.impl.client.IdleConnectionEvictor$1.run(IdleConnectionEvictor.java:66)
        at java.base@11-ea/java.lang.Thread.run(Thread.java:834)
	at __randomizedtesting.SeedInfo.seed([46E036155C41E5C0]:0)


FAILED:  org.apache.solr.handler.TestSQLHandler.doTest

Error Message:
--> http://127.0.0.1:54442/s_toi/po/collection1_shard2_replica_n41:Failed to execute sqlQuery 'select id, field_i, str_s from collection1 where (text='(XXXX)' OR text='XXXX') AND text='XXXX' order by field_i desc' against JDBC connection 'jdbc:calcitesolr:'. Error while executing SQL "select id, field_i, str_s from collection1 where (text='(XXXX)' OR text='XXXX') AND text='XXXX' order by field_i desc": java.io.IOException: java.util.concurrent.ExecutionException: java.io.IOException: --> http://127.0.0.1:54442/s_toi/po/collection1_shard2_replica_n41/:id must have DocValues to use this feature.

Stack Trace:
java.io.IOException: --> http://127.0.0.1:54442/s_toi/po/collection1_shard2_replica_n41:Failed to execute sqlQuery 'select id, field_i, str_s from collection1 where (text='(XXXX)' OR text='XXXX') AND text='XXXX' order by field_i desc' against JDBC connection 'jdbc:calcitesolr:'.
Error while executing SQL "select id, field_i, str_s from collection1 where (text='(XXXX)' OR text='XXXX') AND text='XXXX' order by field_i desc": java.io.IOException: java.util.concurrent.ExecutionException: java.io.IOException: --> http://127.0.0.1:54442/s_toi/po/collection1_shard2_replica_n41/:id must have DocValues to use this feature.
	at __randomizedtesting.SeedInfo.seed([46E036155C41E5C0:E1A48EB131FAF679]:0)
	at org.apache.solr.client.solrj.io.stream.SolrStream.read(SolrStream.java:217)
	at org.apache.solr.handler.TestSQLHandler.getTuples(TestSQLHandler.java:2523)
	at org.apache.solr.handler.TestSQLHandler.testBasicSelect(TestSQLHandler.java:125)
	at org.apache.solr.handler.TestSQLHandler.doTest(TestSQLHandler.java:83)
	at java.base/jdk.internal.reflect.NativeMethodAccessorImpl.invoke0(Native Method)
	at java.base/jdk.internal.reflect.NativeMethodAccessorImpl.invoke(NativeMethodAccessorImpl.java:62)
	at java.base/jdk.internal.reflect.DelegatingMethodAccessorImpl.invoke(DelegatingMethodAccessorImpl.java:43)
	at java.base/java.lang.reflect.Method.invoke(Method.java:566)
	at com.carrotsearch.randomizedtesting.RandomizedRunner.invoke(RandomizedRunner.java:1737)
	at com.carrotsearch.randomizedtesting.RandomizedRunner$8.evaluate(RandomizedRunner.java:934)
	at com.carrotsearch.randomizedtesting.RandomizedRunner$9.evaluate(RandomizedRunner.java:970)
	at com.carrotsearch.randomizedtesting.RandomizedRunner$10.evaluate(RandomizedRunner.java:984)
	at org.apache.solr.BaseDistributedSearchTestCase$ShardsRepeatRule$ShardsFixedStatement.callStatement(BaseDistributedSearchTestCase.java:1008)
	at org.apache.solr.BaseDistributedSearchTestCase$ShardsRepeatRule$ShardsStatement.evaluate(BaseDistributedSearchTestCase.java:983)
	at com.carrotsearch.randomizedtesting.rules.SystemPropertiesRestoreRule$1.evaluate(SystemPropertiesRestoreRule.java:57)
	at org.apache.lucene.util.TestRuleSetupTeardownChained$1.evaluate(TestRuleSetupTeardownChained.java:49)
	at org.apache.lucene.util.AbstractBeforeAfterRule$1.evaluate(AbstractBeforeAfterRule.java:45)
	at org.apache.lucene.util.TestRuleThreadAndTestName$1.evaluate(TestRuleThreadAndTestName.java:48)
	at org.apache.lucene.util.TestRuleIgnoreAfterMaxFailures$1.evaluate(TestRuleIgnoreAfterMaxFailures.java:64)
	at org.apache.lucene.util.TestRuleMarkFailure$1.evaluate(TestRuleMarkFailure.java:47)
	at com.carrotsearch.randomizedtesting.rules.StatementAdapter.evaluate(StatementAdapter.java:36)
	at com.carrotsearch.randomizedtesting.ThreadLeakControl$StatementRunner.run(ThreadLeakControl.java:368)
	at com.carrotsearch.randomizedtesting.ThreadLeakControl.forkTimeoutingTask(ThreadLeakControl.java:817)
	at com.carrotsearch.randomizedtesting.ThreadLeakControl$3.evaluate(ThreadLeakControl.java:468)
	at com.carrotsearch.randomizedtesting.RandomizedRunner.runSingleTest(RandomizedRunner.java:943)
	at com.carrotsearch.randomizedtesting.RandomizedRunner$5.evaluate(RandomizedRunner.java:829)
	at com.carrotsearch.randomizedtesting.RandomizedRunner$6.evaluate(RandomizedRunner.java:879)
	at com.carrotsearch.randomizedtesting.RandomizedRunner$7.evaluate(RandomizedRunner.java:890)
	at com.carrotsearch.randomizedtesting.rules.StatementAdapter.evaluate(StatementAdapter.java:36)
	at com.carrotsearch.randomizedtesting.rules.SystemPropertiesRestoreRule$1.evaluate(SystemPropertiesRestoreRule.java:57)
	at org.apache.lucene.util.AbstractBeforeAfterRule$1.evaluate(AbstractBeforeAfterRule.java:45)
	at com.carrotsearch.randomizedtesting.rules.StatementAdapter.evaluate(StatementAdapter.java:36)
	at org.apache.lucene.util.TestRuleStoreClassName$1.evaluate(TestRuleStoreClassName.java:41)
	at com.carrotsearch.randomizedtesting.rules.NoShadowingOrOverridesOnMethodsRule$1.evaluate(NoShadowingOrOverridesOnMethodsRule.java:40)
	at com.carrotsearch.randomizedtesting.rules.NoShadowingOrOverridesOnMethodsRule$1.evaluate(NoShadowingOrOverridesOnMethodsRule.java:40)
	at com.carrotsearch.randomizedtesting.rules.StatementAdapter.evaluate(StatementAdapter.java:36)
	at com.carrotsearch.randomizedtesting.rules.StatementAdapter.evaluate(StatementAdapter.java:36)
	at org.apache.lucene.util.TestRuleAssertionsRequired$1.evaluate(TestRuleAssertionsRequired.java:53)
	at org.apache.lucene.util.TestRuleMarkFailure$1.evaluate(TestRuleMarkFailure.java:47)
	at org.apache.lucene.util.TestRuleIgnoreAfterMaxFailures$1.evaluate(TestRuleIgnoreAfterMaxFailures.java:64)
	at org.apache.lucene.util.TestRuleIgnoreTestSuites$1.evaluate(TestRuleIgnoreTestSuites.java:54)
	at com.carrotsearch.randomizedtesting.rules.StatementAdapter.evaluate(StatementAdapter.java:36)
	at com.carrotsearch.randomizedtesting.ThreadLeakControl$StatementRunner.run(ThreadLeakControl.java:368)
	at java.base/java.lang.Thread.run(Thread.java:834)


FAILED:  junit.framework.TestSuite.org.apache.solr.handler.TestSQLHandler

Error Message:
1 thread leaked from SUITE scope at org.apache.solr.handler.TestSQLHandler:     1) Thread[id=7949, name=Connection evictor, state=TIMED_WAITING, group=TGRP-TestSQLHandler]         at java.base@11-ea/java.lang.Thread.sleep(Native Method)         at app//org.apache.http.impl.client.IdleConnectionEvictor$1.run(IdleConnectionEvictor.java:66)         at java.base@11-ea/java.lang.Thread.run(Thread.java:834)

Stack Trace:
com.carrotsearch.randomizedtesting.ThreadLeakError: 1 thread leaked from SUITE scope at org.apache.solr.handler.TestSQLHandler: 
   1) Thread[id=7949, name=Connection evictor, state=TIMED_WAITING, group=TGRP-TestSQLHandler]
        at java.base@11-ea/java.lang.Thread.sleep(Native Method)
        at app//org.apache.http.impl.client.IdleConnectionEvictor$1.run(IdleConnectionEvictor.java:66)
        at java.base@11-ea/java.lang.Thread.run(Thread.java:834)
	at __randomizedtesting.SeedInfo.seed([46E036155C41E5C0]:0)


FAILED:  org.apache.solr.handler.TestSQLHandler.doTest

Error Message:


Stack Trace:
java.lang.AssertionError
	at __randomizedtesting.SeedInfo.seed([46E036155C41E5C0:E1A48EB131FAF679]:0)
	at org.apache.solr.handler.TestSQLHandler.testBasicSelect(TestSQLHandler.java:182)
	at org.apache.solr.handler.TestSQLHandler.doTest(TestSQLHandler.java:83)
	at java.base/jdk.internal.reflect.NativeMethodAccessorImpl.invoke0(Native Method)
	at java.base/jdk.internal.reflect.NativeMethodAccessorImpl.invoke(NativeMethodAccessorImpl.java:62)
	at java.base/jdk.internal.reflect.DelegatingMethodAccessorImpl.invoke(DelegatingMethodAccessorImpl.java:43)
	at java.base/java.lang.reflect.Method.invoke(Method.java:566)
	at com.carrotsearch.randomizedtesting.RandomizedRunner.invoke(RandomizedRunner.java:1737)
	at com.carrotsearch.randomizedtesting.RandomizedRunner$8.evaluate(RandomizedRunner.java:934)
	at com.carrotsearch.randomizedtesting.RandomizedRunner$9.evaluate(RandomizedRunner.java:970)
	at com.carrotsearch.randomizedtesting.RandomizedRunner$10.evaluate(RandomizedRunner.java:984)
	at org.apache.solr.BaseDistributedSearchTestCase$ShardsRepeatRule$ShardsFixedStatement.callStatement(BaseDistributedSearchTestCase.java:1008)
	at org.apache.solr.BaseDistributedSearchTestCase$ShardsRepeatRule$ShardsStatement.evaluate(BaseDistributedSearchTestCase.java:983)
	at com.carrotsearch.randomizedtesting.rules.SystemPropertiesRestoreRule$1.evaluate(SystemPropertiesRestoreRule.java:57)
	at org.apache.lucene.util.TestRuleSetupTeardownChained$1.evaluate(TestRuleSetupTeardownChained.java:49)
	at org.apache.lucene.util.AbstractBeforeAfterRule$1.evaluate(AbstractBeforeAfterRule.java:45)
	at org.apache.lucene.util.TestRuleThreadAndTestName$1.evaluate(TestRuleThreadAndTestName.java:48)
	at org.apache.lucene.util.TestRuleIgnoreAfterMaxFailures$1.evaluate(TestRuleIgnoreAfterMaxFailures.java:64)
	at org.apache.lucene.util.TestRuleMarkFailure$1.evaluate(TestRuleMarkFailure.java:47)
	at com.carrotsearch.randomizedtesting.rules.StatementAdapter.evaluate(StatementAdapter.java:36)
	at com.carrotsearch.randomizedtesting.ThreadLeakControl$StatementRunner.run(ThreadLeakControl.java:368)
	at com.carrotsearch.randomizedtesting.ThreadLeakControl.forkTimeoutingTask(ThreadLeakControl.java:817)
	at com.carrotsearch.randomizedtesting.ThreadLeakControl$3.evaluate(ThreadLeakControl.java:468)
	at com.carrotsearch.randomizedtesting.RandomizedRunner.runSingleTest(RandomizedRunner.java:943)
	at com.carrotsearch.randomizedtesting.RandomizedRunner$5.evaluate(RandomizedRunner.java:829)
	at com.carrotsearch.randomizedtesting.RandomizedRunner$6.evaluate(RandomizedRunner.java:879)
	at com.carrotsearch.randomizedtesting.RandomizedRunner$7.evaluate(RandomizedRunner.java:890)
	at com.carrotsearch.randomizedtesting.rules.StatementAdapter.evaluate(StatementAdapter.java:36)
	at com.carrotsearch.randomizedtesting.rules.SystemPropertiesRestoreRule$1.evaluate(SystemPropertiesRestoreRule.java:57)
	at org.apache.lucene.util.AbstractBeforeAfterRule$1.evaluate(AbstractBeforeAfterRule.java:45)
	at com.carrotsearch.randomizedtesting.rules.StatementAdapter.evaluate(StatementAdapter.java:36)
	at org.apache.lucene.util.TestRuleStoreClassName$1.evaluate(TestRuleStoreClassName.java:41)
	at com.carrotsearch.randomizedtesting.rules.NoShadowingOrOverridesOnMethodsRule$1.evaluate(NoShadowingOrOverridesOnMethodsRule.java:40)
	at com.carrotsearch.randomizedtesting.rules.NoShadowingOrOverridesOnMethodsRule$1.evaluate(NoShadowingOrOverridesOnMethodsRule.java:40)
	at com.carrotsearch.randomizedtesting.rules.StatementAdapter.evaluate(StatementAdapter.java:36)
	at com.carrotsearch.randomizedtesting.rules.StatementAdapter.evaluate(StatementAdapter.java:36)
	at org.apache.lucene.util.TestRuleAssertionsRequired$1.evaluate(TestRuleAssertionsRequired.java:53)
	at org.apache.lucene.util.TestRuleMarkFailure$1.evaluate(TestRuleMarkFailure.java:47)
	at org.apache.lucene.util.TestRuleIgnoreAfterMaxFailures$1.evaluate(TestRuleIgnoreAfterMaxFailures.java:64)
	at org.apache.lucene.util.TestRuleIgnoreTestSuites$1.evaluate(TestRuleIgnoreTestSuites.java:54)
	at com.carrotsearch.randomizedtesting.rules.StatementAdapter.evaluate(StatementAdapter.java:36)
	at com.carrotsearch.randomizedtesting.ThreadLeakControl$StatementRunner.run(ThreadLeakControl.java:368)
	at java.base/java.lang.Thread.run(Thread.java:834)


FAILED:  org.apache.solr.metrics.reporters.SolrJmxReporterCloudTest.testJmxReporter

Error Message:
Collection not found: SolrJmxReporterCloudTest_collection

Stack Trace:
org.apache.solr.common.SolrException: Collection not found: SolrJmxReporterCloudTest_collection
	at __randomizedtesting.SeedInfo.seed([46E036155C41E5C0:D75BCBB81FFE7DE3]:0)
	at org.apache.solr.client.solrj.impl.CloudSolrClient.requestWithRetryOnStaleState(CloudSolrClient.java:853)
	at org.apache.solr.client.solrj.impl.CloudSolrClient.request(CloudSolrClient.java:819)
	at org.apache.solr.client.solrj.SolrRequest.process(SolrRequest.java:194)
	at org.apache.solr.client.solrj.SolrClient.add(SolrClient.java:173)
	at org.apache.solr.client.solrj.SolrClient.add(SolrClient.java:138)
	at org.apache.solr.metrics.reporters.SolrJmxReporterCloudTest.testJmxReporter(SolrJmxReporterCloudTest.java:72)
	at java.base/jdk.internal.reflect.NativeMethodAccessorImpl.invoke0(Native Method)
	at java.base/jdk.internal.reflect.NativeMethodAccessorImpl.invoke(NativeMethodAccessorImpl.java:62)
	at java.base/jdk.internal.reflect.DelegatingMethodAccessorImpl.invoke(DelegatingMethodAccessorImpl.java:43)
	at java.base/java.lang.reflect.Method.invoke(Method.java:566)
	at com.carrotsearch.randomizedtesting.RandomizedRunner.invoke(RandomizedRunner.java:1737)
	at com.carrotsearch.randomizedtesting.RandomizedRunner$8.evaluate(RandomizedRunner.java:934)
	at com.carrotsearch.randomizedtesting.RandomizedRunner$9.evaluate(RandomizedRunner.java:970)
	at com.carrotsearch.randomizedtesting.RandomizedRunner$10.evaluate(RandomizedRunner.java:984)
	at com.carrotsearch.randomizedtesting.rules.SystemPropertiesRestoreRule$1.evaluate(SystemPropertiesRestoreRule.java:57)
	at org.apache.lucene.util.TestRuleSetupTeardownChained$1.evaluate(TestRuleSetupTeardownChained.java:49)
	at org.apache.lucene.util.AbstractBeforeAfterRule$1.evaluate(AbstractBeforeAfterRule.java:45)
	at org.apache.lucene.util.TestRuleThreadAndTestName$1.evaluate(TestRuleThreadAndTestName.java:48)
	at org.apache.lucene.util.TestRuleIgnoreAfterMaxFailures$1.evaluate(TestRuleIgnoreAfterMaxFailures.java:64)
	at org.apache.lucene.util.TestRuleMarkFailure$1.evaluate(TestRuleMarkFailure.java:47)
	at com.carrotsearch.randomizedtesting.rules.StatementAdapter.evaluate(StatementAdapter.java:36)
	at com.carrotsearch.randomizedtesting.ThreadLeakControl$StatementRunner.run(ThreadLeakControl.java:368)
	at com.carrotsearch.randomizedtesting.ThreadLeakControl.forkTimeoutingTask(ThreadLeakControl.java:817)
	at com.carrotsearch.randomizedtesting.ThreadLeakControl$3.evaluate(ThreadLeakControl.java:468)
	at com.carrotsearch.randomizedtesting.RandomizedRunner.runSingleTest(RandomizedRunner.java:943)
	at com.carrotsearch.randomizedtesting.RandomizedRunner$5.evaluate(RandomizedRunner.java:829)
	at com.carrotsearch.randomizedtesting.RandomizedRunner$6.evaluate(RandomizedRunner.java:879)
	at com.carrotsearch.randomizedtesting.RandomizedRunner$7.evaluate(RandomizedRunner.java:890)
	at com.carrotsearch.randomizedtesting.rules.StatementAdapter.evaluate(StatementAdapter.java:36)
	at com.carrotsearch.randomizedtesting.rules.SystemPropertiesRestoreRule$1.evaluate(SystemPropertiesRestoreRule.java:57)
	at org.apache.lucene.util.AbstractBeforeAfterRule$1.evaluate(AbstractBeforeAfterRule.java:45)
	at com.carrotsearch.randomizedtesting.rules.StatementAdapter.evaluate(StatementAdapter.java:36)
	at org.apache.lucene.util.TestRuleStoreClassName$1.evaluate(TestRuleStoreClassName.java:41)
	at com.carrotsearch.randomizedtesting.rules.NoShadowingOrOverridesOnMethodsRule$1.evaluate(NoShadowingOrOverridesOnMethodsRule.java:40)
	at com.carrotsearch.randomizedtesting.rules.NoShadowingOrOverridesOnMethodsRule$1.evaluate(NoShadowingOrOverridesOnMethodsRule.java:40)
	at com.carrotsearch.randomizedtesting.rules.StatementAdapter.evaluate(StatementAdapter.java:36)
	at com.carrotsearch.randomizedtesting.rules.StatementAdapter.evaluate(StatementAdapter.java:36)
	at org.apache.lucene.util.TestRuleAssertionsRequired$1.evaluate(TestRuleAssertionsRequired.java:53)
	at org.apache.lucene.util.TestRuleMarkFailure$1.evaluate(TestRuleMarkFailure.java:47)
	at org.apache.lucene.util.TestRuleIgnoreAfterMaxFailures$1.evaluate(TestRuleIgnoreAfterMaxFailures.java:64)
	at org.apache.lucene.util.TestRuleIgnoreTestSuites$1.evaluate(TestRuleIgnoreTestSuites.java:54)
	at com.carrotsearch.randomizedtesting.rules.StatementAdapter.evaluate(StatementAdapter.java:36)
	at com.carrotsearch.randomizedtesting.ThreadLeakControl$StatementRunner.run(ThreadLeakControl.java:368)
	at java.base/java.lang.Thread.run(Thread.java:834)


FAILED:  org.apache.solr.cloud.TestMiniSolrCloudClusterSSL.testSslWithCheckPeerName

Error Message:
Could not find collection:first_collection

Stack Trace:
java.lang.AssertionError: Could not find collection:first_collection
	at __randomizedtesting.SeedInfo.seed([46E036155C41E5C0:F564E1E5E7107D11]:0)
	at org.junit.Assert.fail(Assert.java:93)
	at org.junit.Assert.assertTrue(Assert.java:43)
	at org.junit.Assert.assertNotNull(Assert.java:526)
	at org.apache.solr.cloud.AbstractDistribZkTestBase.waitForRecoveriesToFinish(AbstractDistribZkTestBase.java:155)
	at org.apache.solr.cloud.TestMiniSolrCloudClusterSSL.checkCreateCollection(TestMiniSolrCloudClusterSSL.java:261)
	at org.apache.solr.cloud.TestMiniSolrCloudClusterSSL.checkClusterWithCollectionCreations(TestMiniSolrCloudClusterSSL.java:231)
	at org.apache.solr.cloud.TestMiniSolrCloudClusterSSL.checkClusterWithNodeReplacement(TestMiniSolrCloudClusterSSL.java:155)
	at org.apache.solr.cloud.TestMiniSolrCloudClusterSSL.testSslWithCheckPeerName(TestMiniSolrCloudClusterSSL.java:137)
	at java.base/jdk.internal.reflect.NativeMethodAccessorImpl.invoke0(Native Method)
	at java.base/jdk.internal.reflect.NativeMethodAccessorImpl.invoke(NativeMethodAccessorImpl.java:62)
	at java.base/jdk.internal.reflect.DelegatingMethodAccessorImpl.invoke(DelegatingMethodAccessorImpl.java:43)
	at java.base/java.lang.reflect.Method.invoke(Method.java:566)
	at com.carrotsearch.randomizedtesting.RandomizedRunner.invoke(RandomizedRunner.java:1737)
	at com.carrotsearch.randomizedtesting.RandomizedRunner$8.evaluate(RandomizedRunner.java:934)
	at com.carrotsearch.randomizedtesting.RandomizedRunner$9.evaluate(RandomizedRunner.java:970)
	at com.carrotsearch.randomizedtesting.RandomizedRunner$10.evaluate(RandomizedRunner.java:984)
	at com.carrotsearch.randomizedtesting.rules.StatementAdapter.evaluate(StatementAdapter.java:36)
	at com.carrotsearch.randomizedtesting.rules.SystemPropertiesRestoreRule$1.evaluate(SystemPropertiesRestoreRule.java:57)
	at org.apache.lucene.util.TestRuleSetupTeardownChained$1.evaluate(TestRuleSetupTeardownChained.java:49)
	at org.apache.lucene.util.AbstractBeforeAfterRule$1.evaluate(AbstractBeforeAfterRule.java:45)
	at org.apache.lucene.util.TestRuleThreadAndTestName$1.evaluate(TestRuleThreadAndTestName.java:48)
	at org.apache.lucene.util.TestRuleIgnoreAfterMaxFailures$1.evaluate(TestRuleIgnoreAfterMaxFailures.java:64)
	at org.apache.lucene.util.TestRuleMarkFailure$1.evaluate(TestRuleMarkFailure.java:47)
	at com.carrotsearch.randomizedtesting.rules.StatementAdapter.evaluate(StatementAdapter.java:36)
	at com.carrotsearch.randomizedtesting.ThreadLeakControl$StatementRunner.run(ThreadLeakControl.java:368)
	at com.carrotsearch.randomizedtesting.ThreadLeakControl.forkTimeoutingTask(ThreadLeakControl.java:817)
	at com.carrotsearch.randomizedtesting.ThreadLeakControl$3.evaluate(ThreadLeakControl.java:468)
	at com.carrotsearch.randomizedtesting.RandomizedRunner.runSingleTest(RandomizedRunner.java:943)
	at com.carrotsearch.randomizedtesting.RandomizedRunner$5.evaluate(RandomizedRunner.java:829)
	at com.carrotsearch.randomizedtesting.RandomizedRunner$6.evaluate(RandomizedRunner.java:879)
	at com.carrotsearch.randomizedtesting.RandomizedRunner$7.evaluate(RandomizedRunner.java:890)
	at com.carrotsearch.randomizedtesting.rules.StatementAdapter.evaluate(StatementAdapter.java:36)
	at com.carrotsearch.randomizedtesting.rules.SystemPropertiesRestoreRule$1.evaluate(SystemPropertiesRestoreRule.java:57)
	at org.apache.lucene.util.AbstractBeforeAfterRule$1.evaluate(AbstractBeforeAfterRule.java:45)
	at com.carrotsearch.randomizedtesting.rules.StatementAdapter.evaluate(StatementAdapter.java:36)
	at org.apache.lucene.util.TestRuleStoreClassName$1.evaluate(TestRuleStoreClassName.java:41)
	at com.carrotsearch.randomizedtesting.rules.NoShadowingOrOverridesOnMethodsRule$1.evaluate(NoShadowingOrOverridesOnMethodsRule.java:40)
	at com.carrotsearch.randomizedtesting.rules.NoShadowingOrOverridesOnMethodsRule$1.evaluate(NoShadowingOrOverridesOnMethodsRule.java:40)
	at com.carrotsearch.randomizedtesting.rules.StatementAdapter.evaluate(StatementAdapter.java:36)
	at com.carrotsearch.randomizedtesting.rules.StatementAdapter.evaluate(StatementAdapter.java:36)
	at org.apache.lucene.util.TestRuleAssertionsRequired$1.evaluate(TestRuleAssertionsRequired.java:53)
	at org.apache.lucene.util.TestRuleMarkFailure$1.evaluate(TestRuleMarkFailure.java:47)
	at org.apache.lucene.util.TestRuleIgnoreAfterMaxFailures$1.evaluate(TestRuleIgnoreAfterMaxFailures.java:64)
	at org.apache.lucene.util.TestRuleIgnoreTestSuites$1.evaluate(TestRuleIgnoreTestSuites.java:54)
	at com.carrotsearch.randomizedtesting.rules.StatementAdapter.evaluate(StatementAdapter.java:36)
	at com.carrotsearch.randomizedtesting.ThreadLeakControl$StatementRunner.run(ThreadLeakControl.java:368)
	at java.base/java.lang.Thread.run(Thread.java:834)


FAILED:  org.apache.solr.cloud.TestMiniSolrCloudClusterSSL.testSslWithCheckPeerName

Error Message:
Could not find collection:first_collection

Stack Trace:
java.lang.AssertionError: Could not find collection:first_collection
	at __randomizedtesting.SeedInfo.seed([46E036155C41E5C0:F564E1E5E7107D11]:0)
	at org.junit.Assert.fail(Assert.java:93)
	at org.junit.Assert.assertTrue(Assert.java:43)
	at org.junit.Assert.assertNotNull(Assert.java:526)
	at org.apache.solr.cloud.AbstractDistribZkTestBase.waitForRecoveriesToFinish(AbstractDistribZkTestBase.java:155)
	at org.apache.solr.cloud.TestMiniSolrCloudClusterSSL.checkCreateCollection(TestMiniSolrCloudClusterSSL.java:261)
	at org.apache.solr.cloud.TestMiniSolrCloudClusterSSL.checkClusterWithCollectionCreations(TestMiniSolrCloudClusterSSL.java:231)
	at org.apache.solr.cloud.TestMiniSolrCloudClusterSSL.checkClusterWithNodeReplacement(TestMiniSolrCloudClusterSSL.java:155)
	at org.apache.solr.cloud.TestMiniSolrCloudClusterSSL.testSslWithCheckPeerName(TestMiniSolrCloudClusterSSL.java:137)
	at java.base/jdk.internal.reflect.NativeMethodAccessorImpl.invoke0(Native Method)
	at java.base/jdk.internal.reflect.NativeMethodAccessorImpl.invoke(NativeMethodAccessorImpl.java:62)
	at java.base/jdk.internal.reflect.DelegatingMethodAccessorImpl.invoke(DelegatingMethodAccessorImpl.java:43)
	at java.base/java.lang.reflect.Method.invoke(Method.java:566)
	at com.carrotsearch.randomizedtesting.RandomizedRunner.invoke(RandomizedRunner.java:1737)
	at com.carrotsearch.randomizedtesting.RandomizedRunner$8.evaluate(RandomizedRunner.java:934)
	at com.carrotsearch.randomizedtesting.RandomizedRunner$9.evaluate(RandomizedRunner.java:970)
	at com.carrotsearch.randomizedtesting.RandomizedRunner$10.evaluate(RandomizedRunner.java:984)
	at com.carrotsearch.randomizedtesting.rules.StatementAdapter.evaluate(StatementAdapter.java:36)
	at com.carrotsearch.randomizedtesting.rules.SystemPropertiesRestoreRule$1.evaluate(SystemPropertiesRestoreRule.java:57)
	at org.apache.lucene.util.TestRuleSetupTeardownChained$1.evaluate(TestRuleSetupTeardownChained.java:49)
	at org.apache.lucene.util.AbstractBeforeAfterRule$1.evaluate(AbstractBeforeAfterRule.java:45)
	at org.apache.lucene.util.TestRuleThreadAndTestName$1.evaluate(TestRuleThreadAndTestName.java:48)
	at org.apache.lucene.util.TestRuleIgnoreAfterMaxFailures$1.evaluate(TestRuleIgnoreAfterMaxFailures.java:64)
	at org.apache.lucene.util.TestRuleMarkFailure$1.evaluate(TestRuleMarkFailure.java:47)
	at com.carrotsearch.randomizedtesting.rules.StatementAdapter.evaluate(StatementAdapter.java:36)
	at com.carrotsearch.randomizedtesting.ThreadLeakControl$StatementRunner.run(ThreadLeakControl.java:368)
	at com.carrotsearch.randomizedtesting.ThreadLeakControl.forkTimeoutingTask(ThreadLeakControl.java:817)
	at com.carrotsearch.randomizedtesting.ThreadLeakControl$3.evaluate(ThreadLeakControl.java:468)
	at com.carrotsearch.randomizedtesting.RandomizedRunner.runSingleTest(RandomizedRunner.java:943)
	at com.carrotsearch.randomizedtesting.RandomizedRunner$5.evaluate(RandomizedRunner.java:829)
	at com.carrotsearch.randomizedtesting.RandomizedRunner$6.evaluate(RandomizedRunner.java:879)
	at com.carrotsearch.randomizedtesting.RandomizedRunner$7.evaluate(RandomizedRunner.java:890)
	at com.carrotsearch.randomizedtesting.rules.StatementAdapter.evaluate(StatementAdapter.java:36)
	at com.carrotsearch.randomizedtesting.rules.SystemPropertiesRestoreRule$1.evaluate(SystemPropertiesRestoreRule.java:57)
	at org.apache.lucene.util.AbstractBeforeAfterRule$1.evaluate(AbstractBeforeAfterRule.java:45)
	at com.carrotsearch.randomizedtesting.rules.StatementAdapter.evaluate(StatementAdapter.java:36)
	at org.apache.lucene.util.TestRuleStoreClassName$1.evaluate(TestRuleStoreClassName.java:41)
	at com.carrotsearch.randomizedtesting.rules.NoShadowingOrOverridesOnMethodsRule$1.evaluate(NoShadowingOrOverridesOnMethodsRule.java:40)
	at com.carrotsearch.randomizedtesting.rules.NoShadowingOrOverridesOnMethodsRule$1.evaluate(NoShadowingOrOverridesOnMethodsRule.java:40)
	at com.carrotsearch.randomizedtesting.rules.StatementAdapter.evaluate(StatementAdapter.java:36)
	at com.carrotsearch.randomizedtesting.rules.StatementAdapter.evaluate(StatementAdapter.java:36)
	at org.apache.lucene.util.TestRuleAssertionsRequired$1.evaluate(TestRuleAssertionsRequired.java:53)
	at org.apache.lucene.util.TestRuleMarkFailure$1.evaluate(TestRuleMarkFailure.java:47)
	at org.apache.lucene.util.TestRuleIgnoreAfterMaxFailures$1.evaluate(TestRuleIgnoreAfterMaxFailures.java:64)
	at org.apache.lucene.util.TestRuleIgnoreTestSuites$1.evaluate(TestRuleIgnoreTestSuites.java:54)
	at com.carrotsearch.randomizedtesting.rules.StatementAdapter.evaluate(StatementAdapter.java:36)
	at com.carrotsearch.randomizedtesting.ThreadLeakControl$StatementRunner.run(ThreadLeakControl.java:368)
	at java.base/java.lang.Thread.run(Thread.java:834)


FAILED:  org.apache.solr.cloud.TestMiniSolrCloudClusterSSL.testSslWithCheckPeerName

Error Message:
Could not find collection:first_collection

Stack Trace:
java.lang.AssertionError: Could not find collection:first_collection
	at __randomizedtesting.SeedInfo.seed([46E036155C41E5C0:F564E1E5E7107D11]:0)
	at org.junit.Assert.fail(Assert.java:93)
	at org.junit.Assert.assertTrue(Assert.java:43)
	at org.junit.Assert.assertNotNull(Assert.java:526)
	at org.apache.solr.cloud.AbstractDistribZkTestBase.waitForRecoveriesToFinish(AbstractDistribZkTestBase.java:155)
	at org.apache.solr.cloud.TestMiniSolrCloudClusterSSL.checkCreateCollection(TestMiniSolrCloudClusterSSL.java:261)
	at org.apache.solr.cloud.TestMiniSolrCloudClusterSSL.checkClusterWithCollectionCreations(TestMiniSolrCloudClusterSSL.java:231)
	at org.apache.solr.cloud.TestMiniSolrCloudClusterSSL.checkClusterWithNodeReplacement(TestMiniSolrCloudClusterSSL.java:155)
	at org.apache.solr.cloud.TestMiniSolrCloudClusterSSL.testSslWithCheckPeerName(TestMiniSolrCloudClusterSSL.java:137)
	at java.base/jdk.internal.reflect.NativeMethodAccessorImpl.invoke0(Native Method)
	at java.base/jdk.internal.reflect.NativeMethodAccessorImpl.invoke(NativeMethodAccessorImpl.java:62)
	at java.base/jdk.internal.reflect.DelegatingMethodAccessorImpl.invoke(DelegatingMethodAccessorImpl.java:43)
	at java.base/java.lang.reflect.Method.invoke(Method.java:566)
	at com.carrotsearch.randomizedtesting.RandomizedRunner.invoke(RandomizedRunner.java:1737)
	at com.carrotsearch.randomizedtesting.RandomizedRunner$8.evaluate(RandomizedRunner.java:934)
	at com.carrotsearch.randomizedtesting.RandomizedRunner$9.evaluate(RandomizedRunner.java:970)
	at com.carrotsearch.randomizedtesting.RandomizedRunner$10.evaluate(RandomizedRunner.java:984)
	at com.carrotsearch.randomizedtesting.rules.StatementAdapter.evaluate(StatementAdapter.java:36)
	at com.carrotsearch.randomizedtesting.rules.SystemPropertiesRestoreRule$1.evaluate(SystemPropertiesRestoreRule.java:57)
	at org.apache.lucene.util.TestRuleSetupTeardownChained$1.evaluate(TestRuleSetupTeardownChained.java:49)
	at org.apache.lucene.util.AbstractBeforeAfterRule$1.evaluate(AbstractBeforeAfterRule.java:45)
	at org.apache.lucene.util.TestRuleThreadAndTestName$1.evaluate(TestRuleThreadAndTestName.java:48)
	at org.apache.lucene.util.TestRuleIgnoreAfterMaxFailures$1.evaluate(TestRuleIgnoreAfterMaxFailures.java:64)
	at org.apache.lucene.util.TestRuleMarkFailure$1.evaluate(TestRuleMarkFailure.java:47)
	at com.carrotsearch.randomizedtesting.rules.StatementAdapter.evaluate(StatementAdapter.java:36)
	at com.carrotsearch.randomizedtesting.ThreadLeakControl$StatementRunner.run(ThreadLeakControl.java:368)
	at com.carrotsearch.randomizedtesting.ThreadLeakControl.forkTimeoutingTask(ThreadLeakControl.java:817)
	at com.carrotsearch.randomizedtesting.ThreadLeakControl$3.evaluate(ThreadLeakControl.java:468)
	at com.carrotsearch.randomizedtesting.RandomizedRunner.runSingleTest(RandomizedRunner.java:943)
	at com.carrotsearch.randomizedtesting.RandomizedRunner$5.evaluate(RandomizedRunner.java:829)
	at com.carrotsearch.randomizedtesting.RandomizedRunner$6.evaluate(RandomizedRunner.java:879)
	at com.carrotsearch.randomizedtesting.RandomizedRunner$7.evaluate(RandomizedRunner.java:890)
	at com.carrotsearch.randomizedtesting.rules.StatementAdapter.evaluate(StatementAdapter.java:36)
	at com.carrotsearch.randomizedtesting.rules.SystemPropertiesRestoreRule$1.evaluate(SystemPropertiesRestoreRule.java:57)
	at org.apache.lucene.util.AbstractBeforeAfterRule$1.evaluate(AbstractBeforeAfterRule.java:45)
	at com.carrotsearch.randomizedtesting.rules.StatementAdapter.evaluate(StatementAdapter.java:36)
	at org.apache.lucene.util.TestRuleStoreClassName$1.evaluate(TestRuleStoreClassName.java:41)
	at com.carrotsearch.randomizedtesting.rules.NoShadowingOrOverridesOnMethodsRule$1.evaluate(NoShadowingOrOverridesOnMethodsRule.java:40)
	at com.carrotsearch.randomizedtesting.rules.NoShadowingOrOverridesOnMethodsRule$1.evaluate(NoShadowingOrOverridesOnMethodsRule.java:40)
	at com.carrotsearch.randomizedtesting.rules.StatementAdapter.evaluate(StatementAdapter.java:36)
	at com.carrotsearch.randomizedtesting.rules.StatementAdapter.evaluate(StatementAdapter.java:36)
	at org.apache.lucene.util.TestRuleAssertionsRequired$1.evaluate(TestRuleAssertionsRequired.java:53)
	at org.apache.lucene.util.TestRuleMarkFailure$1.evaluate(TestRuleMarkFailure.java:47)
	at org.apache.lucene.util.TestRuleIgnoreAfterMaxFailures$1.evaluate(TestRuleIgnoreAfterMaxFailures.java:64)
	at org.apache.lucene.util.TestRuleIgnoreTestSuites$1.evaluate(TestRuleIgnoreTestSuites.java:54)
	at com.carrotsearch.randomizedtesting.rules.StatementAdapter.evaluate(StatementAdapter.java:36)
	at com.carrotsearch.randomizedtesting.ThreadLeakControl$StatementRunner.run(ThreadLeakControl.java:368)
	at java.base/java.lang.Thread.run(Thread.java:834)


FAILED:  org.apache.solr.cloud.TestMiniSolrCloudClusterSSL.testSslWithCheckPeerName

Error Message:
Could not find collection:first_collection

Stack Trace:
java.lang.AssertionError: Could not find collection:first_collection
	at __randomizedtesting.SeedInfo.seed([46E036155C41E5C0:F564E1E5E7107D11]:0)
	at org.junit.Assert.fail(Assert.java:93)
	at org.junit.Assert.assertTrue(Assert.java:43)
	at org.junit.Assert.assertNotNull(Assert.java:526)
	at org.apache.solr.cloud.AbstractDistribZkTestBase.waitForRecoveriesToFinish(AbstractDistribZkTestBase.java:155)
	at org.apache.solr.cloud.TestMiniSolrCloudClusterSSL.checkCreateCollection(TestMiniSolrCloudClusterSSL.java:261)
	at org.apache.solr.cloud.TestMiniSolrCloudClusterSSL.checkClusterWithCollectionCreations(TestMiniSolrCloudClusterSSL.java:231)
	at org.apache.solr.cloud.TestMiniSolrCloudClusterSSL.checkClusterWithNodeReplacement(TestMiniSolrCloudClusterSSL.java:155)
	at org.apache.solr.cloud.TestMiniSolrCloudClusterSSL.testSslWithCheckPeerName(TestMiniSolrCloudClusterSSL.java:137)
	at java.base/jdk.internal.reflect.NativeMethodAccessorImpl.invoke0(Native Method)
	at java.base/jdk.internal.reflect.NativeMethodAccessorImpl.invoke(NativeMethodAccessorImpl.java:62)
	at java.base/jdk.internal.reflect.DelegatingMethodAccessorImpl.invoke(DelegatingMethodAccessorImpl.java:43)
	at java.base/java.lang.reflect.Method.invoke(Method.java:566)
	at com.carrotsearch.randomizedtesting.RandomizedRunner.invoke(RandomizedRunner.java:1737)
	at com.carrotsearch.randomizedtesting.RandomizedRunner$8.evaluate(RandomizedRunner.java:934)
	at com.carrotsearch.randomizedtesting.RandomizedRunner$9.evaluate(RandomizedRunner.java:970)
	at com.carrotsearch.randomizedtesting.RandomizedRunner$10.evaluate(RandomizedRunner.java:984)
	at com.carrotsearch.randomizedtesting.rules.StatementAdapter.evaluate(StatementAdapter.java:36)
	at com.carrotsearch.randomizedtesting.rules.SystemPropertiesRestoreRule$1.evaluate(SystemPropertiesRestoreRule.java:57)
	at org.apache.lucene.util.TestRuleSetupTeardownChained$1.evaluate(TestRuleSetupTeardownChained.java:49)
	at org.apache.lucene.util.AbstractBeforeAfterRule$1.evaluate(AbstractBeforeAfterRule.java:45)
	at org.apache.lucene.util.TestRuleThreadAndTestName$1.evaluate(TestRuleThreadAndTestName.java:48)
	at org.apache.lucene.util.TestRuleIgnoreAfterMaxFailures$1.evaluate(TestRuleIgnoreAfterMaxFailures.java:64)
	at org.apache.lucene.util.TestRuleMarkFailure$1.evaluate(TestRuleMarkFailure.java:47)
	at com.carrotsearch.randomizedtesting.rules.StatementAdapter.evaluate(StatementAdapter.java:36)
	at com.carrotsearch.randomizedtesting.ThreadLeakControl$StatementRunner.run(ThreadLeakControl.java:368)
	at com.carrotsearch.randomizedtesting.ThreadLeakControl.forkTimeoutingTask(ThreadLeakControl.java:817)
	at com.carrotsearch.randomizedtesting.ThreadLeakControl$3.evaluate(ThreadLeakControl.java:468)
	at com.carrotsearch.randomizedtesting.RandomizedRunner.runSingleTest(RandomizedRunner.java:943)
	at com.carrotsearch.randomizedtesting.RandomizedRunner$5.evaluate(RandomizedRunner.java:829)
	at com.carrotsearch.randomizedtesting.RandomizedRunner$6.evaluate(RandomizedRunner.java:879)
	at com.carrotsearch.randomizedtesting.RandomizedRunner$7.evaluate(RandomizedRunner.java:890)
	at com.carrotsearch.randomizedtesting.rules.StatementAdapter.evaluate(StatementAdapter.java:36)
	at com.carrotsearch.randomizedtesting.rules.SystemPropertiesRestoreRule$1.evaluate(SystemPropertiesRestoreRule.java:57)
	at org.apache.lucene.util.AbstractBeforeAfterRule$1.evaluate(AbstractBeforeAfterRule.java:45)
	at com.carrotsearch.randomizedtesting.rules.StatementAdapter.evaluate(StatementAdapter.java:36)
	at org.apache.lucene.util.TestRuleStoreClassName$1.evaluate(TestRuleStoreClassName.java:41)
	at com.carrotsearch.randomizedtesting.rules.NoShadowingOrOverridesOnMethodsRule$1.evaluate(NoShadowingOrOverridesOnMethodsRule.java:40)
	at com.carrotsearch.randomizedtesting.rules.NoShadowingOrOverridesOnMethodsRule$1.evaluate(NoShadowingOrOverridesOnMethodsRule.java:40)
	at com.carrotsearch.randomizedtesting.rules.StatementAdapter.evaluate(StatementAdapter.java:36)
	at com.carrotsearch.randomizedtesting.rules.StatementAdapter.evaluate(StatementAdapter.java:36)
	at org.apache.lucene.util.TestRuleAssertionsRequired$1.evaluate(TestRuleAssertionsRequired.java:53)
	at org.apache.lucene.util.TestRuleMarkFailure$1.evaluate(TestRuleMarkFailure.java:47)
	at org.apache.lucene.util.TestRuleIgnoreAfterMaxFailures$1.evaluate(TestRuleIgnoreAfterMaxFailures.java:64)
	at org.apache.lucene.util.TestRuleIgnoreTestSuites$1.evaluate(TestRuleIgnoreTestSuites.java:54)
	at com.carrotsearch.randomizedtesting.rules.StatementAdapter.evaluate(StatementAdapter.java:36)
	at com.carrotsearch.randomizedtesting.ThreadLeakControl$StatementRunner.run(ThreadLeakControl.java:368)
	at java.base/java.lang.Thread.run(Thread.java:834)


FAILED:  org.apache.solr.cloud.TestMiniSolrCloudClusterSSL.testSslWithCheckPeerName

Error Message:
Could not find collection:first_collection

Stack Trace:
java.lang.AssertionError: Could not find collection:first_collection
	at __randomizedtesting.SeedInfo.seed([46E036155C41E5C0:F564E1E5E7107D11]:0)
	at org.junit.Assert.fail(Assert.java:93)
	at org.junit.Assert.assertTrue(Assert.java:43)
	at org.junit.Assert.assertNotNull(Assert.java:526)
	at org.apache.solr.cloud.AbstractDistribZkTestBase.waitForRecoveriesToFinish(AbstractDistribZkTestBase.java:155)
	at org.apache.solr.cloud.TestMiniSolrCloudClusterSSL.checkCreateCollection(TestMiniSolrCloudClusterSSL.java:261)
	at org.apache.solr.cloud.TestMiniSolrCloudClusterSSL.checkClusterWithCollectionCreations(TestMiniSolrCloudClusterSSL.java:231)
	at org.apache.solr.cloud.TestMiniSolrCloudClusterSSL.checkClusterWithNodeReplacement(TestMiniSolrCloudClusterSSL.java:155)
	at org.apache.solr.cloud.TestMiniSolrCloudClusterSSL.testSslWithCheckPeerName(TestMiniSolrCloudClusterSSL.java:137)
	at java.base/jdk.internal.reflect.NativeMethodAccessorImpl.invoke0(Native Method)
	at java.base/jdk.internal.reflect.NativeMethodAccessorImpl.invoke(NativeMethodAccessorImpl.java:62)
	at java.base/jdk.internal.reflect.DelegatingMethodAccessorImpl.invoke(DelegatingMethodAccessorImpl.java:43)
	at java.base/java.lang.reflect.Method.invoke(Method.java:566)
	at com.carrotsearch.randomizedtesting.RandomizedRunner.invoke(RandomizedRunner.java:1737)
	at com.carrotsearch.randomizedtesting.RandomizedRunner$8.evaluate(RandomizedRunner.java:934)
	at com.carrotsearch.randomizedtesting.RandomizedRunner$9.evaluate(RandomizedRunner.java:970)
	at com.carrotsearch.randomizedtesting.RandomizedRunner$10.evaluate(RandomizedRunner.java:984)
	at com.carrotsearch.randomizedtesting.rules.StatementAdapter.evaluate(StatementAdapter.java:36)
	at com.carrotsearch.randomizedtesting.rules.SystemPropertiesRestoreRule$1.evaluate(SystemPropertiesRestoreRule.java:57)
	at org.apache.lucene.util.TestRuleSetupTeardownChained$1.evaluate(TestRuleSetupTeardownChained.java:49)
	at org.apache.lucene.util.AbstractBeforeAfterRule$1.evaluate(AbstractBeforeAfterRule.java:45)
	at org.apache.lucene.util.TestRuleThreadAndTestName$1.evaluate(TestRuleThreadAndTestName.java:48)
	at org.apache.lucene.util.TestRuleIgnoreAfterMaxFailures$1.evaluate(TestRuleIgnoreAfterMaxFailures.java:64)
	at org.apache.lucene.util.TestRuleMarkFailure$1.evaluate(TestRuleMarkFailure.java:47)
	at com.carrotsearch.randomizedtesting.rules.StatementAdapter.evaluate(StatementAdapter.java:36)
	at com.carrotsearch.randomizedtesting.ThreadLeakControl$StatementRunner.run(ThreadLeakControl.java:368)
	at com.carrotsearch.randomizedtesting.ThreadLeakControl.forkTimeoutingTask(ThreadLeakControl.java:817)
	at com.carrotsearch.randomizedtesting.ThreadLeakControl$3.evaluate(ThreadLeakControl.java:468)
	at com.carrotsearch.randomizedtesting.RandomizedRunner.runSingleTest(RandomizedRunner.java:943)
	at com.carrotsearch.randomizedtesting.RandomizedRunner$5.evaluate(RandomizedRunner.java:829)
	at com.carrotsearch.randomizedtesting.RandomizedRunner$6.evaluate(RandomizedRunner.java:879)
	at com.carrotsearch.randomizedtesting.RandomizedRunner$7.evaluate(RandomizedRunner.java:890)
	at com.carrotsearch.randomizedtesting.rules.StatementAdapter.evaluate(StatementAdapter.java:36)
	at com.carrotsearch.randomizedtesting.rules.SystemPropertiesRestoreRule$1.evaluate(SystemPropertiesRestoreRule.java:57)
	at org.apache.lucene.util.AbstractBeforeAfterRule$1.evaluate(AbstractBeforeAfterRule.java:45)
	at com.carrotsearch.randomizedtesting.rules.StatementAdapter.evaluate(StatementAdapter.java:36)
	at org.apache.lucene.util.TestRuleStoreClassName$1.evaluate(TestRuleStoreClassName.java:41)
	at com.carrotsearch.randomizedtesting.rules.NoShadowingOrOverridesOnMethodsRule$1.evaluate(NoShadowingOrOverridesOnMethodsRule.java:40)
	at com.carrotsearch.randomizedtesting.rules.NoShadowingOrOverridesOnMethodsRule$1.evaluate(NoShadowingOrOverridesOnMethodsRule.java:40)
	at com.carrotsearch.randomizedtesting.rules.StatementAdapter.evaluate(StatementAdapter.java:36)
	at com.carrotsearch.randomizedtesting.rules.StatementAdapter.evaluate(StatementAdapter.java:36)
	at org.apache.lucene.util.TestRuleAssertionsRequired$1.evaluate(TestRuleAssertionsRequired.java:53)
	at org.apache.lucene.util.TestRuleMarkFailure$1.evaluate(TestRuleMarkFailure.java:47)
	at org.apache.lucene.util.TestRuleIgnoreAfterMaxFailures$1.evaluate(TestRuleIgnoreAfterMaxFailures.java:64)
	at org.apache.lucene.util.TestRuleIgnoreTestSuites$1.evaluate(TestRuleIgnoreTestSuites.java:54)
	at com.carrotsearch.randomizedtesting.rules.StatementAdapter.evaluate(StatementAdapter.java:36)
	at com.carrotsearch.randomizedtesting.ThreadLeakControl$StatementRunner.run(ThreadLeakControl.java:368)
	at java.base/java.lang.Thread.run(Thread.java:834)


FAILED:  org.apache.solr.cloud.TestMiniSolrCloudClusterSSL.testSslWithCheckPeerName

Error Message:
Could not find collection:first_collection

Stack Trace:
java.lang.AssertionError: Could not find collection:first_collection
	at __randomizedtesting.SeedInfo.seed([46E036155C41E5C0:F564E1E5E7107D11]:0)
	at org.junit.Assert.fail(Assert.java:93)
	at org.junit.Assert.assertTrue(Assert.java:43)
	at org.junit.Assert.assertNotNull(Assert.java:526)
	at org.apache.solr.cloud.AbstractDistribZkTestBase.waitForRecoveriesToFinish(AbstractDistribZkTestBase.java:155)
	at org.apache.solr.cloud.TestMiniSolrCloudClusterSSL.checkCreateCollection(TestMiniSolrCloudClusterSSL.java:261)
	at org.apache.solr.cloud.TestMiniSolrCloudClusterSSL.checkClusterWithCollectionCreations(TestMiniSolrCloudClusterSSL.java:231)
	at org.apache.solr.cloud.TestMiniSolrCloudClusterSSL.checkClusterWithNodeReplacement(TestMiniSolrCloudClusterSSL.java:155)
	at org.apache.solr.cloud.TestMiniSolrCloudClusterSSL.testSslWithCheckPeerName(TestMiniSolrCloudClusterSSL.java:137)
	at java.base/jdk.internal.reflect.NativeMethodAccessorImpl.invoke0(Native Method)
	at java.base/jdk.internal.reflect.NativeMethodAccessorImpl.invoke(NativeMethodAccessorImpl.java:62)
	at java.base/jdk.internal.reflect.DelegatingMethodAccessorImpl.invoke(DelegatingMethodAccessorImpl.java:43)
	at java.base/java.lang.reflect.Method.invoke(Method.java:566)
	at com.carrotsearch.randomizedtesting.RandomizedRunner.invoke(RandomizedRunner.java:1737)
	at com.carrotsearch.randomizedtesting.RandomizedRunner$8.evaluate(RandomizedRunner.java:934)
	at com.carrotsearch.randomizedtesting.RandomizedRunner$9.evaluate(RandomizedRunner.java:970)
	at com.carrotsearch.randomizedtesting.RandomizedRunner$10.evaluate(RandomizedRunner.java:984)
	at com.carrotsearch.randomizedtesting.rules.StatementAdapter.evaluate(StatementAdapter.java:36)
	at com.carrotsearch.randomizedtesting.rules.SystemPropertiesRestoreRule$1.evaluate(SystemPropertiesRestoreRule.java:57)
	at org.apache.lucene.util.TestRuleSetupTeardownChained$1.evaluate(TestRuleSetupTeardownChained.java:49)
	at org.apache.lucene.util.AbstractBeforeAfterRule$1.evaluate(AbstractBeforeAfterRule.java:45)
	at org.apache.lucene.util.TestRuleThreadAndTestName$1.evaluate(TestRuleThreadAndTestName.java:48)
	at org.apache.lucene.util.TestRuleIgnoreAfterMaxFailures$1.evaluate(TestRuleIgnoreAfterMaxFailures.java:64)
	at org.apache.lucene.util.TestRuleMarkFailure$1.evaluate(TestRuleMarkFailure.java:47)
	at com.carrotsearch.randomizedtesting.rules.StatementAdapter.evaluate(StatementAdapter.java:36)
	at com.carrotsearch.randomizedtesting.ThreadLeakControl$StatementRunner.run(ThreadLeakControl.java:368)
	at com.carrotsearch.randomizedtesting.ThreadLeakControl.forkTimeoutingTask(ThreadLeakControl.java:817)
	at com.carrotsearch.randomizedtesting.ThreadLeakControl$3.evaluate(ThreadLeakControl.java:468)
	at com.carrotsearch.randomizedtesting.RandomizedRunner.runSingleTest(RandomizedRunner.java:943)
	at com.carrotsearch.randomizedtesting.RandomizedRunner$5.evaluate(RandomizedRunner.java:829)
	at com.carrotsearch.randomizedtesting.RandomizedRunner$6.evaluate(RandomizedRunner.java:879)
	at com.carrotsearch.randomizedtesting.RandomizedRunner$7.evaluate(RandomizedRunner.java:890)
	at com.carrotsearch.randomizedtesting.rules.StatementAdapter.evaluate(StatementAdapter.java:36)
	at com.carrotsearch.randomizedtesting.rules.SystemPropertiesRestoreRule$1.evaluate(SystemPropertiesRestoreRule.java:57)
	at org.apache.lucene.util.AbstractBeforeAfterRule$1.evaluate(AbstractBeforeAfterRule.java:45)
	at com.carrotsearch.randomizedtesting.rules.StatementAdapter.evaluate(StatementAdapter.java:36)
	at org.apache.lucene.util.TestRuleStoreClassName$1.evaluate(TestRuleStoreClassName.java:41)
	at com.carrotsearch.randomizedtesting.rules.NoShadowingOrOverridesOnMethodsRule$1.evaluate(NoShadowingOrOverridesOnMethodsRule.java:40)
	at com.carrotsearch.randomizedtesting.rules.NoShadowingOrOverridesOnMethodsRule$1.evaluate(NoShadowingOrOverridesOnMethodsRule.java:40)
	at com.carrotsearch.randomizedtesting.rules.StatementAdapter.evaluate(StatementAdapter.java:36)
	at com.carrotsearch.randomizedtesting.rules.StatementAdapter.evaluate(StatementAdapter.java:36)
	at org.apache.lucene.util.TestRuleAssertionsRequired$1.evaluate(TestRuleAssertionsRequired.java:53)
	at org.apache.lucene.util.TestRuleMarkFailure$1.evaluate(TestRuleMarkFailure.java:47)
	at org.apache.lucene.util.TestRuleIgnoreAfterMaxFailures$1.evaluate(TestRuleIgnoreAfterMaxFailures.java:64)
	at org.apache.lucene.util.TestRuleIgnoreTestSuites$1.evaluate(TestRuleIgnoreTestSuites.java:54)
	at com.carrotsearch.randomizedtesting.rules.StatementAdapter.evaluate(StatementAdapter.java:36)
	at com.carrotsearch.randomizedtesting.ThreadLeakControl$StatementRunner.run(ThreadLeakControl.java:368)
	at java.base/java.lang.Thread.run(Thread.java:834)




Build Log:
[...truncated 13625 lines...]
   [junit4] Suite: org.apache.solr.OutputWriterTest
   [junit4]   2> 1572184 INFO  (SUITE-OutputWriterTest-seed#[46E036155C41E5C0]-worker) [    ] o.a.s.SolrTestCaseJ4 SecureRandom sanity checks: test.solr.allowed.securerandom=null & java.security.egd=file:/dev/./urandom
   [junit4]   2> Creating dataDir: C:\Users\jenkins\workspace\Lucene-Solr-master-Windows\solr\build\solr-core\test\J1\temp\solr.OutputWriterTest_46E036155C41E5C0-001\init-core-data-001
   [junit4]   2> 1572185 WARN  (SUITE-OutputWriterTest-seed#[46E036155C41E5C0]-worker) [    ] o.a.s.SolrTestCaseJ4 startTrackingSearchers: numOpens=2 numCloses=2
   [junit4]   2> 1572185 INFO  (SUITE-OutputWriterTest-seed#[46E036155C41E5C0]-worker) [    ] o.a.s.SolrTestCaseJ4 Using PointFields (NUMERIC_POINTS_SYSPROP=true) w/NUMERIC_DOCVALUES_SYSPROP=true
   [junit4]   2> 1572186 INFO  (SUITE-OutputWriterTest-seed#[46E036155C41E5C0]-worker) [    ] o.a.s.SolrTestCaseJ4 Randomized ssl (false) and clientAuth (false) via: @org.apache.solr.util.RandomizeSSL(reason="", value=0.0/0.0, ssl=0.0/0.0, clientAuth=0.0/0.0)
   [junit4]   2> 1572186 INFO  (SUITE-OutputWriterTest-seed#[46E036155C41E5C0]-worker) [    ] o.a.s.SolrTestCaseJ4 ####initCore
   [junit4]   2> 1572187 INFO  (SUITE-OutputWriterTest-seed#[46E036155C41E5C0]-worker) [    ] o.a.s.c.SolrResourceLoader [null] Added 2 libs to classloader, from paths: [/C:/Users/jenkins/workspace/Lucene-Solr-master-Windows/solr/core/src/test-files/solr/collection1/lib, /C:/Users/jenkins/workspace/Lucene-Solr-master-Windows/solr/core/src/test-files/solr/collection1/lib/classes]
   [junit4]   2> 1572201 INFO  (SUITE-OutputWriterTest-seed#[46E036155C41E5C0]-worker) [    ] o.a.s.c.SolrConfig Using Lucene MatchVersion: 8.0.0
   [junit4]   2> 1572206 INFO  (SUITE-OutputWriterTest-seed#[46E036155C41E5C0]-worker) [    ] o.a.s.s.IndexSchema [null] Schema name=test
   [junit4]   2> 1572208 INFO  (SUITE-OutputWriterTest-seed#[46E036155C41E5C0]-worker) [    ] o.a.s.s.IndexSchema Loaded schema test/1.0 with uniqueid field id
   [junit4]   2> 1572391 INFO  (SUITE-OutputWriterTest-seed#[46E036155C41E5C0]-worker) [    ] o.a.s.c.TransientSolrCoreCacheDefault Allocating transient cache for 2147483647 transient cores
   [junit4]   2> 1572391 INFO  (SUITE-OutputWriterTest-seed#[46E036155C41E5C0]-worker) [    ] o.a.s.h.a.MetricsHistoryHandler No .system collection, keeping metrics history in memory.
   [junit4]   2> 1572404 INFO  (SUITE-OutputWriterTest-seed#[46E036155C41E5C0]-worker) [    ] o.a.s.m.r.SolrJmxReporter JMX monitoring for 'solr.node' (registry 'solr.node') enabled at server: com.sun.jmx.mbeanserver.JmxMBeanServer@72c31608
   [junit4]   2> 1572409 INFO  (SUITE-OutputWriterTest-seed#[46E036155C41E5C0]-worker) [    ] o.a.s.m.r.SolrJmxReporter JMX monitoring for 'solr.jvm' (registry 'solr.jvm') enabled at server: com.sun.jmx.mbeanserver.JmxMBeanServer@72c31608
   [junit4]   2> 1572409 INFO  (SUITE-OutputWriterTest-seed#[46E036155C41E5C0]-worker) [    ] o.a.s.m.r.SolrJmxReporter JMX monitoring for 'solr.jetty' (registry 'solr.jetty') enabled at server: com.sun.jmx.mbeanserver.JmxMBeanServer@72c31608
   [junit4]   2> 1572411 INFO  (coreLoadExecutor-7837-thread-1) [    x:collection1] o.a.s.c.SolrResourceLoader [null] Added 2 libs to classloader, from paths: [/C:/Users/jenkins/workspace/Lucene-Solr-master-Windows/solr/core/src/test-files/solr/collection1/lib, /C:/Users/jenkins/workspace/Lucene-Solr-master-Windows/solr/core/src/test-files/solr/collection1/lib/classes]
   [junit4]   2> 1572457 INFO  (coreLoadExecutor-7837-thread-1) [    x:collection1] o.a.s.c.SolrConfig Using Lucene MatchVersion: 8.0.0
   [junit4]   2> 1572462 INFO  (coreLoadExecutor-7837-thread-1) [    x:collection1] o.a.s.s.IndexSchema [collection1] Schema name=test
   [junit4]   2> 1572464 INFO  (coreLoadExecutor-7837-thread-1) [    x:collection1] o.a.s.s.IndexSchema Loaded schema test/1.0 with uniqueid field id
   [junit4]   2> 1572464 INFO  (coreLoadExecutor-7837-thread-1) [    x:collection1] o.a.s.c.CoreContainer Creating SolrCore 'collection1' using configuration from instancedir C:\Users\jenkins\workspace\Lucene-Solr-master-Windows\solr\core\src\test-files\solr\collection1, trusted=true
   [junit4]   2> 1572465 INFO  (coreLoadExecutor-7837-thread-1) [    x:collection1] o.a.s.m.r.SolrJmxReporter JMX monitoring for 'solr.core.collection1' (registry 'solr.core.collection1') enabled at server: com.sun.jmx.mbeanserver.JmxMBeanServer@72c31608
   [junit4]   2> 1572465 INFO  (coreLoadExecutor-7837-thread-1) [    x:collection1] o.a.s.c.SolrCore solr.RecoveryStrategy.Builder
   [junit4]   2> 1572465 INFO  (coreLoadExecutor-7837-thread-1) [    x:collection1] o.a.s.c.SolrCore [[collection1] ] Opening new SolrCore at [C:\Users\jenkins\workspace\Lucene-Solr-master-Windows\solr\core\src\test-files\solr\collection1], dataDir=[C:\Users\jenkins\workspace\Lucene-Solr-master-Windows\solr\build\solr-core\test\J1\temp\solr.OutputWriterTest_46E036155C41E5C0-001\init-core-data-001\]
   [junit4]   2> 1572469 INFO  (coreLoadExecutor-7837-thread-1) [    x:collection1] o.a.s.u.RandomMergePolicy RandomMergePolicy wrapping class org.apache.lucene.index.LogDocMergePolicy: [LogDocMergePolicy: minMergeSize=1000, mergeFactor=28, maxMergeSize=9223372036854775807, maxMergeSizeForForcedMerge=9223372036854775807, calibrateSizeByDeletes=false, maxMergeDocs=2147483647, maxCFSSegmentSizeMB=8.796093022207999E12, noCFSRatio=1.0]
   [junit4]   2> 1572668 INFO  (coreLoadExecutor-7837-thread-1) [    x:collection1] o.a.s.r.XSLTResponseWriter xsltCacheLifetimeSeconds=60
   [junit4]   2> 1572713 INFO  (coreLoadExecutor-7837-thread-1) [    x:collection1] o.a.s.u.CommitTracker Hard AutoCommit: disabled
   [junit4]   2> 1572714 INFO  (coreLoadExecutor-7837-thread-1) [    x:collection1] o.a.s.u.CommitTracker Soft AutoCommit: disabled
   [junit4]   2> 1572714 INFO  (coreLoadExecutor-7837-thread-1) [    x:collection1] o.a.s.u.RandomMergePolicy RandomMergePolicy wrapping class org.apache.lucene.index.LogByteSizeMergePolicy: [LogByteSizeMergePolicy: minMergeSize=1677721, mergeFactor=30, maxMergeSize=2147483648, maxMergeSizeForForcedMerge=9223372036854775807, calibrateSizeByDeletes=true, maxMergeDocs=2147483647, maxCFSSegmentSizeMB=8.796093022207999E12, noCFSRatio=0.0]
   [junit4]   2> 1572715 INFO  (coreLoadExecutor-7837-thread-1) [    x:collection1] o.a.s.s.SolrIndexSearcher Opening [Searcher@18ffaf15[collection1] main]
   [junit4]   2> 1572715 WARN  (coreLoadExecutor-7837-thread-1) [    x:collection1] o.a.s.r.ManagedResourceStorage Cannot write to config directory C:\Users\jenkins\workspace\Lucene-Solr-master-Windows\solr\core\src\test-files\solr\collection1\conf; switching to use InMemory storage instead.
   [junit4]   2> 1572716 INFO  (coreLoadExecutor-7837-thread-1) [    x:collection1] o.a.s.h.ReplicationHandler Commits will be reserved for 10000ms.
   [junit4]   2> 1572716 INFO  (searcherExecutor-7838-thread-1-processing-x:collection1) [    x:collection1] o.a.s.c.SolrCore [collection1] Registered new searcher Searcher@18ffaf15[collection1] main{ExitableDirectoryReader(UninvertingDirectoryReader())}
   [junit4]   2> 1572717 INFO  (SUITE-OutputWriterTest-seed#[46E036155C41E5C0]-worker) [    ] o.a.s.SolrTestCaseJ4 ####initCore end
   [junit4]   2> 1572719 INFO  (TEST-OutputWriterTest.testLazy-seed#[46E036155C41E5C0]) [    ] o.a.s.SolrTestCaseJ4 ###Starting testLazy
   [junit4]   2> 1572720 INFO  (TEST-OutputWriterTest.testLazy-seed#[46E036155C41E5C0]) [    ] o.a.s.SolrTestCaseJ4 ###Ending testLazy
   [junit4]   2> 1572722 INFO  (TEST-OutputWriterTest.testTrivialXsltWriter-seed#[46E036155C41E5C0]) [    ] o.a.s.SolrTestCaseJ4 ###Starting testTrivialXsltWriter
   [junit4]   2> 1572722 INFO  (TEST-OutputWriterTest.testTrivialXsltWriter-seed#[46E036155C41E5C0]) [    ] o.a.s.c.S.Request [collection1]  webapp=null path=null params={q=foo&qt=&start=0&rows=20&version=2.2&wt=xslt&tr=dummy.xsl} hits=0 status=0 QTime=0
   [junit4]   2> 1572728 WARN  (TEST-OutputWriterTest.testTrivialXsltWriter-seed#[46E036155C41E5C0]) [    ] o.a.s.u.x.TransformerProvider The TransformerProvider's simplistic XSLT caching mechanism is not appropriate for high load scenarios, unless a single XSLT transform is used and xsltCacheLifetimeSeconds is set to a sufficiently high value.
   [junit4]   2> 1572988 INFO  (TEST-OutputWriterTest.testTrivialXsltWriter-seed#[46E036155C41E5C0]) [    ] o.a.s.SolrTestCaseJ4 ###Ending testTrivialXsltWriter
   [junit4]   2> 1572990 INFO  (TEST-OutputWriterTest.testUselessWriter-seed#[46E036155C41E5C0]) [    ] o.a.s.SolrTestCaseJ4 ###Starting testUselessWriter
   [junit4]   2> 1572990 INFO  (TEST-OutputWriterTest.testUselessWriter-seed#[46E036155C41E5C0]) [    ] o.a.s.c.S.Request [collection1]  webapp=null path=null params={q=foo&qt=&start=0&rows=20&version=2.2&wt=useless&tr=dummy.xsl} hits=0 status=0 QTime=0
   [junit4]   2> 1572990 INFO  (TEST-OutputWriterTest.testUselessWriter-seed#[46E036155C41E5C0]) [    ] o.a.s.c.PluginBag Going to create a new queryResponseWriter with {type = queryResponseWriter,name = useless,class = org.apache.solr.OutputWriterTest$UselessOutputWriter,attributes = {startup=lazy, name=useless, class=org.apache.solr.OutputWriterTest$UselessOutputWriter},} 
   [junit4]   2> 1572991 INFO  (TEST-OutputWriterTest.testUselessWriter-seed#[46E036155C41E5C0]) [    ] o.a.s.SolrTestCaseJ4 ###Ending testUselessWriter
   [junit4]   2> 1572994 INFO  (TEST-OutputWriterTest.testSOLR59responseHeaderVersions-seed#[46E036155C41E5C0]) [    ] o.a.s.SolrTestCaseJ4 ###Starting testSOLR59responseHeaderVersions
   [junit4]   2> 1572994 INFO  (TEST-OutputWriterTest.testSOLR59responseHeaderVersions-seed#[46E036155C41E5C0]) [    ] o.a.s.c.S.Request [collection1]  webapp=null path=null params={q=foo&qt=&start=0&rows=20&wt=standard&tr=dummy.xsl} hits=0 status=0 QTime=0
   [junit4]   2> 1572995 INFO  (TEST-OutputWriterTest.testSOLR59responseHeaderVersions-seed#[46E036155C41E5C0]) [    ] o.a.s.c.S.Request [collection1]  webapp=null path=null params={q=foo&qt=&start=0&rows=20&tr=dummy.xsl} hits=0 status=0 QTime=0
   [junit4]   2> 1572995 INFO  (TEST-OutputWriterTest.testSOLR59responseHeaderVersions-seed#[46E036155C41E5C0]) [    ] o.a.s.c.S.Request [collection1]  webapp=null path=null params={q=foo&qt=&start=0&rows=20&wt=standard&tr=dummy.xsl} hits=0 status=0 QTime=0
   [junit4]   2> 1572996 INFO  (TEST-OutputWriterTest.testSOLR59responseHeaderVersions-seed#[46E036155C41E5C0]) [    ] o.a.s.c.S.Request [collection1]  webapp=null path=null params={q=foo&qt=&start=0&rows=20&tr=dummy.xsl} hits=0 status=0 QTime=0
   [junit4]   2> 1573000 INFO  (TEST-OutputWriterTest.testSOLR59responseHeaderVersions-seed#[46E036155C41E5C0]) [    ] o.a.s.SolrTestCaseJ4 ###Ending testSOLR59responseHeaderVersions
   [junit4]   2> 1573002 INFO  (TEST-OutputWriterTest.testTrivialXsltWriterInclude-seed#[46E036155C41E5C0]) [    ] o.a.s.SolrTestCaseJ4 ###Starting testTrivialXsltWriterInclude
   [junit4]   2> 1573002 INFO  (TEST-OutputWriterTest.testTrivialXsltWriterInclude-seed#[46E036155C41E5C0]) [    ] o.a.s.c.S.Request [collection1]  webapp=null path=null params={q=foo&qt=&start=0&rows=20&wt=xslt&tr=dummy-using-include.xsl} hits=0 status=0 QTime=0
   [junit4]   2> 1573018 INFO  (TEST-OutputWriterTest.testTrivialXsltWriterInclude-seed#[46E036155C41E5C0]) [    ] o.a.s.SolrTestCaseJ4 ###Ending testTrivialXsltWriterInclude
   [junit4]   2> 1573018 INFO  (SUITE-OutputWriterTest-seed#[46E036155C41E5C0]-worker) [    ] o.a.s.SolrTestCaseJ4 ###deleteCore
   [junit4]   2> 1573018 INFO  (SUITE-OutputWriterTest-seed#[46E036155C41E5C0]-worker) [    ] o.a.s.c.CoreContainer Shutting down CoreContainer instance=747418567
   [junit4]   2> 1573018 INFO  (SUITE-OutputWriterTest-seed#[46E036155C41E5C0]-worker) [    ] o.a.s.m.SolrMetricManager Closing metric reporters for registry=solr.node, tag=null
   [junit4]   2> 1573018 INFO  (SUITE-OutputWriterTest-seed#[46E036155C41E5C0]-worker) [    ] o.a.s.m.r.SolrJmxReporter Closing reporter [org.apache.solr.metrics.reporters.SolrJmxReporter@547d1cdf: rootName = null, domain = solr.node, service url = null, agent id = null] for registry solr.node / com.codahale.metrics.MetricRegistry@44386b0c
   [junit4]   2> 1573029 INFO  (SUITE-OutputWriterTest-seed#[46E036155C41E5C0]-worker) [    ] o.a.s.m.SolrMetricManager Closing metric reporters for registry=solr.jvm, tag=null
   [junit4]   2> 1573029 INFO  (SUITE-OutputWriterTest-seed#[46E036155C41E5C0]-worker) [    ] o.a.s.m.r.SolrJmxReporter Closing reporter [org.apache.solr.metrics.reporters.SolrJmxReporter@77474e72: rootName = null, domain = solr.jvm, service url = null, agent id = null] for registry solr.jvm / com.codahale.metrics.MetricRegistry@3c9f7363
   [junit4]   2> 1573031 INFO  (SUITE-OutputWriterTest-seed#[46E036155C41E5C0]-worker) [    ] o.a.s.m.SolrMetricManager Closing metric reporters for registry=solr.jetty, tag=null
   [junit4]   2> 1573031 INFO  (SUITE-OutputWriterTest-seed#[46E036155C41E5C0]-worker) [    ] o.a.s.m.r.SolrJmxReporter Closing reporter [org.apache.solr.metrics.reporters.SolrJmxReporter@4e6a53c5: rootName = null, domain = solr.jetty, service url = null, agent id = null] for registry solr.jetty / com.codahale.metrics.MetricRegistry@78776076
   [junit4]   2> 1573032 INFO  (coreCloseExecutor-7842-thread-1) [    x:collection1] o.a.s.c.SolrCore [collection1]  CLOSING SolrCore org.apache.solr.core.SolrCore@b19d8b7
   [junit4]   2> 1573032 INFO  (coreCloseExecutor-7842-thread-1) [    x:collection1] o.a.s.m.SolrMetricManager Closing metric reporters for registry=solr.core.collection1, tag=b19d8b7
   [junit4]   2> 1573032 INFO  (coreCloseExecutor-7842-thread-1) [    x:collection1] o.a.s.m.r.SolrJmxReporter Closing reporter [org.apache.solr.metrics.reporters.SolrJmxReporter@34ca59d9: rootName = null, domain = solr.core.collection1, service url = null, agent id = null] for registry solr.core.collection1 / com.codahale.metrics.MetricRegistry@27fe62ec
   [junit4]   2> 1573039 INFO  (SUITE-OutputWriterTest-seed#[46E036155C41E5C0]-worker) [    ] o.a.s.SolrTestCaseJ4 ------------------------------------------------------- Done waiting for tracked resources to be released
   [junit4]   2> NOTE: test params are: codec=Asserting(Lucene70): {}, docValues:{}, maxPointsInLeafNode=1792, maxMBSortInHeap=6.015327675319431, sim=Asserting(org.apache.lucene.search.similarities.AssertingSimilarity@6d73c4b2), locale=en-BI, timezone=Atlantic/Canary
   [junit4]   2> NOTE: Windows 10 10.0 amd64/Oracle Corporation 11-ea (64-bit)/cpus=3,threads=1,free=411701048,total=536870912
   [junit4]   2> NOTE: All tests run in this JVM: [TestNamedUpdateProcessors, TestBackupRepositoryFactory, TestSegmentSorting, DocValuesMultiTest, TestCharFilters, TestRealTimeGet, CircularListTest, TestSurroundQueryParser, SaslZkACLProviderTest, SpellCheckCollatorWithCollapseTest, JSONWriterTest, TermVectorComponentDistributedTest, MetricUtilsTest, CoreMergeIndexesAdminHandlerTest, TestXIncludeConfig, DocExpirationUpdateProcessorFactoryTest, TestSha256AuthenticationProvider, TestCollectionsAPIViaSolrCloudCluster, TestSolrFieldCacheBean, TestFieldSortValues, TestFieldTypeCollectionResource, TestAnalyzedSuggestions, HdfsBasicDistributedZk2Test, UtilsToolTest, TestGeoJSONResponseWriter, UUIDFieldTest, TestOrdValues, TestLocalFSCloudBackupRestore, HdfsDirectoryFactoryTest, SpellCheckComponentTest, TestRawTransformer, ConcurrentDeleteAndCreateCollectionTest, TestFuzzyAnalyzedSuggestions, CreateCollectionCleanupTest, TestSolrDeletionPolicy1, RandomizedTaggerTest, PeerSyncReplicationTest, LeaderElectionIntegrationTest, BaseCdcrDistributedZkTest, ConfigureRecoveryStrategyTest, DistributedSpellCheckComponentTest, CdcrReplicationHandlerTest, TestRequestStatusCollectionAPI, HealthCheckHandlerTest, HdfsSyncSliceTest, TestPullReplicaErrorHandling, TestSolrCoreSnapshots, XmlInterpolationTest, TestSubQueryTransformer, BasicDistributedZk2Test, SolrGangliaReporterTest, TestLFUCache, BasicZkTest, DistributedQueryComponentOptimizationTest, TestNoOpRegenerator, TestUnifiedSolrHighlighter, TransactionLogTest, CdcrVersionReplicationTest, CoreAdminCreateDiscoverTest, AssignBackwardCompatibilityTest, CursorPagingTest, HdfsWriteToMultipleCollectionsTest, TestLegacyFieldReuse, TestDistributedMissingSort, IgnoreCommitOptimizeUpdateProcessorFactoryTest, TestJsonRequest, TestDynamicURP, RangeFacetCloudTest, TestStandardQParsers, BlockDirectoryTest, TestRecoveryHdfs, TestInPlaceUpdatesStandalone, OrderedExecutorTest, TestDocTermOrds, TestDeleteCollectionOnDownNodes, SolrShardReporterTest, StatelessScriptUpdateProcessorFactoryTest, TestPrepRecovery, RequestLoggingTest, RegexBytesRefFilterTest, TestFunctionQuery, TestSizeLimitedDistributedMap, TestNumericRangeQuery32, TestSystemIdResolver, SynonymTokenizerTest, BlockJoinFacetSimpleTest, DistributedFacetPivotSmallTest, FileUtilsTest, TestSchemaSimilarityResource, SolrCoreCheckLockOnStartupTest, HttpPartitionTest, TestCloudConsistency, ParsingFieldUpdateProcessorsTest, TestCloudSchemaless, TestMergePolicyConfig, DistributedFacetPivotLongTailTest, MoreLikeThisHandlerTest, TestEmbeddedSolrServerSchemaAPI, CustomHighlightComponentTest, TestFieldCollectionResource, TestZkAclsWithHadoopAuth, TestSimpleTextCodec, TestRemoteStreaming, TestClassicSimilarityFactory, TestManagedSynonymGraphFilterFactory, TestFastOutputStream, DistributedVersionInfoTest, SearchHandlerTest, SolrIndexConfigTest, SuggesterTSTTest, BigEndianAscendingWordDeserializerTest, URLClassifyProcessorTest, DirectSolrSpellCheckerTest, TestSolrIndexConfig, DirectUpdateHandlerTest, CSVRequestHandlerTest, HdfsDirectoryTest, TaggerTest, TestConfigSetsAPI, TestReloadDeadlock, ZkNodePropsTest, CloneFieldUpdateProcessorFactoryTest, TestUtils, SimplePostToolTest, CheckHdfsIndexTest, TestEmbeddedSolrServerAdminHandler, InfixSuggestersTest, BadIndexSchemaTest, ForceLeaderTest, TestCodecSupport, HdfsChaosMonkeyNothingIsSafeTest, TestNumericTokenStream, AtomicUpdatesTest, TestManagedSchema, TestObjectReleaseTracker, MoveReplicaTest, ZkSolrClientTest, AnalyticsQueryTest, TestClusterStateMutator, TestSchemalessBufferedUpdates, TestPerFieldSimilarityWithDefaultOverride, ShardRoutingTest, MigrateRouteKeyTest, TestDocBasedVersionConstraints, CoreAdminOperationTest, TestNodeLostTrigger, TestInfoStreamLogging, TestReloadAndDeleteDocs, TestInde

[...truncated too long message...]

um concurrent data watches above limit:
   [junit4]   2> 
   [junit4]   2> 	19	/solr/clusterstate.json
   [junit4]   2> 	19	/solr/clusterprops.json
   [junit4]   2> 	5	/solr/autoscaling.json
   [junit4]   2> 
   [junit4]   2> Maximum concurrent children watches above limit:
   [junit4]   2> 
   [junit4]   2> 	19	/solr/live_nodes
   [junit4]   2> 	19	/solr/collections
   [junit4]   2> 	5	/solr/overseer/queue
   [junit4]   2> 	5	/solr/autoscaling/events/.scheduled_maintenance
   [junit4]   2> 	5	/solr/autoscaling/events/.auto_add_replicas
   [junit4]   2> 	5	/solr/overseer/queue-work
   [junit4]   2> 	5	/solr/overseer/collection-queue-work
   [junit4]   2> 
   [junit4]   2> NOTE: reproduce with: ant test  -Dtestcase=TestSQLHandler -Dtests.method=doTest -Dtests.seed=46E036155C41E5C0 -Dtests.slow=true -Dtests.badapples=true -Dtests.locale=ca-AD -Dtests.timezone=Africa/Timbuktu -Dtests.asserts=true -Dtests.file.encoding=US-ASCII
   [junit4] ERROR   16.5s J0 | TestSQLHandler.doTest <<<
   [junit4]    > Throwable #1: java.io.IOException: --> http://127.0.0.1:54442/s_toi/po/collection1_shard2_replica_n41:Failed to execute sqlQuery 'select id, field_i, str_s from collection1 where (text='(XXXX)' OR text='XXXX') AND text='XXXX' order by field_i desc' against JDBC connection 'jdbc:calcitesolr:'.
   [junit4]    > Error while executing SQL "select id, field_i, str_s from collection1 where (text='(XXXX)' OR text='XXXX') AND text='XXXX' order by field_i desc": java.io.IOException: java.util.concurrent.ExecutionException: java.io.IOException: --> http://127.0.0.1:54442/s_toi/po/collection1_shard2_replica_n41/:id must have DocValues to use this feature.
   [junit4]    > 	at __randomizedtesting.SeedInfo.seed([46E036155C41E5C0:E1A48EB131FAF679]:0)
   [junit4]    > 	at org.apache.solr.client.solrj.io.stream.SolrStream.read(SolrStream.java:217)
   [junit4]    > 	at org.apache.solr.handler.TestSQLHandler.getTuples(TestSQLHandler.java:2523)
   [junit4]    > 	at org.apache.solr.handler.TestSQLHandler.testBasicSelect(TestSQLHandler.java:125)
   [junit4]    > 	at org.apache.solr.handler.TestSQLHandler.doTest(TestSQLHandler.java:83)
   [junit4]    > 	at java.base/jdk.internal.reflect.NativeMethodAccessorImpl.invoke0(Native Method)
   [junit4]    > 	at java.base/jdk.internal.reflect.NativeMethodAccessorImpl.invoke(NativeMethodAccessorImpl.java:62)
   [junit4]    > 	at java.base/jdk.internal.reflect.DelegatingMethodAccessorImpl.invoke(DelegatingMethodAccessorImpl.java:43)
   [junit4]    > 	at java.base/java.lang.reflect.Method.invoke(Method.java:566)
   [junit4]    > 	at org.apache.solr.BaseDistributedSearchTestCase$ShardsRepeatRule$ShardsFixedStatement.callStatement(BaseDistributedSearchTestCase.java:1008)
   [junit4]    > 	at org.apache.solr.BaseDistributedSearchTestCase$ShardsRepeatRule$ShardsStatement.evaluate(BaseDistributedSearchTestCase.java:983)
   [junit4]    > 	at java.base/java.lang.Thread.run(Thread.java:834)
   [junit4]   2> NOTE: leaving temporary files on disk at: C:\Users\jenkins\workspace\Lucene-Solr-master-Windows\solr\build\solr-core\test\J0\temp\solr.handler.TestSQLHandler_46E036155C41E5C0-001
   [junit4]   2> Jul 15, 2018 8:57:57 AM com.carrotsearch.randomizedtesting.ThreadLeakControl checkThreadLeaks
   [junit4]   2> WARNING: Will linger awaiting termination of 4 leaked thread(s).
   [junit4]   2> Jul 15, 2018 8:59:17 AM com.carrotsearch.randomizedtesting.ThreadLeakControl checkThreadLeaks
   [junit4]   2> SEVERE: 1 thread leaked from SUITE scope at org.apache.solr.handler.TestSQLHandler: 
   [junit4]   2>    1) Thread[id=7949, name=Connection evictor, state=TIMED_WAITING, group=TGRP-TestSQLHandler]
   [junit4]   2>         at java.base@11-ea/java.lang.Thread.sleep(Native Method)
   [junit4]   2>         at app//org.apache.http.impl.client.IdleConnectionEvictor$1.run(IdleConnectionEvictor.java:66)
   [junit4]   2>         at java.base@11-ea/java.lang.Thread.run(Thread.java:834)
   [junit4]   2> Jul 15, 2018 8:59:17 AM com.carrotsearch.randomizedtesting.ThreadLeakControl tryToInterruptAll
   [junit4]   2> INFO: Starting to interrupt leaked threads:
   [junit4]   2>    1) Thread[id=7949, name=Connection evictor, state=TIMED_WAITING, group=TGRP-TestSQLHandler]
   [junit4]   2> Jul 15, 2018 8:59:17 AM com.carrotsearch.randomizedtesting.ThreadLeakControl tryToInterruptAll
   [junit4]   2> INFO: All leaked threads terminated.
   [junit4]   2> NOTE: test params are: codec=Asserting(Lucene70): {range_facet_l_dv=BlockTreeOrds(blocksize=128), multiDefault=TestBloomFilteredLucenePostings(BloomFilteringPostingsFormat(Lucene50(blocksize=128))), intDefault=PostingsFormat(name=Asserting), id_i1=PostingsFormat(name=Asserting), id=BlockTreeOrds(blocksize=128), range_facet_i_dv=TestBloomFilteredLucenePostings(BloomFilteringPostingsFormat(Lucene50(blocksize=128))), text=Lucene50(blocksize=128), field_i=TestBloomFilteredLucenePostings(BloomFilteringPostingsFormat(Lucene50(blocksize=128))), str_s=Lucene50(blocksize=128), range_facet_l=TestBloomFilteredLucenePostings(BloomFilteringPostingsFormat(Lucene50(blocksize=128))), timestamp=TestBloomFilteredLucenePostings(BloomFilteringPostingsFormat(Lucene50(blocksize=128)))}, docValues:{range_facet_l_dv=DocValuesFormat(name=Lucene70), _version_=DocValuesFormat(name=Asserting), range_facet_i_dv=DocValuesFormat(name=Direct), intDvoDefault=DocValuesFormat(name=Lucene70), timestamp=DocValuesFormat(name=Direct)}, maxPointsInLeafNode=916, maxMBSortInHeap=6.1082780917947455, sim=Asserting(org.apache.lucene.search.similarities.AssertingSimilarity@7c968c63), locale=ca-AD, timezone=Africa/Timbuktu
   [junit4]   2> NOTE: Windows 10 10.0 amd64/Oracle Corporation 11-ea (64-bit)/cpus=3,threads=1,free=291874192,total=513802240
   [junit4]   2> NOTE: All tests run in this JVM: [TestDistributedSearch, TestConfigSetImmutable, TestSQLHandler, TestMiniSolrCloudClusterSSL, TestConfigSetImmutable, TestMiniSolrCloudClusterSSL, TestDistributedSearch, OutputWriterTest, TestMiniSolrCloudClusterSSL, SolrJmxReporterCloudTest, TestDistributedSearch, TestSQLHandler]
   [junit4]   2> NOTE: reproduce with: ant test  -Dtestcase=TestSQLHandler -Dtests.seed=46E036155C41E5C0 -Dtests.slow=true -Dtests.badapples=true -Dtests.locale=ca-AD -Dtests.timezone=Africa/Timbuktu -Dtests.asserts=true -Dtests.file.encoding=US-ASCII
   [junit4] ERROR   0.00s J0 | TestSQLHandler (suite) <<<
   [junit4]    > Throwable #1: com.carrotsearch.randomizedtesting.ThreadLeakError: 1 thread leaked from SUITE scope at org.apache.solr.handler.TestSQLHandler: 
   [junit4]    >    1) Thread[id=7949, name=Connection evictor, state=TIMED_WAITING, group=TGRP-TestSQLHandler]
   [junit4]    >         at java.base@11-ea/java.lang.Thread.sleep(Native Method)
   [junit4]    >         at app//org.apache.http.impl.client.IdleConnectionEvictor$1.run(IdleConnectionEvictor.java:66)
   [junit4]    >         at java.base@11-ea/java.lang.Thread.run(Thread.java:834)
   [junit4]    > 	at __randomizedtesting.SeedInfo.seed([46E036155C41E5C0]:0)
   [junit4] Completed [27/30 (8!)] on J0 in 96.79s, 1 test, 2 errors <<< FAILURES!

[...truncated 41 lines...]
BUILD FAILED
C:\Users\jenkins\workspace\Lucene-Solr-master-Windows\lucene\common-build.xml:1568: The following error occurred while executing this line:
C:\Users\jenkins\workspace\Lucene-Solr-master-Windows\lucene\common-build.xml:1092: There were test failures: 30 suites, 85 tests, 3 suite-level errors, 3 errors, 5 failures [seed: 46E036155C41E5C0]

Total time: 10 minutes 59 seconds

[repro] Setting last failure code to 1

[repro] Failures:
[repro]   0/5 failed: org.apache.solr.OutputWriterTest
[repro]   0/5 failed: org.apache.solr.TestDistributedSearch
[repro]   0/5 failed: org.apache.solr.core.TestConfigSetImmutable
[repro]   0/5 failed: org.apache.solr.metrics.reporters.SolrJmxReporterCloudTest
[repro]   3/5 failed: org.apache.solr.handler.TestSQLHandler
[repro]   5/5 failed: org.apache.solr.cloud.TestMiniSolrCloudClusterSSL
[repro] Exiting with code 1

C:\Users\jenkins\workspace\Lucene-Solr-master-Windows>IF EXIST lucene\build move /y lucene\build lucene\build.repro 
        1 dir(s) moved.

C:\Users\jenkins\workspace\Lucene-Solr-master-Windows>IF EXIST solr\build move /y solr\build solr\build.repro 
        1 dir(s) moved.

C:\Users\jenkins\workspace\Lucene-Solr-master-Windows>IF EXIST lucene\build.orig move /y lucene\build.orig lucene\build 
        1 dir(s) moved.

C:\Users\jenkins\workspace\Lucene-Solr-master-Windows>IF EXIST solr\build.orig move /y solr\build.orig solr\build 
        1 dir(s) moved.

C:\Users\jenkins\workspace\Lucene-Solr-master-Windows>exit 0 
Archiving artifacts
Setting ANT_1_8_2_HOME=C:\Users\jenkins\tools\hudson.tasks.Ant_AntInstallation\ANT_1.8.2
[WARNINGS] Parsing warnings in console log with parser Java Compiler (javac)
Setting ANT_1_8_2_HOME=C:\Users\jenkins\tools\hudson.tasks.Ant_AntInstallation\ANT_1.8.2
Setting ANT_1_8_2_HOME=C:\Users\jenkins\tools\hudson.tasks.Ant_AntInstallation\ANT_1.8.2
<Git Blamer> Using GitBlamer to create author and commit information for all warnings.
<Git Blamer> GIT_COMMIT=e56c81b452a77a4bd7538e5db951a010ddfe3c05, workspace=C:\Users\jenkins\workspace\Lucene-Solr-master-Windows
[WARNINGS] Computing warning deltas based on reference build #7417
Recording test results
Setting ANT_1_8_2_HOME=C:\Users\jenkins\tools\hudson.tasks.Ant_AntInstallation\ANT_1.8.2
Build step 'Publish JUnit test result report' changed build result to UNSTABLE
Email was triggered for: Unstable (Test Failures)
Sending email for trigger: Unstable (Test Failures)
Setting ANT_1_8_2_HOME=C:\Users\jenkins\tools\hudson.tasks.Ant_AntInstallation\ANT_1.8.2
Setting ANT_1_8_2_HOME=C:\Users\jenkins\tools\hudson.tasks.Ant_AntInstallation\ANT_1.8.2
Setting ANT_1_8_2_HOME=C:\Users\jenkins\tools\hudson.tasks.Ant_AntInstallation\ANT_1.8.2
Setting ANT_1_8_2_HOME=C:\Users\jenkins\tools\hudson.tasks.Ant_AntInstallation\ANT_1.8.2

Mime
View raw message