lucene-dev mailing list archives

Site index · List index
Message view « Date » · « Thread »
Top « Date » · « Thread »
From Policeman Jenkins Server <jenk...@thetaphi.de>
Subject [JENKINS] Lucene-Solr-7.x-Linux (32bit/jdk1.8.0_172) - Build # 2319 - Failure!
Date Sat, 14 Jul 2018 18:18:36 GMT
Build: https://jenkins.thetaphi.de/job/Lucene-Solr-7.x-Linux/2319/
Java: 32bit/jdk1.8.0_172 -client -XX:+UseG1GC

2 tests failed.
FAILED:  org.apache.solr.cloud.LIRRollingUpdatesTest.testOldLeaderAndMixedReplicas

Error Message:
Error from server at https://127.0.0.1:34689/solr: ADDREPLICA failed to create replica

Stack Trace:
org.apache.solr.client.solrj.impl.HttpSolrClient$RemoteSolrException: Error from server at https://127.0.0.1:34689/solr: ADDREPLICA failed to create replica
	at __randomizedtesting.SeedInfo.seed([180117DDEDF3D7D5:BCE5CF2B9A2C9EC4]:0)
	at org.apache.solr.client.solrj.impl.HttpSolrClient.executeMethod(HttpSolrClient.java:643)
	at org.apache.solr.client.solrj.impl.HttpSolrClient.request(HttpSolrClient.java:255)
	at org.apache.solr.client.solrj.impl.HttpSolrClient.request(HttpSolrClient.java:244)
	at org.apache.solr.client.solrj.impl.LBHttpSolrClient.doRequest(LBHttpSolrClient.java:483)
	at org.apache.solr.client.solrj.impl.LBHttpSolrClient.request(LBHttpSolrClient.java:413)
	at org.apache.solr.client.solrj.impl.CloudSolrClient.sendRequest(CloudSolrClient.java:1106)
	at org.apache.solr.client.solrj.impl.CloudSolrClient.requestWithRetryOnStaleState(CloudSolrClient.java:886)
	at org.apache.solr.client.solrj.impl.CloudSolrClient.request(CloudSolrClient.java:819)
	at org.apache.solr.client.solrj.SolrRequest.process(SolrRequest.java:194)
	at org.apache.solr.client.solrj.SolrRequest.process(SolrRequest.java:211)
	at org.apache.solr.cloud.LIRRollingUpdatesTest.testLeaderAndMixedReplicas(LIRRollingUpdatesTest.java:257)
	at org.apache.solr.cloud.LIRRollingUpdatesTest.testOldLeaderAndMixedReplicas(LIRRollingUpdatesTest.java:343)
	at sun.reflect.NativeMethodAccessorImpl.invoke0(Native Method)
	at sun.reflect.NativeMethodAccessorImpl.invoke(NativeMethodAccessorImpl.java:62)
	at sun.reflect.DelegatingMethodAccessorImpl.invoke(DelegatingMethodAccessorImpl.java:43)
	at java.lang.reflect.Method.invoke(Method.java:498)
	at com.carrotsearch.randomizedtesting.RandomizedRunner.invoke(RandomizedRunner.java:1737)
	at com.carrotsearch.randomizedtesting.RandomizedRunner$8.evaluate(RandomizedRunner.java:934)
	at com.carrotsearch.randomizedtesting.RandomizedRunner$9.evaluate(RandomizedRunner.java:970)
	at com.carrotsearch.randomizedtesting.RandomizedRunner$10.evaluate(RandomizedRunner.java:984)
	at com.carrotsearch.randomizedtesting.rules.SystemPropertiesRestoreRule$1.evaluate(SystemPropertiesRestoreRule.java:57)
	at org.apache.lucene.util.TestRuleSetupTeardownChained$1.evaluate(TestRuleSetupTeardownChained.java:49)
	at org.apache.lucene.util.AbstractBeforeAfterRule$1.evaluate(AbstractBeforeAfterRule.java:45)
	at org.apache.lucene.util.TestRuleThreadAndTestName$1.evaluate(TestRuleThreadAndTestName.java:48)
	at org.apache.lucene.util.TestRuleIgnoreAfterMaxFailures$1.evaluate(TestRuleIgnoreAfterMaxFailures.java:64)
	at org.apache.lucene.util.TestRuleMarkFailure$1.evaluate(TestRuleMarkFailure.java:47)
	at com.carrotsearch.randomizedtesting.rules.StatementAdapter.evaluate(StatementAdapter.java:36)
	at com.carrotsearch.randomizedtesting.ThreadLeakControl$StatementRunner.run(ThreadLeakControl.java:368)
	at com.carrotsearch.randomizedtesting.ThreadLeakControl.forkTimeoutingTask(ThreadLeakControl.java:817)
	at com.carrotsearch.randomizedtesting.ThreadLeakControl$3.evaluate(ThreadLeakControl.java:468)
	at com.carrotsearch.randomizedtesting.RandomizedRunner.runSingleTest(RandomizedRunner.java:943)
	at com.carrotsearch.randomizedtesting.RandomizedRunner$5.evaluate(RandomizedRunner.java:829)
	at com.carrotsearch.randomizedtesting.RandomizedRunner$6.evaluate(RandomizedRunner.java:879)
	at com.carrotsearch.randomizedtesting.RandomizedRunner$7.evaluate(RandomizedRunner.java:890)
	at com.carrotsearch.randomizedtesting.rules.StatementAdapter.evaluate(StatementAdapter.java:36)
	at com.carrotsearch.randomizedtesting.rules.SystemPropertiesRestoreRule$1.evaluate(SystemPropertiesRestoreRule.java:57)
	at org.apache.lucene.util.AbstractBeforeAfterRule$1.evaluate(AbstractBeforeAfterRule.java:45)
	at com.carrotsearch.randomizedtesting.rules.StatementAdapter.evaluate(StatementAdapter.java:36)
	at org.apache.lucene.util.TestRuleStoreClassName$1.evaluate(TestRuleStoreClassName.java:41)
	at com.carrotsearch.randomizedtesting.rules.NoShadowingOrOverridesOnMethodsRule$1.evaluate(NoShadowingOrOverridesOnMethodsRule.java:40)
	at com.carrotsearch.randomizedtesting.rules.NoShadowingOrOverridesOnMethodsRule$1.evaluate(NoShadowingOrOverridesOnMethodsRule.java:40)
	at com.carrotsearch.randomizedtesting.rules.StatementAdapter.evaluate(StatementAdapter.java:36)
	at com.carrotsearch.randomizedtesting.rules.StatementAdapter.evaluate(StatementAdapter.java:36)
	at com.carrotsearch.randomizedtesting.rules.StatementAdapter.evaluate(StatementAdapter.java:36)
	at org.apache.lucene.util.TestRuleAssertionsRequired$1.evaluate(TestRuleAssertionsRequired.java:53)
	at org.apache.lucene.util.TestRuleMarkFailure$1.evaluate(TestRuleMarkFailure.java:47)
	at org.apache.lucene.util.TestRuleIgnoreAfterMaxFailures$1.evaluate(TestRuleIgnoreAfterMaxFailures.java:64)
	at org.apache.lucene.util.TestRuleIgnoreTestSuites$1.evaluate(TestRuleIgnoreTestSuites.java:54)
	at com.carrotsearch.randomizedtesting.rules.StatementAdapter.evaluate(StatementAdapter.java:36)
	at com.carrotsearch.randomizedtesting.ThreadLeakControl$StatementRunner.run(ThreadLeakControl.java:368)
	at java.lang.Thread.run(Thread.java:748)


FAILED:  org.apache.solr.cloud.LIRRollingUpdatesTest.testNewLeaderAndMixedReplicas

Error Message:
Error from server at https://127.0.0.1:34689/solr: ADDREPLICA failed to create replica

Stack Trace:
org.apache.solr.client.solrj.impl.HttpSolrClient$RemoteSolrException: Error from server at https://127.0.0.1:34689/solr: ADDREPLICA failed to create replica
	at __randomizedtesting.SeedInfo.seed([180117DDEDF3D7D5:AD76F946D69784B5]:0)
	at org.apache.solr.client.solrj.impl.HttpSolrClient.executeMethod(HttpSolrClient.java:643)
	at org.apache.solr.client.solrj.impl.HttpSolrClient.request(HttpSolrClient.java:255)
	at org.apache.solr.client.solrj.impl.HttpSolrClient.request(HttpSolrClient.java:244)
	at org.apache.solr.client.solrj.impl.LBHttpSolrClient.doRequest(LBHttpSolrClient.java:483)
	at org.apache.solr.client.solrj.impl.LBHttpSolrClient.request(LBHttpSolrClient.java:413)
	at org.apache.solr.client.solrj.impl.CloudSolrClient.sendRequest(CloudSolrClient.java:1106)
	at org.apache.solr.client.solrj.impl.CloudSolrClient.requestWithRetryOnStaleState(CloudSolrClient.java:886)
	at org.apache.solr.client.solrj.impl.CloudSolrClient.request(CloudSolrClient.java:819)
	at org.apache.solr.client.solrj.SolrRequest.process(SolrRequest.java:194)
	at org.apache.solr.client.solrj.SolrRequest.process(SolrRequest.java:211)
	at org.apache.solr.cloud.LIRRollingUpdatesTest.testLeaderAndMixedReplicas(LIRRollingUpdatesTest.java:248)
	at org.apache.solr.cloud.LIRRollingUpdatesTest.testNewLeaderAndMixedReplicas(LIRRollingUpdatesTest.java:337)
	at sun.reflect.NativeMethodAccessorImpl.invoke0(Native Method)
	at sun.reflect.NativeMethodAccessorImpl.invoke(NativeMethodAccessorImpl.java:62)
	at sun.reflect.DelegatingMethodAccessorImpl.invoke(DelegatingMethodAccessorImpl.java:43)
	at java.lang.reflect.Method.invoke(Method.java:498)
	at com.carrotsearch.randomizedtesting.RandomizedRunner.invoke(RandomizedRunner.java:1737)
	at com.carrotsearch.randomizedtesting.RandomizedRunner$8.evaluate(RandomizedRunner.java:934)
	at com.carrotsearch.randomizedtesting.RandomizedRunner$9.evaluate(RandomizedRunner.java:970)
	at com.carrotsearch.randomizedtesting.RandomizedRunner$10.evaluate(RandomizedRunner.java:984)
	at com.carrotsearch.randomizedtesting.rules.SystemPropertiesRestoreRule$1.evaluate(SystemPropertiesRestoreRule.java:57)
	at org.apache.lucene.util.TestRuleSetupTeardownChained$1.evaluate(TestRuleSetupTeardownChained.java:49)
	at org.apache.lucene.util.AbstractBeforeAfterRule$1.evaluate(AbstractBeforeAfterRule.java:45)
	at org.apache.lucene.util.TestRuleThreadAndTestName$1.evaluate(TestRuleThreadAndTestName.java:48)
	at org.apache.lucene.util.TestRuleIgnoreAfterMaxFailures$1.evaluate(TestRuleIgnoreAfterMaxFailures.java:64)
	at org.apache.lucene.util.TestRuleMarkFailure$1.evaluate(TestRuleMarkFailure.java:47)
	at com.carrotsearch.randomizedtesting.rules.StatementAdapter.evaluate(StatementAdapter.java:36)
	at com.carrotsearch.randomizedtesting.ThreadLeakControl$StatementRunner.run(ThreadLeakControl.java:368)
	at com.carrotsearch.randomizedtesting.ThreadLeakControl.forkTimeoutingTask(ThreadLeakControl.java:817)
	at com.carrotsearch.randomizedtesting.ThreadLeakControl$3.evaluate(ThreadLeakControl.java:468)
	at com.carrotsearch.randomizedtesting.RandomizedRunner.runSingleTest(RandomizedRunner.java:943)
	at com.carrotsearch.randomizedtesting.RandomizedRunner$5.evaluate(RandomizedRunner.java:829)
	at com.carrotsearch.randomizedtesting.RandomizedRunner$6.evaluate(RandomizedRunner.java:879)
	at com.carrotsearch.randomizedtesting.RandomizedRunner$7.evaluate(RandomizedRunner.java:890)
	at com.carrotsearch.randomizedtesting.rules.StatementAdapter.evaluate(StatementAdapter.java:36)
	at com.carrotsearch.randomizedtesting.rules.SystemPropertiesRestoreRule$1.evaluate(SystemPropertiesRestoreRule.java:57)
	at org.apache.lucene.util.AbstractBeforeAfterRule$1.evaluate(AbstractBeforeAfterRule.java:45)
	at com.carrotsearch.randomizedtesting.rules.StatementAdapter.evaluate(StatementAdapter.java:36)
	at org.apache.lucene.util.TestRuleStoreClassName$1.evaluate(TestRuleStoreClassName.java:41)
	at com.carrotsearch.randomizedtesting.rules.NoShadowingOrOverridesOnMethodsRule$1.evaluate(NoShadowingOrOverridesOnMethodsRule.java:40)
	at com.carrotsearch.randomizedtesting.rules.NoShadowingOrOverridesOnMethodsRule$1.evaluate(NoShadowingOrOverridesOnMethodsRule.java:40)
	at com.carrotsearch.randomizedtesting.rules.StatementAdapter.evaluate(StatementAdapter.java:36)
	at com.carrotsearch.randomizedtesting.rules.StatementAdapter.evaluate(StatementAdapter.java:36)
	at com.carrotsearch.randomizedtesting.rules.StatementAdapter.evaluate(StatementAdapter.java:36)
	at org.apache.lucene.util.TestRuleAssertionsRequired$1.evaluate(TestRuleAssertionsRequired.java:53)
	at org.apache.lucene.util.TestRuleMarkFailure$1.evaluate(TestRuleMarkFailure.java:47)
	at org.apache.lucene.util.TestRuleIgnoreAfterMaxFailures$1.evaluate(TestRuleIgnoreAfterMaxFailures.java:64)
	at org.apache.lucene.util.TestRuleIgnoreTestSuites$1.evaluate(TestRuleIgnoreTestSuites.java:54)
	at com.carrotsearch.randomizedtesting.rules.StatementAdapter.evaluate(StatementAdapter.java:36)
	at com.carrotsearch.randomizedtesting.ThreadLeakControl$StatementRunner.run(ThreadLeakControl.java:368)
	at java.lang.Thread.run(Thread.java:748)




Build Log:
[...truncated 13414 lines...]
   [junit4] Suite: org.apache.solr.cloud.LIRRollingUpdatesTest
   [junit4]   2> Creating dataDir: /home/jenkins/workspace/Lucene-Solr-7.x-Linux/solr/build/solr-core/test/J1/temp/solr.cloud.LIRRollingUpdatesTest_180117DDEDF3D7D5-001/init-core-data-001
   [junit4]   2> 2320733 WARN  (SUITE-LIRRollingUpdatesTest-seed#[180117DDEDF3D7D5]-worker) [    ] o.a.s.SolrTestCaseJ4 startTrackingSearchers: numOpens=39 numCloses=39
   [junit4]   2> 2320733 INFO  (SUITE-LIRRollingUpdatesTest-seed#[180117DDEDF3D7D5]-worker) [    ] o.a.s.SolrTestCaseJ4 Using TrieFields (NUMERIC_POINTS_SYSPROP=false) w/NUMERIC_DOCVALUES_SYSPROP=true
   [junit4]   2> 2320734 INFO  (SUITE-LIRRollingUpdatesTest-seed#[180117DDEDF3D7D5]-worker) [    ] o.a.s.SolrTestCaseJ4 Randomized ssl (true) and clientAuth (false) via: @org.apache.solr.util.RandomizeSSL(reason=, ssl=NaN, value=NaN, clientAuth=NaN)
   [junit4]   2> 2320735 INFO  (SUITE-LIRRollingUpdatesTest-seed#[180117DDEDF3D7D5]-worker) [    ] o.a.s.SolrTestCaseJ4 SecureRandom sanity checks: test.solr.allowed.securerandom=null & java.security.egd=file:/dev/./urandom
   [junit4]   2> 2320735 INFO  (SUITE-LIRRollingUpdatesTest-seed#[180117DDEDF3D7D5]-worker) [    ] o.a.s.c.MiniSolrCloudCluster Starting cluster of 3 servers in /home/jenkins/workspace/Lucene-Solr-7.x-Linux/solr/build/solr-core/test/J1/temp/solr.cloud.LIRRollingUpdatesTest_180117DDEDF3D7D5-001/tempDir-001
   [junit4]   2> 2320735 INFO  (SUITE-LIRRollingUpdatesTest-seed#[180117DDEDF3D7D5]-worker) [    ] o.a.s.c.ZkTestServer STARTING ZK TEST SERVER
   [junit4]   2> 2320735 INFO  (Thread-3227) [    ] o.a.s.c.ZkTestServer client port:0.0.0.0/0.0.0.0:0
   [junit4]   2> 2320735 INFO  (Thread-3227) [    ] o.a.s.c.ZkTestServer Starting server
   [junit4]   2> 2320737 ERROR (Thread-3227) [    ] o.a.z.s.ZooKeeperServer ZKShutdownHandler is not registered, so ZooKeeper server won't take any action on ERROR or SHUTDOWN server state changes
   [junit4]   2> 2320835 INFO  (SUITE-LIRRollingUpdatesTest-seed#[180117DDEDF3D7D5]-worker) [    ] o.a.s.c.ZkTestServer start zk server on port:42775
   [junit4]   2> 2320838 INFO  (zkConnectionManagerCallback-3683-thread-1) [    ] o.a.s.c.c.ConnectionManager zkClient has connected
   [junit4]   2> 2320843 INFO  (jetty-launcher-3680-thread-3) [    ] o.e.j.s.Server jetty-9.4.11.v20180605; built: 2018-06-05T18:24:03.829Z; git: d5fc0523cfa96bfebfbda19606cad384d772f04c; jvm 1.8.0_172-b11
   [junit4]   2> 2320843 INFO  (jetty-launcher-3680-thread-2) [    ] o.e.j.s.Server jetty-9.4.11.v20180605; built: 2018-06-05T18:24:03.829Z; git: d5fc0523cfa96bfebfbda19606cad384d772f04c; jvm 1.8.0_172-b11
   [junit4]   2> 2320843 INFO  (jetty-launcher-3680-thread-1) [    ] o.e.j.s.Server jetty-9.4.11.v20180605; built: 2018-06-05T18:24:03.829Z; git: d5fc0523cfa96bfebfbda19606cad384d772f04c; jvm 1.8.0_172-b11
   [junit4]   2> 2320846 INFO  (jetty-launcher-3680-thread-1) [    ] o.e.j.s.session DefaultSessionIdManager workerName=node0
   [junit4]   2> 2320846 INFO  (jetty-launcher-3680-thread-1) [    ] o.e.j.s.session No SessionScavenger set, using defaults
   [junit4]   2> 2320846 INFO  (jetty-launcher-3680-thread-3) [    ] o.e.j.s.session DefaultSessionIdManager workerName=node0
   [junit4]   2> 2320847 INFO  (jetty-launcher-3680-thread-3) [    ] o.e.j.s.session No SessionScavenger set, using defaults
   [junit4]   2> 2320847 INFO  (jetty-launcher-3680-thread-2) [    ] o.e.j.s.session DefaultSessionIdManager workerName=node0
   [junit4]   2> 2320847 INFO  (jetty-launcher-3680-thread-1) [    ] o.e.j.s.session node0 Scavenging every 660000ms
   [junit4]   2> 2320847 INFO  (jetty-launcher-3680-thread-3) [    ] o.e.j.s.session node0 Scavenging every 600000ms
   [junit4]   2> 2320847 INFO  (jetty-launcher-3680-thread-2) [    ] o.e.j.s.session No SessionScavenger set, using defaults
   [junit4]   2> 2320847 INFO  (jetty-launcher-3680-thread-2) [    ] o.e.j.s.session node0 Scavenging every 600000ms
   [junit4]   2> 2320847 INFO  (jetty-launcher-3680-thread-1) [    ] o.e.j.s.h.ContextHandler Started o.e.j.s.ServletContextHandler@15117c4{/solr,null,AVAILABLE}
   [junit4]   2> 2320847 INFO  (jetty-launcher-3680-thread-3) [    ] o.e.j.s.h.ContextHandler Started o.e.j.s.ServletContextHandler@1a8edec{/solr,null,AVAILABLE}
   [junit4]   2> 2320848 INFO  (jetty-launcher-3680-thread-2) [    ] o.e.j.s.h.ContextHandler Started o.e.j.s.ServletContextHandler@ec4f29{/solr,null,AVAILABLE}
   [junit4]   2> 2320849 INFO  (jetty-launcher-3680-thread-1) [    ] o.e.j.s.AbstractConnector Started ServerConnector@157a10d{SSL,[ssl, http/1.1]}{127.0.0.1:46165}
   [junit4]   2> 2320849 INFO  (jetty-launcher-3680-thread-3) [    ] o.e.j.s.AbstractConnector Started ServerConnector@8adff0{SSL,[ssl, http/1.1]}{127.0.0.1:46127}
   [junit4]   2> 2320849 INFO  (jetty-launcher-3680-thread-1) [    ] o.e.j.s.Server Started @2320922ms
   [junit4]   2> 2320849 INFO  (jetty-launcher-3680-thread-2) [    ] o.e.j.s.AbstractConnector Started ServerConnector@219e56{SSL,[ssl, http/1.1]}{127.0.0.1:45027}
   [junit4]   2> 2320849 INFO  (jetty-launcher-3680-thread-3) [    ] o.e.j.s.Server Started @2320922ms
   [junit4]   2> 2320849 INFO  (jetty-launcher-3680-thread-1) [    ] o.a.s.c.s.e.JettySolrRunner Jetty properties: {hostContext=/solr, hostPort=46165}
   [junit4]   2> 2320849 INFO  (jetty-launcher-3680-thread-3) [    ] o.a.s.c.s.e.JettySolrRunner Jetty properties: {hostContext=/solr, hostPort=46127}
   [junit4]   2> 2320849 INFO  (jetty-launcher-3680-thread-2) [    ] o.e.j.s.Server Started @2320922ms
   [junit4]   2> 2320850 INFO  (jetty-launcher-3680-thread-2) [    ] o.a.s.c.s.e.JettySolrRunner Jetty properties: {hostContext=/solr, hostPort=45027}
   [junit4]   2> 2320850 ERROR (jetty-launcher-3680-thread-3) [    ] o.a.s.u.StartupLoggingUtils Missing Java Option solr.log.dir. Logging may be missing or incomplete.
   [junit4]   2> 2320850 ERROR (jetty-launcher-3680-thread-1) [    ] o.a.s.u.StartupLoggingUtils Missing Java Option solr.log.dir. Logging may be missing or incomplete.
   [junit4]   2> 2320850 INFO  (jetty-launcher-3680-thread-3) [    ] o.a.s.s.SolrDispatchFilter Using logger factory org.apache.logging.slf4j.Log4jLoggerFactory
   [junit4]   2> 2320850 INFO  (jetty-launcher-3680-thread-1) [    ] o.a.s.s.SolrDispatchFilter Using logger factory org.apache.logging.slf4j.Log4jLoggerFactory
   [junit4]   2> 2320850 ERROR (jetty-launcher-3680-thread-2) [    ] o.a.s.u.StartupLoggingUtils Missing Java Option solr.log.dir. Logging may be missing or incomplete.
   [junit4]   2> 2320850 INFO  (jetty-launcher-3680-thread-1) [    ] o.a.s.s.SolrDispatchFilter  ___      _       Welcome to Apache Solr™ version 7.5.0
   [junit4]   2> 2320850 INFO  (jetty-launcher-3680-thread-3) [    ] o.a.s.s.SolrDispatchFilter  ___      _       Welcome to Apache Solr™ version 7.5.0
   [junit4]   2> 2320850 INFO  (jetty-launcher-3680-thread-2) [    ] o.a.s.s.SolrDispatchFilter Using logger factory org.apache.logging.slf4j.Log4jLoggerFactory
   [junit4]   2> 2320850 INFO  (jetty-launcher-3680-thread-3) [    ] o.a.s.s.SolrDispatchFilter / __| ___| |_ _   Starting in cloud mode on port null
   [junit4]   2> 2320850 INFO  (jetty-launcher-3680-thread-2) [    ] o.a.s.s.SolrDispatchFilter  ___      _       Welcome to Apache Solr™ version 7.5.0
   [junit4]   2> 2320850 INFO  (jetty-launcher-3680-thread-3) [    ] o.a.s.s.SolrDispatchFilter \__ \/ _ \ | '_|  Install dir: null
   [junit4]   2> 2320850 INFO  (jetty-launcher-3680-thread-1) [    ] o.a.s.s.SolrDispatchFilter / __| ___| |_ _   Starting in cloud mode on port null
   [junit4]   2> 2320850 INFO  (jetty-launcher-3680-thread-2) [    ] o.a.s.s.SolrDispatchFilter / __| ___| |_ _   Starting in cloud mode on port null
   [junit4]   2> 2320850 INFO  (jetty-launcher-3680-thread-1) [    ] o.a.s.s.SolrDispatchFilter \__ \/ _ \ | '_|  Install dir: null
   [junit4]   2> 2320850 INFO  (jetty-launcher-3680-thread-2) [    ] o.a.s.s.SolrDispatchFilter \__ \/ _ \ | '_|  Install dir: null
   [junit4]   2> 2320850 INFO  (jetty-launcher-3680-thread-1) [    ] o.a.s.s.SolrDispatchFilter |___/\___/_|_|    Start time: 2018-07-14T01:56:47.764Z
   [junit4]   2> 2320850 INFO  (jetty-launcher-3680-thread-3) [    ] o.a.s.s.SolrDispatchFilter |___/\___/_|_|    Start time: 2018-07-14T01:56:47.764Z
   [junit4]   2> 2320850 INFO  (jetty-launcher-3680-thread-2) [    ] o.a.s.s.SolrDispatchFilter |___/\___/_|_|    Start time: 2018-07-14T01:56:47.764Z
   [junit4]   2> 2320851 INFO  (zkConnectionManagerCallback-3686-thread-1) [    ] o.a.s.c.c.ConnectionManager zkClient has connected
   [junit4]   2> 2320851 INFO  (zkConnectionManagerCallback-3687-thread-1) [    ] o.a.s.c.c.ConnectionManager zkClient has connected
   [junit4]   2> 2320852 INFO  (zkConnectionManagerCallback-3689-thread-1) [    ] o.a.s.c.c.ConnectionManager zkClient has connected
   [junit4]   2> 2320852 INFO  (jetty-launcher-3680-thread-3) [    ] o.a.s.s.SolrDispatchFilter solr.xml found in ZooKeeper. Loading...
   [junit4]   2> 2320852 INFO  (jetty-launcher-3680-thread-1) [    ] o.a.s.s.SolrDispatchFilter solr.xml found in ZooKeeper. Loading...
   [junit4]   2> 2320852 INFO  (jetty-launcher-3680-thread-2) [    ] o.a.s.s.SolrDispatchFilter solr.xml found in ZooKeeper. Loading...
   [junit4]   2> 2320858 WARN  (NIOServerCxn.Factory:0.0.0.0/0.0.0.0:0) [    ] o.a.z.s.NIOServerCnxn Unable to read additional data from client sessionid 0x1003bc239ab0001, likely client has closed socket
   [junit4]   2> 2321775 INFO  (jetty-launcher-3680-thread-2) [    ] o.a.s.c.ZkContainer Zookeeper client=127.0.0.1:42775/solr
   [junit4]   2> 2321776 INFO  (zkConnectionManagerCallback-3693-thread-1) [    ] o.a.s.c.c.ConnectionManager zkClient has connected
   [junit4]   2> 2321778 INFO  (zkConnectionManagerCallback-3695-thread-1) [    ] o.a.s.c.c.ConnectionManager zkClient has connected
   [junit4]   2> 2321833 INFO  (jetty-launcher-3680-thread-2) [n:127.0.0.1:45027_solr    ] o.a.s.c.Overseer Overseer (id=null) closing
   [junit4]   2> 2321834 INFO  (jetty-launcher-3680-thread-2) [n:127.0.0.1:45027_solr    ] o.a.s.c.OverseerElectionContext I am going to be the leader 127.0.0.1:45027_solr
   [junit4]   2> 2321835 INFO  (jetty-launcher-3680-thread-2) [n:127.0.0.1:45027_solr    ] o.a.s.c.Overseer Overseer (id=72123299415130117-127.0.0.1:45027_solr-n_0000000000) starting
   [junit4]   2> 2321840 INFO  (zkConnectionManagerCallback-3702-thread-1) [    ] o.a.s.c.c.ConnectionManager zkClient has connected
   [junit4]   2> 2321841 INFO  (jetty-launcher-3680-thread-2) [n:127.0.0.1:45027_solr    ] o.a.s.c.s.i.ZkClientClusterStateProvider Cluster at 127.0.0.1:42775/solr ready
   [junit4]   2> 2321842 INFO  (jetty-launcher-3680-thread-2) [n:127.0.0.1:45027_solr    ] o.a.s.c.ZkController Register node as live in ZooKeeper:/live_nodes/127.0.0.1:45027_solr
   [junit4]   2> 2321843 INFO  (zkCallback-3694-thread-1) [    ] o.a.s.c.c.ZkStateReader Updated live nodes from ZooKeeper... (0) -> (1)
   [junit4]   2> 2321846 INFO  (zkCallback-3701-thread-1) [    ] o.a.s.c.c.ZkStateReader Updated live nodes from ZooKeeper... (0) -> (1)
   [junit4]   2> 2322519 INFO  (jetty-launcher-3680-thread-3) [    ] o.a.s.c.ZkContainer Zookeeper client=127.0.0.1:42775/solr
   [junit4]   2> 2322520 INFO  (zkConnectionManagerCallback-3706-thread-1) [    ] o.a.s.c.c.ConnectionManager zkClient has connected
   [junit4]   2> 2322522 INFO  (zkConnectionManagerCallback-3708-thread-1) [    ] o.a.s.c.c.ConnectionManager zkClient has connected
   [junit4]   2> 2322526 INFO  (jetty-launcher-3680-thread-3) [n:127.0.0.1:46127_solr    ] o.a.s.c.c.ZkStateReader Updated live nodes from ZooKeeper... (0) -> (1)
   [junit4]   2> 2322528 INFO  (jetty-launcher-3680-thread-3) [n:127.0.0.1:46127_solr    ] o.a.s.c.Overseer Overseer (id=null) closing
   [junit4]   2> 2322529 INFO  (jetty-launcher-3680-thread-3) [n:127.0.0.1:46127_solr    ] o.a.s.c.TransientSolrCoreCacheDefault Allocating transient cache for 2147483647 transient cores
   [junit4]   2> 2322529 INFO  (jetty-launcher-3680-thread-3) [n:127.0.0.1:46127_solr    ] o.a.s.c.ZkController Register node as live in ZooKeeper:/live_nodes/127.0.0.1:46127_solr
   [junit4]   2> 2322530 INFO  (zkCallback-3694-thread-1) [    ] o.a.s.c.c.ZkStateReader Updated live nodes from ZooKeeper... (1) -> (2)
   [junit4]   2> 2322530 INFO  (zkCallback-3701-thread-1) [    ] o.a.s.c.c.ZkStateReader Updated live nodes from ZooKeeper... (1) -> (2)
   [junit4]   2> 2322530 INFO  (zkCallback-3707-thread-1) [    ] o.a.s.c.c.ZkStateReader Updated live nodes from ZooKeeper... (1) -> (2)
   [junit4]   2> 2322668 INFO  (jetty-launcher-3680-thread-1) [    ] o.a.s.c.ZkContainer Zookeeper client=127.0.0.1:42775/solr
   [junit4]   2> 2322669 INFO  (zkConnectionManagerCallback-3714-thread-1) [    ] o.a.s.c.c.ConnectionManager zkClient has connected
   [junit4]   2> 2322671 INFO  (zkConnectionManagerCallback-3716-thread-1) [    ] o.a.s.c.c.ConnectionManager zkClient has connected
   [junit4]   2> 2322676 INFO  (jetty-launcher-3680-thread-1) [n:127.0.0.1:46165_solr    ] o.a.s.c.c.ZkStateReader Updated live nodes from ZooKeeper... (0) -> (2)
   [junit4]   2> 2322677 INFO  (jetty-launcher-3680-thread-1) [n:127.0.0.1:46165_solr    ] o.a.s.c.Overseer Overseer (id=null) closing
   [junit4]   2> 2322679 INFO  (jetty-launcher-3680-thread-1) [n:127.0.0.1:46165_solr    ] o.a.s.c.TransientSolrCoreCacheDefault Allocating transient cache for 2147483647 transient cores
   [junit4]   2> 2322679 INFO  (jetty-launcher-3680-thread-1) [n:127.0.0.1:46165_solr    ] o.a.s.c.ZkController Register node as live in ZooKeeper:/live_nodes/127.0.0.1:46165_solr
   [junit4]   2> 2322680 INFO  (zkCallback-3694-thread-1) [    ] o.a.s.c.c.ZkStateReader Updated live nodes from ZooKeeper... (2) -> (3)
   [junit4]   2> 2322680 INFO  (zkCallback-3707-thread-1) [    ] o.a.s.c.c.ZkStateReader Updated live nodes from ZooKeeper... (2) -> (3)
   [junit4]   2> 2322680 INFO  (zkCallback-3701-thread-1) [    ] o.a.s.c.c.ZkStateReader Updated live nodes from ZooKeeper... (2) -> (3)
   [junit4]   2> 2322680 INFO  (zkCallback-3715-thread-1) [    ] o.a.s.c.c.ZkStateReader Updated live nodes from ZooKeeper... (2) -> (3)
   [junit4]   2> 2326868 INFO  (jetty-launcher-3680-thread-2) [n:127.0.0.1:45027_solr    ] o.a.s.h.a.MetricsHistoryHandler No .system collection, keeping metrics history in memory.
   [junit4]   2> 2326890 INFO  (jetty-launcher-3680-thread-2) [n:127.0.0.1:45027_solr    ] o.a.s.m.r.SolrJmxReporter JMX monitoring for 'solr_45027.solr.node' (registry 'solr.node') enabled at server: com.sun.jmx.mbeanserver.JmxMBeanServer@8b862
   [junit4]   2> 2326898 INFO  (jetty-launcher-3680-thread-2) [n:127.0.0.1:45027_solr    ] o.a.s.m.r.SolrJmxReporter JMX monitoring for 'solr_45027.solr.jvm' (registry 'solr.jvm') enabled at server: com.sun.jmx.mbeanserver.JmxMBeanServer@8b862
   [junit4]   2> 2326898 INFO  (jetty-launcher-3680-thread-2) [n:127.0.0.1:45027_solr    ] o.a.s.m.r.SolrJmxReporter JMX monitoring for 'solr_45027.solr.jetty' (registry 'solr.jetty') enabled at server: com.sun.jmx.mbeanserver.JmxMBeanServer@8b862
   [junit4]   2> 2326899 INFO  (jetty-launcher-3680-thread-2) [n:127.0.0.1:45027_solr    ] o.a.s.c.CorePropertiesLocator Found 0 core definitions underneath /home/jenkins/workspace/Lucene-Solr-7.x-Linux/solr/build/solr-core/test/J1/temp/solr.cloud.LIRRollingUpdatesTest_180117DDEDF3D7D5-001/tempDir-001/node2/.
   [junit4]   2> 2331876 INFO  (zkConnectionManagerCallback-3728-thread-1) [    ] o.a.s.c.c.ConnectionManager zkClient has connected
   [junit4]   2> 2331876 INFO  (zkConnectionManagerCallback-3729-thread-1) [    ] o.a.s.c.c.ConnectionManager zkClient has connected
   [junit4]   2> 2331877 INFO  (jetty-launcher-3680-thread-1) [n:127.0.0.1:46165_solr    ] o.a.s.c.c.ZkStateReader Updated live nodes from ZooKeeper... (0) -> (3)
   [junit4]   2> 2331877 INFO  (jetty-launcher-3680-thread-3) [n:127.0.0.1:46127_solr    ] o.a.s.c.c.ZkStateReader Updated live nodes from ZooKeeper... (0) -> (3)
   [junit4]   2> 2331878 INFO  (jetty-launcher-3680-thread-3) [n:127.0.0.1:46127_solr    ] o.a.s.c.s.i.ZkClientClusterStateProvider Cluster at 127.0.0.1:42775/solr ready
   [junit4]   2> 2331878 INFO  (jetty-launcher-3680-thread-1) [n:127.0.0.1:46165_solr    ] o.a.s.c.s.i.ZkClientClusterStateProvider Cluster at 127.0.0.1:42775/solr ready
   [junit4]   2> 2331878 INFO  (jetty-launcher-3680-thread-1) [n:127.0.0.1:46165_solr    ] o.a.s.h.a.MetricsHistoryHandler No .system collection, keeping metrics history in memory.
   [junit4]   2> 2331878 INFO  (jetty-launcher-3680-thread-3) [n:127.0.0.1:46127_solr    ] o.a.s.h.a.MetricsHistoryHandler No .system collection, keeping metrics history in memory.
   [junit4]   2> 2331895 INFO  (jetty-launcher-3680-thread-1) [n:127.0.0.1:46165_solr    ] o.a.s.m.r.SolrJmxReporter JMX monitoring for 'solr_46165.solr.node' (registry 'solr.node') enabled at server: com.sun.jmx.mbeanserver.JmxMBeanServer@8b862
   [junit4]   2> 2331901 INFO  (jetty-launcher-3680-thread-3) [n:127.0.0.1:46127_solr    ] o.a.s.m.r.SolrJmxReporter JMX monitoring for 'solr_46127.solr.node' (registry 'solr.node') enabled at server: com.sun.jmx.mbeanserver.JmxMBeanServer@8b862
   [junit4]   2> 2331904 INFO  (jetty-launcher-3680-thread-1) [n:127.0.0.1:46165_solr    ] o.a.s.m.r.SolrJmxReporter JMX monitoring for 'solr_46165.solr.jvm' (registry 'solr.jvm') enabled at server: com.sun.jmx.mbeanserver.JmxMBeanServer@8b862
   [junit4]   2> 2331905 INFO  (jetty-launcher-3680-thread-1) [n:127.0.0.1:46165_solr    ] o.a.s.m.r.SolrJmxReporter JMX monitoring for 'solr_46165.solr.jetty' (registry 'solr.jetty') enabled at server: com.sun.jmx.mbeanserver.JmxMBeanServer@8b862
   [junit4]   2> 2331906 INFO  (jetty-launcher-3680-thread-1) [n:127.0.0.1:46165_solr    ] o.a.s.c.CorePropertiesLocator Found 0 core definitions underneath /home/jenkins/workspace/Lucene-Solr-7.x-Linux/solr/build/solr-core/test/J1/temp/solr.cloud.LIRRollingUpdatesTest_180117DDEDF3D7D5-001/tempDir-001/node1/.
   [junit4]   2> 2331911 INFO  (jetty-launcher-3680-thread-3) [n:127.0.0.1:46127_solr    ] o.a.s.m.r.SolrJmxReporter JMX monitoring for 'solr_46127.solr.jvm' (registry 'solr.jvm') enabled at server: com.sun.jmx.mbeanserver.JmxMBeanServer@8b862
   [junit4]   2> 2331911 INFO  (jetty-launcher-3680-thread-3) [n:127.0.0.1:46127_solr    ] o.a.s.m.r.SolrJmxReporter JMX monitoring for 'solr_46127.solr.jetty' (registry 'solr.jetty') enabled at server: com.sun.jmx.mbeanserver.JmxMBeanServer@8b862
   [junit4]   2> 2331913 INFO  (jetty-launcher-3680-thread-3) [n:127.0.0.1:46127_solr    ] o.a.s.c.CorePropertiesLocator Found 0 core definitions underneath /home/jenkins/workspace/Lucene-Solr-7.x-Linux/solr/build/solr-core/test/J1/temp/solr.cloud.LIRRollingUpdatesTest_180117DDEDF3D7D5-001/tempDir-001/node3/.
   [junit4]   2> 2331975 INFO  (zkConnectionManagerCallback-3733-thread-1) [    ] o.a.s.c.c.ConnectionManager zkClient has connected
   [junit4]   2> 2331978 INFO  (zkConnectionManagerCallback-3738-thread-1) [    ] o.a.s.c.c.ConnectionManager zkClient has connected
   [junit4]   2> 2331979 INFO  (SUITE-LIRRollingUpdatesTest-seed#[180117DDEDF3D7D5]-worker) [    ] o.a.s.c.c.ZkStateReader Updated live nodes from ZooKeeper... (0) -> (3)
   [junit4]   2> 2331980 INFO  (SUITE-LIRRollingUpdatesTest-seed#[180117DDEDF3D7D5]-worker) [    ] o.a.s.c.s.i.ZkClientClusterStateProvider Cluster at 127.0.0.1:42775/solr ready
   [junit4]   2> 2331983 INFO  (SUITE-LIRRollingUpdatesTest-seed#[180117DDEDF3D7D5]-worker) [    ] o.e.j.s.AbstractConnector Stopped ServerConnector@219e56{SSL,[ssl, http/1.1]}{127.0.0.1:0}
   [junit4]   2> 2331984 INFO  (SUITE-LIRRollingUpdatesTest-seed#[180117DDEDF3D7D5]-worker) [    ] o.a.s.c.CoreContainer Shutting down CoreContainer instance=4255748
   [junit4]   2> 2331984 INFO  (SUITE-LIRRollingUpdatesTest-seed#[180117DDEDF3D7D5]-worker) [    ] o.a.s.m.SolrMetricManager Closing metric reporters for registry=solr.node, tag=null
   [junit4]   2> 2331984 INFO  (SUITE-LIRRollingUpdatesTest-seed#[180117DDEDF3D7D5]-worker) [    ] o.a.s.m.r.SolrJmxReporter Closing reporter [org.apache.solr.metrics.reporters.SolrJmxReporter@4567f: rootName = solr_45027, domain = solr.node, service url = null, agent id = null] for registry solr.node / com.codahale.metrics.MetricRegistry@194a173
   [junit4]   2> 2331990 INFO  (SUITE-LIRRollingUpdatesTest-seed#[180117DDEDF3D7D5]-worker) [    ] o.a.s.m.SolrMetricManager Closing metric reporters for registry=solr.jvm, tag=null
   [junit4]   2> 2331990 INFO  (SUITE-LIRRollingUpdatesTest-seed#[180117DDEDF3D7D5]-worker) [    ] o.a.s.m.r.SolrJmxReporter Closing reporter [org.apache.solr.metrics.reporters.SolrJmxReporter@159cd2e: rootName = solr_45027, domain = solr.jvm, service url = null, agent id = null] for registry solr.jvm / com.codahale.metrics.MetricRegistry@1d242c0
   [junit4]   2> 2331994 INFO  (SUITE-LIRRollingUpdatesTest-seed#[180117DDEDF3D7D5]-worker) [    ] o.a.s.m.SolrMetricManager Closing metric reporters for registry=solr.jetty, tag=null
   [junit4]   2> 2331994 INFO  (SUITE-LIRRollingUpdatesTest-seed#[180117DDEDF3D7D5]-worker) [    ] o.a.s.m.r.SolrJmxReporter Closing reporter [org.apache.solr.metrics.reporters.SolrJmxReporter@23fc57: rootName = solr_45027, domain = solr.jetty, service url = null, agent id = null] for registry solr.jetty / com.codahale.metrics.MetricRegistry@14407e2
   [junit4]   2> 2331995 INFO  (SUITE-LIRRollingUpdatesTest-seed#[180117DDEDF3D7D5]-worker) [    ] o.a.s.c.ZkController Remove node as live in ZooKeeper:/live_nodes/127.0.0.1:45027_solr
   [junit4]   2> 2331996 INFO  (SUITE-LIRRollingUpdatesTest-seed#[180117DDEDF3D7D5]-worker) [    ] o.a.s.m.SolrMetricManager Closing metric reporters for registry=solr.cluster, tag=null
   [junit4]   2> 2331996 INFO  (SUITE-LIRRollingUpdatesTest-seed#[180117DDEDF3D7D5]-worker) [    ] o.a.s.c.TransientSolrCoreCacheDefault Allocating transient cache for 2147483647 transient cores
   [junit4]   2> 2331996 INFO  (zkCallback-3707-thread-1) [    ] o.a.s.c.c.ZkStateReader Updated live nodes from ZooKeeper... (3) -> (2)
   [junit4]   2> 2331996 INFO  (zkCallback-3694-thread-1) [    ] o.a.s.c.c.ZkStateReader Updated live nodes from ZooKeeper... (3) -> (2)
   [junit4]   2> 2331997 INFO  (SUITE-LIRRollingUpdatesTest-seed#[180117DDEDF3D7D5]-worker) [    ] o.a.s.c.Overseer Overseer (id=72123299415130117-127.0.0.1:45027_solr-n_0000000000) closing
   [junit4]   2> 2331997 INFO  (zkCallback-3737-thread-1) [    ] o.a.s.c.c.ZkStateReader Updated live nodes from ZooKeeper... (3) -> (2)
   [junit4]   2> 2331997 INFO  (zkCallback-3701-thread-1) [    ] o.a.s.c.c.ZkStateReader Updated live nodes from ZooKeeper... (3) -> (2)
   [junit4]   2> 2331997 INFO  (OverseerStateUpdate-72123299415130117-127.0.0.1:45027_solr-n_0000000000) [    ] o.a.s.c.Overseer Overseer Loop exiting : 127.0.0.1:45027_solr
   [junit4]   2> 2331997 WARN  (OverseerAutoScalingTriggerThread-72123299415130117-127.0.0.1:45027_solr-n_0000000000) [    ] o.a.s.c.a.OverseerTriggerThread OverseerTriggerThread woken up but we are closed, exiting.
   [junit4]   2> 2331997 INFO  (zkCallback-3726-thread-1) [    ] o.a.s.c.c.ZkStateReader Updated live nodes from ZooKeeper... (3) -> (2)
   [junit4]   2> 2331997 INFO  (zkCallback-3727-thread-1) [    ] o.a.s.c.c.ZkStateReader Updated live nodes from ZooKeeper... (3) -> (2)
   [junit4]   2> 2331997 INFO  (zkCallback-3715-thread-1) [    ] o.a.s.c.c.ZkStateReader Updated live nodes from ZooKeeper... (3) -> (2)
   [junit4]   2> 2332002 INFO  (SUITE-LIRRollingUpdatesTest-seed#[180117DDEDF3D7D5]-worker) [    ] o.e.j.s.h.ContextHandler Stopped o.e.j.s.ServletContextHandler@ec4f29{/solr,null,UNAVAILABLE}
   [junit4]   2> 2332002 INFO  (zkCallback-3707-thread-1) [    ] o.a.s.c.OverseerElectionContext I am going to be the leader 127.0.0.1:46127_solr
   [junit4]   2> 2332002 INFO  (SUITE-LIRRollingUpdatesTest-seed#[180117DDEDF3D7D5]-worker) [    ] o.e.j.s.session node0 Stopped scavenging
   [junit4]   2> 2332003 INFO  (zkCallback-3707-thread-1) [    ] o.a.s.c.Overseer Overseer (id=72123299415130120-127.0.0.1:46127_solr-n_0000000001) starting
   [junit4]   2> 2332007 INFO  (SUITE-LIRRollingUpdatesTest-seed#[180117DDEDF3D7D5]-worker) [    ] o.e.j.s.Server jetty-9.4.11.v20180605; built: 2018-06-05T18:24:03.829Z; git: d5fc0523cfa96bfebfbda19606cad384d772f04c; jvm 1.8.0_172-b11
   [junit4]   2> 2332011 INFO  (SUITE-LIRRollingUpdatesTest-seed#[180117DDEDF3D7D5]-worker) [    ] o.e.j.s.session DefaultSessionIdManager workerName=node0
   [junit4]   2> 2332011 INFO  (SUITE-LIRRollingUpdatesTest-seed#[180117DDEDF3D7D5]-worker) [    ] o.e.j.s.session No SessionScavenger set, using defaults
   [junit4]   2> 2332011 INFO  (SUITE-LIRRollingUpdatesTest-seed#[180117DDEDF3D7D5]-worker) [    ] o.e.j.s.session node0 Scavenging every 600000ms
   [junit4]   2> 2332011 INFO  (SUITE-LIRRollingUpdatesTest-seed#[180117DDEDF3D7D5]-worker) [    ] o.e.j.s.h.ContextHandler Started o.e.j.s.ServletContextHandler@1f995d{/solr,null,AVAILABLE}
   [junit4]   2> 2332012 INFO  (SUITE-LIRRollingUpdatesTest-seed#[180117DDEDF3D7D5]-worker) [    ] o.e.j.s.AbstractConnector Started ServerConnector@68b48b{SSL,[ssl, http/1.1]}{127.0.0.1:41311}
   [junit4]   2> 2332012 INFO  (SUITE-LIRRollingUpdatesTest-seed#[180117DDEDF3D7D5]-worker) [    ] o.e.j.s.Server Started @2332084ms
   [junit4]   2> 2332012 INFO  (SUITE-LIRRollingUpdatesTest-seed#[180117DDEDF3D7D5]-worker) [    ] o.a.s.c.s.e.JettySolrRunner Jetty properties: {hostContext=/solr, hostPort=45363}
   [junit4]   2> 2332012 ERROR (SUITE-LIRRollingUpdatesTest-seed#[180117DDEDF3D7D5]-worker) [    ] o.a.s.u.StartupLoggingUtils Missing Java Option solr.log.dir. Logging may be missing or incomplete.
   [junit4]   2> 2332013 INFO  (SUITE-LIRRollingUpdatesTest-seed#[180117DDEDF3D7D5]-worker) [    ] o.a.s.s.SolrDispatchFilter Using logger factory org.apache.logging.slf4j.Log4jLoggerFactory
   [junit4]   2> 2332013 INFO  (SUITE-LIRRollingUpdatesTest-seed#[180117DDEDF3D7D5]-worker) [    ] o.a.s.s.SolrDispatchFilter  ___      _       Welcome to Apache Solr™ version 7.5.0
   [junit4]   2> 2332013 INFO  (SUITE-LIRRollingUpdatesTest-seed#[180117DDEDF3D7D5]-worker) [    ] o.a.s.s.SolrDispatchFilter / __| ___| |_ _   Starting in cloud mode on port null
   [junit4]   2> 2332013 INFO  (SUITE-LIRRollingUpdatesTest-seed#[180117DDEDF3D7D5]-worker) [    ] o.a.s.s.SolrDispatchFilter \__ \/ _ \ | '_|  Install dir: null
   [junit4]   2> 2332013 INFO  (SUITE-LIRRollingUpdatesTest-seed#[180117DDEDF3D7D5]-worker) [    ] o.a.s.s.SolrDispatchFilter |___/\___/_|_|    Start time: 2018-07-14T01:56:58.927Z
   [junit4]   2> 2332014 INFO  (zkConnectionManagerCallback-3740-thread-1) [    ] o.a.s.c.c.ConnectionManager zkClient has connected
   [junit4]   2> 2332015 INFO  (SUITE-LIRRollingUpdatesTest-seed#[180117DDEDF3D7D5]-worker) [    ] o.a.s.s.SolrDispatchFilter solr.xml found in ZooKeeper. Loading...
   [junit4]   2> 2334222 INFO  (SUITE-LIRRollingUpdatesTest-seed#[180117DDEDF3D7D5]-worker) [    ] o.a.s.c.ZkContainer Zookeeper client=127.0.0.1:42775/solr
   [junit4]   2> 2334224 INFO  (zkConnectionManagerCallback-3744-thread-1) [    ] o.a.s.c.c.ConnectionManager zkClient has connected
   [junit4]   2> 2334226 INFO  (zkConnectionManagerCallback-3746-thread-1) [    ] o.a.s.c.c.ConnectionManager zkClient has connected
   [junit4]   2> 2334232 INFO  (SUITE-LIRRollingUpdatesTest-seed#[180117DDEDF3D7D5]-worker) [n:127.0.0.1:45363_solr    ] o.a.s.c.c.ZkStateReader Updated live nodes from ZooKeeper... (0) -> (2)
   [junit4]   2> 2334233 INFO  (SUITE-LIRRollingUpdatesTest-seed#[180117DDEDF3D7D5]-worker) [n:127.0.0.1:45363_solr    ] o.a.s.c.Overseer Overseer (id=null) closing
   [junit4]   2> 2334234 INFO  (SUITE-LIRRollingUpdatesTest-seed#[180117DDEDF3D7D5]-worker) [n:127.0.0.1:45363_solr    ] o.a.s.c.TransientSolrCoreCacheDefault Allocating transient cache for 2147483647 transient cores
   [junit4]   2> 2334235 INFO  (SUITE-LIRRollingUpdatesTest-seed#[180117DDEDF3D7D5]-worker) [n:127.0.0.1:45363_solr    ] o.a.s.c.ZkController Register node as live in ZooKeeper:/live_nodes/127.0.0.1:45363_solr
   [junit4]   2> 2334235 INFO  (zkCallback-3707-thread-1) [    ] o.a.s.c.c.ZkStateReader Updated live nodes from ZooKeeper... (2) -> (3)
   [junit4]   2> 2334235 INFO  (zkCallback-3737-thread-1) [    ] o.a.s.c.c.ZkStateReader Updated live nodes from ZooKeeper... (2) -> (3)
   [junit4]   2> 2334235 INFO  (zkCallback-3715-thread-1) [    ] o.a.s.c.c.ZkStateReader Updated live nodes from ZooKeeper... (2) -> (3)
   [junit4]   2> 2334235 INFO  (zkCallback-3726-thread-1) [    ] o.a.s.c.c.ZkStateReader Updated live nodes from ZooKeeper... (2) -> (3)
   [junit4]   2> 2334235 INFO  (zkCallback-3727-thread-1) [    ] o.a.s.c.c.ZkStateReader Updated live nodes from ZooKeeper... (2) -> (3)
   [junit4]   2> 2334235 INFO  (zkCallback-3745-thread-1) [    ] o.a.s.c.c.ZkStateReader Updated live nodes from ZooKeeper... (2) -> (3)
   [junit4]   2> 2334253 INFO  (zkConnectionManagerCallback-3753-thread-1) [    ] o.a.s.c.c.ConnectionManager zkClient has connected
   [junit4]   2> 2334254 INFO  (SUITE-LIRRollingUpdatesTest-seed#[180117DDEDF3D7D5]-worker) [n:127.0.0.1:45363_solr    ] o.a.s.c.c.ZkStateReader Updated live nodes from ZooKeeper... (0) -> (3)
   [junit4]   2> 2334255 INFO  (SUITE-LIRRollingUpdatesTest-seed#[180117DDEDF3D7D5]-worker) [n:127.0.0.1:45363_solr    ] o.a.s.c.s.i.ZkClientClusterStateProvider Cluster at 127.0.0.1:42775/solr ready
   [junit4]   2> 2334255 INFO  (SUITE-LIRRollingUpdatesTest-seed#[180117DDEDF3D7D5]-worker) [n:127.0.0.1:45363_solr    ] o.a.s.h.a.MetricsHistoryHandler No .system collection, keeping metrics history in memory.
   [junit4]   2> 2334271 INFO  (SUITE-LIRRollingUpdatesTest-seed#[180117DDEDF3D7D5]-worker) [n:127.0.0.1:45363_solr    ] o.a.s.m.r.SolrJmxReporter JMX monitoring for 'solr_45363.solr.node' (registry 'solr.node') enabled at server: com.sun.jmx.mbeanserver.JmxMBeanServer@8b862
   [junit4]   2> 2334279 INFO  (SUITE-LIRRollingUpdatesTest-seed#[180117DDEDF3D7D5]-worker) [n:127.0.0.1:45363_solr    ] o.a.s.m.r.SolrJmxReporter JMX monitoring for 'solr_45363.solr.jvm' (registry 'solr.jvm') enabled at server: com.sun.jmx.mbeanserver.JmxMBeanServer@8b862
   [junit4]   2> 2334279 INFO  (SUITE-LIRRollingUpdatesTest-seed#[180117DDEDF3D7D5]-worker) [n:127.0.0.1:45363_solr    ] o.a.s.m.r.SolrJmxReporter JMX monitoring for 'solr_45363.solr.jetty' (registry 'solr.jetty') enabled at server: com.sun.jmx.mbeanserver.JmxMBeanServer@8b862
   [junit4]   2> 2334280 INFO  (SUITE-LIRRollingUpdatesTest-seed#[180117DDEDF3D7D5]-worker) [n:127.0.0.1:45363_solr    ] o.a.s.c.CorePropertiesLocator Found 0 core definitions underneath /home/jenkins/workspace/Lucene-Solr-7.x-Linux/solr/build/solr-core/test/J1/temp/solr.cloud.LIRRollingUpdatesTest_180117DDEDF3D7D5-001/tempDir-001/node2/.
   [junit4]   2> 2334310 INFO  (SUITE-LIRRollingUpdatesTest-seed#[180117DDEDF3D7D5]-worker) [    ] o.a.s.c.LIRRollingUpdatesTest Adding proxy for URL: https://127.0.0.1:41311/solr. Proxy: https://127.0.0.1:45363/solr
   [junit4]   2> 2334311 INFO  (SUITE-LIRRollingUpdatesTest-seed#[180117DDEDF3D7D5]-worker) [    ] o.e.j.s.AbstractConnector Stopped ServerConnector@157a10d{SSL,[ssl, http/1.1]}{127.0.0.1:0}
   [junit4]   2> 2334312 INFO  (SUITE-LIRRollingUpdatesTest-seed#[180117DDEDF3D7D5]-worker) [    ] o.a.s.c.CoreContainer Shutting down CoreContainer instance=23302069
   [junit4]   2> 2334312 INFO  (SUITE-LIRRollingUpdatesTest-seed#[180117DDEDF3D7D5]-worker) [    ] o.a.s.m.SolrMetricManager Closing metric reporters for registry=solr.node, tag=null
   [junit4]   2> 2334312 INFO  (SUITE-LIRRollingUpdatesTest-seed#[180117DDEDF3D7D5]-worker) [    ] o.a.s.m.r.SolrJmxReporter Closing reporter [org.apache.solr.metrics.reporters.SolrJmxReporter@1f90419: rootName = solr_46165, domain = solr.node, service url = null, agent id = null] for registry solr.node / com.codahale.metrics.MetricRegistry@88065
   [junit4]   2> 2334318 INFO  (SUITE-LIRRollingUpdatesTest-seed#[180117DDEDF3D7D5]-worker) [    ] o.a.s.m.SolrMetricManager Closing metric reporters for registry=solr.jvm, tag=null
   [junit4]   2> 2334318 INFO  (SUITE-LIRRollingUpdatesTest-seed#[180117DDEDF3D7D5]-worker) [    ] o.a.s.m.r.SolrJmxReporter Closing reporter [org.apache.solr.metrics.reporters.SolrJmxReporter@16751c: rootName = solr_46165, domain = solr.jvm, service url = null, agent id = null] for registry solr.jvm / com.codahale.metrics.MetricRegistry@1d242c0
   [junit4]   2> 2334321 INFO  (SUITE-LIRRollingUpdatesTest-seed#[180117DDEDF3D7D5]-worker) [    ] o.a.s.m.SolrMetricManager Closing metric reporters for registry=solr.jetty, tag=null
   [junit4]   2> 2334321 INFO  (SUITE-LIRRollingUpdatesTest-seed#[180117DDEDF3D7D5]-worker) [    ] o.a.s.m.r.SolrJmxReporter Closing reporter [org.apache.solr.metrics.reporters.SolrJmxReporter@a804f7: rootName = solr_46165, domain = solr.jetty, service url = null, agent id = null] for registry solr.jetty / com.codahale.metrics.MetricRegistry@14407e2
   [junit4]   2> 2334323 INFO  (SUITE-LIRRollingUpdatesTest-seed#[180117DDEDF3D7D5]-worker) [    ] o.a.s.c.ZkController Remove node as live in ZooKeeper:/live_nodes/127.0.0.1:46165_solr
   [junit4]   2> 2334324 INFO  (SUITE-LIRRollingUpdatesTest-seed#[180117DDEDF3D7D5]-worker) [    ] o.a.s.m.SolrMetricManager Closing metric reporters for registry=solr.cluster, tag=null
   [junit4]   2> 2334324 INFO  (zkCallback-3707-thread-1) [    ] o.a.s.c.c.ZkStateReader Updated live nodes from ZooKeeper... (3) -> (2)
   [junit4]   2> 2334324 INFO  (zkCallback-3745-thread-1) [    ] o.a.s.c.c.ZkStateReader Updated live nodes from ZooKeeper... (3) -> (2)
   [junit4]   2> 2334324 INFO  (zkCallback-3726-thread-1) [    ] o.a.s.c.c.ZkStateReader Updated live nodes from ZooKeeper... (3) -> (2)
   [junit4]   2> 2334324 INFO  (zkCallback-3727-thread-1) [    ] o.a.s.c.c.ZkStateReader Updated live nodes from ZooKeeper... (3) -> (2)
   [junit4]   2> 2334324 INFO  (zkCallback-3737-thread-1) [    ] o.a.s.c.c.ZkStateReader Updated live nodes from ZooKeeper... (3) -> (2)
   [junit4]   2> 2334325 INFO  (zkCallback-3715-thread-1) [    ] o.a.s.c.c.ZkStateReader Updated live nodes from ZooKeeper... (3) -> (2)
   [junit4]   2> 2334326 INFO  (zkCallback-3752-thread-1) [    ] o.a.s.c.c.ZkStateReader Updated live nodes from ZooKeeper... (3) -> (2)
   [junit4]   2> 2334328 INFO  (SUITE-LIRRollingUpdatesTest-seed#[180117DDEDF3D7D5]-worker) [    ] o.e.j.s.h.ContextHandler Stopped o.e.j.s.ServletContextHandler@15117c4{/solr,null,UNAVAILABLE}
   [junit4]   2> 2334328 INFO  (SUITE-LIRRollingUpdatesTest-seed#[180117DDEDF3D7D5]-worker) [    ] o.e.j.s.session node0 Stopped scavenging
   [junit4]   2> 2334330 INFO  (SUITE-LIRRollingUpdatesTest-seed#[180117DDEDF3D7D5]-worker) [    ] o.e.j.s.Server jetty-9.4.11.v20180605; built: 2018-06-05T18:24:03.829Z; git: d5fc0523cfa96bfebfbda19606cad384d772f04c; jvm 1.8.0_172-b11
   [junit4]   2> 2334330 INFO  (SUITE-LIRRollingUpdatesTest-seed#[180117DDEDF3D7D5]-worker) [    ] o.e.j.s.session DefaultSessionIdManager workerName=node0
   [junit4]   2> 2334330 INFO  (SUITE-LIRRollingUpdatesTest-seed#[180117DDEDF3D7D5]-worker) [    ] o.e.j.s.session No SessionScavenger set, using defaults
   [junit4]   2> 2334330 INFO  (SUITE-LIRRollingUpdatesTest-seed#[180117DDEDF3D7D5]-worker) [    ] o.e.j.s.session node0 Scavenging every 660000ms
   [junit4]   2> 2334333 INFO  (SUITE-LIRRollingUpdatesTest-seed#[180117DDEDF3D7D5]-worker) [    ] o.e.j.s.h.ContextHandler Started o.e.j.s.ServletContextHandler@8c86e9{/solr,null,AVAILABLE}
   [junit4]   2> 2334334 INFO  (SUITE-LIRRollingUpdatesTest-seed#[180117DDEDF3D7D5]-worker) [    ] o.e.j.s.AbstractConnector Started ServerConnector@bcefd9{SSL,[ssl, http/1.1]}{127.0.0.1:40889}
   [junit4]   2> 2334334 INFO  (SUITE-LIRRollingUpdatesTest-seed#[180117DDEDF3D7D5]-worker) [    ] o.e.j.s.Server Started @2334406ms
   [junit4]   2> 2334334 INFO  (SUITE-LIRRollingUpdatesTest-seed#[180117DDEDF3D7D5]-worker) [    ] o.a.s.c.s.e.JettySolrRunner Jetty properties: {hostContext=/solr, hostPort=34689}
   [junit4]   2> 2334334 ERROR (SUITE-LIRRollingUpdatesTest-seed#[180117DDEDF3D7D5]-worker) [    ] o.a.s.u.StartupLoggingUtils Missing Java Option solr.log.dir. Logging may be missing or incomplete.
   [junit4]   2> 2334334 INFO  (SUITE-LIRRollingUpdatesTest-seed#[180117DDEDF3D7D5]-worker) [    ] o.a.s.s.SolrDispatchFilter Using logger factory org.apache.logging.slf4j.Log4jLoggerFactory
   [junit4]   2> 2334334 INFO  (SUITE-LIRRollingUpdatesTest-seed#[180117DDEDF3D7D5]-worker) [    ] o.a.s.s.SolrDispatchFilter  ___      _       Welcome to Apache Solr™ version 7.5.0
   [junit4]   2> 2334335 INFO  (SUITE-LIRRollingUpdatesTest-seed#[180117DDEDF3D7D5]-worker) [    ] o.a.s.s.SolrDispatchFilter / __| ___| |_ _   Starting in cloud mode on port null
   [junit4]   2> 2334335 INFO  (SUITE-LIRRollingUpdatesTest-seed#[180117DDEDF3D7D5]-worker) [    ] o.a.s.s.SolrDispatchFilter \__ \/ _ \ | '_|  Install dir: null
   [junit4]   2> 2334335 INFO  (SUITE-LIRRollingUpdatesTest-seed#[180117DDEDF3D7D5]-worker) [    ] o.a.s.s.SolrDispatchFilter |___/\___/_|_|    Start time: 2018-07-14T01:57:01.249Z
   [junit4]   2> 2334336 INFO  (zkConnectionManagerCallback-3756-thread-1) [    ] o.a.s.c.c.ConnectionManager zkClient has connected
   [junit4]   2> 2334337 INFO  (SUITE-LIRRollingUpdatesTest-seed#[180117DDEDF3D7D5]-worker) [    ] o.a.s.s.SolrDispatchFilter solr.xml found in ZooKeeper. Loading...
   [junit4]   2> 2336790 INFO  (SUITE-LIRRollingUpdatesTest-seed#[180117DDEDF3D7D5]-worker) [    ] o.a.s.c.ZkContainer Zookeeper client=127.0.0.1:42775/solr
   [junit4]   2> 2336791 INFO  (zkConnectionManagerCallback-3760-thread-1) [    ] o.a.s.c.c.ConnectionManager zkClient has connected
   [junit4]   2> 2336794 INFO  (zkConnectionManagerCallback-3762-thread-1) [    ] o.a.s.c.c.ConnectionManager zkClient has connected
   [junit4]   2> 2336798 INFO  (SUITE-LIRRollingUpdatesTest-seed#[180117DDEDF3D7D5]-worker) [n:127.0.0.1:34689_solr    ] o.a.s.c.c.ZkStateReader Updated live nodes from ZooKeeper... (0) -> (2)
   [junit4]   2> 2336799 INFO  (SUITE-LIRRollingUpdatesTest-seed#[180117DDEDF3D7D5]-worker) [n:127.0.0.1:34689_solr    ] o.a.s.c.Overseer Overseer (id=null) closing
   [junit4]   2> 2336800 INFO  (SUITE-LIRRollingUpdatesTest-seed#[180117DDEDF3D7D5]-worker) [n:127.0.0.1:34689_solr    ] o.a.s.c.TransientSolrCoreCacheDefault Allocating transient cache for 2147483647 transient cores
   [junit4]   2> 2336800 INFO  (SUITE-LIRRollingUpdatesTest-seed#[180117DDEDF3D7D5]-worker) [n:127.0.0.1:34689_solr    ] o.a.s.c.ZkController Register node as live in ZooKeeper:/live_nodes/127.0.0.1:34689_solr
   [junit4]   2> 2336801 INFO  (zkCallback-3745-thread-1) [    ] o.a.s.c.c.ZkStateReader Updated live nodes from ZooKeeper... (2) -> (3)
   [junit4]   2> 2336801 INFO  (zkCallback-3707-thread-1) [    ] o.a.s.c.c.ZkStateReader Updated live nodes from ZooKeeper... (2) -> (3)
   [junit4]   2> 2336801 INFO  (zkCallback-3737-thread-1) [    ] o.a.s.c.c.ZkStateReader Updated live nodes from ZooKeeper... (2) -> (3)
   [junit4]   2> 2336801 INFO  (zkCallback-3727-thread-1) [    ] o.a.s.c.c.ZkStateReader Updated live nodes from ZooKeeper... (2) -> (3)
   [junit4]   2> 2336801 INFO  (zkCallback-3752-thread-1) [    ] o.a.s.c.c.ZkStateReader Updated live nodes from ZooKeeper... (2) -> (3)
   [junit4]   2> 2336802 INFO  (zkCallback-3761-thread-1) [    ] o.a.s.c.c.ZkStateReader Updated live nodes from ZooKeeper... (2) -> (3)
   [junit4]   2> 2336819 INFO  (zkConnectionManagerCallback-3769-thread-1) [    ] o.a.s.c.c.ConnectionManager zkClient has connected
   [junit4]   2> 2336819 INFO  (SUITE-LIRRollingUpdatesTest-seed#[180117DDEDF3D7D5]-worker) [n:127.0.0.1:34689_solr    ] o.a.s.c.c.ZkStateReader Updated live nodes from ZooKeeper... (0) -> (3)
   [junit4]   2> 2336820 INFO  (SUITE-LIRRollingUpdatesTest-seed#[180117DDEDF3D7D5]-worker) [n:127.0.0.1:34689_solr    ] o.a.s.c.s.i.ZkClientClusterStateProvider Cluster at 127.0.0.1:42775/solr ready
   [junit4]   2> 2336821 INFO  (SUITE-LIRRollingUpdatesTest-seed#[180117DDEDF3D7D5]-worker) [n:127.0.0.1:34689_solr    ] o.a.s.h.a.MetricsHistoryHandler No .system collection, keeping metrics history in memory.
   [junit4]   2> 2336836 INFO  (SUITE-LIRRollingUpdatesTest-seed#[180117DDEDF3D7D5]-worker) [n:127.0.0.1:34689_solr    ] o.a.s.m.r.SolrJmxReporter JMX monitoring for 'solr_34689.solr.node' (registry 'solr.node') enabled at server: com.sun.jmx.mbeanserver.JmxMBeanServer@8b862
   [junit4]   2> 2336845 INFO  (SUITE-LIRRollingUpdatesTest-seed#[180117DDEDF3D7D5]-worker) [n:127.0.0.1:34689_solr    ] o.a.s.m.r.SolrJmxReporter JMX monitoring for 'solr_34689.solr.jvm' (registry 'solr.jvm') enabled at server: com.sun.jmx.mbeanserver.JmxMBeanServer@8b862
   [junit4]   2> 2336845 INFO  (SUITE-LIRRollingUpdatesTest-seed#[180117DDEDF3D7D5]-worker) [n:127.0.0.1:34689_solr    ] o.a.s.m.r.SolrJmxReporter JMX monitoring for 'solr_34689.solr.jetty' (registry 'solr.jetty') enabled at server: com.sun.jmx.mbeanserver.JmxMBeanServer@8b862
   [junit4]   2> 2336846 INFO  (SUITE-LIRRollingUpdatesTest-seed#[180117DDEDF3D7D5]-worker) [n:127.0.0.1:34689_solr    ] o.a.s.c.CorePropertiesLocator Found 0 core definitions underneath /home/jenkins/workspace/Lucene-Solr-7.x-Linux/solr/build/solr-core/test/J1/temp/solr.cloud.LIRRollingUpdatesTest_180117DDEDF3D7D5-001/tempDir-001/node1/.
   [junit4]   2> 2336877 INFO  (SUITE-LIRRollingUpdatesTest-seed#[180117DDEDF3D7D5]-worker) [    ] o.a.s.c.LIRRollingUpdatesTest Adding proxy for URL: https://127.0.0.1:40889/solr. Proxy: https://127.0.0.1:34689/solr
   [junit4]   2> 2336879 INFO  (SUITE-LIRRollingUpdatesTest-seed#[180117DDEDF3D7D5]-worker) [    ] o.e.j.s.AbstractConnector Stopped ServerConnector@8adff0{SSL,[ssl, http/1.1]}{127.0.0.1:0}
   [junit4]   2> 2336879 INFO  (SUITE-LIRRollingUpdatesTest-seed#[180117DDEDF3D7D5]-worker) [    ] o.a.s.c.CoreContainer Shutting down CoreContainer instance=13469012
   [junit4]   2> 2336879 INFO  (SUITE-LIRRollingUpdatesTest-seed#[180117DDEDF3D7D5]-worker) [    ] o.a.s.m.SolrMetricManager Closing metric reporters for registry=solr.node, tag=null
   [junit4]   2> 2336879 INFO  (SUITE-LIRRollingUpdatesTest-seed#[180117DDEDF3D7D5]-worker) [    ] o.a.s.m.r.SolrJmxReporter Closing reporter [org.apache.solr.metrics.reporters.SolrJmxReporter@1d21f2c: rootName = solr_46127, domain = solr.node, service url = null, agent id = null] for registry solr.node / com.codahale.metrics.MetricRegistry@18338c2
   [junit4]   2> 2336885 INFO  (SUITE-LIRRollingUpdatesTest-seed#[180117DDEDF3D7D5]-worker) [    ] o.a.s.m.SolrMetricManager Closing metric reporters for registry=solr.jvm, tag=null
   [junit4]   2> 2336886 INFO  (SUITE-LIRRollingUpdatesTest-seed#[180117DDEDF3D7D5]-worker) [    ] o.a.s.m.r.SolrJmxReporter Closing reporter [org.apache.solr.metrics.reporters.SolrJmxReporter@80abda: rootName = solr_46127, domain = solr.jvm, service url = null, agent id = null] for registry solr.jvm / com.codahale.metrics.MetricRegistry@1d242c0
   [junit4]   2> 2336889 INFO  (SUITE-LIRRollingUpdatesTest-seed#[180117DDEDF3D7D5]-worker) [    ] o.a.s.m.SolrMetricManager Closing metric reporters for registry=solr.jetty, tag=null
   [junit4]   2> 2336889 INFO  (SUITE-LIRRollingUpdatesTest-seed#[180117DDEDF3D7D5]-worker) [    ] o.a.s.m.r.SolrJmxReporter Closing reporter [org.apache.solr.metrics.reporters.SolrJmxReporter@15b10ed: rootName = solr_46127, domain = solr.jetty, service url = null, agent id = null] for registry solr.jetty / com.codahale.metrics.MetricRegistry@14407e2
   [junit4]   2> 2336891 INFO  (SUITE-LIRRollingUpdatesTest-seed#[180117DDEDF3D7D5]-worker) [    ] o.a.s.c.ZkController Remove node as live in ZooKeeper:/live_nodes/127.0.0.1:46127_solr
   [junit4]   2> 2336891 INFO  (SUITE-LIRRollingUpdatesTest-seed#[180117DDEDF3D7D5]-worker) [    ] o.a.s.m.SolrMetricManager Closing metric reporters for registry=solr.cluster, tag=null
   [junit4]   2> 2336891 INFO  (zkCallback-3707-thread-1) [    ] o.a.s.c.c.ZkStateReader Updated live nodes from ZooKeeper... (3) -> (2)
   [junit4]   2> 2336892 INFO  (zkCallback-3761-thread-1) [    ] o.a.s.c.c.ZkStateReader Updated live nodes from ZooKeeper... (3) -> (2)
   [junit4]   2> 2336893 INFO  (zkCallback-3727-thread-1) [    ] o.a.s.c.c.ZkStateReader Updated live nodes from ZooKeeper... (3) -> (2)
   [junit4]   2> 2336893 INFO  (SUITE-LIRRollingUpdatesTest-seed#[180117DDEDF3D7D5]-worker) [    ] o.a.s.c.Overseer Overseer (id=72123299415130120-127.0.0.1:46127_solr-n_0000000001) closing
   [junit4]   2> 2336893 INFO  (zkCallback-3752-thread-1) [    ] o.a.s.c.c.ZkStateReader Updated live nodes from ZooKeeper... (3) -> (2)
   [junit4]   2> 2336893 INFO  (zkCallback-3745-thread-1) [    ] o.a.s.c.c.ZkStateReader Updated live nodes from ZooKeeper... (3) -> (2)
   [junit4]   2> 2336893 INFO  (zkCallback-3737-thread-1) [    ] o.a.s.c.c.ZkStateReader Updated live nodes from ZooKeeper... (3) -> (2)
   [junit4]   2> 2336893 INFO  (OverseerStateUpdate-72123299415130120-127.0.0.1:46127_solr-n_0000000001) [    ] o.a.s.c.Overseer Overseer Loop exiting : 127.0.0.1:46127_solr
   [junit4]   2> 2336893 WARN  (OverseerAutoScalingTriggerThread-72123299415130120-127.0.0.1:46127_solr-n_0000000001) [    ] o.a.s.c.a.OverseerTriggerThread OverseerTriggerThread woken up but we are closed, exiting.
   [junit4]   2> 2336895 INFO  (zkCallback-3768-thread-1) [    ] o.a.s.c.c.ZkStateReader Updated live nodes from ZooKeeper... (3) -> (2)
   [junit4]   2> 2336897 INFO  (SUITE-LIRRollingUpdatesTest-seed#[180117DDEDF3D7D5]-worker) [    ] o.e.j.s.h.ContextHandler Stopped o.e.j.s.ServletContextHandler@1a8edec{/solr,null,UNAVAILABLE}
   [junit4]   2> 2336897 INFO  (zkCallback-3745-thread-1) [    ] o.a.s.c.OverseerElectionContext I am going to be the leader 127.0.0.1:45363_solr
   [junit4]   2> 2336897 INFO  (SUITE-LIRRollingUpdatesTest-seed#[180117DDEDF3D7D5]-worker) [    ] o.e.j.s.session node0 Stopped scavenging
   [junit4]   2> 2336898 INFO  (zkCallback-3745-thread-1) [    ] o.a.s.c.Overseer Overseer (id=72123299415130129-127.0.0.1:45363_solr-n_0000000003) starting
   [junit4]   2> 2336900 INFO  (SUITE-LIRRollingUpdatesTest-seed#[180117DDEDF3D7D5]-worker) [    ] o.e.j.s.Server jetty-9.4.11.v20180605; built: 2018-06-05T18:24:03.829Z; git: d5fc0523cfa96bfebfbda19606cad384d772f04c; jvm 1.8.0_172-b11
   [junit4]   2> 2336901 INFO  (SUITE-LIRRollingUpdatesTest-seed#[180117DDEDF3D7D5]-worker) [    ] o.e.j.s.session DefaultSessionIdManager workerName=node0
   [junit4]   2> 2336901 INFO  (SUITE-LIRRollingUpdatesTest-seed#[180117DDEDF3D7D5]-worker) [    ] o.e.j.s.session No SessionScavenger set, using defaults
   [junit4]   2> 2336901 INFO  (SUITE-LIRRollingUpdatesTest-seed#[180117DDEDF3D7D5]-worker) [    ] o.e.j.s.session node0 Scavenging every 600000ms
   [junit4]   2> 2336902 INFO  (SUITE-LIRRollingUpdatesTest-seed#[180117DDEDF3D7D5]-worker) [    ] o.e.j.s.h.ContextHandler Started o.e.j.s.ServletContextHandler@ca2752{/solr,null,AVAILABLE}
   [junit4]   2> 2336902 INFO  (SUITE-LIRRollingUpdatesTest-seed#[180117DDEDF3D7D5]-worker) [    ] o.e.j.s.AbstractConnector Started ServerConnector@3de47{SSL,[ssl, http/1.1]}{127.0.0.1:33943}
   [junit4]   2> 2336902 INFO  (SUITE-LIRRollingUpdatesTest-seed#[180117DDEDF3D7D5]-worker) [    ] o.e.j.s.Server Started @2336975ms
   [junit4]   2> 2336903 INFO  (SUITE-LIRRollingUpdatesTest-seed#[180117DDEDF3D7D5]-worker) [    ] o.a.s.c.s.e.JettySolrRunner Jetty properties: {hostContext=/solr, hostPort=33185}
   [junit4]   2> 2336903 ERROR (SUITE-LIRRollingUpdatesTest-seed#[180117DDEDF3D7D5]-worker) [    ] o.a.s.u.StartupLoggingUtils Missing Java Option solr.log.dir. Logging may be missing or incomplete.
   [junit4]   2> 2336903 INFO  (SUITE-LIRRollingUpdatesTest-seed#[180117DDEDF3D7D5]-worker) [    ] o.a.s.s.SolrDispatchFilter Using logger factory org.apache.logging.slf4j.Log4jLoggerFactory
   [junit4]   2> 2336903 INFO  (SUITE-LIRRollingUpdatesTest-seed#[180117DDEDF3D7D5]-worker) [    ] o.a.s.s.SolrDispatchFilter  ___      _       Welcome to Apache Solr™ version 7.5.0
   [junit4]   2> 2336903 INFO  (SUITE-LIRRollingUpdatesTest-seed#[180117DDEDF3D7D5]-worker) [    ] o.a.s.s.SolrDispatchFilter / __| ___| |_ _   Starting in cloud mode on port null
   [junit4]   2> 2336903 INFO  (SUITE-LIRRollingUpdatesTest-seed#[180117DDEDF3D7D5]-worker) [    ] o.a.s.s.SolrDispatchFilter \__ \/ _ \ | '_|  Install dir: null
   [junit4]   2> 2336903 INFO  (SUITE-LIRRollingUpdatesTest-seed#[180117DDEDF3D7D5]-worker) [    ] o.a.s.s.SolrDispatchFilter |___/\___/_|_|    Start time: 2018-07-14T01:57:03.817Z
   [junit4]   2> 2336909 INFO  (zkConnectionManagerCallback-3772-thread-1) [    ] o.a.s.c.c.ConnectionManager zkClient has connected
   [junit4]   2> 2336910 INFO  (SUITE-LIRRollingUpdatesTest-seed#[180117DDEDF3D7D5]-worker) [    ] o.a.s.s.SolrDispatchFilter solr.xml found in ZooKeeper. Loading...
   [junit4]   2> 2337394 INFO  (SUITE-LIRRollingUpdatesTest-seed#[180117DDEDF3D7D5]-worker) [    ] o.a.s.c.ZkContainer Zookeeper client=127.0.0.1:42775/solr
   [junit4]   2> 2337395 INFO  (zkConnectionManagerCallback-3776-thread-1) [    ] o.a.s.c.c.ConnectionManager zkClient has connected
   [junit4]   2> 2337398 INFO  (zkConnectionManagerCallback-3778-thread-1) [    ] o.a.s.c.c.ConnectionManager zkClient has connected
   [junit4]   2> 2337403 INFO  (SUITE-LIRRollingUpdatesTest-seed#[180117DDEDF3D7D5]-worker) [n:127.0.0.1:33185_solr    ] o.a.s.c.c.ZkStateReader Updated live nodes from ZooKeeper... (0) -> (2)
   [junit4]   2> 2337404 INFO  (SUITE-LIRRollingUpdatesTest-seed#[180117DDEDF3D7D5]-worker) [n:127.0.0.1:33185_solr    ] o.a.s.c.Overseer Overseer (id=null) closing
   [junit4]   2> 2337429 INFO  (SUITE-LIRRollingUpdatesTest-seed#[180117DDEDF3D7D5]-worker) [n:127.0.0.1:33185_solr    ] o.a.s.c.TransientSolrCoreCacheDefault Allocating transient cache for 2147483647 transient cores
   [junit4]   2> 2337430 INFO  (SUITE-LIRRollingUpdatesTest-seed#[180117DDEDF3D7D5]-worker) [n:127.0.0.1:33185_solr    ] o.a.s.c.ZkController Register node as live in ZooKeeper:/live_nodes/127.0.0.1:33185_solr
   [junit4]   2> 2337431 INFO  (zkCallback-3752-thread-1) [    ] o.a.s.c.c.ZkStateReader Updated live nodes from ZooKeeper... (2) -> (3)
   [junit4]   2> 2337431 INFO  (zkCallback-3745-thread-1) [    ] o.a.s.c.c.ZkStateReader Updated live nodes from ZooKeeper... (2) -> (3)
   [junit4]   2> 2337431 INFO  (zkCallback-3761-thread-1) [    ] o.a.s.c.c.ZkStateReader Updated live nodes from ZooKeeper... (2) -> (3)
   [junit4]   2> 2337431 INFO  (zkCallback-3737-thread-1) [    ] o.a.s.c.c.ZkStateReader Updated live nodes from ZooKeeper... (2) -> (3)
   [junit4]   2> 2337431 INFO  (zkCallback-3768-thread-1) [    ] o.a.s.c.c.ZkStateReader Updated live nodes from ZooKeeper... (2) -> (3)
   [junit4]   2> 2337431 INFO  (zkCallback-3777-thread-1) [    ] o.a.s.c.c.ZkStateReader Updated live nodes from ZooKeeper... (2) -> (3)
   [junit4]   2> 2337454 INFO  (zkConnectionManagerCallback-3785-thread-1) [    ] o.a.s.c.c.ConnectionManager zkClient has connected
   [junit4]   2> 2337455 INFO  (SUITE-LIRRollingUpdatesTest-seed#[180117DDEDF3D7D5]-worker) [n:127.0.0.1:33185_solr    ] o.a.s.c.c.ZkStateReader Updated live nodes from ZooKeeper... (0) -> (3)
   [junit4]   2> 2337456 INFO  (SUITE-LIRRollingUpdatesTest-seed#[180117DDEDF3D7D5]-worker) [n:127.0.0.1:33185_solr    ] o.a.s.c.s.i.ZkClientClusterStateProvider Cluster at 127.0.0.1:42775/solr ready
   [junit4]   2> 2337457 INFO  (SUITE-LIRRollingUpdatesTest-seed#[180117DDEDF3D7D5]-worker) [n:127.0.0.1:33185_solr    ] o.a.s.h.a.MetricsHistoryHandler No .system collection, keeping metrics history in memory.
   [junit4]   2> 2337473 INFO  (SUITE-LIRRollingUpdatesTest-seed#[180117DDEDF3D7D5]-worker) [n:127.0.0.1:33185_solr    ] o.a.s.m.r.SolrJmxReporter JMX monitoring for 'solr_33185.solr.node' (registry 'solr.node') enabled at server: com.sun.jmx.mbeanserver.JmxMBeanServer@8b862
   [junit4]   2> 2337482 INFO  (SUITE-LIRRollingUpdatesTest-seed#[180117DDEDF3D7D5]-worker) [n:127.0.0.1:33185_solr    ] o.a.s.m.r.SolrJmxReporter JMX monitoring for 'solr_33185.solr.jvm' (registry 'solr.jvm') enabled at server: com.sun.jmx.mbeanserver.JmxMBeanServer@8b862
   [junit4]   2> 2337482 INFO  (SUITE-LIRRollingUpdatesTest-seed#[180117DDEDF3D7D5]-worker) [n:127.0.0.1:33185_solr    ] o.a.s.m.r.SolrJmxReporter JMX monitoring for 'solr_33185.solr.jetty' (registry 'solr.jetty') enabled at server: com.sun.jmx.mbeanserver.JmxMBeanServer@8b862
   [junit4]   2> 2337483 INFO  (SUITE-LIRRollingUpdatesTest-seed#[180117DDEDF3D7D5]-worker) [n:127.0.0.1:33185_solr    ] o.a.s.c.CorePropertiesLocator Found 0 core definitions underneath /home/jenkins/workspace/Lucene-Solr-7.x-Linux/solr/build/solr-core/test/J1/temp/solr.cloud.LIRRollingUpdatesTest_180117DDEDF3D7D5-001/tempDir-001/node3/.
   [junit4]   2> 2337514 INFO  (SUITE-LIRRollingUpdatesTest-seed#[180117DDEDF3D7D5]-worker) [    ] o.a.s.c.LIRRollingUpdatesTest Adding proxy for URL: https://127.0.0.1:33943/solr. Proxy: https://127.0.0.1:33185/solr
   [junit4]   2> 2337545 INFO  (TEST-LIRRollingUpdatesTest.testNewLeaderOldReplica-seed#[180117DDEDF3D7D5]) [    ] o.a.s.SolrTestCaseJ4 ###Starting testNewLeaderOldReplica
   [junit4]   2> 2337545 INFO  (SocketProxy-Acceptor-33185) [    ] o.a.s.c.SocketProxy accepted Socket[addr=/127.0.0.1,port=59668,localport=33185], receiveBufferSize:531000
   [junit4]   2> 2337546 INFO  (SocketProxy-Acceptor-33185) [    ] o.a.s.c.SocketProxy proxy connection Socket[addr=/127.0.0.1,port=33943,localport=49346], receiveBufferSize=530904
   [junit4]   2> 2337666 INFO  (qtp26609124-13769) [n:127.0.0.1:33185_solr    ] o.a.s.h.a.CollectionsHandler Invoked Collection Action :create with params pullReplicas=0&name=testNewLeaderOldReplica&nrtReplicas=2&action=CREATE&numShards=1&tlogReplicas=0&createNodeSet=&wt=javabin&version=2 and sendToOCPQueue=true
   [junit4]   2> 2337669 INFO  (OverseerThreadFactory-5803-thread-1) [    ] o.a.s.c.a.c.CreateCollectionCmd Create collection testNewLeaderOldReplica
   [junit4]   2> 2337670 INFO  (OverseerThreadFactory-5803-thread-1) [    ] o.a.s.c.c.ZkConfigManager Copying zk node /configs/_default/protwords.txt to /configs/testNewLeaderOldReplica.AUTOCREATED/protwords.txt
   [junit4]   2> 2337672 INFO  (OverseerThreadFactory-5803-thread-1) [    ] o.a.s.c.c.ZkConfigManager Copying zk node /configs/_default/managed-schema to /configs/testNewLeaderOldReplica.AUTOCREATED/managed-schema
   [junit4]   2> 2337673 INFO  (OverseerThreadFactory-5803-thread-1) [    ] o.a.s.c.c.ZkConfigManager Copying zk node /configs/_default/solrconfig.xml to /configs/testNewLeaderOldReplica.AUTOCREATED/solrconfig.xml
   [junit4]   2> 2337674 INFO  (OverseerThreadFactory-5803-thread-1) [    ] o.a.s.c.c.ZkConfigManager Copying zk node /configs/_default/synonyms.txt to /configs/testNewLeaderOldReplica.AUTOCREATED/synonyms.txt
   [junit4]   2> 2337675 INFO  (OverseerThreadFactory-5803-thread-1) [    ] o.a.s.c.c.ZkConfigManager Copying zk node /configs/_default/stopwords.txt to /configs/testNewLeaderOldReplica.AUTOCREATED/stopwords.txt
   [junit4]   2> 2337676 INFO  (OverseerThreadFactory-5803-thread-1) [    ] o.a.s.c.c.ZkConfigManager Copying zk node /configs/_default/lang/contractions_it.txt to /configs/testNewLeaderOldReplica.AUTOCREATED/lang/contractions_it.txt
   [junit4]   2> 2337677 INFO  (OverseerThreadFactory-5803-thread-1) [    ] o.a.s.c.c.ZkConfigManager Copying zk node /configs/_default/lang/stemdict_nl.txt to /configs/testNewLeaderOldReplica.AUTOCREATED/lang/stemdict_nl.txt
   [junit4]   2> 2337678 INFO  (OverseerThreadFactory-5803-thread-1) [    ] o.a.s.c.c.ZkConfigManager Copying zk node /configs/_default/lang/stopwords_hy.txt to /configs/testNewLeaderOldReplica.AUTOCREATED/lang/stopwords_hy.txt
   [junit4]   2> 2337679 INFO  (OverseerThreadFactory-5803-thread-1) [    ] o.a.s.c.c.ZkConfigManager Copying zk node /configs/_default/lang/stopwords_no.txt to /configs/testNewLeaderOldReplica.AUTOCREATED/lang/stopwords_no.txt
   [junit4]   2> 2337680 INFO  (OverseerThreadFactory-5803-thread-1) [    ] o.a.s.c.c.ZkConfigManager Copying zk node /configs/_default/lang/contractions_ca.txt to /configs/testNewLeaderOldReplica.AUTOCREATED/lang/contractions_ca.txt
   [junit4]   2> 2337681 INFO  (OverseerThreadFactory-5803-thread-1) [    ] o.a.s.c.c.ZkConfigManager Copying zk node /configs/_default/lang/stopwords_id.txt to /configs/testNewLeaderOldReplica.AUTOCREATED/lang/stopwords_id.txt
   [junit4]   2> 2337682 INFO  (OverseerThreadFactory-5803-thread-1) [    ] o.a.s.c.c.ZkConfigManager Copying zk node /configs/_default/lang/stopwords_ga.txt to /configs/testNewLeaderOldReplica.AUTOCREATED/lang/stopwords_ga.txt
   [junit4]   2> 2337682 INFO  (OverseerThreadFactory-5803-thread-1) [    ] o.a.s.c.c.ZkConfigManager Copying zk node /configs/_default/lang/stopwords_hi.txt to /configs/testNewLeaderOldReplica.AUTOCREATED/lang/stopwords_hi.txt
   [junit4]   2> 2337683 INFO  (OverseerThreadFactory-5803-thread-1) [    ] o.a.s.c.c.ZkConfigManager Copying zk node /configs/_default/lang/stopwords_da.txt to /configs/testNewLeaderOldReplica.AUTOCREATED/lang/stopwords_da.txt
   [junit4]   2> 2337685 INFO  (OverseerThreadFactory-5803-thread-1) [    ] o.a.s.c.c.ZkConfigManager Copying zk node /configs/_default/lang/stopwords_ja.txt to /configs/testNewLeaderOldReplica.AUTOCREATED/lang/stopwords_ja.txt
   [junit4]   2> 2337685 INFO  (OverseerThreadFactory-5803-thread-1) [    ] o.a.s.c.c.ZkConfigManager Copying zk node /configs/_default/lang/stopwords_pt.txt to /configs/testNewLeaderOldReplica.AUTOCREATED/lang/stopwords_pt.txt
   [junit4]   2> 2337686 INFO  (OverseerThreadFactory-5803-thread-1) [    ] o.a.s.c.c.ZkConfigManager Copying zk node /configs/_default/lang/stopwords_hu.txt to /configs/testNewLeaderOldReplica.AUTOCREATED/lang/stopwords_hu.txt
   [junit4]   2> 2337687 INFO  (OverseerThreadFactory-5803-thread-1) [    ] o.a.s.c.c.ZkConfigManager Copying zk node /configs/_default/lang/stopwords_el.txt to /configs/testNewLeaderOldReplica.AUTOCREATED/lang/stopwords_el.txt
   [junit4]   2> 2337688 INFO  (OverseerThreadFactory-5803-thread-1) [    ] o.a.s.c.c.ZkConfigManager Copying zk node /configs/_default/lang/stopwords_ru.txt to /configs/testNewLeaderOldReplica.AUTOCREATED/lang/stopwords_ru.txt
   [junit4]   2> 2337689 INFO  (OverseerThreadFactory-5803-thread-1) [    ] o.a.s.c.c.ZkConfigManager Copying zk node /configs/_default/lang/stopwords_tr.txt to /configs/testNewLeaderOldReplica.AUTOCREATED/lang/stopwords_tr.txt
   [junit4]   2> 2337689 INFO  (OverseerThreadFactory-5803-thread-1) [    ] o.a.s.c.c.ZkConfigManager Copying zk node /configs/_default/lang/stopwords_ar.txt to /configs/testNewLeaderOldReplica.AUTOCREATED/lang/stopwords_ar.txt
   [junit4]   2> 2337690 INFO  (OverseerThreadFactory-5803-thread-1) [    ] o.a.s.c.c.ZkConfigManager Copying zk node /configs/_default/lang/userdict_ja.txt to /configs/testNewLeaderOldReplica.AUTOCREATED/lang/userdict_ja.txt
   [junit4]   2> 2337691 INFO  (OverseerThreadFactory-5803-thread-1) [    ] o.a.s.c.c.ZkConfigManager Copying zk node /configs/_default/lang/stopwords_eu.txt to /configs/testNewLeaderOldReplica.AUTOCREATED/lang/stopwords_eu.txt
   [junit4]   2> 2337691 INFO  (OverseerThreadFactory-5803-thread-1) [    ] o.a.s.c.c.ZkConfigManager Copying zk node /configs/_default/lang/stopwords_it.txt to /configs/testNewLeaderOldReplica.AUTOCREATED/lang/stopwords_it.txt
   [junit4]   2> 2337692 INFO  (OverseerThreadFactory-5803-thread-1) [    ] o.a.s.c.c.ZkConfigManager Copying zk node /configs/_default/lang/stopwords_cz.txt to /configs/testNewLeaderOldReplica.AUTOCREATED/lang/stopwords_cz.txt
   [junit4]   2> 2337693 INFO  (OverseerThreadFactory-5803-thread-1) [    ] o.a.s.c.c.ZkConfigManager Copying zk node /configs/_default/lang/stoptags_ja.txt to /configs/testNewLeaderOldReplica.AUTOCREATED/lang/stoptags_ja.txt
   [junit4]   2> 2337693 INFO  (OverseerThreadFactory-5803-thread-1) [    ] o.a.s.c.c.ZkConfigManager Copying zk node /configs/_default/lang/contractions_fr.txt to /configs/testNewLeaderOldReplica.AUTOCREATED/lang/contractions_fr.txt
   [junit4]   2> 2337694 INFO  (OverseerThreadFactory-5803-thread-1) [    ] o.a.s.c.c.ZkConfigManager Copying zk node /configs/_default/lang/stopwords_de.txt to /configs/testNewLeaderOldReplica.AUTOCREATED/lang/stopwords_de.txt
   [junit4]   2> 2337695 INFO  (OverseerThreadFactory-5803-thread-1) [    ] o.a.s.c.c.ZkConfigManager Copying zk node /configs/_default/lang/stopwords_fa.txt to /configs/testNewLeaderOldReplica.AUTOCREATED/lang/stopwords_fa.txt
   [junit4]   2> 2337696 INFO  (OverseerThreadFactory-5803-thread-1) [    ] o.a.s.c.c.ZkConfigManager Copying zk node /configs/_default/lang/contractions_ga.txt to /configs/testNewLeaderOldReplica.AUTOCREATED/lang/contractions_ga.txt
   [junit4]   2> 2337697 INFO  (OverseerThreadFactory-5803-thread-1) [    ] o.a.s.c.c.ZkConfigManager Copying zk node /configs/_default/lang/stopwords_ca.txt to /configs/testNewLeaderOldReplica.AUTOCREATED/lang/stopwords_ca.txt
   [junit4]   2> 2337697 INFO  (OverseerThreadFactory-5803-thread-1) [    ] o.a.s.c.c.ZkConfigManager Copying zk node /configs/_default/lang/stopwords_nl.txt to /configs/testNewLeaderOldReplica.AUTOCREATED/lang/stopwords_nl.txt
   [junit4]   2> 2337698 INFO  (OverseerThreadFactory-5803-thread-1) [    ] o.a.s.c.c.ZkConfigManager Copying zk node /configs/_default/lang/stopwords_bg.txt to /configs/testNewLeaderOldReplica.AUTOCREATED/lang/stopwords_bg.txt
   [junit4]   2> 2337699 INFO  (OverseerThreadFactory-5803-thread-1) [    ] o.a.s.c.c.ZkConfigManager Copying zk node /configs/_default/lang/stopwords_lv.txt to /configs/testNewLeaderOldReplica.AUTOCREATED/lang/stopwords_lv.txt
   [junit4]   2> 2337700 INFO  (OverseerThreadFactory-5803-thread-1) [    ] o.a.s.c.c.ZkConfigManager Copying zk node /configs/_default/lang/stopwords_en.txt to /configs/testNewLeaderOldReplica.AUTOCREATED/lang/stopwords_en.txt
   [junit4]   2> 2337700 INFO  (OverseerThreadFactory-5803-thread-1) [    ] o.a.s.c.c.ZkConfigManager Copying zk node /configs/_default/lang/stopwords_es.txt to /configs/testNewLeaderOldReplica.AUTOCREATED/lang/stopwords_es.txt
   [junit4]   2> 2337701 INFO  (OverseerThreadFactory-5803-thread-1) [    ] o.a.s.c.c.ZkConfigManager Copying zk node /configs/_default/lang/stopwords_th.txt to /configs/testNewLeaderOldReplica.AUTOCREATED/lang/stopwords_th.txt
   [junit4]   2> 2337702 INFO  (OverseerThreadFactory-5803-thread-1) [    ] o.a.s.c.c.ZkConfigManager Copying zk node /configs/_default/lang/stopwords_ro.txt to /configs/testNewLeaderOldReplica.AUTOCREATED/lang/stopwords_ro.txt
   [junit4]   2> 2337703 INFO  (OverseerThreadFactory-5803-thread-1) [    ] o.a.s.c.c.ZkConfigManager Copying zk node /configs/_default/lang/stopwords_fr.txt to /configs/testNewLeaderOldReplica.AUTOCREATED/lang/stopwords_fr.txt
   [junit4]   2> 2337703 INFO  (OverseerThreadFactory-5803-thread-1) [    ] o.a.s.c.c.ZkConfigManager Copying zk node /configs/_default/lang/stopwords_sv.txt to /configs/testNewLeaderOldReplica.AUTOCREATED/lang/stopwords_sv.txt
   [junit4]   2> 2337704 INFO  (OverseerThreadFactory-5803-thread-1) [    ] o.a.s.c.c.ZkConfigManager Copying zk node /configs/_default/lang/stopwords_fi.txt to /configs/testNewLeaderOldReplica.AUTOCREATED/lang/stopwords_fi.txt
   [junit4]   2> 2337705 INFO  (OverseerThreadFactory-5803-thread-1) [    ] o.a.s.c.c.ZkConfigManager Copying zk node /configs/_default/lang/hyphenations_ga.txt to /configs/testNewLeaderOldReplica.AUTOCREATED/lang/hyphenations_ga.txt
   [junit4]   2> 2337706 INFO  (OverseerThreadFactory-5803-thread-1) [    ] o.a.s.c.c.ZkConfigManager Copying zk node /configs/_default/lang/stopwords_gl.txt to /configs/testNewLeaderOldReplica.AUTOCREATED/lang/stopwords_gl.txt
   [junit4]   2> 2337707 INFO  (OverseerThreadFactory-5803-thread-1) [    ] o.a.s.c.c.ZkConfigManager Copying zk node /configs/_default/params.json to /configs/testNewLeaderOldReplica.AUTOCREATED/params.json
   [junit4]   2> 2337708 WARN  (OverseerThreadFactory-5803-thread-1) [    ] o.a.s.c.a.c.CreateCollectionCmd It is unusual to create a collection (testNewLeaderOldReplica) without cores.
   [junit4]   2> 2337814 INFO  (qtp26609124-13769) [n:127.0.0.1:33185_solr    ] o.a.s.h.a.CollectionsHandler Wait for new collection to be active for at most 30 seconds. Check all shard replicas
   [junit4]   2> 2337814 INFO  (qtp26609124-13769) [n:127.0.0.1:33185_solr    ] o.a.s.s.HttpSolrCall [admin] webapp=null path=/admin/collections params={pullReplicas=0&name=testNewLeaderOldReplica&nrtReplicas=2&action=CREATE&numShards=1&tlogReplicas=0&createNodeSet=&wt=javabin&version=2} status=0 QTime=148
   [junit4]   2> 2337816 INFO  (SocketProxy-Acceptor-34689) [    ] o.a.s.c.SocketProxy accepted Socket[addr=/127.0.0.1,port=36948,localport=34689], receiveBufferSize:531000
   [junit4]   2> 2337816 INFO  (SocketProxy-Acceptor-34689) [    ] o.a.s.c.SocketProxy proxy connection Socket[addr=/127.0.0.1,port=40889,localport=39362], receiveBufferSize=530904
   [junit4]   2> 2337938 INFO  (qtp21265992-13733) [n:127.0.0.1:34689_solr    ] o.a.s.h.a.CollectionsHandler Invoked Collection Action :addreplica with params node=127.0.0.1:45363_solr&action=ADDREPLICA&collection=testNewLeaderOldReplica&shard=shard1&type=NRT&wt=javabin&version=2 and sendToOCPQueue=true
   [junit4]   2> 2337942 INFO  (OverseerCollectionConfigSetProcessor-72123299415130129-127.0.0.1:45363_solr-n_0000000003) [    ] o.a.s.c.OverseerTaskQueue Response ZK path: /overseer/collection-queue-work/qnr-0000000000 doesn't exist.  Requestor may have disconnected from ZooKeeper
   [junit4]   2> 2337943 INFO  (OverseerThreadFactory-5803-thread-2) [ c:testNewLeaderOldReplica s:shard1  ] o.a.s.c.a.c.AddReplicaCmd Node Identified 127.0.0.1:45363_solr for creating new replica
   [junit4]   2> 2337945 INFO  (OverseerStateUpdate-72123299415130129-127.0.0.1:45363_solr-n_0000000003) [    ] o.a.s.c.o.SliceMutator createReplica() {
   [junit4]   2>   "operation":"addreplica",
   [junit4]   2>   "collection":"testNewLeaderOldReplica",
   [junit4]   2>   "shard":"shard1",
   [junit4]   2>   "core":"testNewLeaderOldReplica_shard1_replica_n41",
   [junit4]   2>   "state":"down",
   [junit4]   2>   "base_url":"https://127.0.0.1:45363/solr",
   [junit4]   2>   "node_name":"127.0.0.1:45363_solr",
   [junit4]   2>   "type":"NRT"} 
   [junit4]   2> 2338149 INFO  (SocketProxy-Acceptor-45363) [    ] o.a.s.c.SocketProxy accepted Socket[addr=/127.0.0.1,port=51828,localport=45363], receiveBufferSize:531000
   [junit4]   2> 2338150 INFO  (SocketProxy-Acceptor-45363) [    ] o.a.s.c.SocketProxy proxy connection Socket[addr=/127.0.0.1,port=41311,localport=57730], receiveBufferSize=530904
   [junit4]   2> 2338271 INFO  (qtp23046864-13697) [n:127.0.0.1:45363_solr    x:testNewLeaderOldReplica_shard1_replica_n41] o.a.s.h.a.CoreAdminOperation core create command qt=/admin/cores&coreNodeName=core_node42&collection.configName=testNewLeaderOldReplica.AUTOCREATED&name=testNewLeaderOldReplica_shard1_replica_n41&action=CREATE&collection=testNewLeaderOldReplica&shard=shard1&wt=javabin&version=2&replicaType=NRT
   [junit4]   2> 2338301 INFO  (qtp23046864-13697) [n:127.0.0.1:45363_solr c:testNewLeaderOldReplica s:shard1 r:core_node42 x:testNewLeaderOldReplica_shard1_replica_n41] o.a.s.c.RequestParams conf resource params.json loaded . version : 0 
   [junit4]   2> 2338302 INFO  (qtp23046864-13697) [n:127.0.0.1:45363_solr c:testNewLeaderOldReplica s:shard1 r:core_node42 x:testNewLeaderOldReplica_shard1_replica_n41] o.a.s.c.RequestParams request params refreshed to version 0
   [junit4]   2> 2338302 WARN  (qtp23046864-13697) [n:127.0.0.1:45363_solr c:testNewLeaderOldReplica s:shard1 r:core_node42 x:testNewLeaderOldReplica_shard1_replica_n41] o.a.s.c.SolrConfig Couldn't add files from /home/jenkins/workspace/Lucene-Solr-7.x-Linux/solr/build/solr-core/test/J1/temp/solr.cloud.LIRRollingUpdatesTest_180117DDEDF3D7D5-001/tempDir-001/node2/testNewLeaderOldReplica_shard1_replica_n41/../../../../contrib/extraction/lib filtered by .*\.jar to classpath: /home/jenkins/workspace/Lucene-Solr-7.x-Linux/solr/build/solr-core/test/J1/temp/solr.cloud.LIRRollingUpdatesTest_180117DDEDF3D7D5-001/tempDir-001/node2/testNewLeaderOldReplica_shard1_replica_n41/../../../../contrib/extraction/lib
   [junit4]   2> 2338303 WARN  (qtp23046864-13697) [n:127.0.0.1:45363_solr c:testNewLeaderOldReplica s:shard1 r:core_node42 x:testNewLeaderOldReplica_shard1_replica_n41] o.a.s.c.SolrConfig Couldn't add files from /home/jenkins/workspace/Lucene-Solr-7.x-Linux/solr/build/solr-core/test/J1/temp/solr.cloud.LIRRollingUpdatesTest_180117DDEDF3D7D5-001/tempDir-001/node2/testNewLeaderOldReplica_shard1_replica_n41/../../../../dist filtered by solr-cell-\d.*\.jar to classpath: /home/jenkins/workspace/Lucene-Solr-7.x-Linux/solr/build/solr-core/test/J1/temp/solr.cloud.LIRRollingUpdatesTest_180117DDEDF3D7D5-001/tempDir-001/node2/testNewLeaderOldReplica_shard1_replica_n41/../../../../dist
   [junit4]   2> 2338303 WARN  (qtp23046864-13697) [n:127.0.0.1:45363_solr c:testNewLeaderOldReplica s:shard1 r:core_node42 x:testNewLeaderOldReplica_shard1_replica_n41] o.a.s.c.SolrConfig Couldn't add files from /home/jenkins/workspace/Lucene-Solr-7.x-Linux/solr/build/solr-core/test/J1/temp/solr.cloud.LIRRollingUpdatesTest_180117DDEDF3D7D5-001/tempDir-001/node2/testNewLeaderOldReplica_shard1_replica_n41/../../../../contrib/clustering/lib filtered by .*\.jar to classpath: /home/jenkins/workspace/Lucene-Solr-7.x-Linux/solr/build/solr-core/test/J1/temp/solr.cloud.LIRRollingUpdatesTest_180117DDEDF3D7D5-001/tempDir-001/node2/testNewLeaderOldReplica_shard1_replica_n41/../../../../contrib/clustering/lib
   [junit4]   2> 2338303 WARN  (qtp23046864-13697) [n:127.0.0.1:45363_solr c:testNewLeaderOldReplica s:shard1 r:core_node42 x:testNewLeaderOldReplica_shard1_replica_n41] o.a.s.c.SolrConfig Couldn't add files from /home/jenkins/workspace/Lucene-Solr-7.x-Linux/solr/build/solr-core/test/J1/temp/solr.cloud.LIRRollingUpdatesTest_180117DDEDF3D7D5-001/tempDir-001/node2/testNewLeaderOldReplica_shard1_replica_n41/../../../../dist filtered by solr-clustering-\d.*\.jar to classpath: /home/jenkins/workspace/Lucene-Solr-7.x-Linux/solr/build/solr-core/test/J1/temp/solr.cloud.LIRRollingUpdatesTest_180117DDEDF3D7D5-001/tempDir-001/node2/testNewLeaderOldReplica_shard1_replica_n41/../../../../dist
   [junit4]   2> 2338304 WARN  (qtp23046864-13697) [n:127.0.0.1:45363_solr c:testNewLeaderOldReplica s:shard1 r:core_node42 x:testNewLeaderOldReplica_shard1_replica_n41] o.a.s.c.SolrConfig Couldn't add files from /home/jenkins/workspace/Lucene-Solr-7.x-Linux/solr/build/solr-core/test/J1/temp/solr.cloud.LIRRollingUpdatesTest_180117DDEDF3D7D5-001/tempDir-001/node2/testNewLeaderOldReplica_shard1_replica_n41/../../../../contrib/langid/lib filtered by .*\.jar to classpath: /home/jenkins/workspace/Lucene-Solr-7.x-Linux/solr/build/solr-core/test/J1/temp/solr.cloud.LIRRollingUpdatesTest_180117DDEDF3D7D5-001/tempDir-001/node2/testNewLeaderOldReplica_shard1_replica_n41/../../../../contrib/langid/lib
   [junit4]   2> 2338304 WARN  (qtp23046864-13697) [n:127.0.0.1:45363_solr c:testNewLeaderOldReplica s:shard1 r:core_node42 x:testNewLeaderOldReplica_shard1_replica_n41] o.a.s.c.SolrConfig Couldn't add files from /home/jenkins/workspace/Lucene-Solr-7.x-Linux/solr/build/solr-core/test/J1/temp/solr.cloud.LIRRollingUpdatesTest_180117DDEDF3D7D5-001/tempDir-001/node2/testNewLeaderOldReplica_shard1_replica_n41/../../../../dist filtered by solr-langid-\d.*\.jar to classpath: /home/jenkins/workspace/Lucene-Solr-7.x-Linux/solr/build/solr-core/test/J1/temp/solr.cloud.LIRRollingUpdatesTest_180117DDEDF3D7D5-001/tempDir-001/node2/testNewLeaderOldReplica_shard1_replica_n41/../../../../dist
   [junit4]   2> 2338304 WARN  (qtp23046864-13697) [n:127.0.0.1:45363_solr c:testNewLeaderOldReplica s:shard1 r:core_node42 x:testNewLeaderOldReplica_shard1_replica_n41] o.a.s.c.SolrConfig Couldn't add files from /home/jenkins/workspace/Lucene-Solr-7.x-Linux/solr/build/solr-core/test/J1/temp/solr.cloud.LIRRollingUpdatesTest_180117DDEDF3D7D5-001/tempDir-001/node2/testNewLeaderOldReplica_shard1_replica_n41/../../../../contrib/velocity/lib filtered by .*\.jar to classpath: /home/jenkins/workspace/Lucene-Solr-7.x-Linux/solr/build/solr-core/test/J1/temp/solr.cloud.LIRRollingUpdatesTest_180117DDEDF3D7D5-001/tempDir-001/node2/testNewLeaderOldReplica_shard1_replica_n41/../../../../contrib/velocity/lib
   [junit4]   2> 2338304 WARN  (qtp23046864-13697) [n:127.0.0.1:45363_solr c:testNewLeaderOldReplica s:shard1 r:core_node42 x:testNewLeaderOldReplica_shard1_replica_n41] o.a.s.c.SolrConfig Couldn't add files from /home/jenkins/workspace/Lucene-Solr-7.x-Linux/solr/build/solr-core/test/J1/temp/solr.cloud.LIRRollingUpdatesTest_180117DDEDF3D7D5-001/tempDir-001/node2/testNewLeaderOldReplica_shard1_replica_n41/../../../../dist filtered by solr-velocity-\d.*\.jar to classpath: /home/jenkins/workspace/Lucene-Solr-7.x-Linux/solr/build/solr-core/test/J1/temp/solr.cloud.LIRRollingUpdatesTest_180117DDEDF3D7D5-001/tempDir-001/node2/testNewLeaderOldReplica_shard1_replica_n41/../../../../dist
   [junit4]   2> 2338316 INFO  (qtp23046864-13697) [n:127.0.0.1:45363_solr c:testNewLeaderOldReplica s:shard1 r:core_node42 x:testNewLeaderOldReplica_shard1_replica_n41] o.a.s.c.SolrConfig Using Lucene MatchVersion: 7.5.0
   [junit4]   2> 2338353 INFO  (qtp23046864-13697) [n:127.0.0.1:45363_solr c:testNewLeaderOldReplica s:shard1 r:core_node42 x:testNewLeaderOldReplica_shard1_replica_n41] o.a.s.s.IndexSchema [testNewLeaderOldReplica_shard1_replica_n41] Schema name=default-config
   [junit4]   2> 2338504 INFO  (qtp23046864-13697) [n:127.0.0.1:45363_solr c:testNewLeaderOldReplica s:shard1 r:core_node42 x:testNewLeaderOldReplica_shard1_replica_n41] o.a.s.s.IndexSchema Loaded schema default-config/1.6 with uniqueid field id
   [junit4]   2> 2338530 INFO  (qtp23046864-13697) [n:127.0.0.1:45363_solr c:testNewLeaderOldReplica s:shard1 r:core_node42 x:testNewLeaderOldReplica_shard1_replica_n41] o.a.s.c.CoreContainer Creating SolrCore 'testNewLeaderOldReplica_shard1_replica_n41' using configuration from collection testNewLeaderOldReplica, trusted=true
   [junit4]   2> 2338531 INFO  (qtp23046864-13697) [n:127.0.0.1:45363_solr c:testNewLeaderOldReplica s:shard1 r:core_node42 x:testNewLeaderOldReplica_shard1_replica_n41] o.a.s.m.r.SolrJmxReporter JMX monitoring for 'solr_45363.solr.core.testNewLeaderOldReplica.shard1.replica_n41' (registry 'solr.core.testNewLeaderOldReplica.shard1.replica_n41') enabled at server: com.sun.jmx.mbeanserver.JmxMBeanServer@8b862
   [junit4]   2> 2338531 INFO  (qtp23046864-13697) [n:127.0.0.1:45363_solr c:testNewLeaderOldReplica s:shard1 r:core_node42 x:testNewLeaderOldReplica_shard1_replica_n41] o.a.s.c.SolrCore solr.RecoveryStrategy.Builder
   [junit4]   2> 2338531 INFO  (qtp23046864-13697) [n:127.0.0.1:45363_solr c:testNewLeaderOldReplica s:shard1 r:core_node42 x:testNewLeaderOldReplica_shard1_replica_n41] o.a.s.c.SolrCore [[testNewLeaderOldReplica_shard1_replica_n41] ] Opening new SolrCore at [/home/jenkins/workspace/Lucene-Solr-7.x-Linux/solr/build/solr-core/test/J1/temp/solr.cloud.LIRRollingUpdatesTest_180117DDEDF3D7D5-001/tempDir-001/node2/testNewLeaderOldReplica_shard1_replica_n41], dataDir=[/home/jenkins/workspace/Lucene-Solr-7.x-Linux/solr/build/solr-core/test/J1/temp/solr.cloud.LIRRollingUpdatesTest_180117DDEDF3D7D5-001/tempDir-001/node2/./testNewLeaderOldReplica_shard1_replica_n41/data/]
   [junit4]   2> 2338534 INFO  (qtp23046864-13697) [n:127.0.0.1:45363_solr c:testNewLeaderOldReplica s:shard1 r:core_node42 x:testNewLeaderOldReplica_shard1_replica_n41] o.a.s.r.XSLTResponseWriter xsltCacheLifetimeSeconds=5
   [junit4]   2> 2338583 INFO  (qtp23046864-13697) [n:127.0.0.1:45363_solr c:testNewLeaderOldReplica s:shard1 r:core_node42 x:testNewLeaderOldReplica_shard1_replica_n41] o.a.s.u.UpdateHandler Using UpdateLog implementation: org.apache.solr.update.UpdateLog
   [junit4]   2> 2338583 INFO  (qtp23046864-13697) [n:127.0.0.1:45363_solr c:testNewLeaderOldReplica s:shard1 r:core_node42 x:testNewLeaderOldReplica_shard1_replica_n41] o.a.s.u.UpdateLog Initializing UpdateLog: dataDir= defaultSyncLevel=FLUSH numRecordsToKeep=100 maxNumLogsToKeep=10 numVersionBuckets=65536
   [junit4]   2> 2338584 INFO  (qtp23046864-13697) [n:127.0.0.1:45363_solr c:testNewLeaderOldReplica s:shard1 r:core_node42 x:testNewLeaderOldReplica_shard1_replica_n41] o.a.s.u.CommitTracker Hard AutoCommit: if uncommited for 15000ms; 
   [junit4]   2> 2338584 INFO  (qtp23046864-13697) [n:127.0.0.1:45363_solr c:testNewLeaderOldReplica s:shard1 r:core_node42 x:testNewLeaderOldReplica_shard1_replica_n41] o.a.s.u.CommitTracker Soft AutoCommit: disabled
   [junit4]   2> 2338586 INFO  (qtp23046864-13697) [n:127.0.0.1:45363_solr c:testNewLeaderOldReplica s:shard1 r:core_node42 x:testNewLeaderOldReplica_shard1_replica_n41] o.a.s.s.SolrIndexSearcher Opening [Searcher@1c78562[testNewLeaderOldReplica_shard1_replica_n41] main]
   [junit4]   2> 2338588 INFO  (qtp23046864-13697) [n:127.0.0.1:45363_solr c:testNewLeaderOldReplica s:shard1 r:core_node42 x:testNewLeaderOldReplica_shard1_replica_n41] o.a.s.r.ManagedResourceStorage Configured ZooKeeperStorageIO with znodeBase: /configs/testNewLeaderOldReplica.AUTOCREATED
   [junit4]   2> 2338588 INFO  (qtp23046864-13697) [n:127.0.0.1:45363_solr c:testNewLeaderOldReplica s:shard1 r:core_node42 x:testNewLeaderOldReplica_shard1_replica_n41] o.a.s.r.ManagedResourceStorage Loaded null at path _rest_managed.json using ZooKeeperStorageIO:path=/configs/testNewLeaderOldReplica.AUTOCREATED
   [junit4]   2> 2338588 INFO  (qtp23046864-13697) [n:127.0.0.1:45363_solr c:testNewLeaderOldReplica s:shard1 r:core_node42 x:testNewLeaderOldReplica_shard1_replica_n41] o.a.s.s.ZkIndexSchemaReader Creating ZooKeeper watch for the managed schema at /configs/testNewLeaderOldReplica.AUTOCREATED/managed-schema
   [junit4]   2> 2338589 INFO  (qtp23046864-13697) [n:127.0.0.1:45363_solr c:testNewLeaderOldReplica s:shard1 r:core_node42 x:testNewLeaderOldReplica_shard1_replica_n41] o.a.s.s.ZkIndexSchemaReader Current schema version 0 is already the latest
   [junit4]   2> 2338589 INFO  (qtp23046864-13697) [n:127.0.0.1:45363_solr c:testNewLeaderOldReplica s:shard1 r:core_node42 x:testNewLeaderOldReplica_shard1_replica_n41] o.a.s.h.c.SpellCheckComponent Initializing spell checkers
   [junit4]   2> 2338590 INFO  (qtp23046864-13697) [n:127.0.0.1:45363_solr c:testNewLeaderOldReplica s:shard1 r:core_node42 x:testNewLeaderOldReplica_shard1_replica_n41] o.a.s.s.DirectSolrSpellChecker init: {name=default,field=_text_,classname=solr.DirectSolrSpellChecker,distanceMeasure=internal,accuracy=0.5,maxEdits=2,minPrefix=1,maxInspections=5,minQueryLength=4,maxQueryFrequency=0.01}
   [junit4]   2> 2338593 INFO  (qtp23046864-13697) [n:127.0.0.1:45363_solr c:testNewLeaderOldReplica s:shard1 r:core_node42 x:testNewLeaderOldReplica_shard1_replica_n41] o.a.s.h.ReplicationHandler Commits will be reserved for 10000ms.
   [junit4]   2> 2338593 INFO  (searcherExecutor-5813-thread-1-processing-n:127.0.0.1:45363_solr x:testNewLeaderOldReplica_shard1_replica_n41 c:testNewLeaderOl

[...truncated too long message...]

test-lib/apacheds-kerberos-codec-2.0.0-M15.jar:/home/jenkins/workspace/Lucene-Solr-7.x-Linux/solr/core/test-lib/apacheds-ldif-partition-2.0.0-M15.jar:/home/jenkins/workspace/Lucene-Solr-7.x-Linux/solr/core/test-lib/apacheds-mavibot-partition-2.0.0-M15.jar:/home/jenkins/workspace/Lucene-Solr-7.x-Linux/solr/core/test-lib/apacheds-protocol-kerberos-2.0.0-M15.jar:/home/jenkins/workspace/Lucene-Solr-7.x-Linux/solr/core/test-lib/apacheds-protocol-ldap-2.0.0-M15.jar:/home/jenkins/workspace/Lucene-Solr-7.x-Linux/solr/core/test-lib/apacheds-protocol-shared-2.0.0-M15.jar:/home/jenkins/workspace/Lucene-Solr-7.x-Linux/solr/core/test-lib/apacheds-xdbm-partition-2.0.0-M15.jar:/home/jenkins/workspace/Lucene-Solr-7.x-Linux/solr/core/test-lib/api-all-1.0.0-M20.jar:/home/jenkins/workspace/Lucene-Solr-7.x-Linux/solr/core/test-lib/bcprov-jdk15on-1.54.jar:/home/jenkins/workspace/Lucene-Solr-7.x-Linux/solr/core/test-lib/byte-buddy-1.6.2.jar:/home/jenkins/workspace/Lucene-Solr-7.x-Linux/solr/core/test-lib/commons-collections-3.2.2.jar:/home/jenkins/workspace/Lucene-Solr-7.x-Linux/solr/core/test-lib/commons-math3-3.6.1.jar:/home/jenkins/workspace/Lucene-Solr-7.x-Linux/solr/core/test-lib/ehcache-core-2.4.4.jar:/home/jenkins/workspace/Lucene-Solr-7.x-Linux/solr/core/test-lib/hadoop-common-2.7.4-tests.jar:/home/jenkins/workspace/Lucene-Solr-7.x-Linux/solr/core/test-lib/hadoop-hdfs-2.7.4-tests.jar:/home/jenkins/workspace/Lucene-Solr-7.x-Linux/solr/core/test-lib/hadoop-minikdc-2.7.4.jar:/home/jenkins/workspace/Lucene-Solr-7.x-Linux/solr/core/test-lib/htrace-core-3.2.0-incubating.jar:/home/jenkins/workspace/Lucene-Solr-7.x-Linux/solr/core/test-lib/jersey-core-1.9.jar:/home/jenkins/workspace/Lucene-Solr-7.x-Linux/solr/core/test-lib/jersey-server-1.9.jar:/home/jenkins/workspace/Lucene-Solr-7.x-Linux/solr/core/test-lib/jetty-6.1.26.jar:/home/jenkins/workspace/Lucene-Solr-7.x-Linux/solr/core/test-lib/jetty-sslengine-6.1.26.jar:/home/jenkins/workspace/Lucene-Solr-7.x-Linux/solr/core/test-lib/jetty-util-6.1.26.jar:/home/jenkins/workspace/Lucene-Solr-7.x-Linux/solr/core/test-lib/mina-core-2.0.0-M5.jar:/home/jenkins/workspace/Lucene-Solr-7.x-Linux/solr/core/test-lib/mockito-core-2.6.2.jar:/home/jenkins/workspace/Lucene-Solr-7.x-Linux/solr/core/test-lib/netty-all-4.0.36.Final.jar:/home/jenkins/workspace/Lucene-Solr-7.x-Linux/solr/core/test-lib/objenesis-2.5.jar:/home/jenkins/workspace/Lucene-Solr-7.x-Linux/lucene/build/analysis/icu/lucene-analyzers-icu-7.5.0-SNAPSHOT.jar:/home/jenkins/workspace/Lucene-Solr-7.x-Linux/solr/build/contrib/solr-analysis-extras/classes/java:/home/jenkins/workspace/Lucene-Solr-7.x-Linux/lucene/build/queryparser/classes/test:/home/jenkins/workspace/Lucene-Solr-7.x-Linux/lucene/build/backward-codecs/classes/test:/home/jenkins/workspace/Lucene-Solr-7.x-Linux/solr/contrib/analysis-extras/lib/icu4j-62.1.jar:/var/lib/jenkins/tools/hudson.tasks.Ant_AntInstallation/ANT_1.8.2/lib/ant-launcher.jar:/home/jenkins/.ant/lib/ivy-2.4.0.jar:/var/lib/jenkins/tools/hudson.tasks.Ant_AntInstallation/ANT_1.8.2/lib/ant-netrexx.jar:/var/lib/jenkins/tools/hudson.tasks.Ant_AntInstallation/ANT_1.8.2/lib/ant-apache-xalan2.jar:/var/lib/jenkins/tools/hudson.tasks.Ant_AntInstallation/ANT_1.8.2/lib/ant.jar:/var/lib/jenkins/tools/hudson.tasks.Ant_AntInstallation/ANT_1.8.2/lib/ant-javamail.jar:/var/lib/jenkins/tools/hudson.tasks.Ant_AntInstallation/ANT_1.8.2/lib/ant-commons-net.jar:/var/lib/jenkins/tools/hudson.tasks.Ant_AntInstallation/ANT_1.8.2/lib/ant-apache-regexp.jar:/var/lib/jenkins/tools/hudson.tasks.Ant_AntInstallation/ANT_1.8.2/lib/ant-apache-oro.jar:/var/lib/jenkins/tools/hudson.tasks.Ant_AntInstallation/ANT_1.8.2/lib/ant-jmf.jar:/var/lib/jenkins/tools/hudson.tasks.Ant_AntInstallation/ANT_1.8.2/lib/ant-apache-log4j.jar:/var/lib/jenkins/tools/hudson.tasks.Ant_AntInstallation/ANT_1.8.2/lib/ant-jsch.jar:/var/lib/jenkins/tools/hudson.tasks.Ant_AntInstallation/ANT_1.8.2/lib/ant-jai.jar:/var/lib/jenkins/tools/hudson.tasks.Ant_AntInstallation/ANT_1.8.2/lib/ant-apache-bsf.jar:/var/lib/jenkins/tools/hudson.tasks.Ant_AntInstallation/ANT_1.8.2/lib/ant-junit4.jar:/var/lib/jenkins/tools/hudson.tasks.Ant_AntInstallation/ANT_1.8.2/lib/ant-apache-resolver.jar:/var/lib/jenkins/tools/hudson.tasks.Ant_AntInstallation/ANT_1.8.2/lib/ant-apache-bcel.jar:/var/lib/jenkins/tools/hudson.tasks.Ant_AntInstallation/ANT_1.8.2/lib/ant-junit.jar:/var/lib/jenkins/tools/hudson.tasks.Ant_AntInstallation/ANT_1.8.2/lib/ant-jdepend.jar:/var/lib/jenkins/tools/hudson.tasks.Ant_AntInstallation/ANT_1.8.2/lib/ant-testutil.jar:/var/lib/jenkins/tools/hudson.tasks.Ant_AntInstallation/ANT_1.8.2/lib/ant-antlr.jar:/var/lib/jenkins/tools/hudson.tasks.Ant_AntInstallation/ANT_1.8.2/lib/ant-swing.jar:/var/lib/jenkins/tools/hudson.tasks.Ant_AntInstallation/ANT_1.8.2/lib/ant-commons-logging.jar:/home/jenkins/tools/java/32bit/jdk1.8.0_172/lib/tools.jar:/home/jenkins/.ivy2/cache/com.carrotsearch.randomizedtesting/junit4-ant/jars/junit4-ant-2.6.0.jar com.carrotsearch.ant.tasks.junit4.slave.SlaveMainSafe -eventsfile /home/jenkins/workspace/Lucene-Solr-7.x-Linux/solr/build/solr-core/test/temp/junit4-J0-20180714_011806_7622469176736876168461.events @/home/jenkins/workspace/Lucene-Solr-7.x-Linux/solr/build/solr-core/test/temp/junit4-J0-20180714_011806_7622135225531963495658.suites -stdin
   [junit4] ERROR: JVM J0 ended with an exception: Quit event not received from the forked process? This may indicate JVM crash or runner bugs.
   [junit4] 	at com.carrotsearch.ant.tasks.junit4.JUnit4.executeSlave(JUnit4.java:1540)
   [junit4] 	at com.carrotsearch.ant.tasks.junit4.JUnit4.access$000(JUnit4.java:126)
   [junit4] 	at com.carrotsearch.ant.tasks.junit4.JUnit4$2.call(JUnit4.java:982)
   [junit4] 	at com.carrotsearch.ant.tasks.junit4.JUnit4$2.call(JUnit4.java:979)
   [junit4] 	at java.util.concurrent.FutureTask.run(FutureTask.java:266)
   [junit4] 	at java.util.concurrent.ThreadPoolExecutor.runWorker(ThreadPoolExecutor.java:1149)
   [junit4] 	at java.util.concurrent.ThreadPoolExecutor$Worker.run(ThreadPoolExecutor.java:624)
   [junit4] 	at java.lang.Thread.run(Thread.java:748)

BUILD FAILED
/home/jenkins/workspace/Lucene-Solr-7.x-Linux/build.xml:633: The following error occurred while executing this line:
/home/jenkins/workspace/Lucene-Solr-7.x-Linux/build.xml:577: The following error occurred while executing this line:
/home/jenkins/workspace/Lucene-Solr-7.x-Linux/build.xml:59: The following error occurred while executing this line:
/home/jenkins/workspace/Lucene-Solr-7.x-Linux/solr/build.xml:267: The following error occurred while executing this line:
/home/jenkins/workspace/Lucene-Solr-7.x-Linux/solr/common-build.xml:556: The following error occurred while executing this line:
/home/jenkins/workspace/Lucene-Solr-7.x-Linux/lucene/common-build.xml:1568: The following error occurred while executing this line:
/home/jenkins/workspace/Lucene-Solr-7.x-Linux/lucene/common-build.xml:1092: At least one slave process threw an exception, first: Quit event not received from the forked process? This may indicate JVM crash or runner bugs.

Total time: 1045 minutes 4 seconds
Build step 'Invoke Ant' marked build as failure
Archiving artifacts
Setting ANT_1_8_2_HOME=/var/lib/jenkins/tools/hudson.tasks.Ant_AntInstallation/ANT_1.8.2
ERROR: Step ‘Archive the artifacts’ aborted due to exception: 
java.nio.file.FileSystemException: /var/lib/jenkins/workspace/Lucene-Solr-7.x-Linux/solr/build/solr-core/test/temp/junit4-J0-20180714_011806_7622469176736876168461.events -> /var/lib/jenkins/jobs/Lucene-Solr-7.x-Linux/builds/2319/archive/solr/build/solr-core/test/temp/junit4-J0-20180714_011806_7622469176736876168461.events: No space left on device
	at sun.nio.fs.UnixException.translateToIOException(UnixException.java:91)
	at sun.nio.fs.UnixException.rethrowAsIOException(UnixException.java:102)
	at sun.nio.fs.UnixCopyFile.copyFile(UnixCopyFile.java:253)
	at sun.nio.fs.UnixCopyFile.copy(UnixCopyFile.java:581)
	at sun.nio.fs.UnixFileSystemProvider.copy(UnixFileSystemProvider.java:253)
	at java.nio.file.Files.copy(Files.java:1274)
	at hudson.FilePath$CopyRecursiveLocal$1.visit(FilePath.java:2488)
	at hudson.util.DirScanner.scanSingle(DirScanner.java:44)
	at hudson.FilePath$ExplicitlySpecifiedDirScanner.scan(FilePath.java:3162)
	at hudson.FilePath$CopyRecursiveLocal.invoke(FilePath.java:2482)
	at hudson.FilePath$CopyRecursiveLocal.invoke(FilePath.java:2466)
	at hudson.FilePath.act(FilePath.java:1095)
	at hudson.FilePath.act(FilePath.java:1078)
	at hudson.FilePath.copyRecursiveTo(FilePath.java:2414)
	at jenkins.model.StandardArtifactManager.archive(StandardArtifactManager.java:61)
	at hudson.tasks.ArtifactArchiver.perform(ArtifactArchiver.java:235)
	at hudson.tasks.BuildStepCompatibilityLayer.perform(BuildStepCompatibilityLayer.java:81)
	at hudson.tasks.BuildStepMonitor$1.perform(BuildStepMonitor.java:20)
	at hudson.model.AbstractBuild$AbstractBuildExecution.perform(AbstractBuild.java:744)
	at hudson.model.AbstractBuild$AbstractBuildExecution.performAllBuildSteps(AbstractBuild.java:690)
	at hudson.model.Build$BuildExecution.post2(Build.java:186)
	at hudson.model.AbstractBuild$AbstractBuildExecution.post(AbstractBuild.java:635)
	at hudson.model.Run.execute(Run.java:1840)
	at hudson.model.FreeStyleBuild.run(FreeStyleBuild.java:43)
	at hudson.model.ResourceController.execute(ResourceController.java:97)
	at hudson.model.Executor.run(Executor.java:429)
[WARNINGS] Skipping publisher since build result is FAILURE
Recording test results
Setting ANT_1_8_2_HOME=/var/lib/jenkins/tools/hudson.tasks.Ant_AntInstallation/ANT_1.8.2
Email was triggered for: Failure - Any
Sending email for trigger: Failure - Any
Setting ANT_1_8_2_HOME=/var/lib/jenkins/tools/hudson.tasks.Ant_AntInstallation/ANT_1.8.2
Setting ANT_1_8_2_HOME=/var/lib/jenkins/tools/hudson.tasks.Ant_AntInstallation/ANT_1.8.2
Setting ANT_1_8_2_HOME=/var/lib/jenkins/tools/hudson.tasks.Ant_AntInstallation/ANT_1.8.2
Setting ANT_1_8_2_HOME=/var/lib/jenkins/tools/hudson.tasks.Ant_AntInstallation/ANT_1.8.2

Mime
View raw message