lucene-dev mailing list archives

Site index · List index
Message view « Date » · « Thread »
Top « Date » · « Thread »
From Policeman Jenkins Server <jenk...@thetaphi.de>
Subject [JENKINS] Lucene-Solr-7.x-Solaris (64bit/jdk1.8.0) - Build # 722 - Unstable!
Date Sat, 14 Jul 2018 00:04:58 GMT
Build: https://jenkins.thetaphi.de/job/Lucene-Solr-7.x-Solaris/722/
Java: 64bit/jdk1.8.0 -XX:+UseCompressedOops -XX:+UseG1GC

1 tests failed.
FAILED:  org.apache.solr.client.solrj.io.stream.StreamDecoratorTest.testParallelCommitStream

Error Message:
expected:<5> but was:<3>

Stack Trace:
java.lang.AssertionError: expected:<5> but was:<3>
	at __randomizedtesting.SeedInfo.seed([75107210499CDA03:55FA1010D5DD374F]:0)
	at org.junit.Assert.fail(Assert.java:93)
	at org.junit.Assert.failNotEquals(Assert.java:647)
	at org.junit.Assert.assertEquals(Assert.java:128)
	at org.junit.Assert.assertEquals(Assert.java:472)
	at org.junit.Assert.assertEquals(Assert.java:456)
	at org.apache.solr.client.solrj.io.stream.StreamDecoratorTest.testParallelCommitStream(StreamDecoratorTest.java:3025)
	at sun.reflect.NativeMethodAccessorImpl.invoke0(Native Method)
	at sun.reflect.NativeMethodAccessorImpl.invoke(NativeMethodAccessorImpl.java:62)
	at sun.reflect.DelegatingMethodAccessorImpl.invoke(DelegatingMethodAccessorImpl.java:43)
	at java.lang.reflect.Method.invoke(Method.java:498)
	at com.carrotsearch.randomizedtesting.RandomizedRunner.invoke(RandomizedRunner.java:1737)
	at com.carrotsearch.randomizedtesting.RandomizedRunner$8.evaluate(RandomizedRunner.java:934)
	at com.carrotsearch.randomizedtesting.RandomizedRunner$9.evaluate(RandomizedRunner.java:970)
	at com.carrotsearch.randomizedtesting.RandomizedRunner$10.evaluate(RandomizedRunner.java:984)
	at com.carrotsearch.randomizedtesting.rules.SystemPropertiesRestoreRule$1.evaluate(SystemPropertiesRestoreRule.java:57)
	at org.apache.lucene.util.TestRuleSetupTeardownChained$1.evaluate(TestRuleSetupTeardownChained.java:49)
	at org.apache.lucene.util.AbstractBeforeAfterRule$1.evaluate(AbstractBeforeAfterRule.java:45)
	at org.apache.lucene.util.TestRuleThreadAndTestName$1.evaluate(TestRuleThreadAndTestName.java:48)
	at org.apache.lucene.util.TestRuleIgnoreAfterMaxFailures$1.evaluate(TestRuleIgnoreAfterMaxFailures.java:64)
	at org.apache.lucene.util.TestRuleMarkFailure$1.evaluate(TestRuleMarkFailure.java:47)
	at com.carrotsearch.randomizedtesting.rules.StatementAdapter.evaluate(StatementAdapter.java:36)
	at com.carrotsearch.randomizedtesting.ThreadLeakControl$StatementRunner.run(ThreadLeakControl.java:368)
	at com.carrotsearch.randomizedtesting.ThreadLeakControl.forkTimeoutingTask(ThreadLeakControl.java:817)
	at com.carrotsearch.randomizedtesting.ThreadLeakControl$3.evaluate(ThreadLeakControl.java:468)
	at com.carrotsearch.randomizedtesting.RandomizedRunner.runSingleTest(RandomizedRunner.java:943)
	at com.carrotsearch.randomizedtesting.RandomizedRunner$5.evaluate(RandomizedRunner.java:829)
	at com.carrotsearch.randomizedtesting.RandomizedRunner$6.evaluate(RandomizedRunner.java:879)
	at com.carrotsearch.randomizedtesting.RandomizedRunner$7.evaluate(RandomizedRunner.java:890)
	at com.carrotsearch.randomizedtesting.rules.StatementAdapter.evaluate(StatementAdapter.java:36)
	at com.carrotsearch.randomizedtesting.rules.SystemPropertiesRestoreRule$1.evaluate(SystemPropertiesRestoreRule.java:57)
	at org.apache.lucene.util.AbstractBeforeAfterRule$1.evaluate(AbstractBeforeAfterRule.java:45)
	at com.carrotsearch.randomizedtesting.rules.StatementAdapter.evaluate(StatementAdapter.java:36)
	at org.apache.lucene.util.TestRuleStoreClassName$1.evaluate(TestRuleStoreClassName.java:41)
	at com.carrotsearch.randomizedtesting.rules.NoShadowingOrOverridesOnMethodsRule$1.evaluate(NoShadowingOrOverridesOnMethodsRule.java:40)
	at com.carrotsearch.randomizedtesting.rules.NoShadowingOrOverridesOnMethodsRule$1.evaluate(NoShadowingOrOverridesOnMethodsRule.java:40)
	at com.carrotsearch.randomizedtesting.rules.StatementAdapter.evaluate(StatementAdapter.java:36)
	at com.carrotsearch.randomizedtesting.rules.StatementAdapter.evaluate(StatementAdapter.java:36)
	at com.carrotsearch.randomizedtesting.rules.StatementAdapter.evaluate(StatementAdapter.java:36)
	at org.apache.lucene.util.TestRuleAssertionsRequired$1.evaluate(TestRuleAssertionsRequired.java:53)
	at org.apache.lucene.util.TestRuleMarkFailure$1.evaluate(TestRuleMarkFailure.java:47)
	at org.apache.lucene.util.TestRuleIgnoreAfterMaxFailures$1.evaluate(TestRuleIgnoreAfterMaxFailures.java:64)
	at org.apache.lucene.util.TestRuleIgnoreTestSuites$1.evaluate(TestRuleIgnoreTestSuites.java:54)
	at com.carrotsearch.randomizedtesting.rules.StatementAdapter.evaluate(StatementAdapter.java:36)
	at com.carrotsearch.randomizedtesting.ThreadLeakControl$StatementRunner.run(ThreadLeakControl.java:368)
	at java.lang.Thread.run(Thread.java:748)




Build Log:
[...truncated 15772 lines...]
   [junit4] Suite: org.apache.solr.client.solrj.io.stream.StreamDecoratorTest
   [junit4]   2> Creating dataDir: /export/home/jenkins/workspace/Lucene-Solr-7.x-Solaris/solr/build/solr-solrj/test/J1/temp/solr.client.solrj.io.stream.StreamDecoratorTest_75107210499CDA03-001/init-core-data-001
   [junit4]   1> 23:33:18.175 [Thread-114] ERROR org.apache.zookeeper.server.ZooKeeperServer - ZKShutdownHandler is not registered, so ZooKeeper server won't take any action on ERROR or SHUTDOWN server state changes
   [junit4]   1> 23:33:18.288 [jetty-launcher-1039-thread-1] ERROR org.apache.solr.util.StartupLoggingUtils - Missing Java Option solr.log.dir. Logging may be missing or incomplete.
   [junit4]   1> 23:33:18.291 [jetty-launcher-1039-thread-2] ERROR org.apache.solr.util.StartupLoggingUtils - Missing Java Option solr.log.dir. Logging may be missing or incomplete.
   [junit4]   1> 23:33:18.296 [jetty-launcher-1039-thread-4] ERROR org.apache.solr.util.StartupLoggingUtils - Missing Java Option solr.log.dir. Logging may be missing or incomplete.
   [junit4]   1> 23:33:18.302 [jetty-launcher-1039-thread-3] ERROR org.apache.solr.util.StartupLoggingUtils - Missing Java Option solr.log.dir. Logging may be missing or incomplete.
   [junit4] IGNOR/A 0.18s J1 | StreamDecoratorTest.testParallelTerminatingDaemonUpdateStream
   [junit4]    > Assumption #1: got: <false>, expected: is <true>
   [junit4] IGNOR/A 0.11s J1 | StreamDecoratorTest.testTerminatingDaemonStream
   [junit4]    > Assumption #1: got: <false>, expected: is <true>
   [junit4] IGNOR/A 0.09s J1 | StreamDecoratorTest.testParallelPriorityStream
   [junit4]    > Assumption #1: got: <false>, expected: is <true>
   [junit4] IGNOR/A 0.13s J1 | StreamDecoratorTest.testClassifyStream
   [junit4]    > Assumption #1: got: <false>, expected: is <true>
   [junit4] IGNOR/A 0.11s J1 | StreamDecoratorTest.testPriorityStream
   [junit4]    > Assumption #1: got: <false>, expected: is <true>
   [junit4]   2> NOTE: reproduce with: ant test  -Dtestcase=StreamDecoratorTest -Dtests.method=testParallelCommitStream -Dtests.seed=75107210499CDA03 -Dtests.slow=true -Dtests.locale=cs-CZ -Dtests.timezone=Europe/Samara -Dtests.asserts=true -Dtests.file.encoding=US-ASCII
   [junit4] FAILURE 4.20s J1 | StreamDecoratorTest.testParallelCommitStream <<<
   [junit4]    > Throwable #1: java.lang.AssertionError: expected:<5> but was:<3>
   [junit4]    > 	at __randomizedtesting.SeedInfo.seed([75107210499CDA03:55FA1010D5DD374F]:0)
   [junit4]    > 	at org.apache.solr.client.solrj.io.stream.StreamDecoratorTest.testParallelCommitStream(StreamDecoratorTest.java:3025)
   [junit4]    > 	at java.lang.Thread.run(Thread.java:748)
   [junit4]   1> 23:34:54.351 [SUITE-StreamDecoratorTest-seed#[75107210499CDA03]-worker] ERROR org.apache.zookeeper.server.ZooKeeperServer - ZKShutdownHandler is not registered, so ZooKeeper server won't take any action on ERROR or SHUTDOWN server state changes
   [junit4]   2> NOTE: leaving temporary files on disk at: /export/home/jenkins/workspace/Lucene-Solr-7.x-Solaris/solr/build/solr-solrj/test/J1/temp/solr.client.solrj.io.stream.StreamDecoratorTest_75107210499CDA03-001
   [junit4]   2> Jul 13, 2018 11:34:54 PM com.carrotsearch.randomizedtesting.ThreadLeakControl checkThreadLeaks
   [junit4]   2> WARNING: Will linger awaiting termination of 1 leaked thread(s).
   [junit4]   2> NOTE: test params are: codec=Asserting(Lucene70): {expr_s=Lucene50(blocksize=128), type_s=PostingsFormat(name=MockRandom), join2_s=PostingsFormat(name=LuceneVarGapFixedInterval), multiDefault=PostingsFormat(name=LuceneVarGapFixedInterval), subject=PostingsFormat(name=LuceneVarGapFixedInterval), a1_s=PostingsFormat(name=MockRandom), a2_s=Lucene50(blocksize=128), test_t=PostingsFormat(name=Direct), body_t=PostingsFormat(name=Direct), ident_s=PostingsFormat(name=MockRandom), s_multi=Lucene50(blocksize=128), a_ss=PostingsFormat(name=LuceneVarGapFixedInterval), a_s=Lucene50(blocksize=128), extra_s=PostingsFormat(name=LuceneVarGapFixedInterval), ykey_s=PostingsFormat(name=MockRandom), side_s=PostingsFormat(name=Direct), id=PostingsFormat(name=Direct), text=Lucene50(blocksize=128), bbid_s=PostingsFormat(name=Direct)}, docValues:{expr_s=DocValuesFormat(name=Memory), join2_s=DocValuesFormat(name=Asserting), multiDefault=DocValuesFormat(name=Asserting), a1_s=DocValuesFormat(name=Lucene70), intDefault=DocValuesFormat(name=Lucene70), a_f=DocValuesFormat(name=Lucene70), join1_i=DocValuesFormat(name=Memory), a2_s=DocValuesFormat(name=Memory), a_i=DocValuesFormat(name=Lucene70), test_i=DocValuesFormat(name=Asserting), join3_i=DocValuesFormat(name=Lucene70), field_i=DocValuesFormat(name=Asserting), s_multi=DocValuesFormat(name=Memory), a_ss=DocValuesFormat(name=Asserting), a_s=DocValuesFormat(name=Memory), id=DocValuesFormat(name=Lucene70), bbid_s=DocValuesFormat(name=Lucene70), timestamp=DocValuesFormat(name=Asserting), type_s=DocValuesFormat(name=Lucene70), i_multi=DocValuesFormat(name=Lucene70), b_ls=DocValuesFormat(name=Lucene70), ident_s=DocValuesFormat(name=Lucene70), _version_=DocValuesFormat(name=Lucene70), extra_s=DocValuesFormat(name=Asserting), ykey_s=DocValuesFormat(name=Lucene70), side_s=DocValuesFormat(name=Lucene70)}, maxPointsInLeafNode=993, maxMBSortInHeap=6.155531721015194, sim=RandomSimilarity(queryNorm=true): {}, locale=cs-CZ, timezone=Europe/Samara
   [junit4]   2> NOTE: SunOS 5.11 amd64/Oracle Corporation 1.8.0_172 (64-bit)/cpus=3,threads=1,free=86980288,total=317718528
   [junit4]   2> NOTE: All tests run in this JVM: [SineEvaluatorTest, JdbcTest, SubtractEvaluatorTest, GraphTest, TestCollectionStateWatchers, AppendEvaluatorTest, SolrExampleJettyTest, JettyWebappTest, HyperbolicSineEvaluatorTest, StreamExpressionToExpessionTest, NotEvaluatorTest, SolrSchemalessExampleTest, StreamDecoratorTest]
   [junit4] Completed [56/154 (1!)] on J1 in 97.06s, 46 tests, 1 failure, 5 skipped <<< FAILURES!

[...truncated 47501 lines...]
[asciidoctor:convert] asciidoctor: ERROR: about-this-guide.adoc: line 1: invalid part, must have at least one section (e.g., chapter, appendix, etc.)
[asciidoctor:convert] asciidoctor: ERROR: solr-glossary.adoc: line 1: invalid part, must have at least one section (e.g., chapter, appendix, etc.)
     [java] Processed 2220 links (1775 relative) to 2998 anchors in 229 files
     [echo] Validated Links & Anchors via: /export/home/jenkins/workspace/Lucene-Solr-7.x-Solaris/solr/build/solr-ref-guide/bare-bones-html/

-documentation-lint:
    [jtidy] Checking for broken html (such as invalid tags)...
   [delete] Deleting directory /export/home/jenkins/workspace/Lucene-Solr-7.x-Solaris/lucene/build/jtidy_tmp
     [echo] Checking for broken links...
     [exec] 
     [exec] Crawl/parse...
     [exec] 
     [exec] Verify...
     [echo] Checking for malformed docs...

jar-checksums:

resolve:

ivy-availability-check:
[loadresource] Do not set property disallowed.ivy.jars.list as its length is 0.

-ivy-fail-disallowed-ivy-version:

ivy-fail:

ivy-configure:
[ivy:configure] :: loading settings :: file = /export/home/jenkins/workspace/Lucene-Solr-7.x-Solaris/lucene/top-level-ivy-settings.xml

resolve:

ivy-availability-check:
[loadresource] Do not set property disallowed.ivy.jars.list as its length is 0.

-ivy-fail-disallowed-ivy-version:

ivy-fail:

ivy-configure:
[ivy:configure] :: loading settings :: file = /export/home/jenkins/workspace/Lucene-Solr-7.x-Solaris/lucene/top-level-ivy-settings.xml

resolve:

resolve:

ivy-availability-check:
[loadresource] Do not set property disallowed.ivy.jars.list as its length is 0.

-ivy-fail-disallowed-ivy-version:

ivy-fail:

ivy-configure:
[ivy:configure] :: loading settings :: file = /export/home/jenkins/workspace/Lucene-Solr-7.x-Solaris/lucene/top-level-ivy-settings.xml

resolve:

ivy-availability-check:
[loadresource] Do not set property disallowed.ivy.jars.list as its length is 0.

-ivy-fail-disallowed-ivy-version:

ivy-fail:

ivy-configure:
[ivy:configure] :: loading settings :: file = /export/home/jenkins/workspace/Lucene-Solr-7.x-Solaris/lucene/top-level-ivy-settings.xml

resolve:

ivy-availability-check:
[loadresource] Do not set property disallowed.ivy.jars.list as its length is 0.

-ivy-fail-disallowed-ivy-version:

ivy-fail:

ivy-configure:
[ivy:configure] :: loading settings :: file = /export/home/jenkins/workspace/Lucene-Solr-7.x-Solaris/lucene/top-level-ivy-settings.xml

resolve:

ivy-availability-check:
[loadresource] Do not set property disallowed.ivy.jars.list as its length is 0.

-ivy-fail-disallowed-ivy-version:

ivy-fail:

ivy-configure:
[ivy:configure] :: loading settings :: file = /export/home/jenkins/workspace/Lucene-Solr-7.x-Solaris/lucene/top-level-ivy-settings.xml

resolve:

ivy-availability-check:
[loadresource] Do not set property disallowed.ivy.jars.list as its length is 0.

-ivy-fail-disallowed-ivy-version:

ivy-fail:

ivy-configure:
[ivy:configure] :: loading settings :: file = /export/home/jenkins/workspace/Lucene-Solr-7.x-Solaris/lucene/top-level-ivy-settings.xml

resolve:

ivy-availability-check:
[loadresource] Do not set property disallowed.ivy.jars.list as its length is 0.

-ivy-fail-disallowed-ivy-version:

ivy-fail:

ivy-configure:
[ivy:configure] :: loading settings :: file = /export/home/jenkins/workspace/Lucene-Solr-7.x-Solaris/lucene/top-level-ivy-settings.xml

resolve:

ivy-availability-check:
[loadresource] Do not set property disallowed.ivy.jars.list as its length is 0.

-ivy-fail-disallowed-ivy-version:

ivy-fail:

ivy-configure:
[ivy:configure] :: loading settings :: file = /export/home/jenkins/workspace/Lucene-Solr-7.x-Solaris/lucene/top-level-ivy-settings.xml

resolve:

ivy-availability-check:
[loadresource] Do not set property disallowed.ivy.jars.list as its length is 0.

-ivy-fail-disallowed-ivy-version:

ivy-fail:

ivy-configure:
[ivy:configure] :: loading settings :: file = /export/home/jenkins/workspace/Lucene-Solr-7.x-Solaris/lucene/top-level-ivy-settings.xml

resolve:

ivy-availability-check:
[loadresource] Do not set property disallowed.ivy.jars.list as its length is 0.

-ivy-fail-disallowed-ivy-version:

ivy-fail:

ivy-configure:
[ivy:configure] :: loading settings :: file = /export/home/jenkins/workspace/Lucene-Solr-7.x-Solaris/lucene/top-level-ivy-settings.xml

resolve:

ivy-availability-check:
[loadresource] Do not set property disallowed.ivy.jars.list as its length is 0.

-ivy-fail-disallowed-ivy-version:

ivy-fail:

ivy-configure:
[ivy:configure] :: loading settings :: file = /export/home/jenkins/workspace/Lucene-Solr-7.x-Solaris/lucene/top-level-ivy-settings.xml

resolve:

ivy-availability-check:
[loadresource] Do not set property disallowed.ivy.jars.list as its length is 0.

-ivy-fail-disallowed-ivy-version:

ivy-fail:

ivy-configure:
[ivy:configure] :: loading settings :: file = /export/home/jenkins/workspace/Lucene-Solr-7.x-Solaris/lucene/top-level-ivy-settings.xml

resolve:

ivy-availability-check:
[loadresource] Do not set property disallowed.ivy.jars.list as its length is 0.

-ivy-fail-disallowed-ivy-version:

ivy-fail:

ivy-configure:
[ivy:configure] :: loading settings :: file = /export/home/jenkins/workspace/Lucene-Solr-7.x-Solaris/lucene/top-level-ivy-settings.xml

resolve:

ivy-availability-check:
[loadresource] Do not set property disallowed.ivy.jars.list as its length is 0.

-ivy-fail-disallowed-ivy-version:

ivy-fail:

ivy-configure:
[ivy:configure] :: loading settings :: file = /export/home/jenkins/workspace/Lucene-Solr-7.x-Solaris/lucene/top-level-ivy-settings.xml

resolve:

ivy-availability-check:
[loadresource] Do not set property disallowed.ivy.jars.list as its length is 0.

-ivy-fail-disallowed-ivy-version:

ivy-fail:

ivy-configure:
[ivy:configure] :: loading settings :: file = /export/home/jenkins/workspace/Lucene-Solr-7.x-Solaris/lucene/top-level-ivy-settings.xml

resolve:

ivy-availability-check:
[loadresource] Do not set property disallowed.ivy.jars.list as its length is 0.

-ivy-fail-disallowed-ivy-version:

ivy-fail:

ivy-configure:
[ivy:configure] :: loading settings :: file = /export/home/jenkins/workspace/Lucene-Solr-7.x-Solaris/lucene/top-level-ivy-settings.xml

resolve:

ivy-availability-check:
[loadresource] Do not set property disallowed.ivy.jars.list as its length is 0.

-ivy-fail-disallowed-ivy-version:

ivy-fail:

ivy-configure:
[ivy:configure] :: loading settings :: file = /export/home/jenkins/workspace/Lucene-Solr-7.x-Solaris/lucene/top-level-ivy-settings.xml

resolve:

ivy-availability-check:
[loadresource] Do not set property disallowed.ivy.jars.list as its length is 0.

-ivy-fail-disallowed-ivy-version:

ivy-fail:

ivy-configure:
[ivy:configure] :: loading settings :: file = /export/home/jenkins/workspace/Lucene-Solr-7.x-Solaris/lucene/top-level-ivy-settings.xml

resolve:

ivy-availability-check:
[loadresource] Do not set property disallowed.ivy.jars.list as its length is 0.

-ivy-fail-disallowed-ivy-version:

ivy-fail:

ivy-configure:
[ivy:configure] :: loading settings :: file = /export/home/jenkins/workspace/Lucene-Solr-7.x-Solaris/lucene/top-level-ivy-settings.xml

resolve:

ivy-availability-check:
[loadresource] Do not set property disallowed.ivy.jars.list as its length is 0.

-ivy-fail-disallowed-ivy-version:

ivy-fail:

ivy-configure:
[ivy:configure] :: loading settings :: file = /export/home/jenkins/workspace/Lucene-Solr-7.x-Solaris/lucene/top-level-ivy-settings.xml

resolve:

ivy-availability-check:
[loadresource] Do not set property disallowed.ivy.jars.list as its length is 0.

-ivy-fail-disallowed-ivy-version:

ivy-fail:

ivy-configure:
[ivy:configure] :: loading settings :: file = /export/home/jenkins/workspace/Lucene-Solr-7.x-Solaris/lucene/top-level-ivy-settings.xml

resolve:

ivy-availability-check:
[loadresource] Do not set property disallowed.ivy.jars.list as its length is 0.

-ivy-fail-disallowed-ivy-version:

ivy-fail:

ivy-configure:
[ivy:configure] :: loading settings :: file = /export/home/jenkins/workspace/Lucene-Solr-7.x-Solaris/lucene/top-level-ivy-settings.xml

resolve:

ivy-availability-check:
[loadresource] Do not set property disallowed.ivy.jars.list as its length is 0.

-ivy-fail-disallowed-ivy-version:

ivy-fail:

ivy-configure:
[ivy:configure] :: loading settings :: file = /export/home/jenkins/workspace/Lucene-Solr-7.x-Solaris/lucene/top-level-ivy-settings.xml

resolve:

ivy-availability-check:
[loadresource] Do not set property disallowed.ivy.jars.list as its length is 0.

-ivy-fail-disallowed-ivy-version:

ivy-fail:

ivy-configure:
[ivy:configure] :: loading settings :: file = /export/home/jenkins/workspace/Lucene-Solr-7.x-Solaris/lucene/top-level-ivy-settings.xml

resolve:

ivy-availability-check:
[loadresource] Do not set property disallowed.ivy.jars.list as its length is 0.

-ivy-fail-disallowed-ivy-version:

ivy-fail:

ivy-configure:
[ivy:configure] :: loading settings :: file = /export/home/jenkins/workspace/Lucene-Solr-7.x-Solaris/lucene/top-level-ivy-settings.xml

common.resolve:

resolve:

ivy-availability-check:
[loadresource] Do not set property disallowed.ivy.jars.list as its length is 0.

-ivy-fail-disallowed-ivy-version:

ivy-fail:

ivy-configure:
[ivy:configure] :: loading settings :: file = /export/home/jenkins/workspace/Lucene-Solr-7.x-Solaris/lucene/top-level-ivy-settings.xml

resolve:

ivy-availability-check:
[loadresource] Do not set property disallowed.ivy.jars.list as its length is 0.

-ivy-fail-disallowed-ivy-version:

ivy-fail:

ivy-configure:
[ivy:configure] :: loading settings :: file = /export/home/jenkins/workspace/Lucene-Solr-7.x-Solaris/lucene/top-level-ivy-settings.xml

resolve:

ivy-availability-check:
[loadresource] Do not set property disallowed.ivy.jars.list as its length is 0.

-ivy-fail-disallowed-ivy-version:

ivy-fail:

ivy-configure:
[ivy:configure] :: loading settings :: file = /export/home/jenkins/workspace/Lucene-Solr-7.x-Solaris/lucene/top-level-ivy-settings.xml

resolve:

ivy-availability-check:
[loadresource] Do not set property disallowed.ivy.jars.list as its length is 0.

-ivy-fail-disallowed-ivy-version:

ivy-fail:

ivy-configure:
[ivy:configure] :: loading settings :: file = /export/home/jenkins/workspace/Lucene-Solr-7.x-Solaris/lucene/top-level-ivy-settings.xml

resolve:

ivy-availability-check:
[loadresource] Do not set property disallowed.ivy.jars.list as its length is 0.

-ivy-fail-disallowed-ivy-version:

ivy-fail:

ivy-configure:
[ivy:configure] :: loading settings :: file = /export/home/jenkins/workspace/Lucene-Solr-7.x-Solaris/lucene/top-level-ivy-settings.xml

resolve:

jar-checksums:
    [mkdir] Created dir: /export/home/jenkins/workspace/Lucene-Solr-7.x-Solaris/lucene/null1370916471
     [copy] Copying 36 files to /export/home/jenkins/workspace/Lucene-Solr-7.x-Solaris/lucene/null1370916471
   [delete] Deleting directory /export/home/jenkins/workspace/Lucene-Solr-7.x-Solaris/lucene/null1370916471

resolve-example:

ivy-availability-check:
[loadresource] Do not set property disallowed.ivy.jars.list as its length is 0.

-ivy-fail-disallowed-ivy-version:

ivy-fail:

ivy-configure:
[ivy:configure] :: loading settings :: file = /export/home/jenkins/workspace/Lucene-Solr-7.x-Solaris/lucene/top-level-ivy-settings.xml

resolve:

resolve-server:

ivy-availability-check:
[loadresource] Do not set property disallowed.ivy.jars.list as its length is 0.

-ivy-fail-disallowed-ivy-version:

ivy-fail:

ivy-fail:

ivy-configure:
[ivy:configure] :: loading settings :: file = /export/home/jenkins/workspace/Lucene-Solr-7.x-Solaris/lucene/top-level-ivy-settings.xml

resolve:

resolve:

ivy-availability-check:
[loadresource] Do not set property disallowed.ivy.jars.list as its length is 0.

-ivy-fail-disallowed-ivy-version:

ivy-fail:

ivy-fail:

ivy-configure:
[ivy:configure] :: loading settings :: file = /export/home/jenkins/workspace/Lucene-Solr-7.x-Solaris/lucene/top-level-ivy-settings.xml

resolve:

ivy-availability-check:
[loadresource] Do not set property disallowed.ivy.jars.list as its length is 0.

-ivy-fail-disallowed-ivy-version:

ivy-fail:

ivy-fail:

ivy-configure:
[ivy:configure] :: loading settings :: file = /export/home/jenkins/workspace/Lucene-Solr-7.x-Solaris/lucene/top-level-ivy-settings.xml

resolve:

ivy-availability-check:
[loadresource] Do not set property disallowed.ivy.jars.list as its length is 0.

-ivy-fail-disallowed-ivy-version:

ivy-fail:

ivy-configure:
[ivy:configure] :: loading settings :: file = /export/home/jenkins/workspace/Lucene-Solr-7.x-Solaris/lucene/top-level-ivy-settings.xml

resolve:

ivy-availability-check:
[loadresource] Do not set property disallowed.ivy.jars.list as its length is 0.

-ivy-fail-disallowed-ivy-version:

ivy-fail:

ivy-fail:

ivy-configure:
[ivy:configure] :: loading settings :: file = /export/home/jenkins/workspace/Lucene-Solr-7.x-Solaris/lucene/top-level-ivy-settings.xml

resolve:

ivy-availability-check:
[loadresource] Do not set property disallowed.ivy.jars.list as its length is 0.

-ivy-fail-disallowed-ivy-version:

ivy-fail:

ivy-configure:
[ivy:configure] :: loading settings :: file = /export/home/jenkins/workspace/Lucene-Solr-7.x-Solaris/lucene/top-level-ivy-settings.xml

resolve:

ivy-availability-check:
[loadresource] Do not set property disallowed.ivy.jars.list as its length is 0.

-ivy-fail-disallowed-ivy-version:

ivy-fail:

ivy-fail:

ivy-configure:
[ivy:configure] :: loading settings :: file = /export/home/jenkins/workspace/Lucene-Solr-7.x-Solaris/lucene/top-level-ivy-settings.xml

resolve:

ivy-availability-check:
[loadresource] Do not set property disallowed.ivy.jars.list as its length is 0.

-ivy-fail-disallowed-ivy-version:

ivy-fail:

ivy-fail:

ivy-configure:
[ivy:configure] :: loading settings :: file = /export/home/jenkins/workspace/Lucene-Solr-7.x-Solaris/lucene/top-level-ivy-settings.xml

resolve:

ivy-availability-check:
[loadresource] Do not set property disallowed.ivy.jars.list as its length is 0.

-ivy-fail-disallowed-ivy-version:

ivy-fail:

ivy-fail:

ivy-configure:
[ivy:configure] :: loading settings :: file = /export/home/jenkins/workspace/Lucene-Solr-7.x-Solaris/lucene/top-level-ivy-settings.xml

resolve:

ivy-availability-check:
[loadresource] Do not set property disallowed.ivy.jars.list as its length is 0.

-ivy-fail-disallowed-ivy-version:

ivy-fail:

ivy-fail:

ivy-configure:
[ivy:configure] :: loading settings :: file = /export/home/jenkins/workspace/Lucene-Solr-7.x-Solaris/lucene/top-level-ivy-settings.xml

resolve:

ivy-availability-check:
[loadresource] Do not set property disallowed.ivy.jars.list as its length is 0.

-ivy-fail-disallowed-ivy-version:

ivy-fail:

ivy-fail:

ivy-configure:
[ivy:configure] :: loading settings :: file = /export/home/jenkins/workspace/Lucene-Solr-7.x-Solaris/lucene/top-level-ivy-settings.xml

resolve:

ivy-availability-check:
[loadresource] Do not set property disallowed.ivy.jars.list as its length is 0.

-ivy-fail-disallowed-ivy-version:

ivy-fail:

ivy-fail:

ivy-configure:
[ivy:configure] :: loading settings :: file = /export/home/jenkins/workspace/Lucene-Solr-7.x-Solaris/lucene/top-level-ivy-settings.xml

resolve:

ivy-availability-check:
[loadresource] Do not set property disallowed.ivy.jars.list as its length is 0.

-ivy-fail-disallowed-ivy-version:

ivy-fail:

ivy-fail:

ivy-configure:
[ivy:configure] :: loading settings :: file = /export/home/jenkins/workspace/Lucene-Solr-7.x-Solaris/lucene/top-level-ivy-settings.xml

resolve:

ivy-availability-check:
[loadresource] Do not set property disallowed.ivy.jars.list as its length is 0.

-ivy-fail-disallowed-ivy-version:

ivy-fail:

ivy-fail:

ivy-configure:
[ivy:configure] :: loading settings :: file = /export/home/jenkins/workspace/Lucene-Solr-7.x-Solaris/lucene/top-level-ivy-settings.xml

resolve:

ivy-availability-check:
[loadresource] Do not set property disallowed.ivy.jars.list as its length is 0.

-ivy-fail-disallowed-ivy-version:

ivy-fail:

ivy-fail:

ivy-configure:
[ivy:configure] :: loading settings :: file = /export/home/jenkins/workspace/Lucene-Solr-7.x-Solaris/lucene/top-level-ivy-settings.xml

resolve:

ivy-availability-check:
[loadresource] Do not set property disallowed.ivy.jars.list as its length is 0.

-ivy-fail-disallowed-ivy-version:

ivy-fail:

ivy-fail:

ivy-configure:
[ivy:configure] :: loading settings :: file = /export/home/jenkins/workspace/Lucene-Solr-7.x-Solaris/lucene/top-level-ivy-settings.xml

resolve:

jar-checksums:
    [mkdir] Created dir: /export/home/jenkins/workspace/Lucene-Solr-7.x-Solaris/solr/null516352141
     [copy] Copying 241 files to /export/home/jenkins/workspace/Lucene-Solr-7.x-Solaris/solr/null516352141
   [delete] Deleting directory /export/home/jenkins/workspace/Lucene-Solr-7.x-Solaris/solr/null516352141

check-working-copy:
[ivy:cachepath] :: resolving dependencies :: org.eclipse.jgit#org.eclipse.jgit-caller;working
[ivy:cachepath] 	confs: [default]
[ivy:cachepath] 	found org.eclipse.jgit#org.eclipse.jgit;4.6.0.201612231935-r in public
[ivy:cachepath] 	found com.jcraft#jsch;0.1.53 in public
[ivy:cachepath] 	found com.googlecode.javaewah#JavaEWAH;1.1.6 in public
[ivy:cachepath] 	found org.apache.httpcomponents#httpclient;4.3.6 in public
[ivy:cachepath] 	found org.apache.httpcomponents#httpcore;4.3.3 in public
[ivy:cachepath] 	found commons-logging#commons-logging;1.1.3 in public
[ivy:cachepath] 	found commons-codec#commons-codec;1.6 in public
[ivy:cachepath] 	found org.slf4j#slf4j-api;1.7.2 in public
[ivy:cachepath] :: resolution report :: resolve 29ms :: artifacts dl 2ms
	---------------------------------------------------------------------
	|                  |            modules            ||   artifacts   |
	|       conf       | number| search|dwnlded|evicted|| number|dwnlded|
	---------------------------------------------------------------------
	|      default     |   8   |   0   |   0   |   0   ||   8   |   0   |
	---------------------------------------------------------------------
[wc-checker] Initializing working copy...
[wc-checker] SLF4J: Failed to load class "org.slf4j.impl.StaticLoggerBinder".
[wc-checker] SLF4J: Defaulting to no-operation (NOP) logger implementation
[wc-checker] SLF4J: See http://www.slf4j.org/codes.html#StaticLoggerBinder for further details.
[wc-checker] Checking working copy status...

-jenkins-base:

BUILD SUCCESSFUL
Total time: 109 minutes 5 seconds
Setting ANT_1_8_2_HOME=/export/home/jenkins/tools/hudson.tasks.Ant_AntInstallation/ANT_1.8.2
[Lucene-Solr-7.x-Solaris] $ /bin/sh -xe /var/tmp/jenkins6383440629825553984.sh
+ mv lucene/build lucene/build.orig
+ mv solr/build solr/build.orig
+ ANT_HOME=/export/home/jenkins/tools/hudson.tasks.Ant_AntInstallation/ANT_1.8.2
+ export ANT_HOME
+ PATH=/export/home/jenkins/tools/hudson.tasks.Ant_AntInstallation/ANT_1.8.2/bin:/export/home/jenkins/tools/java/64bit/jdk1.8.0/bin:/usr/bin:/usr/sbin
+ export PATH
+ python3.4 -u dev-tools/scripts/reproduceJenkinsFailures.py --no-git https://jenkins.thetaphi.de/job/Lucene-Solr-7.x-Solaris/722/consoleText
[repro] Jenkins log URL: https://jenkins.thetaphi.de/job/Lucene-Solr-7.x-Solaris/722/consoleText

[repro] Revision: 82388667bf5cf54e6dac7346cc323a516b9eca2a

[repro] Ant options: "-Dargs=-XX:+UseCompressedOops -XX:+UseG1GC"
[repro] Repro line:  ant test  -Dtestcase=StreamDecoratorTest -Dtests.method=testParallelCommitStream -Dtests.seed=75107210499CDA03 -Dtests.slow=true -Dtests.locale=cs-CZ -Dtests.timezone=Europe/Samara -Dtests.asserts=true -Dtests.file.encoding=US-ASCII

[repro] ant clean
Buildfile: /export/home/jenkins/workspace/Lucene-Solr-7.x-Solaris/build.xml

clean:

clean:

clean:

BUILD SUCCESSFUL
Total time: 0 seconds
[repro] Test suites by module:
[repro]    solr/solrj
[repro]       StreamDecoratorTest
[repro] ant compile-test
Buildfile: /export/home/jenkins/workspace/Lucene-Solr-7.x-Solaris/solr/solrj/build.xml

compile-solr-test-framework:

ivy-availability-check:
[loadresource] Do not set property disallowed.ivy.jars.list as its length is 0.

-ivy-fail-disallowed-ivy-version:

ivy-fail:

ivy-configure:
[ivy:configure] :: Apache Ivy 2.4.0 - 20141213170938 :: http://ant.apache.org/ivy/ ::
[ivy:configure] :: loading settings :: file = /export/home/jenkins/workspace/Lucene-Solr-7.x-Solaris/lucene/top-level-ivy-settings.xml

resolve:

-clover.disable:

-clover.load:

-clover.classpath:

-clover.setup:

clover:

compile-solr-core:

compile-solrj:

ivy-availability-check:
[loadresource] Do not set property disallowed.ivy.jars.list as its length is 0.

-ivy-fail-disallowed-ivy-version:

ivy-fail:

ivy-configure:
[ivy:configure] :: loading settings :: file = /export/home/jenkins/workspace/Lucene-Solr-7.x-Solaris/lucene/top-level-ivy-settings.xml

resolve-groovy:
[ivy:cachepath] :: resolving dependencies :: org.codehaus.groovy#groovy-all-caller;working
[ivy:cachepath] 	confs: [default]
[ivy:cachepath] 	found org.codehaus.groovy#groovy-all;2.4.15 in public
[ivy:cachepath] :: resolution report :: resolve 16ms :: artifacts dl 1ms
	---------------------------------------------------------------------
	|                  |            modules            ||   artifacts   |
	|       conf       | number| search|dwnlded|evicted|| number|dwnlded|
	---------------------------------------------------------------------
	|      default     |   1   |   0   |   0   |   0   ||   1   |   0   |
	---------------------------------------------------------------------

check-lucene-core-uptodate:

jar-lucene-core:

-mrjar-classes-uptodate:

ivy-availability-check:
[loadresource] Do not set property disallowed.ivy.jars.list as its length is 0.

-ivy-fail-disallowed-ivy-version:

ivy-fail:

ivy-configure:
[ivy:configure] :: loading settings :: file = /export/home/jenkins/workspace/Lucene-Solr-7.x-Solaris/lucene/top-level-ivy-settings.xml

resolve-groovy:

-check-git-state:

-git-cleanroot:

-copy-git-state:
     [copy] Copying 1 file to /export/home/jenkins/workspace/Lucene-Solr-7.x-Solaris/lucene/build

git-autoclean:

resolve:

init:

-clover.disable:

-clover.load:

-clover.classpath:

-clover.setup:

clover:

compile-core:
    [mkdir] Created dir: /export/home/jenkins/workspace/Lucene-Solr-7.x-Solaris/lucene/build/core/classes/java
    [javac] Compiling 842 source files to /export/home/jenkins/workspace/Lucene-Solr-7.x-Solaris/lucene/build/core/classes/java
    [javac] Note: Some input files use or override a deprecated API.
    [javac] Note: Recompile with -Xlint:deprecation for details.
    [javac] Creating empty /export/home/jenkins/workspace/Lucene-Solr-7.x-Solaris/lucene/build/core/classes/java/org/apache/lucene/util/graph/package-info.class
    [javac] Creating empty /export/home/jenkins/workspace/Lucene-Solr-7.x-Solaris/lucene/build/core/classes/java/org/apache/lucene/document/package-info.class
    [javac] Creating empty /export/home/jenkins/workspace/Lucene-Solr-7.x-Solaris/lucene/build/core/classes/java/org/apache/lucene/package-info.class
    [javac] Creating empty /export/home/jenkins/workspace/Lucene-Solr-7.x-Solaris/lucene/build/core/classes/java/org/apache/lucene/util/bkd/package-info.class
    [javac] Creating empty /export/home/jenkins/workspace/Lucene-Solr-7.x-Solaris/lucene/build/core/classes/java/org/apache/lucene/codecs/compressing/package-info.class
    [javac] Creating empty /export/home/jenkins/workspace/Lucene-Solr-7.x-Solaris/lucene/build/core/classes/java/org/apache/lucene/codecs/lucene60/package-info.class
    [javac] Creating empty /export/home/jenkins/workspace/Lucene-Solr-7.x-Solaris/lucene/build/core/classes/java/org/apache/lucene/codecs/package-info.class
    [javac] Creating empty /export/home/jenkins/workspace/Lucene-Solr-7.x-Solaris/lucene/build/core/classes/java/org/apache/lucene/util/package-info.class
    [javac] Creating empty /export/home/jenkins/workspace/Lucene-Solr-7.x-Solaris/lucene/build/core/classes/java/org/apache/lucene/index/package-info.class
    [javac] Creating empty /export/home/jenkins/workspace/Lucene-Solr-7.x-Solaris/lucene/build/core/classes/java/org/apache/lucene/util/fst/package-info.class
    [javac] Creating empty /export/home/jenkins/workspace/Lucene-Solr-7.x-Solaris/lucene/build/core/classes/java/org/apache/lucene/analysis/tokenattributes/package-info.class
    [javac] Creating empty /export/home/jenkins/workspace/Lucene-Solr-7.x-Solaris/lucene/build/core/classes/java/org/apache/lucene/search/package-info.class
    [javac] Creating empty /export/home/jenkins/workspace/Lucene-Solr-7.x-Solaris/lucene/build/core/classes/java/org/apache/lucene/codecs/lucene62/package-info.class
    [javac] Creating empty /export/home/jenkins/workspace/Lucene-Solr-7.x-Solaris/lucene/build/core/classes/java/org/apache/lucene/util/packed/package-info.class
    [javac] Creating empty /export/home/jenkins/workspace/Lucene-Solr-7.x-Solaris/lucene/build/core/classes/java/org/apache/lucene/util/mutable/package-info.class
    [javac] Creating empty /export/home/jenkins/workspace/Lucene-Solr-7.x-Solaris/lucene/build/core/classes/java/org/apache/lucene/codecs/lucene70/package-info.class
    [javac] Creating empty /export/home/jenkins/workspace/Lucene-Solr-7.x-Solaris/lucene/build/core/classes/java/org/apache/lucene/codecs/perfield/package-info.class
    [javac] Creating empty /export/home/jenkins/workspace/Lucene-Solr-7.x-Solaris/lucene/build/core/classes/java/org/apache/lucene/analysis/package-info.class
    [javac] Creating empty /export/home/jenkins/workspace/Lucene-Solr-7.x-Solaris/lucene/build/core/classes/java/org/apache/lucene/analysis/standard/package-info.class
    [javac] Creating empty /export/home/jenkins/workspace/Lucene-Solr-7.x-Solaris/lucene/build/core/classes/java/org/apache/lucene/store/package-info.class
    [javac] Creating empty /export/home/jenkins/workspace/Lucene-Solr-7.x-Solaris/lucene/build/core/classes/java/org/apache/lucene/codecs/blocktree/package-info.class
    [javac] Creating empty /export/home/jenkins/workspace/Lucene-Solr-7.x-Solaris/lucene/build/core/classes/java/org/apache/lucene/search/spans/package-info.class
    [javac] Creating empty /export/home/jenkins/workspace/Lucene-Solr-7.x-Solaris/lucene/build/core/classes/java/org/apache/lucene/search/similarities/package-info.class
    [javac] Creating empty /export/home/jenkins/workspace/Lucene-Solr-7.x-Solaris/lucene/build/core/classes/java/org/apache/lucene/util/automaton/package-info.class
    [javac] Creating empty /export/home/jenkins/workspace/Lucene-Solr-7.x-Solaris/lucene/build/core/classes/java/org/apache/lucene/codecs/lucene50/package-info.class
    [javac] Creating empty /export/home/jenkins/workspace/Lucene-Solr-7.x-Solaris/lucene/build/core/classes/java/org/apache/lucene/geo/package-info.class
     [copy] Copying 3 files to /export/home/jenkins/workspace/Lucene-Solr-7.x-Solaris/lucene/build/core/classes/java

patch-mrjar-classes:
[patch-cls] Remapped: org/apache/lucene/analysis/tokenattributes/CharTermAttributeImpl
[patch-cls] Remapped: org/apache/lucene/codecs/compressing/LZ4
[patch-cls] Remapped: org/apache/lucene/document/BinaryPoint$2
[patch-cls] Remapped: org/apache/lucene/document/DoubleRange
[patch-cls] Remapped: org/apache/lucene/document/FloatRange
[patch-cls] Remapped: org/apache/lucene/document/IntRange
[patch-cls] Remapped: org/apache/lucene/document/LongRange
[patch-cls] Remapped: org/apache/lucene/index/BitsSlice
[patch-cls] Remapped: org/apache/lucene/index/CodecReader
[patch-cls] Remapped: org/apache/lucene/index/MergeReaderWrapper
[patch-cls] Remapped: org/apache/lucene/search/BooleanScorer$TailPriorityQueue
[patch-cls] Remapped: org/apache/lucene/util/BytesRef
[patch-cls] Remapped: org/apache/lucene/util/BytesRefArray
[patch-cls] Remapped: org/apache/lucene/util/CharsRef$UTF16SortedAsUTF8Comparator
[patch-cls] Remapped: org/apache/lucene/util/CharsRef
[patch-cls] Remapped: org/apache/lucene/util/IntsRef
[patch-cls] Remapped: org/apache/lucene/util/LongsRef
[patch-cls] Remapped: org/apache/lucene/util/StringHelper
[patch-cls] Remapped: org/apache/lucene/util/automaton/Automaton$Builder
[patch-cls] Remapped: org/apache/lucene/util/automaton/Automaton
[patch-cls] Remapped 20 class files for Java 9 to: /export/home/jenkins/workspace/Lucene-Solr-7.x-Solaris/lucene/build/core/classes/java9
    [touch] Creating /export/home/jenkins/workspace/Lucene-Solr-7.x-Solaris/lucene/build/core/patch-mrjar.stamp

-mrjar-check:

-mrjar-core:
     [exec] Execute failed: java.io.IOException: Cannot run program "git" (in directory "/export/home/jenkins/workspace/Lucene-Solr-7.x-Solaris/lucene/core"): error=2, No such file or directory
      [jar] Building jar: /export/home/jenkins/workspace/Lucene-Solr-7.x-Solaris/lucene/build/core/lucene-core-7.5.0-SNAPSHOT.jar

-jar-core:

jar-core:

check-backward-codecs-uptodate:

jar-backward-codecs:

-mrjar-classes-uptodate:

ivy-availability-check:
[loadresource] Do not set property disallowed.ivy.jars.list as its length is 0.

-ivy-fail-disallowed-ivy-version:

ivy-fail:

ivy-configure:
[ivy:configure] :: loading settings :: file = /export/home/jenkins/workspace/Lucene-Solr-7.x-Solaris/lucene/top-level-ivy-settings.xml

resolve-groovy:

-check-git-state:

-git-cleanroot:

-copy-git-state:

git-autoclean:

resolve:

common.init:

compile-lucene-core:

-check-git-state:

-git-cleanroot:

-copy-git-state:

git-autoclean:

ivy-availability-check:
[loadresource] Do not set property disallowed.ivy.jars.list as its length is 0.

-ivy-fail-disallowed-ivy-version:

ivy-fail:

ivy-configure:
[ivy:configure] :: loading settings :: file = /export/home/jenkins/workspace/Lucene-Solr-7.x-Solaris/lucene/top-level-ivy-settings.xml

resolve:

init:

-clover.disable:

-clover.load:

-clover.classpath:

-clover.setup:

clover:

compile-core:

init:

-clover.disable:

-clover.load:

-clover.classpath:

-clover.setup:

clover:

compile-core:
    [mkdir] Created dir: /export/home/jenkins/workspace/Lucene-Solr-7.x-Solaris/lucene/build/backward-codecs/classes/java
    [javac] Compiling 13 source files to /export/home/jenkins/workspace/Lucene-Solr-7.x-Solaris/lucene/build/backward-codecs/classes/java
    [javac] Note: Some input files use or override a deprecated API.
    [javac] Note: Recompile with -Xlint:deprecation for details.
    [javac] Creating empty /export/home/jenkins/workspace/Lucene-Solr-7.x-Solaris/lucene/build/backward-codecs/classes/java/org/apache/lucene/codecs/lucene54/package-info.class
    [javac] Creating empty /export/home/jenkins/workspace/Lucene-Solr-7.x-Solaris/lucene/build/backward-codecs/classes/java/org/apache/lucene/codecs/lucene53/package-info.class
     [copy] Copying 3 files to /export/home/jenkins/workspace/Lucene-Solr-7.x-Solaris/lucene/build/backward-codecs/classes/java

patch-mrjar-classes:
[patch-cls] Remapped 0 class files for Java 9 to: /export/home/jenkins/workspace/Lucene-Solr-7.x-Solaris/lucene/build/backward-codecs/classes/java9
    [touch] Creating /export/home/jenkins/workspace/Lucene-Solr-7.x-Solaris/lucene/build/backward-codecs/patch-mrjar.stamp

-mrjar-check:

-mrjar-core:

-jar-core:
     [exec] Execute failed: java.io.IOException: Cannot run program "git" (in directory "/export/home/jenkins/workspace/Lucene-Solr-7.x-Solaris/lucene/backward-codecs"): error=2, No such file or directory
      [jar] Building jar: /export/home/jenkins/workspace/Lucene-Solr-7.x-Solaris/lucene/build/backward-codecs/lucene-backward-codecs-7.5.0-SNAPSHOT.jar

jar-core:

check-analyzers-phonetic-uptodate:

jar-analyzers-phonetic:

-mrjar-classes-uptodate:

ivy-availability-check:
[loadresource] Do not set property disallowed.ivy.jars.list as its length is 0.

-ivy-fail-disallowed-ivy-version:

ivy-fail:

ivy-configure:
[ivy:configure] :: loading settings :: file = /export/home/jenkins/workspace/Lucene-Solr-7.x-Solaris/lucene/top-level-ivy-settings.xml

resolve-groovy:

check-analyzers-common-uptodate:

jar-analyzers-common:

-mrjar-classes-uptodate:

ivy-availability-check:
[loadresource] Do not set property disallowed.ivy.jars.list as its length is 0.

-ivy-fail-disallowed-ivy-version:

ivy-fail:

ivy-configure:
[ivy:configure] :: loading settings :: file = /export/home/jenkins/workspace/Lucene-Solr-7.x-Solaris/lucene/top-level-ivy-settings.xml

resolve-groovy:

-check-git-state:

-git-cleanroot:

-copy-git-state:

git-autoclean:

resolve:

common.init:

compile-lucene-core:

-check-git-state:

-git-cleanroot:

-copy-git-state:

git-autoclean:

ivy-availability-check:
[loadresource] Do not set property disallowed.ivy.jars.list as its length is 0.

-ivy-fail-disallowed-ivy-version:

ivy-fail:

ivy-configure:
[ivy:configure] :: loading settings :: file = /export/home/jenkins/workspace/Lucene-Solr-7.x-Solaris/lucene/top-level-ivy-settings.xml

resolve:

init:

-clover.disable:

-clover.load:

-clover.classpath:

-clover.setup:

clover:

compile-core:

init:

-clover.disable:

-clover.load:

-clover.classpath:

-clover.setup:

clover:

compile-core:
    [mkdir] Created dir: /export/home/jenkins/workspace/Lucene-Solr-7.x-Solaris/lucene/build/analysis/common/classes/java
    [javac] Compiling 475 source files to /export/home/jenkins/workspace/Lucene-Solr-7.x-Solaris/lucene/build/analysis/common/classes/java
    [javac] Note: Some input files use or override a deprecated API.
    [javac] Note: Recompile with -Xlint:deprecation for details.
    [javac] Creating empty /export/home/jenkins/workspace/Lucene-Solr-7.x-Solaris/lucene/build/analysis/common/classes/java/org/apache/lucene/analysis/hunspell/package-info.class
    [javac] Creating empty /export/home/jenkins/workspace/Lucene-Solr-7.x-Solaris/lucene/build/analysis/common/classes/java/org/apache/lucene/analysis/minhash/package-info.class
    [javac] Creating empty /export/home/jenkins/workspace/Lucene-Solr-7.x-Solaris/lucene/build/analysis/common/classes/java/org/apache/lucene/analysis/ga/package-info.class
    [javac] Creating empty /export/home/jenkins/workspace/Lucene-Solr-7.x-Solaris/lucene/build/analysis/common/classes/java/org/apache/lucene/analysis/ca/package-info.class
    [javac] Creating empty /export/home/jenkins/workspace/Lucene-Solr-7.x-Solaris/lucene/build/analysis/common/classes/java/org/apache/lucene/analysis/custom/package-info.class
    [javac] Creating empty /export/home/jenkins/workspace/Lucene-Solr-7.x-Solaris/lucene/build/analysis/common/classes/java/org/apache/lucene/analysis/sr/package-info.class
    [javac] Creating empty /export/home/jenkins/workspace/Lucene-Solr-7.x-Solaris/lucene/build/analysis/common/classes/java/org/apache/lucene/collation/package-info.class
    [javac] Creating empty /export/home/jenkins/workspace/Lucene-Solr-7.x-Solaris/lucene/build/analysis/common/classes/java/org/apache/lucene/analysis/sv/package-info.class
    [javac] Creating empty /export/home/jenkins/workspace/Lucene-Solr-7.x-Solaris/lucene/build/analysis/common/classes/java/org/apache/lucene/analysis/bg/package-info.class
    [javac] Creating empty /export/home/jenkins/workspace/Lucene-Solr-7.x-Solaris/lucene/build/analysis/common/classes/java/org/apache/lucene/analysis/payloads/package-info.class
    [javac] Creating empty /export/home/jenkins/workspace/Lucene-Solr-7.x-Solaris/lucene/build/analysis/common/classes/java/org/apache/lucene/analysis/ngram/package-info.class
    [javac] Creating empty /export/home/jenkins/workspace/Lucene-Solr-7.x-Solaris/lucene/build/analysis/common/classes/java/org/apache/lucene/analysis/core/package-info.class
    [javac] Creating empty /export/home/jenkins/workspace/Lucene-Solr-7.x-Solaris/lucene/build/analysis/common/classes/java/org/apache/lucene/analysis/bn/package-info.class
    [javac] Creating empty /export/home/jenkins/workspace/Lucene-Solr-7.x-Solaris/lucene/build/analysis/common/classes/java/org/apache/lucene/analysis/fr/package-info.class
    [javac] Creating empty /export/home/jenkins/workspace/Lucene-Solr-7.x-Solaris/lucene/build/analysis/common/classes/java/org/tartarus/snowball/ext/package-info.class
    [javac] Creating empty /export/home/jenkins/workspace/Lucene-Solr-7.x-Solaris/lucene/build/analysis/common/classes/java/org/apache/lucene/analysis/br/package-info.class
    [javac] Creating empty /export/home/jenkins/workspace/Lucene-Solr-7.x-Solaris/lucene/build/analysis/common/classes/java/org/apache/lucene/analysis/miscellaneous/package-info.class
    [javac] Creating empty /export/home/jenkins/workspace/Lucene-Solr-7.x-Solaris/lucene/build/analysis/common/classes/java/org/apache/lucene/analysis/sinks/package-info.class
    [javac] Creating empty /export/home/jenkins/workspace/Lucene-Solr-7.x-Solaris/lucene/build/analysis/common/classes/java/org/apache/lucene/analysis/cjk/package-info.class
    [javac] Creating empty /export/home/jenkins/workspace/Lucene-Solr-7.x-Solaris/lucene/build/analysis/common/classes/java/org/apache/lucene/analysis/synonym/package-info.class
    [javac] Creating empty /export/home/jenkins/workspace/Lucene-Solr-7.x-Solaris/lucene/build/analysis/common/classes/java/org/apache/lucene/analysis/wikipedia/package-info.class
    [javac] Creating empty /export/home/jenkins/workspace/Lucene-Solr-7.x-Solaris/lucene/build/analysis/common/classes/java/org/apache/lucene/analysis/fa/package-info.class
    [javac] Creating empty /export/home/jenkins/workspace/Lucene-Solr-7.x-Solaris/lucene/build/analysis/common/classes/java/org/apache/lucene/analysis/reverse/package-info.class
    [javac] Creating empty /export/home/jenkins/workspace/Lucene-Solr-7.x-Solaris/lucene/build/analysis/common/classes/java/org/apache/lucene/analysis/nl/package-info.class
    [javac] Creating empty /export/home/jenkins/workspace/Lucene-Solr-7.x-Solaris/lucene/build/analysis/common/classes/java/org/apache/lucene/analysis/ro/package-info.class
    [javac] Creating empty /export/home/jenkins/workspace/Lucene-Solr-7.x-Solaris/lucene/build/analysis/common/classes/java/org/apache/lucene/analysis/fi/package-info.class
    [javac] Creating empty /export/home/jenkins/workspace/Lucene-Solr-7.x-Solaris/lucene/build/analysis/common/classes/java/org/apache/lucene/analysis/ru/package-info.class
    [javac] Creating empty /export/home/jenkins/workspace/Lucene-Solr-7.x-Solaris/lucene/build/analysis/common/classes/java/org/apache/lucene/analysis/no/package-info.class
    [javac] Creating empty /export/home/jenkins/workspace/Lucene-Solr-7.x-Solaris/lucene/build/analysis/common/classes/java/org/apache/lucene/analysis/el/package-info.class
    [javac] Creating empty /export/home/jenkins/workspace/Lucene-Solr-7.x-Solaris/lucene/build/analysis/common/classes/java/org/apache/lucene/analysis/ckb/package-info.class
    [javac] Creating empty /export/home/jenkins/workspace/Lucene-Solr-7.x-Solaris/lucene/build/analysis/common/classes/java/org/tartarus/snowball/package-info.class
    [javac] Creating empty /export/home/jenkins/workspace/Lucene-Solr-7.x-Solaris/lucene/build/analysis/common/classes/java/org/apache/lucene/analysis/in/package-info.class
    [javac] Creating empty /export/home/jenkins/workspace/Lucene-Solr-7.x-Solaris/lucene/build/analysis/common/classes/java/org/apache/lucene/analysis/util/package-info.class
    [javac] Creating empty /export/home/jenkins/workspace/Lucene-Solr-7.x-Solaris/lucene/build/analysis/common/classes/java/org/apache/lucene/analysis/it/package-info.class
    [javac] Creating empty /export/home/jenkins/workspace/Lucene-Solr-7.x-Solaris/lucene/build/analysis/common/classes/java/org/apache/lucene/analysis/snowball/package-info.class
    [javac] Creating empty /export/home/jenkins/workspace/Lucene-Solr-7.x-Solaris/lucene/build/analysis/common/classes/java/org/apache/lucene/analysis/en/package-info.class
    [javac] Creating empty /export/home/jenkins/workspace/Lucene-Solr-7.x-Solaris/lucene/build/analysis/common/classes/java/org/apache/lucene/analysis/es/package-info.class
    [javac] Creating empty /export/home/jenkins/workspace/Lucene-Solr-7.x-Solaris/lucene/build/analysis/common/classes/java/org/apache/lucene/analysis/shingle/package-info.class
    [javac] Creating empty /export/home/jenkins/workspace/Lucene-Solr-7.x-Solaris/lucene/build/analysis/common/classes/java/org/apache/lucene/analysis/eu/package-info.class
    [javac] Creating empty /export/home/jenkins/workspace/Lucene-Solr-7.x-Solaris/lucene/build/analysis/common/classes/java/org/apache/lucene/analysis/ar/package-info.class
    [javac] Creating empty /export/home/jenkins/workspace/Lucene-Solr-7.x-Solaris/lucene/build/analysis/common/classes/java/org/apache/lucene/analysis/query/package-info.class
    [javac] Creating empty /export/home/jenkins/workspace/Lucene-Solr-7.x-Solaris/lucene/build/analysis/common/classes/java/org/apache/lucene/analysis/id/package-info.class
    [javac] Creating empty /export/home/jenkins/workspace/Lucene-Solr-7.x-Solaris/lucene/build/analysis/common/classes/java/org/apache/lucene/analysis/compound/hyphenation/package-info.class
    [javac] Creating empty /export/home/jenkins/workspace/Lucene-Solr-7.x-Solaris/lucene/build/analysis/common/classes/java/org/apache/lucene/analysis/charfilter/package-info.class
    [javac] Creating empty /export/home/jenkins/workspace/Lucene-Solr-7.x-Solaris/lucene/build/analysis/common/classes/java/org/apache/lucene/analysis/pt/package-info.class
    [javac] Creating empty /export/home/jenkins/workspace/Lucene-Solr-7.x-Solaris/lucene/build/analysis/common/classes/java/org/apache/lucene/analysis/lv/package-info.class
    [javac] Creating empty /export/home/jenkins/workspace/Lucene-Solr-7.x-Solaris/lucene/build/analysis/common/classes/java/org/apache/lucene/analysis/lt/package-info.class
    [javac] Creating empty /export/home/jenkins/workspace/Lucene-Solr-7.x-Solaris/lucene/build/analysis/common/classes/java/org/apache/lucene/analysis/hu/package-info.class
    [javac] Creating empty /export/home/jenkins/workspace/Lucene-Solr-7.x-Solaris/lucene/build/analysis/common/classes/java/org/apache/lucene/analysis/hy/package-info.class
    [javac] Creating empty /export/home/jenkins/workspace/Lucene-Solr-7.x-Solaris/lucene/build/analysis/common/classes/java/org/apache/lucene/analysis/pattern/package-info.class
    [javac] Creating empty /export/home/jenkins/workspace/Lucene-Solr-7.x-Solaris/lucene/build/analysis/common/classes/java/org/apache/lucene/analysis/cz/package-info.class
    [javac] Creating empty /export/home/jenkins/workspace/Lucene-Solr-7.x-Solaris/lucene/build/analysis/common/classes/java/org/apache/lucene/analysis/th/package-info.class
    [javac] Creating empty /export/home/jenkins/workspace/Lucene-Solr-7.x-Solaris/lucene/build/analysis/common/classes/java/org/apache/lucene/analysis/path/package-info.class
    [javac] Creating empty /export/home/jenkins/workspace/Lucene-Solr-7.x-Solaris/lucene/build/analysis/common/classes/java/org/apache/lucene/analysis/tr/package-info.class
    [javac] Creating empty /export/home/jenkins/workspace/Lucene-Solr-7.x-Solaris/lucene/build/analysis/common/classes/java/org/apache/lucene/analysis/da/package-info.class
    [javac] Creating empty /export/home/jenkins/workspace/Lucene-Solr-7.x-Solaris/lucene/build/analysis/common/classes/java/org/apache/lucene/analysis/de/package-info.class
    [javac] Creating empty /export/home/jenkins/workspace/Lucene-Solr-7.x-Solaris/lucene/build/analysis/common/classes/java/org/apache/lucene/analysis/hi/package-info.class
    [javac] Creating empty /export/home/jenkins/workspace/Lucene-Solr-7.x-Solaris/lucene/build/analysis/common/classes/java/org/apache/lucene/collation/tokenattributes/package-info.class
    [javac] Creating empty /export/home/jenkins/workspace/Lucene-Solr-7.x-Solaris/lucene/build/analysis/common/classes/java/org/apache/lucene/analysis/gl/package-info.class
    [javac] Creating empty /export/home/jenkins/workspace/Lucene-Solr-7.x-Solaris/lucene/build/analysis/common/classes/java/org/apache/lucene/analysis/commongrams/package-info.class
    [javac] Creating empty /export/home/jenkins/workspace/Lucene-Solr-7.x-Solaris/lucene/build/analysis/common/classes/java/org/apache/lucene/analysis/compound/package-info.class
     [copy] Copying 40 files to /export/home/jenkins/workspace/Lucene-Solr-7.x-Solaris/lucene/build/analysis/common/classes/java

patch-mrjar-classes:
[patch-cls] Remapped 0 class files for Java 9 to: /export/home/jenkins/workspace/Lucene-Solr-7.x-Solaris/lucene/build/analysis/common/classes/java9
    [touch] Creating /export/home/jenkins/workspace/Lucene-Solr-7.x-Solaris/lucene/build/analysis/common/patch-mrjar.stamp

-mrjar-check:

-mrjar-core:

-jar-core:
     [exec] Execute failed: java.io.IOException: Cannot run program "git" (in directory "/export/home/jenkins/workspace/Lucene-Solr-7.x-Solaris/lucene/analysis/common"): error=2, No such file or directory
      [jar] Building jar: /export/home/jenkins/workspace/Lucene-Solr-7.x-Solaris/lucene/build/analysis/common/lucene-analyzers-common-7.5.0-SNAPSHOT.jar

jar-core:

-check-git-state:

-git-cleanroot:

-copy-git-state:

git-autoclean:

resolve:

common.init:

compile-lucene-core:

-check-git-state:

-git-cleanroot:

-copy-git-state:

git-autoclean:

ivy-availability-check:
[loadresource] Do not set property disallowed.ivy.jars.list as its length is 0.

-ivy-fail-disallowed-ivy-version:

ivy-fail:

ivy-configure:
[ivy:configure] :: loading settings :: file = /export/home/jenkins/workspace/Lucene-Solr-7.x-Solaris/lucene/top-level-ivy-settings.xml

resolve:

init:

-clover.disable:

-clover.load:

-clover.classpath:

-clover.setup:

clover:

compile-core:

init:

-clover.disable:

-clover.load:

-clover.classpath:

-clover.setup:

clover:

common.compile-core:
    [mkdir] Created dir: /export/home/jenkins/workspace/Lucene-Solr-7.x-Solaris/lucene/build/analysis/phonetic/classes/java
    [javac] Compiling 9 source files to /export/home/jenkins/workspace/Lucene-Solr-7.x-Solaris/lucene/build/analysis/phonetic/classes/java
    [javac] Creating empty /export/home/jenkins/workspace/Lucene-Solr-7.x-Solaris/lucene/build/analysis/phonetic/classes/java/org/apache/lucene/analysis/phonetic/package-info.class
     [copy] Copying 1 file to /export/home/jenkins/workspace/Lucene-Solr-7.x-Solaris/lucene/build/analysis/phonetic/classes/java

compile-core:

patch-mrjar-classes:
[patch-cls] Remapped 0 class files for Java 9 to: /export/home/jenkins/workspace/Lucene-Solr-7.x-Solaris/lucene/build/analysis/phonetic/classes/java9
    [touch] Creating /export/home/jenkins/workspace/Lucene-Solr-7.x-Solaris/lucene/build/analysis/phonetic/patch-mrjar.stamp

-mrjar-check:

-mrjar-core:

-jar-core:
     [exec] Execute failed: java.io.IOException: Cannot run program "git" (in directory "/export/home/jenkins/workspace/Lucene-Solr-7.x-Solaris/lucene/analysis/phonetic"): error=2, No such file or directory
      [jar] Building jar: /export/home/jenkins/workspace/Lucene-Solr-7.x-Solaris/lucene/build/analysis/phonetic/lucene-analyzers-phonetic-7.5.0-SNAPSHOT.jar

jar-core:

check-analyzers-kuromoji-uptodate:

jar-analyzers-kuromoji:

-mrjar-classes-uptodate:

ivy-availability-check:
[loadresource] Do not set property disallowed.ivy.jars.list as its length is 0.

-ivy-fail-disallowed-ivy-version:

ivy-fail:

ivy-configure:
[ivy:configure] :: loading settings :: file = /export/home/jenkins/workspace/Lucene-Solr-7.x-Solaris/lucene/top-level-ivy-settings.xml

resolve-groovy:

check-analyzers-common-uptodate:

jar-analyzers-common:

-check-git-state:

-git-cleanroot:

-copy-git-state:

git-autoclean:

resolve:

common.init:

compile-lucene-core:

-check-git-state:

-git-cleanroot:

-copy-git-state:

git-autoclean:

ivy-availability-check:
[loadresource] Do not set property disallowed.ivy.jars.list as its length is 0.

-ivy-fail-disallowed-ivy-version:

ivy-fail:

ivy-configure:
[ivy:configure] :: loading settings :: file = /export/home/jenkins/workspace/Lucene-Solr-7.x-Solaris/lucene/top-level-ivy-settings.xml

resolve:

init:

-clover.disable:

-clover.load:

-clover.classpath:

-clover.setup:

clover:

compile-core:

init:

-clover.disable:

-clover.load:

-clover.classpath:

-clover.setup:

clover:

common.compile-core:
    [mkdir] Created dir: /export/home/jenkins/workspace/Lucene-Solr-7.x-Solaris/lucene/build/analysis/kuromoji/classes/java
    [javac] Compiling 39 source files to /export/home/jenkins/workspace/Lucene-Solr-7.x-Solaris/lucene/build/analysis/kuromoji/classes/java
    [javac] Creating empty /export/home/jenkins/workspace/Lucene-Solr-7.x-Solaris/lucene/build/analysis/kuromoji/classes/java/org/apache/lucene/analysis/ja/dict/package-info.class
    [javac] Creating empty /export/home/jenkins/workspace/Lucene-Solr-7.x-Solaris/lucene/build/analysis/kuromoji/classes/java/org/apache/lucene/analysis/ja/package-info.class
    [javac] Creating empty /export/home/jenkins/workspace/Lucene-Solr-7.x-Solaris/lucene/build/analysis/kuromoji/classes/java/org/apache/lucene/analysis/ja/util/package-info.class
    [javac] Creating empty /export/home/jenkins/workspace/Lucene-Solr-7.x-Solaris/lucene/build/analysis/kuromoji/classes/java/org/apache/lucene/analysis/ja/tokenattributes/package-info.class
     [copy] Copying 14 files to /export/home/jenkins/workspace/Lucene-Solr-7.x-Solaris/lucene/build/analysis/kuromoji/classes/java

compile-core:

patch-mrjar-classes:
[patch-cls] Remapped 0 class files for Java 9 to: /export/home/jenkins/workspace/Lucene-Solr-7.x-Solaris/lucene/build/analysis/kuromoji/classes/java9
    [touch] Creating /export/home/jenkins/workspace/Lucene-Solr-7.x-Solaris/lucene/build/analysis/kuromoji/patch-mrjar.stamp

-mrjar-check:

-mrjar-core:

-jar-core:
     [exec] Execute failed: java.io.IOException: Cannot run program "git" (in directory "/export/home/jenkins/workspace/Lucene-Solr-7.x-Solaris/lucene/analysis/kuromoji"): error=2, No such file or directory
      [jar] Building jar: /export/home/jenkins/workspace/Lucene-Solr-7.x-Solaris/lucene/build/analysis/kuromoji/lucene-analyzers-kuromoji-7.5.0-SNAPSHOT.jar

jar-core:

check-codecs-uptodate:

jar-codecs:

-mrjar-classes-uptodate:

ivy-availability-check:
[loadresource] Do not set property disallowed.ivy.jars.list as its length is 0.

-ivy-fail-disallowed-ivy-version:

ivy-fail:

ivy-configure:
[ivy:configure] :: loading settings :: file = /export/home/jenkins/workspace/Lucene-Solr-7.x-Solaris/lucene/top-level-ivy-settings.xml

resolve-groovy:

-check-git-state:

-git-cleanroot:

-copy-git-state:

git-autoclean:

resolve:

common.init:

compile-lucene-core:

-check-git-state:

-git-cleanroot:

-copy-git-state:

git-autoclean:

ivy-availability-check:
[loadresource] Do not set property disallowed.ivy.jars.list as its length is 0.

-ivy-fail-disallowed-ivy-version:

ivy-fail:

ivy-configure:
[ivy:configure] :: loading settings :: file = /export/home/jenkins/workspace/Lucene-Solr-7.x-Solaris/lucene/top-level-ivy-settings.xml

resolve:

init:

-clover.disable:

-clover.load:

-clover.classpath:

-clover.setup:

clover:

compile-core:

init:

-clover.disable:

-clover.load:

-clover.classpath:

-clover.setup:

clover:

compile-core:
    [mkdir] Created dir: /export/home/jenkins/workspace/Lucene-Solr-7.x-Solaris/lucene/build/codecs/classes/java
    [javac] Compiling 67 source files to /export/home/jenkins/workspace/Lucene-Solr-7.x-Solaris/lucene/build/codecs/classes/java
    [javac] Note: Some input files use or override a deprecated API.
    [javac] Note: Recompile with -Xlint:deprecation for details.
    [javac] Creating empty /export/home/jenkins/workspace/Lucene-Solr-7.x-Solaris/lucene/build/codecs/classes/java/org/apache/lucene/codecs/bloom/package-info.class
    [javac] Creating empty /export/home/jenkins/workspace/Lucene-Solr-7.x-Solaris/lucene/build/codecs/classes/java/org/apache/lucene/codecs/memory/package-info.class
    [javac] Creating empty /export/home/jenkins/workspace/Lucene-Solr-7.x-Solaris/lucene/build/codecs/classes/java/org/apache/lucene/codecs/simpletext/package-info.class
    [javac] Creating empty /export/home/jenkins/workspace/Lucene-Solr-7.x-Solaris/lucene/build/codecs/classes/java/org/apache/lucene/codecs/blockterms/package-info.class
    [javac] Creating empty /export/home/jenkins/workspace/Lucene-Solr-7.x-Solaris/lucene/build/codecs/classes/java/org/apache/lucene/codecs/blocktreeords/package-info.class
     [copy] Copying 3 files to /export/home/jenkins/workspace/Lucene-Solr-7.x-Solaris/lucene/build/codecs/classes/java

patch-mrjar-classes:
[patch-cls] Remapped: org/apache/lucene/codecs/simpletext/SimpleTextStoredFieldsReader
[patch-cls] Remapped 1 class files for Java 9 to: /export/home/jenkins/workspace/Lucene-Solr-7.x-Solaris/lucene/build/codecs/classes/java9
    [touch] Creating /export/home/jenkins/workspace/Lucene-Solr-7.x-Solaris/lucene/build/codecs/patch-mrjar.stamp

-mrjar-check:

-mrjar-core:
     [exec] Execute failed: java.io.IOException: Cannot run program "git" (in directory "/export/home/jenkins/workspace/Lucene-Solr-7.x-Solaris/lucene/codecs"): error=2, No such file or directory
      [jar] Building jar: /export/home/jenkins/workspace/Lucene-Solr-7.x-Solaris/lucene/build/codecs/lucene-codecs-7.5.0-SNAPSHOT.jar

-jar-core:

jar-core:

check-expressions-uptodate:

jar-expressions:

-mrjar-classes-uptodate:

ivy-availability-check:
[loadresource] Do not set property disallowed.ivy.jars.list as its length is 0.

-ivy-fail-disallowed-ivy-version:

ivy-fail:

ivy-configure:
[ivy:configure] :: loading settings :: file = /export/home/jenkins/workspace/Lucene-Solr-7.x-Solaris/lucene/top-level-ivy-settings.xml

resolve-groovy:

-check-git-state:

-git-cleanroot:

-copy-git-state:

git-autoclean:

resolve:

common.init:

compile-lucene-core:

-check-git-state:

-git-cleanroot:

-copy-git-state:

git-autoclean:

ivy-availability-check:
[loadresource] Do not set property disallowed.ivy.jars.list as its length is 0.

-ivy-fail-disallowed-ivy-version:

ivy-fail:

ivy-configure:
[ivy:configure] :: loading settings :: file = /export/home/jenkins/workspace/Lucene-Solr-7.x-Solaris/lucene/top-level-ivy-settings.xml

resolve:

init:

-clover.disable:

-clover.load:

-clover.classpath:

-clover.setup:

clover:

compile-core:

init:

-clover.disable:

-clover.load:

-clover.classpath:

-clover.setup:

clover:

compile-core:
    [mkdir] Created dir: /export/home/jenkins/workspace/Lucene-Solr-7.x-Solaris/lucene/build/expressions/classes/java
    [javac] Compiling 17 source files to /export/home/jenkins/workspace/Lucene-Solr-7.x-Solaris/lucene/build/expressions/classes/java
    [javac] Creating empty /export/home/jenkins/workspace/Lucene-Solr-7.x-Solaris/lucene/build/expressions/classes/java/org/apache/lucene/expressions/js/package-info.class
    [javac] Creating empty /export/home/jenkins/workspace/Lucene-Solr-7.x-Solaris/lucene/build/expressions/classes/java/org/apache/lucene/expressions/package-info.class
     [copy] Copying 1 file to /export/home/jenkins/workspace/Lucene-Solr-7.x-Solaris/lucene/build/expressions/classes/java

patch-mrjar-classes:
[patch-cls] Remapped 0 class files for Java 9 to: /export/home/jenkins/workspace/Lucene-Solr-7.x-Solaris/lucene/build/expressions/classes/java9
    [touch] Creating /export/home/jenkins/workspace/Lucene-Solr-7.x-Solaris/lucene/build/expressions/patch-mrjar.stamp

-mrjar-check:

-mrjar-core:

-jar-core:
     [exec] Execute failed: java.io.IOException: Cannot run program "git" (in directory "/export/home/jenkins/workspace/Lucene-Solr-7.x-Solaris/lucene/expressions"): error=2, No such file or directory
      [jar] Building jar: /export/home/jenkins/workspace/Lucene-Solr-7.x-Solaris/lucene/build/expressions/lucene-expressions-7.5.0-SNAPSHOT.jar

jar-core:

check-suggest-uptodate:

jar-suggest:

-mrjar-classes-uptodate:

ivy-availability-check:
[loadresource] Do not set property disallowed.ivy.jars.list as its length is 0.

-ivy-fail-disallowed-ivy-version:

ivy-fail:

ivy-configure:
[ivy:configure] :: loading settings :: file = /export/home/jenkins/workspace/Lucene-Solr-7.x-Solaris/lucene/top-level-ivy-settings.xml

resolve-groovy:

check-expressions-uptodate:

jar-expressions:

check-analyzers-common-uptodate:

jar-analyzers-common:

-check-git-state:

-git-cleanroot:

-copy-git-state:

git-autoclean:

resolve:

common.init:

compile-lucene-core:

-check-git-state:

-git-cleanroot:

-copy-git-state:

git-autoclean:

ivy-availability-check:
[loadresource] Do not set property disallowed.ivy.jars.list as its length is 0.

-ivy-fail-disallowed-ivy-version:

ivy-fail:

ivy-configure:
[ivy:configure] :: loading settings :: file = /export/home/jenkins/workspace/Lucene-Solr-7.x-Solaris/lucene/top-level-ivy-settings.xml

resolve:

init:

-clover.disable:

-clover.load:

-clover.classpath:

-clover.setup:

clover:

compile-core:

init:

-clover.disable:

-clover.load:

-clover.classpath:

-clover.setup:

clover:

common.compile-core:
    [mkdir] Created dir: /export/home/jenkins/workspace/Lucene-Solr-7.x-Solaris/lucene/build/suggest/classes/java
    [javac] Compiling 78 source files to /export/home/jenkins/workspace/Lucene-Solr-7.x-Solaris/lucene/build/suggest/classes/java
    [javac] /export/home/jenkins/workspace/Lucene-Solr-7.x-Solaris/lucene/suggest/src/java/org/apache/lucene/search/spell/LuceneLevenshteinDistance.java:39: warning: [overrides] Class LuceneLevenshteinDistance overrides equals, but neither it nor any superclass overrides hashCode method
    [javac] public final class LuceneLevenshteinDistance implements StringDistance {
    [javac]              ^
    [javac] Note: /export/home/jenkins/workspace/Lucene-Solr-7.x-Solaris/lucene/suggest/src/java/org/apache/lucene/search/suggest/jaspell/JaspellLookup.java uses or overrides a deprecated API.
    [javac] Note: Recompile with -Xlint:deprecation for details.
    [javac] 1 warning
    [javac] Creating empty /export/home/jenkins/workspace/Lucene-Solr-7.x-Solaris/lucene/build/suggest/classes/java/org/apache/lucene/search/suggest/package-info.class
    [javac] Creating empty /export/home/jenkins/workspace/Lucene-Solr-7.x-Solaris/lucene/build/suggest/classes/java/org/apache/lucene/search/suggest/document/package-info.class
    [javac] Creating empty /export/home/jenkins/workspace/Lucene-Solr-7.x-Solaris/lucene/build/suggest/classes/java/org/apache/lucene/search/spell/package-info.class
    [javac] Creating empty /export/home/jenkins/workspace/Lucene-Solr-7.x-Solaris/lucene/build/suggest/classes/java/org/apache/lucene/search/suggest/jaspell/package-info.class
    [javac] Creating empty /export/home/jenkins/workspace/Lucene-Solr-7.x-Solaris/lucene/build/suggest/classes/java/org/apache/lucene/search/suggest/tst/package-info.class
    [javac] Creating empty /export/home/jenkins/workspace/Lucene-Solr-7.x-Solaris/lucene/build/suggest/classes/java/org/apache/lucene/search/suggest/analyzing/package-info.class
    [javac] Creating empty /export/home/jenkins/workspace/Lucene-Solr-7.x-Solaris/lucene/build/suggest/classes/java/org/apache/lucene/search/suggest/fst/package-info.class
     [copy] Copying 2 files to /export/home/jenkins/workspace/Lucene-Solr-7.x-Solaris/lucene/build/suggest/classes/java

compile-core:

patch-mrjar-classes:
[patch-cls] Remapped 0 class files for Java 9 to: /export/home/jenkins/workspace/Lucene-Solr-7.x-Solaris/lucene/build/suggest/classes/java9
    [touch] Creating /export/home/jenkins/workspace/Lucene-Solr-7.x-Solaris/lucene/build/suggest/patch-mrjar.stamp

-mrjar-check:

-mrjar-core:

-jar-core:
     [exec] Execute failed: java.io.IOException: Cannot run program "git" (in directory "/export/home/jenkins/workspace/Lucene-Solr-7.x-Solaris/lucene/suggest"): error=2, No such file or directory
      [jar] Building jar: /export/home/jenkins/workspace/Lucene-Solr-7.x-Solaris/lucene/build/suggest/lucene-suggest-7.5.0-SNAPSHOT.jar

jar-core:

check-highlighter-uptodate:

jar-highlighter:

-mrjar-classes-uptodate:

ivy-availability-check:
[loadresource] Do not set property disallowed.ivy.jars.list as its length is 0.

-ivy-fail-disallowed-ivy-version:

ivy-fail:

ivy-configure:
[ivy:configure] :: loading settings :: file = /export/home/jenkins/workspace/Lucene-Solr-7.x-Solaris/lucene/top-level-ivy-settings.xml

resolve-groovy:

check-memory-uptodate:

jar-memory:

-mrjar-classes-uptodate:

ivy-availability-check:
[loadresource] Do not set property disallowed.ivy.jars.list as its length is 0.

-ivy-fail-disallowed-ivy-version:

ivy-fail:

ivy-configure:
[ivy:configure] :: loading settings :: file = /export/home/jenkins/workspace/Lucene-Solr-7.x-Solaris/lucene/top-level-ivy-settings.xml

resolve-groovy:

check-queryparser-uptodate:

jar-queryparser:

-mrjar-classes-uptodate:

ivy-availability-check:
[loadresource] Do not set property disallowed.ivy.jars.list as its length is 0.

-ivy-fail-disallowed-ivy-version:

ivy-fail:

ivy-configure:
[ivy:configure] :: loading settings :: file = /export/home/jenkins/workspace/Lucene-Solr-7.x-Solaris/lucene/top-level-ivy-settings.xml

resolve-groovy:

check-queries-uptodate:

jar-queries:

-mrjar-classes-uptodate:

ivy-availability-check:
[loadresource] Do not set property disallowed.ivy.jars.list as its length is 0.

-ivy-fail-disallowed-ivy-version:

ivy-fail:

ivy-configure:
[ivy:configure] :: loading settings :: file = /export/home/jenkins/workspace/Lucene-Solr-7.x-Solaris/lucene/top-level-ivy-settings.xml

resolve-groovy:

check-expressions-uptodate:

jar-expressions:

-check-git-state:

-git-cleanroot:

-copy-git-state:

git-autoclean:

resolve:

common.init:

compile-lucene-core:

-check-git-state:

-git-cleanroot:

-copy-git-state:

git-autoclean:

ivy-availability-check:
[loadresource] Do not set property disallowed.ivy.jars.list as its length is 0.

-ivy-fail-disallowed-ivy-version:

ivy-fail:

ivy-configure:
[ivy:configure] :: loading settings :: file = /export/home/jenkins/workspace/Lucene-Solr-7.x-Solaris/lucene/top-level-ivy-settings.xml

resolve:

init:

-clover.disable:

-clover.load:

-clover.classpath:

-clover.setup:

clover:

compile-core:

init:

-clover.disable:

-clover.load:

-clover.classpath:

-clover.setup:

clover:

common.compile-core:
    [mkdir] Created dir: /export/home/jenkins/workspace/Lucene-Solr-7.x-Solaris/lucene/build/queries/classes/java
    [javac] Compiling 86 source files to /export/home/jenkins/workspace/Lucene-Solr-7.x-Solaris/lucene/build/queries/classes/java
    [javac] /export/home/jenkins/workspace/Lucene-Solr-7.x-Solaris/lucene/queries/src/java/org/apache/lucene/queries/function/FunctionQuery.java:59: warning: [rawtypes] found raw type: Map
    [javac]     protected final Map context;
    [javac]                     ^
    [javac]   missing type arguments for generic class Map<K,V>
    [javac]   where K,V are type-variables:
    [javac]     K extends Object declared in interface Map
    [javac]     V extends Object declared in interface Map
    [javac] /export/home/jenkins/workspace/Lucene-Solr-7.x-Solaris/lucene/queries/src/java/org/apache/lucene/queries/function/ValueSource.java:54: warning: [rawtypes] found raw type: Map
    [javac]   public abstract FunctionValues getValues(Map context, LeafReaderContext readerContext) throws IOException;
    [javac]                                            ^
    [javac]   missing type arguments for generic class Map<K,V>
    [javac]   where K,V are type-variables:
    [javac]     K extends Object declared in interface Map
    [javac]     V extends Object declared in interface Map
    [javac] /export/home/jenkins/workspace/Lucene-Solr-7.x-Solaris/lucene/queries/src/java/org/apache/lucene/queries/function/ValueSource.java:78: warning: [rawtypes] found raw type: Map
    [javac]   public void createWeight(Map context, IndexSearcher searcher) throws IOException {
    [javac]                            ^
    [javac]   missing type arguments for generic class Map<K,V>
    [javac]   where K,V are type-variables:
    [javac]     K extends Object declared in interface Map
    [javac]     V extends Object declared in interface Map
    [javac] /export/home/jenkins/workspace/Lucene-Solr-7.x-Solaris/lucene/queries/src/java/org/apache/lucene/queries/function/ValueSource.java:84: warning: [rawtypes] found raw type: Map
    [javac]   public static Map newContext(IndexSearcher searcher) {
    [javac]                 ^
    [javac]   missing type arguments for generic class Map<K,V>
    [javac]   where K,V are type-variables:
    [javac]     K extends Object declared in interface Map
    [javac]     V extends Object declared in interface Map
    [javac] /export/home/jenkins/workspace/Lucene-Solr-7.x-Solaris/lucene/queries/src/java/org/apache/lucene/queries/function/ValueSource.java:85: warning: [rawtypes] found raw type: Map
    [javac]     Map context = new IdentityHashMap();
    [javac]     ^
    [javac]   missing type arguments for generic class Map<K,V>
    [javac]   where K,V are type-variables:
    [javac]     K extends Object declared in interface Map
    [javac]     V extends Object declared in interface Map
    [javac] /export/home/jenkins/workspace/Lucene-Solr-7.x-Solaris/lucene/queries/src/java/org/apache/lucene/queries/function/ValueSource.java:85: warning: [rawtypes] found raw type: IdentityHashMap
    [javac]     Map context = new IdentityHashMap();
    [javac]                       ^
    [javac]   missing type arguments for generic class IdentityHashMap<K,V>
    [javac]   where K,V are type-variables:
    [javac]     K extends Object declared in class IdentityHashMap
    [javac]     V extends Object declared in class IdentityHashMap
    [javac] /export/home/jenkins/workspace/Lucene-Solr-7.x-Solaris/lucene/queries/src/java/org/apache/lucene/queries/function/ValueSource.java:86: warning: [unchecked] unchecked call to put(K,V) as a member of the raw type Map
    [javac]     context.put("searcher", searcher);
    [javac]                ^
    [javac]   where K,V are type-variables:
    [javac]     K extends Object declared in interface Map
    [javac]     V extends Object declared in interface Map
    [javac] /export/home/jenkins/workspace/Lucene-Solr-7.x-Solaris/lucene/queries/src/java/org/apache/lucene/queries/function/ValueSource.java:132: warning: [rawtypes] found raw type: Map
    [javac]       Map context = new IdentityHashMap<>();
    [javac]       ^
    [javac]   missing type arguments for generic class Map<K,V>
    [javac]   where K,V are type-variables:
    [javac]     K extends Object declared in interface Map
    [javac]     V extends Object declared in interface Map
    [javac] /export/home/jenkins/workspace/Lucene-Solr-7.x-Solaris/lucene/queries/src/java/org/apache/lucene/queries/function/ValueSource.java:134: warning: [unchecked] unchecked call to put(K,V) as a member of the raw type Map
    [javac]       context.put("scorer", scorer);
    [javac]                  ^
    [javac]   where K,V are type-variables:
    [javac]     K extends Object declared in interface Map
    [javac]     V extends Object declared in interface Map
    [javac] /export/home/jenkins/workspace/Lucene-Solr-7.x-Solaris/lucene/queries/src/java/org/apache/lucene/queries/function/ValueSource.java:208: warning: [rawtypes] found raw type: Map
    [javac]       Map context = new HashMap<>();
    [javac]       ^
    [javac]   missing type arguments for generic class Map<K,V>
    [javac]   where K,V are type-variables:
    [javac]     K extends Object declared in interface Map
    [javac]     V extends Object declared in interface Map
    [javac] /export/home/jenkins/workspace/Lucene-Solr-7.x-Solaris/lucene/queries/src/java/org/apache/lucene/queries/function/ValueSource.java:210: warning: [unchecked] unchecked call to put(K,V) as a member of the raw type Map
    [javac]       context.put("scorer", scorer);
    [javac]                  ^
    [javac]   where K,V are type-variables:
    [javac]     K extends Object declared in interface Map
    [javac]     V extends Object declared in interface Map
    [javac] /export/home/jenkins/workspace/Lucene-Solr-7.x-Solaris/lucene/queries/src/java/org/apache/lucene/queries/function/ValueSource.java:211: warning: [unchecked] unchecked call to put(K,V) as a member of the raw type Map
    [javac]       context.put("searcher", searcher);
    [javac]                  ^
    [javac]   where K,V are type-variables:
    [javac]     K extends Object declared in interface Map
    [javac]     V extends Object declared in interface Map
    [javac] /export/home/jenkins/workspace/Lucene-Solr-7.x-Solaris/lucene/queries/src/java/org/apache/lucene/queries/function/ValueSource.java:245: warning: [rawtypes] found raw type: Map
    [javac]       Map context = new HashMap<>();
    [javac]       ^
    [javac]   missing type arguments for generic class Map<K,V>
    [javac]   where K,V are type-variables:
    [javac]     K extends Object declared in interface Map
    [javac]     V extends Object declared in interface Map
    [javac] /export/home/jenkins/workspace/Lucene-Solr-7.x-Solaris/lucene/queries/src/java/org/apache/lucene/queries/function/ValueSource.java:248: warning: [unchecked] unchecked call to put(K,V) as a member of the raw type Map
    [javac]       context.put("scorer", scorer);
    [javac]                  ^
    [javac]   where K,V are type-variables:
    [javac]     K extends Object declared in interface Map
    [javac]     V extends Object declared in interface Map
    [javac] /export/home/jenkins/workspace/Lucene-Solr-7.x-Solaris/lucene/queries/src/java/org/apache/lucene/queries/function/ValueSource.java:249: warning: [unchecked] unchecked call to put(K,V) as a member of the raw type Map
    [javac]       context.put("searcher", searcher);
    [javac]                  ^
    [javac]   where K,V are type-variables:
    [javac]     K extends Object declared in interface Map
    [javac]     V extends Object declared in interface Map
    [javac] /export/home/jenkins/workspace/Lucene-Solr-7.x-Solaris/lucene/queries/src/java/org/apache/lucene/queries/function/ValueSource.java:293: warning: [rawtypes] found raw type: Map
    [javac]     public FunctionValues getValues(Map context, LeafReaderContext readerContext) throws IOException {
    [javac]                                     ^
    [javac]   missing type arguments for generic class Map<K,V>
    [javac]   where K,V are type-variables:
    [javac]     K extends Object declared in interface Map
    [javac]     V extends Object declared in interface Map
    [javac] /export/home/jenkins/workspace/Lucene-Solr-7.x-Solaris/lucene/queries/src/java/org/apache/lucene/queries/function/ValueSource.java:375: warning: [rawtypes] found raw type: Map
    [javac]       Map context = newContext(searcher);
    [javac]       ^
    [javac]   missing type arguments for generic class Map<K,V>
    [javac]   where K,V are type-variables:
    [javac]     K extends Object declared in interface Map
    [javac]     V extends Object declared in interface Map
    [javac] /export/home/jenkins/workspace/Lucene-Solr-7.x-Solaris/lucene/queries/src/java/org/apache/lucene/queries/function/ValueSource.java:382: warning: [rawtypes] found raw type: Map
    [javac]     private final Map context;
    [javac]                   ^
    [javac]   missing type arguments for generic class Map<K,V>
    [javac]   where K,V are type-variables:
    [javac]     K extends Object declared in interface Map
    [javac]     V extends Object declared in interface Map
    [javac] /export/home/jenkins/workspace/Lucene-Solr-7.x-Solaris/lucene/queries/src/java/org/apache/lucene/queries/function/ValueSource.java:384: warning: [rawtypes] found raw type: Map
    [javac]     public ValueSourceComparatorSource(Map context) {
    [javac]                                        ^
    [javac]   missing type arguments for generic class Map<K,V>
    [javac]   where K,V are type-variables:
    [javac]     K extends Object declared in interface Map
    [javac]     V extends Object declared in interface Map
    [javac] /export/home/jenkins/workspace/Lucene-Solr-7.x-Solaris/lucene/queries/src/java/org/apache/lucene/queries/function/ValueSource.java:404: warning: [rawtypes] found raw type: Map
    [javac]     private final Map fcontext;
    [javac]                   ^
    [javac]   missing type arguments for generic class Map<K,V>
    [javac]   where K,V are type-variables:
    [javac]     K extends Object declared in interface Map
    [javac]     V extends Object declared in interface Map
    [javac] /export/home/jenkins/workspace/Lucene-Solr-7.x-Solaris/lucene/queries/src/java/org/apache/lucene/queries/function/ValueSource.java:407: warning: [rawtypes] found raw type: Map
    [javac]     ValueSourceComparator(Map fcontext, int numHits) {
    [javac]                           ^
    [javac]   missing type arguments for generic class Map<K,V>
    [javac]   where K,V are type-variables:
    [javac]     K extends Object declared in interface Map
    [javac]     V extends Object declared in interface Map
    [javac] /export/home/jenkins/workspace/Lucene-Solr-7.x-Solaris/lucene/queries/src/java/org/apache/lucene/queries/function/BoostedQuery.java:70: warning: [rawtypes] found raw type: Map
    [javac]     Map fcontext;
    [javac]     ^
    [javac]   missing type arguments for generic class Map<K,V>
    [javac]   where K,V are type-variables:
    [javac]     K extends Object declared in interface Map
    [javac]     V extends Object declared in interface Map
    [javac] /export/home/jenkins/workspace/Lucene-Solr-7.x-Solaris/lucene/queries/src/java/org/apache/lucene/queries/function/valuesource/BytesRefFieldSource.java:44: warning: [rawtypes] found raw type: Map
    [javac]   public FunctionValues getValues(Map context, LeafReaderContext readerContext) throws IOException {
    [javac]                                   ^
    [javac]   missing type arguments for generic class Map<K,V>
    [javac]   where K,V are type-variables:
    [javac]     K extends Object declared in interface Map
    [javac]     V extends Object declared in interface Map
    [javac] /export/home/jenkins/workspace/Lucene-Solr-7.x-Solaris/lucene/queries/src/java/org/apache/lucene/queries/function/valuesource/ComparisonBoolFunction.java:53: warning: [rawtypes] found raw type: Map
    [javac]   public FunctionValues getValues(Map context, LeafReaderContext readerContext) throws IOException {
    [javac]                                   ^
    [javac]   missing type arguments for generic class Map<K,V>
    [javac]   where K,V are type-variables:
    [javac]     K extends Object declared in interface Map
    [javac]     V extends Object declared in interface Map
    [javac] /export/home/jenkins/workspace/Lucene-Solr-7.x-Solaris/lucene/queries/src/java/org/apache/lucene/queries/function/valuesource/ComparisonBoolFunction.java:100: warning: [rawtypes] found raw type: Map
    [javac]   public void createWeight(Map context, IndexSearcher searcher) throws IOException {
    [javac]                            ^
    [javac]   missing type arguments for generic class Map<K,V>
    [javac]   where K,V are type-variables:
    [javac]     K extends Object declared in interface Map
    [javac]     V extends Object declared in interface Map
    [javac] /export/home/jenkins/workspace/Lucene-Solr-7.x-Solaris/lucene/queries/src/java/org/apache/lucene/queries/function/valuesource/ConstValueSource.java:44: warning: [rawtypes] found raw type: Map
    [javac]   public FunctionValues getValues(Map context, LeafReaderContext readerContext) throws IOException {
    [javac]                                   ^
    [javac]   missing type arguments for generic class Map<K,V>
    [javac]   where K,V are type-variables:
    [javac]     K extends Object declared in interface Map
    [javac]     V extends Object declared in interface Map
    [javac] /export/home/jenkins/workspace/Lucene-Solr-7.x-Solaris/lucene/queries/src/java/org/apache/lucene/queries/function/valuesource/MultiFunction.java:115: warning: [rawtypes] found raw type: Map
    [javac]   public static FunctionValues[] valsArr(List<ValueSource> sources, Map fcontext, LeafReaderContext readerContext) throws IOException {
    [javac]                                                                     ^
    [javac]   missing type arguments for generic class Map<K,V>
    [javac]   where K,V are type-variables:
    [javac]     K extends Object declared in interface Map
    [javac]     V extends Object declared in interface Map
    [javac] /export/home/jenkins/workspace/Lucene-Solr-7.x-Solaris/lucene/queries/src/java/org/apache/lucene/queries/function/valuesource/MultiFunction.java:160: warning: [rawtypes] found raw type: Map
    [javac]   public void createWeight(Map context, IndexSearcher searcher) throws IOException {
    [javac]                            ^
    [javac]   missing type arguments for generic class Map<K,V>
    [javac]   where K,V are type-variables:
    [javac]     K extends Object declared in interface Map
    [javac]     V extends Object declared in interface Map
    [javac] /export/home/jenkins/workspace/Lucene-Solr-7.x-Solaris/lucene/queries/src/java/org/apache/lucene/queries/function/valuesource/DefFunction.java:45: warning: [rawtypes] found raw type: Map
    [javac]   public FunctionValues getValues(Map fcontext, LeafReaderContext readerContext) throws IOException {
    [javac]                                   ^
    [javac]   missing type arguments for generic class Map<K,V>
    [javac]   where K,V are type-variables:
    [javac]     K extends Object declared in interface Map
    [javac]     V extends Object declared in interface Map
    [javac] /export/home/jenkins/workspace/Lucene-Solr-7.x-Solaris/lucene/queries/src/java/org/apache/lucene/queries/function/valuesource/DualFloatFunction.java:54: warning: [rawtypes] found raw type: Map
    [javac]   public FunctionValues getValues(Map context, LeafReaderContext readerContext) throws IOException {
    [javac]                                   ^
    [javac]   missing type arguments for generic class Map<K,V>
    [javac]   where K,V are type-variables:
    [javac]     K extends Object declared in interface Map
    [javac]     V extends Object declared in interface Map
    [javac] /export/home/jenkins/workspace/Lucene-Solr-7.x-Solaris/lucene/queries/src/java/org/apache/lucene/queries/function/valuesource/DualFloatFunction.java:78: warning: [rawtypes] found raw type: Map
    [javac]   public void createWeight(Map context, IndexSearcher searcher) throws IOException {
    [javac]                            ^
    [javac]   missing type arguments for generic class Map<K,V>
    [javac]   where K,V are type-variables:
    [javac]     K extends Object declared in interface Map
    [javac]     V extends Object declared in interface Map
    [javac] /export/home/jenkins/workspace/Lucene-Solr-7.x-Solaris/lucene/queries/src/java/org/apache/lucene/queries/function/valuesource/DocFreqValueSource.java:148: warning: [rawtypes] found raw type: Map
    [javac]   public FunctionValues getValues(Map context, LeafReaderContext readerContext) throws IOException {
    [javac]                                   ^
    [javac]   missing type arguments for generic class Map<K,V>
    [javac]   where K,V are type-variables:
    [javac]     K extends Object declared in interface Map
    [javac]     V extends Object declared in interface Map
    [javac] /export/home/jenkins/workspace/Lucene-Solr-7.x-Solaris/lucene/queries/src/java/org/apache/lucene/queries/function/valuesource/DocFreqValueSource.java:155: warning: [rawtypes] found raw type: Map
    [javac]   public void createWeight(Map context, IndexSearcher searcher) throws IOException {
    [javac]                            ^
    [javac]   missing type arguments for generic

[...truncated too long message...]

it4] OK      0.11s J0 | StreamDecoratorTest.testHashJoinStreamWithKnownConflict
   [junit4] OK      0.10s J0 | StreamDecoratorTest.testOuterHashJoinStreamWithKnownConflict
   [junit4] OK      12.8s J0 | StreamDecoratorTest.testParallelExecutorStream
   [junit4] OK      11.2s J0 | StreamDecoratorTest.testDaemonStream
   [junit4] OK      0.17s J0 | StreamDecoratorTest.testCartesianProductStream
   [junit4] OK      0.17s J0 | StreamDecoratorTest.testLeftOuterJoinStream
   [junit4] OK      0.20s J0 | StreamDecoratorTest.testParallelComplementStream
   [junit4] OK      0.14s J0 | StreamDecoratorTest.testRollupStream
   [junit4] OK      0.19s J0 | StreamDecoratorTest.testParallelIntersectStream
   [junit4] OK      3.77s J0 | StreamDecoratorTest.testParallelUpdateStream
   [junit4] OK      0.10s J0 | StreamDecoratorTest.testParallelUniqueStream
   [junit4] OK      0.10s J0 | StreamDecoratorTest.testRankStream
   [junit4] IGNOR/A 0.07s J0 | StreamDecoratorTest.testParallelTerminatingDaemonUpdateStream
   [junit4]    > Assumption #1: got: <false>, expected: is <true>
   [junit4] OK      0.10s J0 | StreamDecoratorTest.testParallelReducerStream
   [junit4] OK      0.13s J0 | StreamDecoratorTest.testSelectStream
   [junit4] OK      0.14s J0 | StreamDecoratorTest.testHavingStream
   [junit4] OK      0.10s J0 | StreamDecoratorTest.testParallelRankStream
   [junit4] OK      3.76s J0 | StreamDecoratorTest.testCommitStream
   [junit4] OK      0.14s J0 | StreamDecoratorTest.testParallelFetchStream
   [junit4] OK      0.10s J0 | StreamDecoratorTest.testParallelNullStream
   [junit4] OK      0.10s J0 | StreamDecoratorTest.testOuterHashJoinStream
   [junit4] IGNOR/A 0.07s J0 | StreamDecoratorTest.testTerminatingDaemonStream
   [junit4]    > Assumption #1: got: <false>, expected: is <true>
   [junit4] OK      0.18s J0 | StreamDecoratorTest.testFetchStream
   [junit4] OK      0.09s J0 | StreamDecoratorTest.testIntersectStream
   [junit4] OK      0.11s J0 | StreamDecoratorTest.testReducerStream
   [junit4] IGNOR/A 0.07s J0 | StreamDecoratorTest.testParallelPriorityStream
   [junit4]    > Assumption #1: got: <false>, expected: is <true>
   [junit4] OK      0.11s J0 | StreamDecoratorTest.testMergeStream
   [junit4] IGNOR/A 0.08s J0 | StreamDecoratorTest.testClassifyStream
   [junit4]    > Assumption #1: got: <false>, expected: is <true>
   [junit4] OK      0.15s J0 | StreamDecoratorTest.testParallelMergeStream
   [junit4] OK      5.69s J0 | StreamDecoratorTest.testParallelDaemonCommitStream
   [junit4] OK      0.10s J0 | StreamDecoratorTest.testParallelShuffleStream
   [junit4] OK      0.14s J0 | StreamDecoratorTest.testParallelHavingStream
   [junit4] OK      0.09s J0 | StreamDecoratorTest.testNullStream
   [junit4] OK      0.11s J0 | StreamDecoratorTest.testComplementStream
   [junit4] OK      0.08s J0 | StreamDecoratorTest.testSortStream
   [junit4] OK      0.12s J0 | StreamDecoratorTest.testInnerJoinStream
   [junit4] OK      5.64s J0 | StreamDecoratorTest.testParallelDaemonUpdateStream
   [junit4] OK      0.11s J0 | StreamDecoratorTest.testUniqueStream
   [junit4] OK      3.66s J0 | StreamDecoratorTest.testUpdateStream
   [junit4] OK      0.10s J0 | StreamDecoratorTest.testParallelRollupStream
   [junit4] IGNOR/A 0.07s J0 | StreamDecoratorTest.testPriorityStream
   [junit4]    > Assumption #1: got: <false>, expected: is <true>
   [junit4] OK      13.3s J0 | StreamDecoratorTest.testExecutorStream
   [junit4] OK      0.12s J0 | StreamDecoratorTest.testHashJoinStream
   [junit4] OK      3.64s J0 | StreamDecoratorTest.testParallelCommitStream
   [junit4] OK      0.07s J0 | StreamDecoratorTest.testLetStream
   [junit4] Completed [5/5] on J0 in 73.60s, 46 tests, 5 skipped
   [junit4] 
   [junit4] JVM J0:     0.98 ..   264.03 =   263.05s
   [junit4] JVM J1:     0.98 ..   190.61 =   189.63s
   [junit4] Execution time total: 4 minutes 24 seconds
   [junit4] Tests summary: 5 suites, 230 tests, 25 ignored (25 assumptions)
   [junit4] Could not remove temporary path: /export/home/jenkins/workspace/Lucene-Solr-7.x-Solaris/solr/build/solr-solrj/test/J0 (java.nio.file.DirectoryNotEmptyException: Remaining files: [/export/home/jenkins/workspace/Lucene-Solr-7.x-Solaris/solr/build/solr-solrj/test/J0/temp])
   [junit4] Could not remove temporary path: /export/home/jenkins/workspace/Lucene-Solr-7.x-Solaris/solr/build/solr-solrj/test/J1 (java.nio.file.DirectoryNotEmptyException: Remaining files: [/export/home/jenkins/workspace/Lucene-Solr-7.x-Solaris/solr/build/solr-solrj/test/J1/temp])
     [echo] 5 slowest tests:
[junit4:tophints]  91.02s | org.apache.solr.client.solrj.io.stream.StreamDecoratorTest
[junit4:tophints]  50.97s | org.apache.solr.common.cloud.TestCloudCollectionsListeners
[junit4:tophints]  48.90s | org.apache.solr.client.solrj.request.SchemaTest
[junit4:tophints]  44.79s | org.apache.solr.client.solrj.impl.CloudSolrClientTest
[junit4:tophints]  33.25s | org.apache.solr.client.solrj.io.sql.JdbcTest

-check-totals:

test-nocompile:

BUILD SUCCESSFUL
Total time: 4 minutes 27 seconds
[repro] Failures:
[repro]   0/5 failed: org.apache.solr.client.solrj.io.stream.StreamDecoratorTest
[repro] Exiting with code 0
+ mv lucene/build lucene/build.repro
+ mv solr/build solr/build.repro
+ mv lucene/build.orig lucene/build
+ mv solr/build.orig solr/build
Archiving artifacts
Setting ANT_1_8_2_HOME=/export/home/jenkins/tools/hudson.tasks.Ant_AntInstallation/ANT_1.8.2
java.lang.InterruptedException: no matches found within 10000
	at hudson.FilePath$ValidateAntFileMask.hasMatch(FilePath.java:2843)
	at hudson.FilePath$ValidateAntFileMask.invoke(FilePath.java:2722)
	at hudson.FilePath$ValidateAntFileMask.invoke(FilePath.java:2703)
	at hudson.FilePath$FileCallableWrapper.call(FilePath.java:3082)
Also:   hudson.remoting.Channel$CallSiteStackTrace: Remote call to Solaris VBOX
		at hudson.remoting.Channel.attachCallSiteStackTrace(Channel.java:1741)
		at hudson.remoting.UserRequest$ExceptionResponse.retrieve(UserRequest.java:357)
		at hudson.remoting.Channel.call(Channel.java:955)
		at hudson.FilePath.act(FilePath.java:1089)
		at hudson.FilePath.act(FilePath.java:1078)
		at hudson.FilePath.validateAntFileMask(FilePath.java:2701)
		at hudson.tasks.ArtifactArchiver.perform(ArtifactArchiver.java:243)
		at hudson.tasks.BuildStepCompatibilityLayer.perform(BuildStepCompatibilityLayer.java:81)
		at hudson.tasks.BuildStepMonitor$1.perform(BuildStepMonitor.java:20)
		at hudson.model.AbstractBuild$AbstractBuildExecution.perform(AbstractBuild.java:744)
		at hudson.model.AbstractBuild$AbstractBuildExecution.performAllBuildSteps(AbstractBuild.java:690)
		at hudson.model.Build$BuildExecution.post2(Build.java:186)
		at hudson.model.AbstractBuild$AbstractBuildExecution.post(AbstractBuild.java:635)
		at hudson.model.Run.execute(Run.java:1840)
		at hudson.model.FreeStyleBuild.run(FreeStyleBuild.java:43)
		at hudson.model.ResourceController.execute(ResourceController.java:97)
		at hudson.model.Executor.run(Executor.java:429)
Caused: hudson.FilePath$TunneledInterruptedException
	at hudson.FilePath$FileCallableWrapper.call(FilePath.java:3084)
	at hudson.remoting.UserRequest.perform(UserRequest.java:212)
	at hudson.remoting.UserRequest.perform(UserRequest.java:54)
	at hudson.remoting.Request$2.run(Request.java:369)
	at hudson.remoting.InterceptingExecutorService$1.call(InterceptingExecutorService.java:72)
	at java.util.concurrent.FutureTask.run(FutureTask.java:266)
	at java.util.concurrent.ThreadPoolExecutor.runWorker(ThreadPoolExecutor.java:1149)
	at java.util.concurrent.ThreadPoolExecutor$Worker.run(ThreadPoolExecutor.java:624)
	at java.lang.Thread.run(Thread.java:748)
Caused: java.lang.InterruptedException: java.lang.InterruptedException: no matches found within 10000
	at hudson.FilePath.act(FilePath.java:1091)
	at hudson.FilePath.act(FilePath.java:1078)
	at hudson.FilePath.validateAntFileMask(FilePath.java:2701)
	at hudson.tasks.ArtifactArchiver.perform(ArtifactArchiver.java:243)
	at hudson.tasks.BuildStepCompatibilityLayer.perform(BuildStepCompatibilityLayer.java:81)
	at hudson.tasks.BuildStepMonitor$1.perform(BuildStepMonitor.java:20)
	at hudson.model.AbstractBuild$AbstractBuildExecution.perform(AbstractBuild.java:744)
	at hudson.model.AbstractBuild$AbstractBuildExecution.performAllBuildSteps(AbstractBuild.java:690)
	at hudson.model.Build$BuildExecution.post2(Build.java:186)
	at hudson.model.AbstractBuild$AbstractBuildExecution.post(AbstractBuild.java:635)
	at hudson.model.Run.execute(Run.java:1840)
	at hudson.model.FreeStyleBuild.run(FreeStyleBuild.java:43)
	at hudson.model.ResourceController.execute(ResourceController.java:97)
	at hudson.model.Executor.run(Executor.java:429)
No artifacts found that match the file pattern "**/*.events,heapdumps/**,**/*_pid*.log". Configuration error?
[WARNINGS] Parsing warnings in console log with parser Java Compiler (javac)
Setting ANT_1_8_2_HOME=/export/home/jenkins/tools/hudson.tasks.Ant_AntInstallation/ANT_1.8.2
Setting ANT_1_8_2_HOME=/export/home/jenkins/tools/hudson.tasks.Ant_AntInstallation/ANT_1.8.2
<Git Blamer> Using GitBlamer to create author and commit information for all warnings.
<Git Blamer> GIT_COMMIT=82388667bf5cf54e6dac7346cc323a516b9eca2a, workspace=/export/home/jenkins/workspace/Lucene-Solr-7.x-Solaris
[WARNINGS] Computing warning deltas based on reference build #721
Recording test results
Setting ANT_1_8_2_HOME=/export/home/jenkins/tools/hudson.tasks.Ant_AntInstallation/ANT_1.8.2
Build step 'Publish JUnit test result report' changed build result to UNSTABLE
Email was triggered for: Unstable (Test Failures)
Sending email for trigger: Unstable (Test Failures)
Setting ANT_1_8_2_HOME=/export/home/jenkins/tools/hudson.tasks.Ant_AntInstallation/ANT_1.8.2
Setting ANT_1_8_2_HOME=/export/home/jenkins/tools/hudson.tasks.Ant_AntInstallation/ANT_1.8.2
Setting ANT_1_8_2_HOME=/export/home/jenkins/tools/hudson.tasks.Ant_AntInstallation/ANT_1.8.2
Setting ANT_1_8_2_HOME=/export/home/jenkins/tools/hudson.tasks.Ant_AntInstallation/ANT_1.8.2

Mime
View raw message