lucene-dev mailing list archives

Site index · List index
Message view « Date » · « Thread »
Top « Date » · « Thread »
From Policeman Jenkins Server <jenk...@thetaphi.de>
Subject [JENKINS] Lucene-Solr-master-Solaris (64bit/jdk1.8.0) - Build # 1961 - Still Unstable!
Date Tue, 10 Jul 2018 13:51:35 GMT
Build: https://jenkins.thetaphi.de/job/Lucene-Solr-master-Solaris/1961/
Java: 64bit/jdk1.8.0 -XX:-UseCompressedOops -XX:+UseConcMarkSweepGC

1 tests failed.
FAILED:  junit.framework.TestSuite.org.apache.solr.util.TestSolrCLIRunExample

Error Message:
ObjectTracker found 4 object(s) that were not released!!! [NRTCachingDirectory, NRTCachingDirectory, NRTCachingDirectory, TransactionLog] org.apache.solr.common.util.ObjectReleaseTracker$ObjectTrackerException: org.apache.lucene.store.NRTCachingDirectory  at org.apache.solr.common.util.ObjectReleaseTracker.track(ObjectReleaseTracker.java:42)  at org.apache.solr.core.CachingDirectoryFactory.get(CachingDirectoryFactory.java:348)  at org.apache.solr.update.SolrIndexWriter.create(SolrIndexWriter.java:95)  at org.apache.solr.core.SolrCore.initIndex(SolrCore.java:768)  at org.apache.solr.core.SolrCore.<init>(SolrCore.java:960)  at org.apache.solr.core.SolrCore.<init>(SolrCore.java:869)  at org.apache.solr.core.CoreContainer.createFromDescriptor(CoreContainer.java:1140)  at org.apache.solr.core.CoreContainer.create(CoreContainer.java:1050)  at org.apache.solr.handler.admin.CoreAdminOperation.lambda$static$0(CoreAdminOperation.java:92)  at org.apache.solr.handler.admin.CoreAdminOperation.execute(CoreAdminOperation.java:360)  at org.apache.solr.handler.admin.CoreAdminHandler$CallInfo.call(CoreAdminHandler.java:395)  at org.apache.solr.handler.admin.CoreAdminHandler.handleRequestBody(CoreAdminHandler.java:180)  at org.apache.solr.handler.RequestHandlerBase.handleRequest(RequestHandlerBase.java:199)  at org.apache.solr.servlet.HttpSolrCall.handleAdmin(HttpSolrCall.java:734)  at org.apache.solr.servlet.HttpSolrCall.handleAdminRequest(HttpSolrCall.java:715)  at org.apache.solr.servlet.HttpSolrCall.call(HttpSolrCall.java:496)  at org.apache.solr.servlet.SolrDispatchFilter.doFilter(SolrDispatchFilter.java:377)  at org.apache.solr.servlet.SolrDispatchFilter.doFilter(SolrDispatchFilter.java:323)  at org.eclipse.jetty.servlet.ServletHandler$CachedChain.doFilter(ServletHandler.java:1642)  at org.apache.solr.client.solrj.embedded.JettySolrRunner$DebugFilter.doFilter(JettySolrRunner.java:139)  at org.eclipse.jetty.servlet.ServletHandler$CachedChain.doFilter(ServletHandler.java:1642)  at org.eclipse.jetty.servlet.ServletHandler.doHandle(ServletHandler.java:533)  at org.eclipse.jetty.server.handler.ScopedHandler.nextHandle(ScopedHandler.java:255)  at org.eclipse.jetty.server.session.SessionHandler.doHandle(SessionHandler.java:1595)  at org.eclipse.jetty.server.handler.ScopedHandler.nextHandle(ScopedHandler.java:255)  at org.eclipse.jetty.server.handler.ContextHandler.doHandle(ContextHandler.java:1317)  at org.eclipse.jetty.server.handler.ScopedHandler.nextScope(ScopedHandler.java:203)  at org.eclipse.jetty.servlet.ServletHandler.doScope(ServletHandler.java:473)  at org.eclipse.jetty.server.session.SessionHandler.doScope(SessionHandler.java:1564)  at org.eclipse.jetty.server.handler.ScopedHandler.nextScope(ScopedHandler.java:201)  at org.eclipse.jetty.server.handler.ContextHandler.doScope(ContextHandler.java:1219)  at org.eclipse.jetty.server.handler.ScopedHandler.handle(ScopedHandler.java:144)  at org.eclipse.jetty.server.handler.gzip.GzipHandler.handle(GzipHandler.java:674)  at org.eclipse.jetty.server.handler.HandlerWrapper.handle(HandlerWrapper.java:132)  at org.eclipse.jetty.server.Server.handle(Server.java:531)  at org.eclipse.jetty.server.HttpChannel.handle(HttpChannel.java:352)  at org.eclipse.jetty.server.HttpConnection.onFillable(HttpConnection.java:260)  at org.eclipse.jetty.io.AbstractConnection$ReadCallback.succeeded(AbstractConnection.java:281)  at org.eclipse.jetty.io.FillInterest.fillable(FillInterest.java:102)  at org.eclipse.jetty.io.ChannelEndPoint$2.run(ChannelEndPoint.java:118)  at org.eclipse.jetty.util.thread.strategy.EatWhatYouKill.runTask(EatWhatYouKill.java:333)  at org.eclipse.jetty.util.thread.strategy.EatWhatYouKill.doProduce(EatWhatYouKill.java:310)  at org.eclipse.jetty.util.thread.strategy.EatWhatYouKill.tryProduce(EatWhatYouKill.java:168)  at org.eclipse.jetty.util.thread.strategy.EatWhatYouKill.run(EatWhatYouKill.java:126)  at org.eclipse.jetty.util.thread.ReservedThreadExecutor$ReservedThread.run(ReservedThreadExecutor.java:366)  at org.eclipse.jetty.util.thread.QueuedThreadPool.runJob(QueuedThreadPool.java:762)  at org.eclipse.jetty.util.thread.QueuedThreadPool$2.run(QueuedThreadPool.java:680)  at java.lang.Thread.run(Thread.java:748)  org.apache.solr.common.util.ObjectReleaseTracker$ObjectTrackerException: org.apache.lucene.store.NRTCachingDirectory  at org.apache.solr.common.util.ObjectReleaseTracker.track(ObjectReleaseTracker.java:42)  at org.apache.solr.core.CachingDirectoryFactory.get(CachingDirectoryFactory.java:348)  at org.apache.solr.core.SolrCore.initSnapshotMetaDataManager(SolrCore.java:507)  at org.apache.solr.core.SolrCore.<init>(SolrCore.java:954)  at org.apache.solr.core.SolrCore.<init>(SolrCore.java:869)  at org.apache.solr.core.CoreContainer.createFromDescriptor(CoreContainer.java:1140)  at org.apache.solr.core.CoreContainer.create(CoreContainer.java:1050)  at org.apache.solr.handler.admin.CoreAdminOperation.lambda$static$0(CoreAdminOperation.java:92)  at org.apache.solr.handler.admin.CoreAdminOperation.execute(CoreAdminOperation.java:360)  at org.apache.solr.handler.admin.CoreAdminHandler$CallInfo.call(CoreAdminHandler.java:395)  at org.apache.solr.handler.admin.CoreAdminHandler.handleRequestBody(CoreAdminHandler.java:180)  at org.apache.solr.handler.RequestHandlerBase.handleRequest(RequestHandlerBase.java:199)  at org.apache.solr.servlet.HttpSolrCall.handleAdmin(HttpSolrCall.java:734)  at org.apache.solr.servlet.HttpSolrCall.handleAdminRequest(HttpSolrCall.java:715)  at org.apache.solr.servlet.HttpSolrCall.call(HttpSolrCall.java:496)  at org.apache.solr.servlet.SolrDispatchFilter.doFilter(SolrDispatchFilter.java:377)  at org.apache.solr.servlet.SolrDispatchFilter.doFilter(SolrDispatchFilter.java:323)  at org.eclipse.jetty.servlet.ServletHandler$CachedChain.doFilter(ServletHandler.java:1642)  at org.apache.solr.client.solrj.embedded.JettySolrRunner$DebugFilter.doFilter(JettySolrRunner.java:139)  at org.eclipse.jetty.servlet.ServletHandler$CachedChain.doFilter(ServletHandler.java:1642)  at org.eclipse.jetty.servlet.ServletHandler.doHandle(ServletHandler.java:533)  at org.eclipse.jetty.server.handler.ScopedHandler.nextHandle(ScopedHandler.java:255)  at org.eclipse.jetty.server.session.SessionHandler.doHandle(SessionHandler.java:1595)  at org.eclipse.jetty.server.handler.ScopedHandler.nextHandle(ScopedHandler.java:255)  at org.eclipse.jetty.server.handler.ContextHandler.doHandle(ContextHandler.java:1317)  at org.eclipse.jetty.server.handler.ScopedHandler.nextScope(ScopedHandler.java:203)  at org.eclipse.jetty.servlet.ServletHandler.doScope(ServletHandler.java:473)  at org.eclipse.jetty.server.session.SessionHandler.doScope(SessionHandler.java:1564)  at org.eclipse.jetty.server.handler.ScopedHandler.nextScope(ScopedHandler.java:201)  at org.eclipse.jetty.server.handler.ContextHandler.doScope(ContextHandler.java:1219)  at org.eclipse.jetty.server.handler.ScopedHandler.handle(ScopedHandler.java:144)  at org.eclipse.jetty.server.handler.gzip.GzipHandler.handle(GzipHandler.java:674)  at org.eclipse.jetty.server.handler.HandlerWrapper.handle(HandlerWrapper.java:132)  at org.eclipse.jetty.server.Server.handle(Server.java:531)  at org.eclipse.jetty.server.HttpChannel.handle(HttpChannel.java:352)  at org.eclipse.jetty.server.HttpConnection.onFillable(HttpConnection.java:260)  at org.eclipse.jetty.io.AbstractConnection$ReadCallback.succeeded(AbstractConnection.java:281)  at org.eclipse.jetty.io.FillInterest.fillable(FillInterest.java:102)  at org.eclipse.jetty.io.ChannelEndPoint$2.run(ChannelEndPoint.java:118)  at org.eclipse.jetty.util.thread.strategy.EatWhatYouKill.runTask(EatWhatYouKill.java:333)  at org.eclipse.jetty.util.thread.strategy.EatWhatYouKill.doProduce(EatWhatYouKill.java:310)  at org.eclipse.jetty.util.thread.strategy.EatWhatYouKill.tryProduce(EatWhatYouKill.java:168)  at org.eclipse.jetty.util.thread.strategy.EatWhatYouKill.run(EatWhatYouKill.java:126)  at org.eclipse.jetty.util.thread.ReservedThreadExecutor$ReservedThread.run(ReservedThreadExecutor.java:366)  at org.eclipse.jetty.util.thread.QueuedThreadPool.runJob(QueuedThreadPool.java:762)  at org.eclipse.jetty.util.thread.QueuedThreadPool$2.run(QueuedThreadPool.java:680)  at java.lang.Thread.run(Thread.java:748)  org.apache.solr.common.util.ObjectReleaseTracker$ObjectTrackerException: org.apache.lucene.store.NRTCachingDirectory  at org.apache.solr.common.util.ObjectReleaseTracker.track(ObjectReleaseTracker.java:42)  at org.apache.solr.core.CachingDirectoryFactory.get(CachingDirectoryFactory.java:348)  at org.apache.solr.core.SolrCore.getNewIndexDir(SolrCore.java:358)  at org.apache.solr.core.SolrCore.initIndex(SolrCore.java:737)  at org.apache.solr.core.SolrCore.<init>(SolrCore.java:960)  at org.apache.solr.core.SolrCore.<init>(SolrCore.java:869)  at org.apache.solr.core.CoreContainer.createFromDescriptor(CoreContainer.java:1140)  at org.apache.solr.core.CoreContainer.create(CoreContainer.java:1050)  at org.apache.solr.handler.admin.CoreAdminOperation.lambda$static$0(CoreAdminOperation.java:92)  at org.apache.solr.handler.admin.CoreAdminOperation.execute(CoreAdminOperation.java:360)  at org.apache.solr.handler.admin.CoreAdminHandler$CallInfo.call(CoreAdminHandler.java:395)  at org.apache.solr.handler.admin.CoreAdminHandler.handleRequestBody(CoreAdminHandler.java:180)  at org.apache.solr.handler.RequestHandlerBase.handleRequest(RequestHandlerBase.java:199)  at org.apache.solr.servlet.HttpSolrCall.handleAdmin(HttpSolrCall.java:734)  at org.apache.solr.servlet.HttpSolrCall.handleAdminRequest(HttpSolrCall.java:715)  at org.apache.solr.servlet.HttpSolrCall.call(HttpSolrCall.java:496)  at org.apache.solr.servlet.SolrDispatchFilter.doFilter(SolrDispatchFilter.java:377)  at org.apache.solr.servlet.SolrDispatchFilter.doFilter(SolrDispatchFilter.java:323)  at org.eclipse.jetty.servlet.ServletHandler$CachedChain.doFilter(ServletHandler.java:1642)  at org.apache.solr.client.solrj.embedded.JettySolrRunner$DebugFilter.doFilter(JettySolrRunner.java:139)  at org.eclipse.jetty.servlet.ServletHandler$CachedChain.doFilter(ServletHandler.java:1642)  at org.eclipse.jetty.servlet.ServletHandler.doHandle(ServletHandler.java:533)  at org.eclipse.jetty.server.handler.ScopedHandler.nextHandle(ScopedHandler.java:255)  at org.eclipse.jetty.server.session.SessionHandler.doHandle(SessionHandler.java:1595)  at org.eclipse.jetty.server.handler.ScopedHandler.nextHandle(ScopedHandler.java:255)  at org.eclipse.jetty.server.handler.ContextHandler.doHandle(ContextHandler.java:1317)  at org.eclipse.jetty.server.handler.ScopedHandler.nextScope(ScopedHandler.java:203)  at org.eclipse.jetty.servlet.ServletHandler.doScope(ServletHandler.java:473)  at org.eclipse.jetty.server.session.SessionHandler.doScope(SessionHandler.java:1564)  at org.eclipse.jetty.server.handler.ScopedHandler.nextScope(ScopedHandler.java:201)  at org.eclipse.jetty.server.handler.ContextHandler.doScope(ContextHandler.java:1219)  at org.eclipse.jetty.server.handler.ScopedHandler.handle(ScopedHandler.java:144)  at org.eclipse.jetty.server.handler.gzip.GzipHandler.handle(GzipHandler.java:674)  at org.eclipse.jetty.server.handler.HandlerWrapper.handle(HandlerWrapper.java:132)  at org.eclipse.jetty.server.Server.handle(Server.java:531)  at org.eclipse.jetty.server.HttpChannel.handle(HttpChannel.java:352)  at org.eclipse.jetty.server.HttpConnection.onFillable(HttpConnection.java:260)  at org.eclipse.jetty.io.AbstractConnection$ReadCallback.succeeded(AbstractConnection.java:281)  at org.eclipse.jetty.io.FillInterest.fillable(FillInterest.java:102)  at org.eclipse.jetty.io.ChannelEndPoint$2.run(ChannelEndPoint.java:118)  at org.eclipse.jetty.util.thread.strategy.EatWhatYouKill.runTask(EatWhatYouKill.java:333)  at org.eclipse.jetty.util.thread.strategy.EatWhatYouKill.doProduce(EatWhatYouKill.java:310)  at org.eclipse.jetty.util.thread.strategy.EatWhatYouKill.tryProduce(EatWhatYouKill.java:168)  at org.eclipse.jetty.util.thread.strategy.EatWhatYouKill.run(EatWhatYouKill.java:126)  at org.eclipse.jetty.util.thread.ReservedThreadExecutor$ReservedThread.run(ReservedThreadExecutor.java:366)  at org.eclipse.jetty.util.thread.QueuedThreadPool.runJob(QueuedThreadPool.java:762)  at org.eclipse.jetty.util.thread.QueuedThreadPool$2.run(QueuedThreadPool.java:680)  at java.lang.Thread.run(Thread.java:748)  org.apache.solr.common.util.ObjectReleaseTracker$ObjectTrackerException: org.apache.solr.update.TransactionLog  at org.apache.solr.common.util.ObjectReleaseTracker.track(ObjectReleaseTracker.java:42)  at org.apache.solr.update.TransactionLog.<init>(TransactionLog.java:188)  at org.apache.solr.update.UpdateLog.newTransactionLog(UpdateLog.java:467)  at org.apache.solr.update.UpdateLog.ensureLog(UpdateLog.java:1323)  at org.apache.solr.update.UpdateLog.add(UpdateLog.java:571)  at org.apache.solr.update.UpdateLog.add(UpdateLog.java:551)  at org.apache.solr.update.DirectUpdateHandler2.doNormalUpdate(DirectUpdateHandler2.java:345)  at org.apache.solr.update.DirectUpdateHandler2.addDoc0(DirectUpdateHandler2.java:283)  at org.apache.solr.update.DirectUpdateHandler2.addDoc(DirectUpdateHandler2.java:233)  at org.apache.solr.update.processor.RunUpdateProcessor.processAdd(RunUpdateProcessorFactory.java:67)  at org.apache.solr.update.processor.UpdateRequestProcessor.processAdd(UpdateRequestProcessor.java:55)  at org.apache.solr.update.processor.DistributedUpdateProcessor.doLocalAdd(DistributedUpdateProcessor.java:950)  at org.apache.solr.update.processor.DistributedUpdateProcessor.versionAdd(DistributedUpdateProcessor.java:1168)  at org.apache.solr.update.processor.DistributedUpdateProcessor.processAdd(DistributedUpdateProcessor.java:633)  at org.apache.solr.update.processor.UpdateRequestProcessor.processAdd(UpdateRequestProcessor.java:55)  at org.apache.solr.update.processor.AddSchemaFieldsUpdateProcessorFactory$AddSchemaFieldsUpdateProcessor.processAdd(AddSchemaFieldsUpdateProcessorFactory.java:475)  at org.apache.solr.handler.loader.JavabinLoader$1.update(JavabinLoader.java:98)  at org.apache.solr.client.solrj.request.JavaBinUpdateRequestCodec$1.readOuterMostDocIterator(JavaBinUpdateRequestCodec.java:188)  at org.apache.solr.client.solrj.request.JavaBinUpdateRequestCodec$1.readIterator(JavaBinUpdateRequestCodec.java:144)  at org.apache.solr.common.util.JavaBinCodec.readObject(JavaBinCodec.java:311)  at org.apache.solr.common.util.JavaBinCodec.readVal(JavaBinCodec.java:256)  at org.apache.solr.client.solrj.request.JavaBinUpdateRequestCodec$1.readNamedList(JavaBinUpdateRequestCodec.java:130)  at org.apache.solr.common.util.JavaBinCodec.readObject(JavaBinCodec.java:276)  at org.apache.solr.common.util.JavaBinCodec.readVal(JavaBinCodec.java:256)  at org.apache.solr.common.util.JavaBinCodec.unmarshal(JavaBinCodec.java:178)  at org.apache.solr.client.solrj.request.JavaBinUpdateRequestCodec.unmarshal(JavaBinUpdateRequestCodec.java:195)  at org.apache.solr.handler.loader.JavabinLoader.parseAndLoadDocs(JavabinLoader.java:109)  at org.apache.solr.handler.loader.JavabinLoader.load(JavabinLoader.java:55)  at org.apache.solr.handler.UpdateRequestHandler$1.load(UpdateRequestHandler.java:97)  at org.apache.solr.handler.ContentStreamHandlerBase.handleRequestBody(ContentStreamHandlerBase.java:68)  at org.apache.solr.handler.RequestHandlerBase.handleRequest(RequestHandlerBase.java:199)  at org.apache.solr.core.SolrCore.execute(SolrCore.java:2541)  at org.apache.solr.servlet.HttpSolrCall.execute(HttpSolrCall.java:709)  at org.apache.solr.servlet.HttpSolrCall.call(HttpSolrCall.java:515)  at org.apache.solr.servlet.SolrDispatchFilter.doFilter(SolrDispatchFilter.java:377)  at org.apache.solr.servlet.SolrDispatchFilter.doFilter(SolrDispatchFilter.java:323)  at org.eclipse.jetty.servlet.ServletHandler$CachedChain.doFilter(ServletHandler.java:1642)  at org.apache.solr.client.solrj.embedded.JettySolrRunner$DebugFilter.doFilter(JettySolrRunner.java:139)  at org.eclipse.jetty.servlet.ServletHandler$CachedChain.doFilter(ServletHandler.java:1642)  at org.eclipse.jetty.servlet.ServletHandler.doHandle(ServletHandler.java:533)  at org.eclipse.jetty.server.handler.ScopedHandler.nextHandle(ScopedHandler.java:255)  at org.eclipse.jetty.server.session.SessionHandler.doHandle(SessionHandler.java:1595)  at org.eclipse.jetty.server.handler.ScopedHandler.nextHandle(ScopedHandler.java:255)  at org.eclipse.jetty.server.handler.ContextHandler.doHandle(ContextHandler.java:1317)  at org.eclipse.jetty.server.handler.ScopedHandler.nextScope(ScopedHandler.java:203)  at org.eclipse.jetty.servlet.ServletHandler.doScope(ServletHandler.java:473)  at org.eclipse.jetty.server.session.SessionHandler.doScope(SessionHandler.java:1564)  at org.eclipse.jetty.server.handler.ScopedHandler.nextScope(ScopedHandler.java:201)  at org.eclipse.jetty.server.handler.ContextHandler.doScope(ContextHandler.java:1219)  at org.eclipse.jetty.server.handler.ScopedHandler.handle(ScopedHandler.java:144)  at org.eclipse.jetty.server.handler.gzip.GzipHandler.handle(GzipHandler.java:674)  at org.eclipse.jetty.server.handler.HandlerWrapper.handle(HandlerWrapper.java:132)  at org.eclipse.jetty.server.Server.handle(Server.java:531)  at org.eclipse.jetty.server.HttpChannel.handle(HttpChannel.java:352)  at org.eclipse.jetty.server.HttpConnection.onFillable(HttpConnection.java:260)  at org.eclipse.jetty.io.AbstractConnection$ReadCallback.succeeded(AbstractConnection.java:281)  at org.eclipse.jetty.io.FillInterest.fillable(FillInterest.java:102)  at org.eclipse.jetty.io.ChannelEndPoint$2.run(ChannelEndPoint.java:118)  at org.eclipse.jetty.util.thread.strategy.EatWhatYouKill.runTask(EatWhatYouKill.java:333)  at org.eclipse.jetty.util.thread.strategy.EatWhatYouKill.doProduce(EatWhatYouKill.java:310)  at org.eclipse.jetty.util.thread.strategy.EatWhatYouKill.tryProduce(EatWhatYouKill.java:168)  at org.eclipse.jetty.util.thread.strategy.EatWhatYouKill.run(EatWhatYouKill.java:126)  at org.eclipse.jetty.util.thread.ReservedThreadExecutor$ReservedThread.run(ReservedThreadExecutor.java:366)  at org.eclipse.jetty.util.thread.QueuedThreadPool.runJob(QueuedThreadPool.java:762)  at org.eclipse.jetty.util.thread.QueuedThreadPool$2.run(QueuedThreadPool.java:680)  at java.lang.Thread.run(Thread.java:748)  

Stack Trace:
java.lang.AssertionError: ObjectTracker found 4 object(s) that were not released!!! [NRTCachingDirectory, NRTCachingDirectory, NRTCachingDirectory, TransactionLog]
org.apache.solr.common.util.ObjectReleaseTracker$ObjectTrackerException: org.apache.lucene.store.NRTCachingDirectory
	at org.apache.solr.common.util.ObjectReleaseTracker.track(ObjectReleaseTracker.java:42)
	at org.apache.solr.core.CachingDirectoryFactory.get(CachingDirectoryFactory.java:348)
	at org.apache.solr.update.SolrIndexWriter.create(SolrIndexWriter.java:95)
	at org.apache.solr.core.SolrCore.initIndex(SolrCore.java:768)
	at org.apache.solr.core.SolrCore.<init>(SolrCore.java:960)
	at org.apache.solr.core.SolrCore.<init>(SolrCore.java:869)
	at org.apache.solr.core.CoreContainer.createFromDescriptor(CoreContainer.java:1140)
	at org.apache.solr.core.CoreContainer.create(CoreContainer.java:1050)
	at org.apache.solr.handler.admin.CoreAdminOperation.lambda$static$0(CoreAdminOperation.java:92)
	at org.apache.solr.handler.admin.CoreAdminOperation.execute(CoreAdminOperation.java:360)
	at org.apache.solr.handler.admin.CoreAdminHandler$CallInfo.call(CoreAdminHandler.java:395)
	at org.apache.solr.handler.admin.CoreAdminHandler.handleRequestBody(CoreAdminHandler.java:180)
	at org.apache.solr.handler.RequestHandlerBase.handleRequest(RequestHandlerBase.java:199)
	at org.apache.solr.servlet.HttpSolrCall.handleAdmin(HttpSolrCall.java:734)
	at org.apache.solr.servlet.HttpSolrCall.handleAdminRequest(HttpSolrCall.java:715)
	at org.apache.solr.servlet.HttpSolrCall.call(HttpSolrCall.java:496)
	at org.apache.solr.servlet.SolrDispatchFilter.doFilter(SolrDispatchFilter.java:377)
	at org.apache.solr.servlet.SolrDispatchFilter.doFilter(SolrDispatchFilter.java:323)
	at org.eclipse.jetty.servlet.ServletHandler$CachedChain.doFilter(ServletHandler.java:1642)
	at org.apache.solr.client.solrj.embedded.JettySolrRunner$DebugFilter.doFilter(JettySolrRunner.java:139)
	at org.eclipse.jetty.servlet.ServletHandler$CachedChain.doFilter(ServletHandler.java:1642)
	at org.eclipse.jetty.servlet.ServletHandler.doHandle(ServletHandler.java:533)
	at org.eclipse.jetty.server.handler.ScopedHandler.nextHandle(ScopedHandler.java:255)
	at org.eclipse.jetty.server.session.SessionHandler.doHandle(SessionHandler.java:1595)
	at org.eclipse.jetty.server.handler.ScopedHandler.nextHandle(ScopedHandler.java:255)
	at org.eclipse.jetty.server.handler.ContextHandler.doHandle(ContextHandler.java:1317)
	at org.eclipse.jetty.server.handler.ScopedHandler.nextScope(ScopedHandler.java:203)
	at org.eclipse.jetty.servlet.ServletHandler.doScope(ServletHandler.java:473)
	at org.eclipse.jetty.server.session.SessionHandler.doScope(SessionHandler.java:1564)
	at org.eclipse.jetty.server.handler.ScopedHandler.nextScope(ScopedHandler.java:201)
	at org.eclipse.jetty.server.handler.ContextHandler.doScope(ContextHandler.java:1219)
	at org.eclipse.jetty.server.handler.ScopedHandler.handle(ScopedHandler.java:144)
	at org.eclipse.jetty.server.handler.gzip.GzipHandler.handle(GzipHandler.java:674)
	at org.eclipse.jetty.server.handler.HandlerWrapper.handle(HandlerWrapper.java:132)
	at org.eclipse.jetty.server.Server.handle(Server.java:531)
	at org.eclipse.jetty.server.HttpChannel.handle(HttpChannel.java:352)
	at org.eclipse.jetty.server.HttpConnection.onFillable(HttpConnection.java:260)
	at org.eclipse.jetty.io.AbstractConnection$ReadCallback.succeeded(AbstractConnection.java:281)
	at org.eclipse.jetty.io.FillInterest.fillable(FillInterest.java:102)
	at org.eclipse.jetty.io.ChannelEndPoint$2.run(ChannelEndPoint.java:118)
	at org.eclipse.jetty.util.thread.strategy.EatWhatYouKill.runTask(EatWhatYouKill.java:333)
	at org.eclipse.jetty.util.thread.strategy.EatWhatYouKill.doProduce(EatWhatYouKill.java:310)
	at org.eclipse.jetty.util.thread.strategy.EatWhatYouKill.tryProduce(EatWhatYouKill.java:168)
	at org.eclipse.jetty.util.thread.strategy.EatWhatYouKill.run(EatWhatYouKill.java:126)
	at org.eclipse.jetty.util.thread.ReservedThreadExecutor$ReservedThread.run(ReservedThreadExecutor.java:366)
	at org.eclipse.jetty.util.thread.QueuedThreadPool.runJob(QueuedThreadPool.java:762)
	at org.eclipse.jetty.util.thread.QueuedThreadPool$2.run(QueuedThreadPool.java:680)
	at java.lang.Thread.run(Thread.java:748)

org.apache.solr.common.util.ObjectReleaseTracker$ObjectTrackerException: org.apache.lucene.store.NRTCachingDirectory
	at org.apache.solr.common.util.ObjectReleaseTracker.track(ObjectReleaseTracker.java:42)
	at org.apache.solr.core.CachingDirectoryFactory.get(CachingDirectoryFactory.java:348)
	at org.apache.solr.core.SolrCore.initSnapshotMetaDataManager(SolrCore.java:507)
	at org.apache.solr.core.SolrCore.<init>(SolrCore.java:954)
	at org.apache.solr.core.SolrCore.<init>(SolrCore.java:869)
	at org.apache.solr.core.CoreContainer.createFromDescriptor(CoreContainer.java:1140)
	at org.apache.solr.core.CoreContainer.create(CoreContainer.java:1050)
	at org.apache.solr.handler.admin.CoreAdminOperation.lambda$static$0(CoreAdminOperation.java:92)
	at org.apache.solr.handler.admin.CoreAdminOperation.execute(CoreAdminOperation.java:360)
	at org.apache.solr.handler.admin.CoreAdminHandler$CallInfo.call(CoreAdminHandler.java:395)
	at org.apache.solr.handler.admin.CoreAdminHandler.handleRequestBody(CoreAdminHandler.java:180)
	at org.apache.solr.handler.RequestHandlerBase.handleRequest(RequestHandlerBase.java:199)
	at org.apache.solr.servlet.HttpSolrCall.handleAdmin(HttpSolrCall.java:734)
	at org.apache.solr.servlet.HttpSolrCall.handleAdminRequest(HttpSolrCall.java:715)
	at org.apache.solr.servlet.HttpSolrCall.call(HttpSolrCall.java:496)
	at org.apache.solr.servlet.SolrDispatchFilter.doFilter(SolrDispatchFilter.java:377)
	at org.apache.solr.servlet.SolrDispatchFilter.doFilter(SolrDispatchFilter.java:323)
	at org.eclipse.jetty.servlet.ServletHandler$CachedChain.doFilter(ServletHandler.java:1642)
	at org.apache.solr.client.solrj.embedded.JettySolrRunner$DebugFilter.doFilter(JettySolrRunner.java:139)
	at org.eclipse.jetty.servlet.ServletHandler$CachedChain.doFilter(ServletHandler.java:1642)
	at org.eclipse.jetty.servlet.ServletHandler.doHandle(ServletHandler.java:533)
	at org.eclipse.jetty.server.handler.ScopedHandler.nextHandle(ScopedHandler.java:255)
	at org.eclipse.jetty.server.session.SessionHandler.doHandle(SessionHandler.java:1595)
	at org.eclipse.jetty.server.handler.ScopedHandler.nextHandle(ScopedHandler.java:255)
	at org.eclipse.jetty.server.handler.ContextHandler.doHandle(ContextHandler.java:1317)
	at org.eclipse.jetty.server.handler.ScopedHandler.nextScope(ScopedHandler.java:203)
	at org.eclipse.jetty.servlet.ServletHandler.doScope(ServletHandler.java:473)
	at org.eclipse.jetty.server.session.SessionHandler.doScope(SessionHandler.java:1564)
	at org.eclipse.jetty.server.handler.ScopedHandler.nextScope(ScopedHandler.java:201)
	at org.eclipse.jetty.server.handler.ContextHandler.doScope(ContextHandler.java:1219)
	at org.eclipse.jetty.server.handler.ScopedHandler.handle(ScopedHandler.java:144)
	at org.eclipse.jetty.server.handler.gzip.GzipHandler.handle(GzipHandler.java:674)
	at org.eclipse.jetty.server.handler.HandlerWrapper.handle(HandlerWrapper.java:132)
	at org.eclipse.jetty.server.Server.handle(Server.java:531)
	at org.eclipse.jetty.server.HttpChannel.handle(HttpChannel.java:352)
	at org.eclipse.jetty.server.HttpConnection.onFillable(HttpConnection.java:260)
	at org.eclipse.jetty.io.AbstractConnection$ReadCallback.succeeded(AbstractConnection.java:281)
	at org.eclipse.jetty.io.FillInterest.fillable(FillInterest.java:102)
	at org.eclipse.jetty.io.ChannelEndPoint$2.run(ChannelEndPoint.java:118)
	at org.eclipse.jetty.util.thread.strategy.EatWhatYouKill.runTask(EatWhatYouKill.java:333)
	at org.eclipse.jetty.util.thread.strategy.EatWhatYouKill.doProduce(EatWhatYouKill.java:310)
	at org.eclipse.jetty.util.thread.strategy.EatWhatYouKill.tryProduce(EatWhatYouKill.java:168)
	at org.eclipse.jetty.util.thread.strategy.EatWhatYouKill.run(EatWhatYouKill.java:126)
	at org.eclipse.jetty.util.thread.ReservedThreadExecutor$ReservedThread.run(ReservedThreadExecutor.java:366)
	at org.eclipse.jetty.util.thread.QueuedThreadPool.runJob(QueuedThreadPool.java:762)
	at org.eclipse.jetty.util.thread.QueuedThreadPool$2.run(QueuedThreadPool.java:680)
	at java.lang.Thread.run(Thread.java:748)

org.apache.solr.common.util.ObjectReleaseTracker$ObjectTrackerException: org.apache.lucene.store.NRTCachingDirectory
	at org.apache.solr.common.util.ObjectReleaseTracker.track(ObjectReleaseTracker.java:42)
	at org.apache.solr.core.CachingDirectoryFactory.get(CachingDirectoryFactory.java:348)
	at org.apache.solr.core.SolrCore.getNewIndexDir(SolrCore.java:358)
	at org.apache.solr.core.SolrCore.initIndex(SolrCore.java:737)
	at org.apache.solr.core.SolrCore.<init>(SolrCore.java:960)
	at org.apache.solr.core.SolrCore.<init>(SolrCore.java:869)
	at org.apache.solr.core.CoreContainer.createFromDescriptor(CoreContainer.java:1140)
	at org.apache.solr.core.CoreContainer.create(CoreContainer.java:1050)
	at org.apache.solr.handler.admin.CoreAdminOperation.lambda$static$0(CoreAdminOperation.java:92)
	at org.apache.solr.handler.admin.CoreAdminOperation.execute(CoreAdminOperation.java:360)
	at org.apache.solr.handler.admin.CoreAdminHandler$CallInfo.call(CoreAdminHandler.java:395)
	at org.apache.solr.handler.admin.CoreAdminHandler.handleRequestBody(CoreAdminHandler.java:180)
	at org.apache.solr.handler.RequestHandlerBase.handleRequest(RequestHandlerBase.java:199)
	at org.apache.solr.servlet.HttpSolrCall.handleAdmin(HttpSolrCall.java:734)
	at org.apache.solr.servlet.HttpSolrCall.handleAdminRequest(HttpSolrCall.java:715)
	at org.apache.solr.servlet.HttpSolrCall.call(HttpSolrCall.java:496)
	at org.apache.solr.servlet.SolrDispatchFilter.doFilter(SolrDispatchFilter.java:377)
	at org.apache.solr.servlet.SolrDispatchFilter.doFilter(SolrDispatchFilter.java:323)
	at org.eclipse.jetty.servlet.ServletHandler$CachedChain.doFilter(ServletHandler.java:1642)
	at org.apache.solr.client.solrj.embedded.JettySolrRunner$DebugFilter.doFilter(JettySolrRunner.java:139)
	at org.eclipse.jetty.servlet.ServletHandler$CachedChain.doFilter(ServletHandler.java:1642)
	at org.eclipse.jetty.servlet.ServletHandler.doHandle(ServletHandler.java:533)
	at org.eclipse.jetty.server.handler.ScopedHandler.nextHandle(ScopedHandler.java:255)
	at org.eclipse.jetty.server.session.SessionHandler.doHandle(SessionHandler.java:1595)
	at org.eclipse.jetty.server.handler.ScopedHandler.nextHandle(ScopedHandler.java:255)
	at org.eclipse.jetty.server.handler.ContextHandler.doHandle(ContextHandler.java:1317)
	at org.eclipse.jetty.server.handler.ScopedHandler.nextScope(ScopedHandler.java:203)
	at org.eclipse.jetty.servlet.ServletHandler.doScope(ServletHandler.java:473)
	at org.eclipse.jetty.server.session.SessionHandler.doScope(SessionHandler.java:1564)
	at org.eclipse.jetty.server.handler.ScopedHandler.nextScope(ScopedHandler.java:201)
	at org.eclipse.jetty.server.handler.ContextHandler.doScope(ContextHandler.java:1219)
	at org.eclipse.jetty.server.handler.ScopedHandler.handle(ScopedHandler.java:144)
	at org.eclipse.jetty.server.handler.gzip.GzipHandler.handle(GzipHandler.java:674)
	at org.eclipse.jetty.server.handler.HandlerWrapper.handle(HandlerWrapper.java:132)
	at org.eclipse.jetty.server.Server.handle(Server.java:531)
	at org.eclipse.jetty.server.HttpChannel.handle(HttpChannel.java:352)
	at org.eclipse.jetty.server.HttpConnection.onFillable(HttpConnection.java:260)
	at org.eclipse.jetty.io.AbstractConnection$ReadCallback.succeeded(AbstractConnection.java:281)
	at org.eclipse.jetty.io.FillInterest.fillable(FillInterest.java:102)
	at org.eclipse.jetty.io.ChannelEndPoint$2.run(ChannelEndPoint.java:118)
	at org.eclipse.jetty.util.thread.strategy.EatWhatYouKill.runTask(EatWhatYouKill.java:333)
	at org.eclipse.jetty.util.thread.strategy.EatWhatYouKill.doProduce(EatWhatYouKill.java:310)
	at org.eclipse.jetty.util.thread.strategy.EatWhatYouKill.tryProduce(EatWhatYouKill.java:168)
	at org.eclipse.jetty.util.thread.strategy.EatWhatYouKill.run(EatWhatYouKill.java:126)
	at org.eclipse.jetty.util.thread.ReservedThreadExecutor$ReservedThread.run(ReservedThreadExecutor.java:366)
	at org.eclipse.jetty.util.thread.QueuedThreadPool.runJob(QueuedThreadPool.java:762)
	at org.eclipse.jetty.util.thread.QueuedThreadPool$2.run(QueuedThreadPool.java:680)
	at java.lang.Thread.run(Thread.java:748)

org.apache.solr.common.util.ObjectReleaseTracker$ObjectTrackerException: org.apache.solr.update.TransactionLog
	at org.apache.solr.common.util.ObjectReleaseTracker.track(ObjectReleaseTracker.java:42)
	at org.apache.solr.update.TransactionLog.<init>(TransactionLog.java:188)
	at org.apache.solr.update.UpdateLog.newTransactionLog(UpdateLog.java:467)
	at org.apache.solr.update.UpdateLog.ensureLog(UpdateLog.java:1323)
	at org.apache.solr.update.UpdateLog.add(UpdateLog.java:571)
	at org.apache.solr.update.UpdateLog.add(UpdateLog.java:551)
	at org.apache.solr.update.DirectUpdateHandler2.doNormalUpdate(DirectUpdateHandler2.java:345)
	at org.apache.solr.update.DirectUpdateHandler2.addDoc0(DirectUpdateHandler2.java:283)
	at org.apache.solr.update.DirectUpdateHandler2.addDoc(DirectUpdateHandler2.java:233)
	at org.apache.solr.update.processor.RunUpdateProcessor.processAdd(RunUpdateProcessorFactory.java:67)
	at org.apache.solr.update.processor.UpdateRequestProcessor.processAdd(UpdateRequestProcessor.java:55)
	at org.apache.solr.update.processor.DistributedUpdateProcessor.doLocalAdd(DistributedUpdateProcessor.java:950)
	at org.apache.solr.update.processor.DistributedUpdateProcessor.versionAdd(DistributedUpdateProcessor.java:1168)
	at org.apache.solr.update.processor.DistributedUpdateProcessor.processAdd(DistributedUpdateProcessor.java:633)
	at org.apache.solr.update.processor.UpdateRequestProcessor.processAdd(UpdateRequestProcessor.java:55)
	at org.apache.solr.update.processor.AddSchemaFieldsUpdateProcessorFactory$AddSchemaFieldsUpdateProcessor.processAdd(AddSchemaFieldsUpdateProcessorFactory.java:475)
	at org.apache.solr.handler.loader.JavabinLoader$1.update(JavabinLoader.java:98)
	at org.apache.solr.client.solrj.request.JavaBinUpdateRequestCodec$1.readOuterMostDocIterator(JavaBinUpdateRequestCodec.java:188)
	at org.apache.solr.client.solrj.request.JavaBinUpdateRequestCodec$1.readIterator(JavaBinUpdateRequestCodec.java:144)
	at org.apache.solr.common.util.JavaBinCodec.readObject(JavaBinCodec.java:311)
	at org.apache.solr.common.util.JavaBinCodec.readVal(JavaBinCodec.java:256)
	at org.apache.solr.client.solrj.request.JavaBinUpdateRequestCodec$1.readNamedList(JavaBinUpdateRequestCodec.java:130)
	at org.apache.solr.common.util.JavaBinCodec.readObject(JavaBinCodec.java:276)
	at org.apache.solr.common.util.JavaBinCodec.readVal(JavaBinCodec.java:256)
	at org.apache.solr.common.util.JavaBinCodec.unmarshal(JavaBinCodec.java:178)
	at org.apache.solr.client.solrj.request.JavaBinUpdateRequestCodec.unmarshal(JavaBinUpdateRequestCodec.java:195)
	at org.apache.solr.handler.loader.JavabinLoader.parseAndLoadDocs(JavabinLoader.java:109)
	at org.apache.solr.handler.loader.JavabinLoader.load(JavabinLoader.java:55)
	at org.apache.solr.handler.UpdateRequestHandler$1.load(UpdateRequestHandler.java:97)
	at org.apache.solr.handler.ContentStreamHandlerBase.handleRequestBody(ContentStreamHandlerBase.java:68)
	at org.apache.solr.handler.RequestHandlerBase.handleRequest(RequestHandlerBase.java:199)
	at org.apache.solr.core.SolrCore.execute(SolrCore.java:2541)
	at org.apache.solr.servlet.HttpSolrCall.execute(HttpSolrCall.java:709)
	at org.apache.solr.servlet.HttpSolrCall.call(HttpSolrCall.java:515)
	at org.apache.solr.servlet.SolrDispatchFilter.doFilter(SolrDispatchFilter.java:377)
	at org.apache.solr.servlet.SolrDispatchFilter.doFilter(SolrDispatchFilter.java:323)
	at org.eclipse.jetty.servlet.ServletHandler$CachedChain.doFilter(ServletHandler.java:1642)
	at org.apache.solr.client.solrj.embedded.JettySolrRunner$DebugFilter.doFilter(JettySolrRunner.java:139)
	at org.eclipse.jetty.servlet.ServletHandler$CachedChain.doFilter(ServletHandler.java:1642)
	at org.eclipse.jetty.servlet.ServletHandler.doHandle(ServletHandler.java:533)
	at org.eclipse.jetty.server.handler.ScopedHandler.nextHandle(ScopedHandler.java:255)
	at org.eclipse.jetty.server.session.SessionHandler.doHandle(SessionHandler.java:1595)
	at org.eclipse.jetty.server.handler.ScopedHandler.nextHandle(ScopedHandler.java:255)
	at org.eclipse.jetty.server.handler.ContextHandler.doHandle(ContextHandler.java:1317)
	at org.eclipse.jetty.server.handler.ScopedHandler.nextScope(ScopedHandler.java:203)
	at org.eclipse.jetty.servlet.ServletHandler.doScope(ServletHandler.java:473)
	at org.eclipse.jetty.server.session.SessionHandler.doScope(SessionHandler.java:1564)
	at org.eclipse.jetty.server.handler.ScopedHandler.nextScope(ScopedHandler.java:201)
	at org.eclipse.jetty.server.handler.ContextHandler.doScope(ContextHandler.java:1219)
	at org.eclipse.jetty.server.handler.ScopedHandler.handle(ScopedHandler.java:144)
	at org.eclipse.jetty.server.handler.gzip.GzipHandler.handle(GzipHandler.java:674)
	at org.eclipse.jetty.server.handler.HandlerWrapper.handle(HandlerWrapper.java:132)
	at org.eclipse.jetty.server.Server.handle(Server.java:531)
	at org.eclipse.jetty.server.HttpChannel.handle(HttpChannel.java:352)
	at org.eclipse.jetty.server.HttpConnection.onFillable(HttpConnection.java:260)
	at org.eclipse.jetty.io.AbstractConnection$ReadCallback.succeeded(AbstractConnection.java:281)
	at org.eclipse.jetty.io.FillInterest.fillable(FillInterest.java:102)
	at org.eclipse.jetty.io.ChannelEndPoint$2.run(ChannelEndPoint.java:118)
	at org.eclipse.jetty.util.thread.strategy.EatWhatYouKill.runTask(EatWhatYouKill.java:333)
	at org.eclipse.jetty.util.thread.strategy.EatWhatYouKill.doProduce(EatWhatYouKill.java:310)
	at org.eclipse.jetty.util.thread.strategy.EatWhatYouKill.tryProduce(EatWhatYouKill.java:168)
	at org.eclipse.jetty.util.thread.strategy.EatWhatYouKill.run(EatWhatYouKill.java:126)
	at org.eclipse.jetty.util.thread.ReservedThreadExecutor$ReservedThread.run(ReservedThreadExecutor.java:366)
	at org.eclipse.jetty.util.thread.QueuedThreadPool.runJob(QueuedThreadPool.java:762)
	at org.eclipse.jetty.util.thread.QueuedThreadPool$2.run(QueuedThreadPool.java:680)
	at java.lang.Thread.run(Thread.java:748)


	at __randomizedtesting.SeedInfo.seed([CBEBEECC579C6C71]:0)
	at org.junit.Assert.fail(Assert.java:93)
	at org.junit.Assert.assertTrue(Assert.java:43)
	at org.junit.Assert.assertNull(Assert.java:551)
	at org.apache.solr.SolrTestCaseJ4.teardownTestCases(SolrTestCaseJ4.java:304)
	at sun.reflect.GeneratedMethodAccessor71.invoke(Unknown Source)
	at sun.reflect.DelegatingMethodAccessorImpl.invoke(DelegatingMethodAccessorImpl.java:43)
	at java.lang.reflect.Method.invoke(Method.java:498)
	at com.carrotsearch.randomizedtesting.RandomizedRunner.invoke(RandomizedRunner.java:1737)
	at com.carrotsearch.randomizedtesting.RandomizedRunner$7.evaluate(RandomizedRunner.java:897)
	at com.carrotsearch.randomizedtesting.rules.StatementAdapter.evaluate(StatementAdapter.java:36)
	at com.carrotsearch.randomizedtesting.rules.SystemPropertiesRestoreRule$1.evaluate(SystemPropertiesRestoreRule.java:57)
	at org.apache.lucene.util.AbstractBeforeAfterRule$1.evaluate(AbstractBeforeAfterRule.java:45)
	at com.carrotsearch.randomizedtesting.rules.StatementAdapter.evaluate(StatementAdapter.java:36)
	at org.apache.lucene.util.TestRuleStoreClassName$1.evaluate(TestRuleStoreClassName.java:41)
	at com.carrotsearch.randomizedtesting.rules.NoShadowingOrOverridesOnMethodsRule$1.evaluate(NoShadowingOrOverridesOnMethodsRule.java:40)
	at com.carrotsearch.randomizedtesting.rules.NoShadowingOrOverridesOnMethodsRule$1.evaluate(NoShadowingOrOverridesOnMethodsRule.java:40)
	at com.carrotsearch.randomizedtesting.rules.StatementAdapter.evaluate(StatementAdapter.java:36)
	at com.carrotsearch.randomizedtesting.rules.StatementAdapter.evaluate(StatementAdapter.java:36)
	at com.carrotsearch.randomizedtesting.rules.StatementAdapter.evaluate(StatementAdapter.java:36)
	at org.apache.lucene.util.TestRuleAssertionsRequired$1.evaluate(TestRuleAssertionsRequired.java:53)
	at org.apache.lucene.util.TestRuleMarkFailure$1.evaluate(TestRuleMarkFailure.java:47)
	at org.apache.lucene.util.TestRuleIgnoreAfterMaxFailures$1.evaluate(TestRuleIgnoreAfterMaxFailures.java:64)
	at org.apache.lucene.util.TestRuleIgnoreTestSuites$1.evaluate(TestRuleIgnoreTestSuites.java:54)
	at com.carrotsearch.randomizedtesting.rules.StatementAdapter.evaluate(StatementAdapter.java:36)
	at com.carrotsearch.randomizedtesting.ThreadLeakControl$StatementRunner.run(ThreadLeakControl.java:368)
	at java.lang.Thread.run(Thread.java:748)




Build Log:
[...truncated 15077 lines...]
   [junit4] Suite: org.apache.solr.util.TestSolrCLIRunExample
   [junit4]   2> Creating dataDir: /export/home/jenkins/workspace/Lucene-Solr-master-Solaris/solr/build/solr-core/test/J1/temp/solr.util.TestSolrCLIRunExample_CBEBEECC579C6C71-001/init-core-data-001
   [junit4]   2> 3991618 INFO  (TEST-TestSolrCLIRunExample.testInteractiveSolrCloudExampleWithAutoScalingPolicy-seed#[CBEBEECC579C6C71]) [    ] o.a.s.c.MiniSolrCloudCluster Starting cluster of 1 servers in /export/home/jenkins/workspace/Lucene-Solr-master-Solaris/solr/build/solr-core/test/J1/temp/solr.util.TestSolrCLIRunExample_CBEBEECC579C6C71-001/tempDir-002
   [junit4]   2> 3991618 INFO  (TEST-TestSolrCLIRunExample.testInteractiveSolrCloudExampleWithAutoScalingPolicy-seed#[CBEBEECC579C6C71]) [    ] o.a.s.c.ZkTestServer STARTING ZK TEST SERVER
   [junit4]   2> 3991618 INFO  (Thread-7681) [    ] o.a.s.c.ZkTestServer client port:0.0.0.0/0.0.0.0:0
   [junit4]   2> 3991618 INFO  (Thread-7681) [    ] o.a.s.c.ZkTestServer Starting server
   [junit4]   2> 3991621 ERROR (Thread-7681) [    ] o.a.z.s.ZooKeeperServer ZKShutdownHandler is not registered, so ZooKeeper server won't take any action on ERROR or SHUTDOWN server state changes
   [junit4]   2> 3991718 INFO  (TEST-TestSolrCLIRunExample.testInteractiveSolrCloudExampleWithAutoScalingPolicy-seed#[CBEBEECC579C6C71]) [    ] o.a.s.c.ZkTestServer start zk server on port:50968
   [junit4]   2> 3991721 INFO  (zkConnectionManagerCallback-11774-thread-1) [    ] o.a.s.c.c.ConnectionManager zkClient has connected
   [junit4]   2> 3991725 INFO  (jetty-launcher-11771-thread-1) [    ] o.e.j.s.Server jetty-9.4.11.v20180605; built: 2018-06-05T18:24:03.829Z; git: d5fc0523cfa96bfebfbda19606cad384d772f04c; jvm 1.8.0_172-b11
   [junit4]   2> 3991726 INFO  (jetty-launcher-11771-thread-1) [    ] o.e.j.s.session DefaultSessionIdManager workerName=node0
   [junit4]   2> 3991726 INFO  (jetty-launcher-11771-thread-1) [    ] o.e.j.s.session No SessionScavenger set, using defaults
   [junit4]   2> 3991726 INFO  (jetty-launcher-11771-thread-1) [    ] o.e.j.s.session node0 Scavenging every 660000ms
   [junit4]   2> 3991726 INFO  (jetty-launcher-11771-thread-1) [    ] o.e.j.s.h.ContextHandler Started o.e.j.s.ServletContextHandler@45b1c3fb{/solr,null,AVAILABLE}
   [junit4]   2> 3991727 INFO  (jetty-launcher-11771-thread-1) [    ] o.e.j.s.AbstractConnector Started ServerConnector@7850214c{HTTP/1.1,[http/1.1]}{127.0.0.1:64804}
   [junit4]   2> 3991727 INFO  (jetty-launcher-11771-thread-1) [    ] o.e.j.s.Server Started @3993801ms
   [junit4]   2> 3991727 INFO  (jetty-launcher-11771-thread-1) [    ] o.a.s.c.s.e.JettySolrRunner Jetty properties: {hostContext=/solr, hostPort=64804}
   [junit4]   2> 3991728 INFO  (jetty-launcher-11771-thread-1) [    ] o.a.s.s.SolrDispatchFilter Using logger factory org.apache.logging.slf4j.Log4jLoggerFactory
   [junit4]   2> 3991728 INFO  (jetty-launcher-11771-thread-1) [    ] o.a.s.s.SolrDispatchFilter  ___      _       Welcome to Apache Solr? version 8.0.0
   [junit4]   2> 3991728 INFO  (jetty-launcher-11771-thread-1) [    ] o.a.s.s.SolrDispatchFilter / __| ___| |_ _   Starting in cloud mode on port 64804
   [junit4]   2> 3991728 INFO  (jetty-launcher-11771-thread-1) [    ] o.a.s.s.SolrDispatchFilter \__ \/ _ \ | '_|  Install dir: null
   [junit4]   2> 3991728 INFO  (jetty-launcher-11771-thread-1) [    ] o.a.s.s.SolrDispatchFilter |___/\___/_|_|    Start time: 2018-07-10T13:22:34.628Z
   [junit4]   2> 3991730 INFO  (zkConnectionManagerCallback-11776-thread-1) [    ] o.a.s.c.c.ConnectionManager zkClient has connected
   [junit4]   2> 3991731 INFO  (jetty-launcher-11771-thread-1) [    ] o.a.s.s.SolrDispatchFilter solr.xml found in ZooKeeper. Loading...
   [junit4]   2> 3991736 INFO  (jetty-launcher-11771-thread-1) [    ] o.a.s.c.SolrXmlConfig MBean server found: com.sun.jmx.mbeanserver.JmxMBeanServer@63b9a921, but no JMX reporters were configured - adding default JMX reporter.
   [junit4]   2> 3993483 INFO  (jetty-launcher-11771-thread-1) [    ] o.a.s.c.ZkContainer Zookeeper client=127.0.0.1:50968/solr
   [junit4]   2> 3993493 INFO  (zkConnectionManagerCallback-11780-thread-1) [    ] o.a.s.c.c.ConnectionManager zkClient has connected
   [junit4]   2> 3993501 INFO  (zkConnectionManagerCallback-11782-thread-1) [    ] o.a.s.c.c.ConnectionManager zkClient has connected
   [junit4]   2> 3993735 INFO  (jetty-launcher-11771-thread-1) [n:localhost:64804_solr    ] o.a.s.c.Overseer Overseer (id=null) closing
   [junit4]   2> 3993736 INFO  (jetty-launcher-11771-thread-1) [n:localhost:64804_solr    ] o.a.s.c.OverseerElectionContext I am going to be the leader localhost:64804_solr
   [junit4]   2> 3993737 INFO  (jetty-launcher-11771-thread-1) [n:localhost:64804_solr    ] o.a.s.c.Overseer Overseer (id=72483420286550019-localhost:64804_solr-n_0000000000) starting
   [junit4]   2> 3993748 INFO  (zkConnectionManagerCallback-11789-thread-1) [    ] o.a.s.c.c.ConnectionManager zkClient has connected
   [junit4]   2> 3993751 INFO  (jetty-launcher-11771-thread-1) [n:localhost:64804_solr    ] o.a.s.c.s.i.ZkClientClusterStateProvider Cluster at 127.0.0.1:50968/solr ready
   [junit4]   2> 3993753 INFO  (jetty-launcher-11771-thread-1) [n:localhost:64804_solr    ] o.a.s.c.ZkController Register node as live in ZooKeeper:/live_nodes/localhost:64804_solr
   [junit4]   2> 3993764 INFO  (OverseerStateUpdate-72483420286550019-localhost:64804_solr-n_0000000000) [    ] o.a.s.c.c.ZkStateReader Updated live nodes from ZooKeeper... (0) -> (1)
   [junit4]   2> 3993771 INFO  (jetty-launcher-11771-thread-1) [n:localhost:64804_solr    ] o.a.s.h.a.MetricsHistoryHandler No .system collection, keeping metrics history in memory.
   [junit4]   2> 3993784 INFO  (jetty-launcher-11771-thread-1) [n:localhost:64804_solr    ] o.a.s.m.r.SolrJmxReporter JMX monitoring for 'solr.node' (registry 'solr.node') enabled at server: com.sun.jmx.mbeanserver.JmxMBeanServer@63b9a921
   [junit4]   2> 3993788 INFO  (jetty-launcher-11771-thread-1) [n:localhost:64804_solr    ] o.a.s.m.r.SolrJmxReporter JMX monitoring for 'solr.jvm' (registry 'solr.jvm') enabled at server: com.sun.jmx.mbeanserver.JmxMBeanServer@63b9a921
   [junit4]   2> 3993788 INFO  (jetty-launcher-11771-thread-1) [n:localhost:64804_solr    ] o.a.s.m.r.SolrJmxReporter JMX monitoring for 'solr.jetty' (registry 'solr.jetty') enabled at server: com.sun.jmx.mbeanserver.JmxMBeanServer@63b9a921
   [junit4]   2> 3993789 INFO  (jetty-launcher-11771-thread-1) [n:localhost:64804_solr    ] o.a.s.c.CorePropertiesLocator Found 0 core definitions underneath /export/home/jenkins/workspace/Lucene-Solr-master-Solaris/solr/build/solr-core/test/J1/temp/solr.util.TestSolrCLIRunExample_CBEBEECC579C6C71-001/tempDir-002/node1
   [junit4]   2> 3993792 INFO  (zkCallback-11788-thread-1) [    ] o.a.s.c.c.ZkStateReader Updated live nodes from ZooKeeper... (0) -> (1)
   [junit4]   2> 3993807 INFO  (zkConnectionManagerCallback-11792-thread-1) [    ] o.a.s.c.c.ConnectionManager zkClient has connected
   [junit4]   2> 3993833 INFO  (qtp1005567289-41529) [n:localhost:64804_solr    ] o.a.s.s.HttpSolrCall [admin] webapp=null path=/admin/info/system params={wt=json} status=0 QTime=20
   [junit4]   2> 3993836 INFO  (qtp1005567289-41526) [n:localhost:64804_solr    ] o.a.s.h.a.CollectionsHandler Invoked Collection Action :clusterstatus with params action=CLUSTERSTATUS&wt=json and sendToOCPQueue=true
   [junit4]   2> 3993837 INFO  (qtp1005567289-41526) [n:localhost:64804_solr    ] o.a.s.s.HttpSolrCall [admin] webapp=null path=/admin/collections params={action=CLUSTERSTATUS&wt=json} status=0 QTime=2
   [junit4]   2> 3993840 INFO  (zkConnectionManagerCallback-11798-thread-1) [    ] o.a.s.c.c.ConnectionManager zkClient has connected
   [junit4]   2> 3993842 INFO  (TEST-TestSolrCLIRunExample.testInteractiveSolrCloudExampleWithAutoScalingPolicy-seed#[CBEBEECC579C6C71]) [    ] o.a.s.c.c.ZkStateReader Updated live nodes from ZooKeeper... (0) -> (1)
   [junit4]   2> 3993844 INFO  (TEST-TestSolrCLIRunExample.testInteractiveSolrCloudExampleWithAutoScalingPolicy-seed#[CBEBEECC579C6C71]) [    ] o.a.s.c.s.i.ZkClientClusterStateProvider Cluster at 127.0.0.1:50968/solr ready
   [junit4]   2> 3993847 INFO  (qtp1005567289-41530) [n:localhost:64804_solr    ] o.a.s.h.a.CollectionsHandler Invoked Collection Action :list with params action=list&wt=json and sendToOCPQueue=true
   [junit4]   2> 3993847 INFO  (qtp1005567289-41530) [n:localhost:64804_solr    ] o.a.s.s.HttpSolrCall [admin] webapp=null path=/admin/collections params={action=list&wt=json} status=0 QTime=0
   [junit4]   2> 3993867 INFO  (qtp1005567289-41533) [n:localhost:64804_solr    ] o.a.s.h.a.CollectionsHandler Invoked Collection Action :clusterstatus with params action=CLUSTERSTATUS&wt=json and sendToOCPQueue=true
   [junit4]   2> 3993944 INFO  (qtp1005567289-41530) [n:localhost:64804_solr    ] o.a.s.h.a.CollectionsHandler Invoked Collection Action :list with params action=list&wt=json and sendToOCPQueue=true
   [junit4]   2> 3993946 INFO  (qtp1005567289-41533) [n:localhost:64804_solr    ] o.a.s.h.a.CollectionsHandler Invoked Collection Action :create with params replicationFactor=2&maxShardsPerNode=-1&collection.configName=testCloudExamplePrompt1&name=testCloudExamplePrompt1&action=CREATE&numShards=2&wt=json and sendToOCPQueue=true
   [junit4]   2> 3993949 INFO  (OverseerThreadFactory-16510-thread-1) [    ] o.a.s.c.a.c.CreateCollectionCmd Create collection testCloudExamplePrompt1
   [junit4]   2> 3993950 WARN  (OverseerThreadFactory-16510-thread-1) [    ] o.a.s.c.a.c.CreateCollectionCmd Specified number of replicas of 2 on collection testCloudExamplePrompt1 is higher than the number of Solr instances currently live or live and part of your createNodeSet(1). It's unusual to run two replica of the same slice on the same Solr-instance.
   [junit4]   2> 3994061 INFO  (OverseerStateUpdate-72483420286550019-localhost:64804_solr-n_0000000000) [    ] o.a.s.c.o.SliceMutator createReplica() {
   [junit4]   2>   "operation":"ADDREPLICA",
   [junit4]   2>   "collection":"testCloudExamplePrompt1",
   [junit4]   2>   "shard":"shard1",
   [junit4]   2>   "core":"testCloudExamplePrompt1_shard1_replica_n1",
   [junit4]   2>   "state":"down",
   [junit4]   2>   "base_url":"http://localhost:64804/solr",
   [junit4]   2>   "type":"NRT",
   [junit4]   2>   "waitForFinalState":"false"} 
   [junit4]   2> 3994066 INFO  (OverseerStateUpdate-72483420286550019-localhost:64804_solr-n_0000000000) [    ] o.a.s.c.o.SliceMutator createReplica() {
   [junit4]   2>   "operation":"ADDREPLICA",
   [junit4]   2>   "collection":"testCloudExamplePrompt1",
   [junit4]   2>   "shard":"shard1",
   [junit4]   2>   "core":"testCloudExamplePrompt1_shard1_replica_n2",
   [junit4]   2>   "state":"down",
   [junit4]   2>   "base_url":"http://localhost:64804/solr",
   [junit4]   2>   "type":"NRT",
   [junit4]   2>   "waitForFinalState":"false"} 
   [junit4]   2> 3994069 INFO  (OverseerStateUpdate-72483420286550019-localhost:64804_solr-n_0000000000) [    ] o.a.s.c.o.SliceMutator createReplica() {
   [junit4]   2>   "operation":"ADDREPLICA",
   [junit4]   2>   "collection":"testCloudExamplePrompt1",
   [junit4]   2>   "shard":"shard2",
   [junit4]   2>   "core":"testCloudExamplePrompt1_shard2_replica_n4",
   [junit4]   2>   "state":"down",
   [junit4]   2>   "base_url":"http://localhost:64804/solr",
   [junit4]   2>   "type":"NRT",
   [junit4]   2>   "waitForFinalState":"false"} 
   [junit4]   2> 3994072 INFO  (OverseerStateUpdate-72483420286550019-localhost:64804_solr-n_0000000000) [    ] o.a.s.c.o.SliceMutator createReplica() {
   [junit4]   2>   "operation":"ADDREPLICA",
   [junit4]   2>   "collection":"testCloudExamplePrompt1",
   [junit4]   2>   "shard":"shard2",
   [junit4]   2>   "core":"testCloudExamplePrompt1_shard2_replica_n6",
   [junit4]   2>   "state":"down",
   [junit4]   2>   "base_url":"http://localhost:64804/solr",
   [junit4]   2>   "type":"NRT",
   [junit4]   2>   "waitForFinalState":"false"} 
   [junit4]   2> 3994276 INFO  (qtp1005567289-41530) [n:localhost:64804_solr    x:testCloudExamplePrompt1_shard1_replica_n2] o.a.s.h.a.CoreAdminOperation core create command qt=/admin/cores&coreNodeName=core_node5&collection.configName=testCloudExamplePrompt1&newCollection=true&name=testCloudExamplePrompt1_shard1_replica_n2&action=CREATE&numShards=2&collection=testCloudExamplePrompt1&shard=shard1&wt=javabin&version=2&replicaType=NRT
   [junit4]   2> 3994277 INFO  (qtp1005567289-41528) [n:localhost:64804_solr    x:testCloudExamplePrompt1_shard1_replica_n1] o.a.s.h.a.CoreAdminOperation core create command qt=/admin/cores&coreNodeName=core_node3&collection.configName=testCloudExamplePrompt1&newCollection=true&name=testCloudExamplePrompt1_shard1_replica_n1&action=CREATE&numShards=2&collection=testCloudExamplePrompt1&shard=shard1&wt=javabin&version=2&replicaType=NRT
   [junit4]   2> 3994277 INFO  (qtp1005567289-41531) [n:localhost:64804_solr    x:testCloudExamplePrompt1_shard2_replica_n6] o.a.s.h.a.CoreAdminOperation core create command qt=/admin/cores&coreNodeName=core_node8&collection.configName=testCloudExamplePrompt1&newCollection=true&name=testCloudExamplePrompt1_shard2_replica_n6&action=CREATE&numShards=2&collection=testCloudExamplePrompt1&shard=shard2&wt=javabin&version=2&replicaType=NRT
   [junit4]   2> 3994277 INFO  (qtp1005567289-41529) [n:localhost:64804_solr    x:testCloudExamplePrompt1_shard2_replica_n4] o.a.s.h.a.CoreAdminOperation core create command qt=/admin/cores&coreNodeName=core_node7&collection.configName=testCloudExamplePrompt1&newCollection=true&name=testCloudExamplePrompt1_shard2_replica_n4&action=CREATE&numShards=2&collection=testCloudExamplePrompt1&shard=shard2&wt=javabin&version=2&replicaType=NRT
   [junit4]   2> 3995304 WARN  (qtp1005567289-41528) [n:localhost:64804_solr c:testCloudExamplePrompt1 s:shard1 r:core_node3 x:testCloudExamplePrompt1_shard1_replica_n1] o.a.s.c.SolrConfig Couldn't add files from /export/home/jenkins/workspace/Lucene-Solr-master-Solaris/solr/build/solr-core/test/J1/temp/solr.util.TestSolrCLIRunExample_CBEBEECC579C6C71-001/tempDir-002/node1/testCloudExamplePrompt1_shard1_replica_n1/../../../../contrib/extraction/lib filtered by .*\.jar to classpath: /export/home/jenkins/workspace/Lucene-Solr-master-Solaris/solr/build/solr-core/test/J1/temp/solr.util.TestSolrCLIRunExample_CBEBEECC579C6C71-001/tempDir-002/node1/testCloudExamplePrompt1_shard1_replica_n1/../../../../contrib/extraction/lib
   [junit4]   2> 3995306 WARN  (qtp1005567289-41528) [n:localhost:64804_solr c:testCloudExamplePrompt1 s:shard1 r:core_node3 x:testCloudExamplePrompt1_shard1_replica_n1] o.a.s.c.SolrConfig Couldn't add files from /export/home/jenkins/workspace/Lucene-Solr-master-Solaris/solr/build/solr-core/test/J1/temp/solr.util.TestSolrCLIRunExample_CBEBEECC579C6C71-001/tempDir-002/node1/testCloudExamplePrompt1_shard1_replica_n1/../../../../dist filtered by solr-cell-\d.*\.jar to classpath: /export/home/jenkins/workspace/Lucene-Solr-master-Solaris/solr/build/solr-core/test/J1/temp/solr.util.TestSolrCLIRunExample_CBEBEECC579C6C71-001/tempDir-002/node1/testCloudExamplePrompt1_shard1_replica_n1/../../../../dist
   [junit4]   2> 3995306 WARN  (qtp1005567289-41528) [n:localhost:64804_solr c:testCloudExamplePrompt1 s:shard1 r:core_node3 x:testCloudExamplePrompt1_shard1_replica_n1] o.a.s.c.SolrConfig Couldn't add files from /export/home/jenkins/workspace/Lucene-Solr-master-Solaris/solr/build/solr-core/test/J1/temp/solr.util.TestSolrCLIRunExample_CBEBEECC579C6C71-001/tempDir-002/node1/testCloudExamplePrompt1_shard1_replica_n1/../../../../contrib/clustering/lib filtered by .*\.jar to classpath: /export/home/jenkins/workspace/Lucene-Solr-master-Solaris/solr/build/solr-core/test/J1/temp/solr.util.TestSolrCLIRunExample_CBEBEECC579C6C71-001/tempDir-002/node1/testCloudExamplePrompt1_shard1_replica_n1/../../../../contrib/clustering/lib
   [junit4]   2> 3995307 WARN  (qtp1005567289-41528) [n:localhost:64804_solr c:testCloudExamplePrompt1 s:shard1 r:core_node3 x:testCloudExamplePrompt1_shard1_replica_n1] o.a.s.c.SolrConfig Couldn't add files from /export/home/jenkins/workspace/Lucene-Solr-master-Solaris/solr/build/solr-core/test/J1/temp/solr.util.TestSolrCLIRunExample_CBEBEECC579C6C71-001/tempDir-002/node1/testCloudExamplePrompt1_shard1_replica_n1/../../../../dist filtered by solr-clustering-\d.*\.jar to classpath: /export/home/jenkins/workspace/Lucene-Solr-master-Solaris/solr/build/solr-core/test/J1/temp/solr.util.TestSolrCLIRunExample_CBEBEECC579C6C71-001/tempDir-002/node1/testCloudExamplePrompt1_shard1_replica_n1/../../../../dist
   [junit4]   2> 3995307 WARN  (qtp1005567289-41528) [n:localhost:64804_solr c:testCloudExamplePrompt1 s:shard1 r:core_node3 x:testCloudExamplePrompt1_shard1_replica_n1] o.a.s.c.SolrConfig Couldn't add files from /export/home/jenkins/workspace/Lucene-Solr-master-Solaris/solr/build/solr-core/test/J1/temp/solr.util.TestSolrCLIRunExample_CBEBEECC579C6C71-001/tempDir-002/node1/testCloudExamplePrompt1_shard1_replica_n1/../../../../contrib/langid/lib filtered by .*\.jar to classpath: /export/home/jenkins/workspace/Lucene-Solr-master-Solaris/solr/build/solr-core/test/J1/temp/solr.util.TestSolrCLIRunExample_CBEBEECC579C6C71-001/tempDir-002/node1/testCloudExamplePrompt1_shard1_replica_n1/../../../../contrib/langid/lib
   [junit4]   2> 3995307 WARN  (qtp1005567289-41528) [n:localhost:64804_solr c:testCloudExamplePrompt1 s:shard1 r:core_node3 x:testCloudExamplePrompt1_shard1_replica_n1] o.a.s.c.SolrConfig Couldn't add files from /export/home/jenkins/workspace/Lucene-Solr-master-Solaris/solr/build/solr-core/test/J1/temp/solr.util.TestSolrCLIRunExample_CBEBEECC579C6C71-001/tempDir-002/node1/testCloudExamplePrompt1_shard1_replica_n1/../../../../dist filtered by solr-langid-\d.*\.jar to classpath: /export/home/jenkins/workspace/Lucene-Solr-master-Solaris/solr/build/solr-core/test/J1/temp/solr.util.TestSolrCLIRunExample_CBEBEECC579C6C71-001/tempDir-002/node1/testCloudExamplePrompt1_shard1_replica_n1/../../../../dist
   [junit4]   2> 3995307 WARN  (qtp1005567289-41530) [n:localhost:64804_solr c:testCloudExamplePrompt1 s:shard1 r:core_node5 x:testCloudExamplePrompt1_shard1_replica_n2] o.a.s.c.SolrConfig Couldn't add files from /export/home/jenkins/workspace/Lucene-Solr-master-Solaris/solr/build/solr-core/test/J1/temp/solr.util.TestSolrCLIRunExample_CBEBEECC579C6C71-001/tempDir-002/node1/testCloudExamplePrompt1_shard1_replica_n2/../../../../contrib/extraction/lib filtered by .*\.jar to classpath: /export/home/jenkins/workspace/Lucene-Solr-master-Solaris/solr/build/solr-core/test/J1/temp/solr.util.TestSolrCLIRunExample_CBEBEECC579C6C71-001/tempDir-002/node1/testCloudExamplePrompt1_shard1_replica_n2/../../../../contrib/extraction/lib
   [junit4]   2> 3995307 WARN  (qtp1005567289-41528) [n:localhost:64804_solr c:testCloudExamplePrompt1 s:shard1 r:core_node3 x:testCloudExamplePrompt1_shard1_replica_n1] o.a.s.c.SolrConfig Couldn't add files from /export/home/jenkins/workspace/Lucene-Solr-master-Solaris/solr/build/solr-core/test/J1/temp/solr.util.TestSolrCLIRunExample_CBEBEECC579C6C71-001/tempDir-002/node1/testCloudExamplePrompt1_shard1_replica_n1/../../../../contrib/velocity/lib filtered by .*\.jar to classpath: /export/home/jenkins/workspace/Lucene-Solr-master-Solaris/solr/build/solr-core/test/J1/temp/solr.util.TestSolrCLIRunExample_CBEBEECC579C6C71-001/tempDir-002/node1/testCloudExamplePrompt1_shard1_replica_n1/../../../../contrib/velocity/lib
   [junit4]   2> 3995307 WARN  (qtp1005567289-41530) [n:localhost:64804_solr c:testCloudExamplePrompt1 s:shard1 r:core_node5 x:testCloudExamplePrompt1_shard1_replica_n2] o.a.s.c.SolrConfig Couldn't add files from /export/home/jenkins/workspace/Lucene-Solr-master-Solaris/solr/build/solr-core/test/J1/temp/solr.util.TestSolrCLIRunExample_CBEBEECC579C6C71-001/tempDir-002/node1/testCloudExamplePrompt1_shard1_replica_n2/../../../../dist filtered by solr-cell-\d.*\.jar to classpath: /export/home/jenkins/workspace/Lucene-Solr-master-Solaris/solr/build/solr-core/test/J1/temp/solr.util.TestSolrCLIRunExample_CBEBEECC579C6C71-001/tempDir-002/node1/testCloudExamplePrompt1_shard1_replica_n2/../../../../dist
   [junit4]   2> 3995307 WARN  (qtp1005567289-41528) [n:localhost:64804_solr c:testCloudExamplePrompt1 s:shard1 r:core_node3 x:testCloudExamplePrompt1_shard1_replica_n1] o.a.s.c.SolrConfig Couldn't add files from /export/home/jenkins/workspace/Lucene-Solr-master-Solaris/solr/build/solr-core/test/J1/temp/solr.util.TestSolrCLIRunExample_CBEBEECC579C6C71-001/tempDir-002/node1/testCloudExamplePrompt1_shard1_replica_n1/../../../../dist filtered by solr-velocity-\d.*\.jar to classpath: /export/home/jenkins/workspace/Lucene-Solr-master-Solaris/solr/build/solr-core/test/J1/temp/solr.util.TestSolrCLIRunExample_CBEBEECC579C6C71-001/tempDir-002/node1/testCloudExamplePrompt1_shard1_replica_n1/../../../../dist
   [junit4]   2> 3995308 WARN  (qtp1005567289-41528) [n:localhost:64804_solr c:testCloudExamplePrompt1 s:shard1 r:core_node3 x:testCloudExamplePrompt1_shard1_replica_n1] o.a.s.c.SolrConfig Couldn't add files from /export/home/jenkins/workspace/Lucene-Solr-master-Solaris/solr/build/solr-core/test/J1/temp/solr.util.TestSolrCLIRunExample_CBEBEECC579C6C71-001/tempDir-002/node1/testCloudExamplePrompt1_shard1_replica_n1/../../../../dist filtered by solr-ltr-\d.*\.jar to classpath: /export/home/jenkins/workspace/Lucene-Solr-master-Solaris/solr/build/solr-core/test/J1/temp/solr.util.TestSolrCLIRunExample_CBEBEECC579C6C71-001/tempDir-002/node1/testCloudExamplePrompt1_shard1_replica_n1/../../../../dist
   [junit4]   2> 3995308 WARN  (qtp1005567289-41530) [n:localhost:64804_solr c:testCloudExamplePrompt1 s:shard1 r:core_node5 x:testCloudExamplePrompt1_shard1_replica_n2] o.a.s.c.SolrConfig Couldn't add files from /export/home/jenkins/workspace/Lucene-Solr-master-Solaris/solr/build/solr-core/test/J1/temp/solr.util.TestSolrCLIRunExample_CBEBEECC579C6C71-001/tempDir-002/node1/testCloudExamplePrompt1_shard1_replica_n2/../../../../contrib/clustering/lib filtered by .*\.jar to classpath: /export/home/jenkins/workspace/Lucene-Solr-master-Solaris/solr/build/solr-core/test/J1/temp/solr.util.TestSolrCLIRunExample_CBEBEECC579C6C71-001/tempDir-002/node1/testCloudExamplePrompt1_shard1_replica_n2/../../../../contrib/clustering/lib
   [junit4]   2> 3995308 WARN  (qtp1005567289-41530) [n:localhost:64804_solr c:testCloudExamplePrompt1 s:shard1 r:core_node5 x:testCloudExamplePrompt1_shard1_replica_n2] o.a.s.c.SolrConfig Couldn't add files from /export/home/jenkins/workspace/Lucene-Solr-master-Solaris/solr/build/solr-core/test/J1/temp/solr.util.TestSolrCLIRunExample_CBEBEECC579C6C71-001/tempDir-002/node1/testCloudExamplePrompt1_shard1_replica_n2/../../../../dist filtered by solr-clustering-\d.*\.jar to classpath: /export/home/jenkins/workspace/Lucene-Solr-master-Solaris/solr/build/solr-core/test/J1/temp/solr.util.TestSolrCLIRunExample_CBEBEECC579C6C71-001/tempDir-002/node1/testCloudExamplePrompt1_shard1_replica_n2/../../../../dist
   [junit4]   2> 3995308 WARN  (qtp1005567289-41530) [n:localhost:64804_solr c:testCloudExamplePrompt1 s:shard1 r:core_node5 x:testCloudExamplePrompt1_shard1_replica_n2] o.a.s.c.SolrConfig Couldn't add files from /export/home/jenkins/workspace/Lucene-Solr-master-Solaris/solr/build/solr-core/test/J1/temp/solr.util.TestSolrCLIRunExample_CBEBEECC579C6C71-001/tempDir-002/node1/testCloudExamplePrompt1_shard1_replica_n2/../../../../contrib/langid/lib filtered by .*\.jar to classpath: /export/home/jenkins/workspace/Lucene-Solr-master-Solaris/solr/build/solr-core/test/J1/temp/solr.util.TestSolrCLIRunExample_CBEBEECC579C6C71-001/tempDir-002/node1/testCloudExamplePrompt1_shard1_replica_n2/../../../../contrib/langid/lib
   [junit4]   2> 3995308 WARN  (qtp1005567289-41530) [n:localhost:64804_solr c:testCloudExamplePrompt1 s:shard1 r:core_node5 x:testCloudExamplePrompt1_shard1_replica_n2] o.a.s.c.SolrConfig Couldn't add files from /export/home/jenkins/workspace/Lucene-Solr-master-Solaris/solr/build/solr-core/test/J1/temp/solr.util.TestSolrCLIRunExample_CBEBEECC579C6C71-001/tempDir-002/node1/testCloudExamplePrompt1_shard1_replica_n2/../../../../dist filtered by solr-langid-\d.*\.jar to classpath: /export/home/jenkins/workspace/Lucene-Solr-master-Solaris/solr/build/solr-core/test/J1/temp/solr.util.TestSolrCLIRunExample_CBEBEECC579C6C71-001/tempDir-002/node1/testCloudExamplePrompt1_shard1_replica_n2/../../../../dist
   [junit4]   2> 3995308 WARN  (qtp1005567289-41529) [n:localhost:64804_solr c:testCloudExamplePrompt1 s:shard2 r:core_node7 x:testCloudExamplePrompt1_shard2_replica_n4] o.a.s.c.SolrConfig Couldn't add files from /export/home/jenkins/workspace/Lucene-Solr-master-Solaris/solr/build/solr-core/test/J1/temp/solr.util.TestSolrCLIRunExample_CBEBEECC579C6C71-001/tempDir-002/node1/testCloudExamplePrompt1_shard2_replica_n4/../../../../contrib/extraction/lib filtered by .*\.jar to classpath: /export/home/jenkins/workspace/Lucene-Solr-master-Solaris/solr/build/solr-core/test/J1/temp/solr.util.TestSolrCLIRunExample_CBEBEECC579C6C71-001/tempDir-002/node1/testCloudExamplePrompt1_shard2_replica_n4/../../../../contrib/extraction/lib
   [junit4]   2> 3995308 WARN  (qtp1005567289-41530) [n:localhost:64804_solr c:testCloudExamplePrompt1 s:shard1 r:core_node5 x:testCloudExamplePrompt1_shard1_replica_n2] o.a.s.c.SolrConfig Couldn't add files from /export/home/jenkins/workspace/Lucene-Solr-master-Solaris/solr/build/solr-core/test/J1/temp/solr.util.TestSolrCLIRunExample_CBEBEECC579C6C71-001/tempDir-002/node1/testCloudExamplePrompt1_shard1_replica_n2/../../../../contrib/velocity/lib filtered by .*\.jar to classpath: /export/home/jenkins/workspace/Lucene-Solr-master-Solaris/solr/build/solr-core/test/J1/temp/solr.util.TestSolrCLIRunExample_CBEBEECC579C6C71-001/tempDir-002/node1/testCloudExamplePrompt1_shard1_replica_n2/../../../../contrib/velocity/lib
   [junit4]   2> 3995309 WARN  (qtp1005567289-41529) [n:localhost:64804_solr c:testCloudExamplePrompt1 s:shard2 r:core_node7 x:testCloudExamplePrompt1_shard2_replica_n4] o.a.s.c.SolrConfig Couldn't add files from /export/home/jenkins/workspace/Lucene-Solr-master-Solaris/solr/build/solr-core/test/J1/temp/solr.util.TestSolrCLIRunExample_CBEBEECC579C6C71-001/tempDir-002/node1/testCloudExamplePrompt1_shard2_replica_n4/../../../../dist filtered by solr-cell-\d.*\.jar to classpath: /export/home/jenkins/workspace/Lucene-Solr-master-Solaris/solr/build/solr-core/test/J1/temp/solr.util.TestSolrCLIRunExample_CBEBEECC579C6C71-001/tempDir-002/node1/testCloudExamplePrompt1_shard2_replica_n4/../../../../dist
   [junit4]   2> 3995309 WARN  (qtp1005567289-41530) [n:localhost:64804_solr c:testCloudExamplePrompt1 s:shard1 r:core_node5 x:testCloudExamplePrompt1_shard1_replica_n2] o.a.s.c.SolrConfig Couldn't add files from /export/home/jenkins/workspace/Lucene-Solr-master-Solaris/solr/build/solr-core/test/J1/temp/solr.util.TestSolrCLIRunExample_CBEBEECC579C6C71-001/tempDir-002/node1/testCloudExamplePrompt1_shard1_replica_n2/../../../../dist filtered by solr-velocity-\d.*\.jar to classpath: /export/home/jenkins/workspace/Lucene-Solr-master-Solaris/solr/build/solr-core/test/J1/temp/solr.util.TestSolrCLIRunExample_CBEBEECC579C6C71-001/tempDir-002/node1/testCloudExamplePrompt1_shard1_replica_n2/../../../../dist
   [junit4]   2> 3995309 WARN  (qtp1005567289-41530) [n:localhost:64804_solr c:testCloudExamplePrompt1 s:shard1 r:core_node5 x:testCloudExamplePrompt1_shard1_replica_n2] o.a.s.c.SolrConfig Couldn't add files from /export/home/jenkins/workspace/Lucene-Solr-master-Solaris/solr/build/solr-core/test/J1/temp/solr.util.TestSolrCLIRunExample_CBEBEECC579C6C71-001/tempDir-002/node1/testCloudExamplePrompt1_shard1_replica_n2/../../../../dist filtered by solr-ltr-\d.*\.jar to classpath: /export/home/jenkins/workspace/Lucene-Solr-master-Solaris/solr/build/solr-core/test/J1/temp/solr.util.TestSolrCLIRunExample_CBEBEECC579C6C71-001/tempDir-002/node1/testCloudExamplePrompt1_shard1_replica_n2/../../../../dist
   [junit4]   2> 3995309 WARN  (qtp1005567289-41529) [n:localhost:64804_solr c:testCloudExamplePrompt1 s:shard2 r:core_node7 x:testCloudExamplePrompt1_shard2_replica_n4] o.a.s.c.SolrConfig Couldn't add files from /export/home/jenkins/workspace/Lucene-Solr-master-Solaris/solr/build/solr-core/test/J1/temp/solr.util.TestSolrCLIRunExample_CBEBEECC579C6C71-001/tempDir-002/node1/testCloudExamplePrompt1_shard2_replica_n4/../../../../contrib/clustering/lib filtered by .*\.jar to classpath: /export/home/jenkins/workspace/Lucene-Solr-master-Solaris/solr/build/solr-core/test/J1/temp/solr.util.TestSolrCLIRunExample_CBEBEECC579C6C71-001/tempDir-002/node1/testCloudExamplePrompt1_shard2_replica_n4/../../../../contrib/clustering/lib
   [junit4]   2> 3995309 WARN  (qtp1005567289-41529) [n:localhost:64804_solr c:testCloudExamplePrompt1 s:shard2 r:core_node7 x:testCloudExamplePrompt1_shard2_replica_n4] o.a.s.c.SolrConfig Couldn't add files from /export/home/jenkins/workspace/Lucene-Solr-master-Solaris/solr/build/solr-core/test/J1/temp/solr.util.TestSolrCLIRunExample_CBEBEECC579C6C71-001/tempDir-002/node1/testCloudExamplePrompt1_shard2_replica_n4/../../../../dist filtered by solr-clustering-\d.*\.jar to classpath: /export/home/jenkins/workspace/Lucene-Solr-master-Solaris/solr/build/solr-core/test/J1/temp/solr.util.TestSolrCLIRunExample_CBEBEECC579C6C71-001/tempDir-002/node1/testCloudExamplePrompt1_shard2_replica_n4/../../../../dist
   [junit4]   2> 3995309 WARN  (qtp1005567289-41529) [n:localhost:64804_solr c:testCloudExamplePrompt1 s:shard2 r:core_node7 x:testCloudExamplePrompt1_shard2_replica_n4] o.a.s.c.SolrConfig Couldn't add files from /export/home/jenkins/workspace/Lucene-Solr-master-Solaris/solr/build/solr-core/test/J1/temp/solr.util.TestSolrCLIRunExample_CBEBEECC579C6C71-001/tempDir-002/node1/testCloudExamplePrompt1_shard2_replica_n4/../../../../contrib/langid/lib filtered by .*\.jar to classpath: /export/home/jenkins/workspace/Lucene-Solr-master-Solaris/solr/build/solr-core/test/J1/temp/solr.util.TestSolrCLIRunExample_CBEBEECC579C6C71-001/tempDir-002/node1/testCloudExamplePrompt1_shard2_replica_n4/../../../../contrib/langid/lib
   [junit4]   2> 3995309 WARN  (qtp1005567289-41529) [n:localhost:64804_solr c:testCloudExamplePrompt1 s:shard2 r:core_node7 x:testCloudExamplePrompt1_shard2_replica_n4] o.a.s.c.SolrConfig Couldn't add files from /export/home/jenkins/workspace/Lucene-Solr-master-Solaris/solr/build/solr-core/test/J1/temp/solr.util.TestSolrCLIRunExample_CBEBEECC579C6C71-001/tempDir-002/node1/testCloudExamplePrompt1_shard2_replica_n4/../../../../dist filtered by solr-langid-\d.*\.jar to classpath: /export/home/jenkins/workspace/Lucene-Solr-master-Solaris/solr/build/solr-core/test/J1/temp/solr.util.TestSolrCLIRunExample_CBEBEECC579C6C71-001/tempDir-002/node1/testCloudExamplePrompt1_shard2_replica_n4/../../../../dist
   [junit4]   2> 3995309 WARN  (qtp1005567289-41529) [n:localhost:64804_solr c:testCloudExamplePrompt1 s:shard2 r:core_node7 x:testCloudExamplePrompt1_shard2_replica_n4] o.a.s.c.SolrConfig Couldn't add files from /export/home/jenkins/workspace/Lucene-Solr-master-Solaris/solr/build/solr-core/test/J1/temp/solr.util.TestSolrCLIRunExample_CBEBEECC579C6C71-001/tempDir-002/node1/testCloudExamplePrompt1_shard2_replica_n4/../../../../contrib/velocity/lib filtered by .*\.jar to classpath: /export/home/jenkins/workspace/Lucene-Solr-master-Solaris/solr/build/solr-core/test/J1/temp/solr.util.TestSolrCLIRunExample_CBEBEECC579C6C71-001/tempDir-002/node1/testCloudExamplePrompt1_shard2_replica_n4/../../../../contrib/velocity/lib
   [junit4]   2> 3995310 WARN  (qtp1005567289-41529) [n:localhost:64804_solr c:testCloudExamplePrompt1 s:shard2 r:core_node7 x:testCloudExamplePrompt1_shard2_replica_n4] o.a.s.c.SolrConfig Couldn't add files from /export/home/jenkins/workspace/Lucene-Solr-master-Solaris/solr/build/solr-core/test/J1/temp/solr.util.TestSolrCLIRunExample_CBEBEECC579C6C71-001/tempDir-002/node1/testCloudExamplePrompt1_shard2_replica_n4/../../../../dist filtered by solr-velocity-\d.*\.jar to classpath: /export/home/jenkins/workspace/Lucene-Solr-master-Solaris/solr/build/solr-core/test/J1/temp/solr.util.TestSolrCLIRunExample_CBEBEECC579C6C71-001/tempDir-002/node1/testCloudExamplePrompt1_shard2_replica_n4/../../../../dist
   [junit4]   2> 3995310 WARN  (qtp1005567289-41529) [n:localhost:64804_solr c:testCloudExamplePrompt1 s:shard2 r:core_node7 x:testCloudExamplePrompt1_shard2_replica_n4] o.a.s.c.SolrConfig Couldn't add files from /export/home/jenkins/workspace/Lucene-Solr-master-Solaris/solr/build/solr-core/test/J1/temp/solr.util.TestSolrCLIRunExample_CBEBEECC579C6C71-001/tempDir-002/node1/testCloudExamplePrompt1_shard2_replica_n4/../../../../dist filtered by solr-ltr-\d.*\.jar to classpath: /export/home/jenkins/workspace/Lucene-Solr-master-Solaris/solr/build/solr-core/test/J1/temp/solr.util.TestSolrCLIRunExample_CBEBEECC579C6C71-001/tempDir-002/node1/testCloudExamplePrompt1_shard2_replica_n4/../../../../dist
   [junit4]   2> 3995311 WARN  (qtp1005567289-41531) [n:localhost:64804_solr c:testCloudExamplePrompt1 s:shard2 r:core_node8 x:testCloudExamplePrompt1_shard2_replica_n6] o.a.s.c.SolrConfig Couldn't add files from /export/home/jenkins/workspace/Lucene-Solr-master-Solaris/solr/build/solr-core/test/J1/temp/solr.util.TestSolrCLIRunExample_CBEBEECC579C6C71-001/tempDir-002/node1/testCloudExamplePrompt1_shard2_replica_n6/../../../../contrib/extraction/lib filtered by .*\.jar to classpath: /export/home/jenkins/workspace/Lucene-Solr-master-Solaris/solr/build/solr-core/test/J1/temp/solr.util.TestSolrCLIRunExample_CBEBEECC579C6C71-001/tempDir-002/node1/testCloudExamplePrompt1_shard2_replica_n6/../../../../contrib/extraction/lib
   [junit4]   2> 3995311 WARN  (qtp1005567289-41531) [n:localhost:64804_solr c:testCloudExamplePrompt1 s:shard2 r:core_node8 x:testCloudExamplePrompt1_shard2_replica_n6] o.a.s.c.SolrConfig Couldn't add files from /export/home/jenkins/workspace/Lucene-Solr-master-Solaris/solr/build/solr-core/test/J1/temp/solr.util.TestSolrCLIRunExample_CBEBEECC579C6C71-001/tempDir-002/node1/testCloudExamplePrompt1_shard2_replica_n6/../../../../dist filtered by solr-cell-\d.*\.jar to classpath: /export/home/jenkins/workspace/Lucene-Solr-master-Solaris/solr/build/solr-core/test/J1/temp/solr.util.TestSolrCLIRunExample_CBEBEECC579C6C71-001/tempDir-002/node1/testCloudExamplePrompt1_shard2_replica_n6/../../../../dist
   [junit4]   2> 3995311 WARN  (qtp1005567289-41531) [n:localhost:64804_solr c:testCloudExamplePrompt1 s:shard2 r:core_node8 x:testCloudExamplePrompt1_shard2_replica_n6] o.a.s.c.SolrConfig Couldn't add files from /export/home/jenkins/workspace/Lucene-Solr-master-Solaris/solr/build/solr-core/test/J1/temp/solr.util.TestSolrCLIRunExample_CBEBEECC579C6C71-001/tempDir-002/node1/testCloudExamplePrompt1_shard2_replica_n6/../../../../contrib/clustering/lib filtered by .*\.jar to classpath: /export/home/jenkins/workspace/Lucene-Solr-master-Solaris/solr/build/solr-core/test/J1/temp/solr.util.TestSolrCLIRunExample_CBEBEECC579C6C71-001/tempDir-002/node1/testCloudExamplePrompt1_shard2_replica_n6/../../../../contrib/clustering/lib
   [junit4]   2> 3995311 WARN  (qtp1005567289-41531) [n:localhost:64804_solr c:testCloudExamplePrompt1 s:shard2 r:core_node8 x:testCloudExamplePrompt1_shard2_replica_n6] o.a.s.c.SolrConfig Couldn't add files from /export/home/jenkins/workspace/Lucene-Solr-master-Solaris/solr/build/solr-core/test/J1/temp/solr.util.TestSolrCLIRunExample_CBEBEECC579C6C71-001/tempDir-002/node1/testCloudExamplePrompt1_shard2_replica_n6/../../../../dist filtered by solr-clustering-\d.*\.jar to classpath: /export/home/jenkins/workspace/Lucene-Solr-master-Solaris/solr/build/solr-core/test/J1/temp/solr.util.TestSolrCLIRunExample_CBEBEECC579C6C71-001/tempDir-002/node1/testCloudExamplePrompt1_shard2_replica_n6/../../../../dist
   [junit4]   2> 3995311 WARN  (qtp1005567289-41531) [n:localhost:64804_solr c:testCloudExamplePrompt1 s:shard2 r:core_node8 x:testCloudExamplePrompt1_shard2_replica_n6] o.a.s.c.SolrConfig Couldn't add files from /export/home/jenkins/workspace/Lucene-Solr-master-Solaris/solr/build/solr-core/test/J1/temp/solr.util.TestSolrCLIRunExample_CBEBEECC579C6C71-001/tempDir-002/node1/testCloudExamplePrompt1_shard2_replica_n6/../../../../contrib/langid/lib filtered by .*\.jar to classpath: /export/home/jenkins/workspace/Lucene-Solr-master-Solaris/solr/build/solr-core/test/J1/temp/solr.util.TestSolrCLIRunExample_CBEBEECC579C6C71-001/tempDir-002/node1/testCloudExamplePrompt1_shard2_replica_n6/../../../../contrib/langid/lib
   [junit4]   2> 3995311 WARN  (qtp1005567289-41531) [n:localhost:64804_solr c:testCloudExamplePrompt1 s:shard2 r:core_node8 x:testCloudExamplePrompt1_shard2_replica_n6] o.a.s.c.SolrConfig Couldn't add files from /export/home/jenkins/workspace/Lucene-Solr-master-Solaris/solr/build/solr-core/test/J1/temp/solr.util.TestSolrCLIRunExample_CBEBEECC579C6C71-001/tempDir-002/node1/testCloudExamplePrompt1_shard2_replica_n6/../../../../dist filtered by solr-langid-\d.*\.jar to classpath: /export/home/jenkins/workspace/Lucene-Solr-master-Solaris/solr/build/solr-core/test/J1/temp/solr.util.TestSolrCLIRunExample_CBEBEECC579C6C71-001/tempDir-002/node1/testCloudExamplePrompt1_shard2_replica_n6/../../../../dist
   [junit4]   2> 3995312 WARN  (qtp1005567289-41531) [n:localhost:64804_solr c:testCloudExamplePrompt1 s:shard2 r:core_node8 x:testCloudExamplePrompt1_shard2_replica_n6] o.a.s.c.SolrConfig Couldn't add files from /export/home/jenkins/workspace/Lucene-Solr-master-Solaris/solr/build/solr-core/test/J1/temp/solr.util.TestSolrCLIRunExample_CBEBEECC579C6C71-001/tempDir-002/node1/testCloudExamplePrompt1_shard2_replica_n6/../../../../contrib/velocity/lib filtered by .*\.jar to classpath: /export/home/jenkins/workspace/Lucene-Solr-master-Solaris/solr/build/solr-core/test/J1/temp/solr.util.TestSolrCLIRunExample_CBEBEECC579C6C71-001/tempDir-002/node1/testCloudExamplePrompt1_shard2_replica_n6/../../../../contrib/velocity/lib
   [junit4]   2> 3995312 WARN  (qtp1005567289-41531) [n:localhost:64804_solr c:testCloudExamplePrompt1 s:shard2 r:core_node8 x:testCloudExamplePrompt1_shard2_replica_n6] o.a.s.c.SolrConfig Couldn't add files from /export/home/jenkins/workspace/Lucene-Solr-master-Solaris/solr/build/solr-core/test/J1/temp/solr.util.TestSolrCLIRunExample_CBEBEECC579C6C71-001/tempDir-002/node1/testCloudExamplePrompt1_shard2_replica_n6/../../../../dist filtered by solr-velocity-\d.*\.jar to classpath: /export/home/jenkins/workspace/Lucene-Solr-master-Solaris/solr/build/solr-core/test/J1/temp/solr.util.TestSolrCLIRunExample_CBEBEECC579C6C71-001/tempDir-002/node1/testCloudExamplePrompt1_shard2_replica_n6/../../../../dist
   [junit4]   2> 3995312 WARN  (qtp1005567289-41531) [n:localhost:64804_solr c:testCloudExamplePrompt1 s:shard2 r:core_node8 x:testCloudExamplePrompt1_shard2_replica_n6] o.a.s.c.SolrConfig Couldn't add files from /export/home/jenkins/workspace/Lucene-Solr-master-Solaris/solr/build/solr-core/test/J1/temp/solr.util.TestSolrCLIRunExample_CBEBEECC579C6C71-001/tempDir-002/node1/testCloudExamplePrompt1_shard2_replica_n6/../../../../dist filtered by solr-ltr-\d.*\.jar to classpath: /export/home/jenkins/workspace/Lucene-Solr-master-Solaris/solr/build/solr-core/test/J1/temp/solr.util.TestSolrCLIRunExample_CBEBEECC579C6C71-001/tempDir-002/node1/testCloudExamplePrompt1_shard2_replica_n6/../../../../dist
   [junit4]   2> 3995881 INFO  (qtp1005567289-41531) [n:localhost:64804_solr c:testCloudExamplePrompt1 s:shard2 r:core_node8 x:testCloudExamplePrompt1_shard2_replica_n6] o.a.s.c.ZkShardTerms Successful update of terms at /collections/testCloudExamplePrompt1/terms/shard2 to Terms{values={core_node8=0}, version=0}
   [junit4]   2> 3995885 INFO  (qtp1005567289-41528) [n:localhost:64804_solr c:testCloudExamplePrompt1 s:shard1 r:core_node3 x:testCloudExamplePrompt1_shard1_replica_n1] o.a.s.c.ZkShardTerms Failed to save terms, version is not a match, retrying
   [junit4]   2> 3995885 INFO  (qtp1005567289-41530) [n:localhost:64804_solr c:testCloudExamplePrompt1 s:shard1 r:core_node5 x:testCloudExamplePrompt1_shard1_replica_n2] o.a.s.c.ZkShardTerms Successful update of terms at /collections/testCloudExamplePrompt1/terms/shard1 to Terms{values={core_node5=0}, version=0}
   [junit4]   2> 3995887 INFO  (qtp1005567289-41528) [n:localhost:64804_solr c:testCloudExamplePrompt1 s:shard1 r:core_node3 x:testCloudExamplePrompt1_shard1_replica_n1] o.a.s.c.ZkShardTerms Successful update of terms at /collections/testCloudExamplePrompt1/terms/shard1 to Terms{values={core_node3=0, core_node5=0}, version=1}
   [junit4]   2> 3995894 INFO  (qtp1005567289-41531) [n:localhost:64804_solr c:testCloudExamplePrompt1 s:shard2 r:core_node8 x:testCloudExamplePrompt1_shard2_replica_n6] o.a.s.c.ShardLeaderElectionContext Waiting until we see more replicas up for shard shard2: total=2 found=1 timeoutin=179998ms
   [junit4]   2> 3995903 INFO  (qtp1005567289-41530) [n:localhost:64804_solr c:testCloudExamplePrompt1 s:shard1 r:core_node5 x:testCloudExamplePrompt1_shard1_replica_n2] o.a.s.c.ShardLeaderElectionContext Enough replicas found to continue.
   [junit4]   2> 3995903 INFO  (qtp1005567289-41530) [n:localhost:64804_solr c:testCloudExamplePrompt1 s:shard1 r:core_node5 x:testCloudExamplePrompt1_shard1_replica_n2] o.a.s.c.ShardLeaderElectionContext I may be the new leader - try and sync
   [junit4]   2> 3995903 INFO  (qtp1005567289-41530) [n:localhost:64804_solr c:testCloudExamplePrompt1 s:shard1 r:core_node5 x:testCloudExamplePrompt1_shard1_replica_n2] o.a.s.c.SyncStrategy Sync replicas to http://localhost:64804/solr/testCloudExamplePrompt1_shard1_replica_n2/
   [junit4]   2> 3995906 INFO  (qtp1005567289-41530) [n:localhost:64804_solr c:testCloudExamplePrompt1 s:shard1 r:core_node5 x:testCloudExamplePrompt1_shard1_replica_n2] o.a.s.c.SyncStrategy Leader's attempt to sync with shard failed, moving to the next candidate
   [junit4]   2> 3995906 INFO  (qtp1005567289-41530) [n:localhost:64804_solr c:testCloudExamplePrompt1 s:shard1 r:core_node5 x:testCloudExamplePrompt1_shard1_replica_n2] o.a.s.c.ShardLeaderElectionContext We failed sync, but we have no versions - we can't sync in that case - we were active before, so become leader anyway
   [junit4]   2> 3995906 INFO  (qtp1005567289-41530) [n:localhost:64804_solr c:testCloudExamplePrompt1 s:shard1 r:core_node5 x:testCloudExamplePrompt1_shard1_replica_n2] o.a.s.c.ShardLeaderElectionContext Found all replicas participating in election, clear LIR
   [junit4]   2> 3995913 INFO  (qtp1005567289-41530) [n:localhost:64804_solr c:testCloudExamplePrompt1 s:shard1 r:core_node5 x:testCloudExamplePrompt1_shard1_replica_n2] o.a.s.c.ShardLeaderElectionContext I am the new leader: http://localhost:64804/solr/testCloudExamplePrompt1_shard1_replica_n2/ shard1
   [junit4]   2> 3995938 INFO  (qtp1005567289-41529) [n:localhost:64804_solr c:testCloudExamplePrompt1 s:shard2 r:core_node7 x:testCloudExamplePrompt1_shard2_replica_n4] o.a.s.c.ZkShardTerms Successful update of terms at /collections/testCloudExamplePrompt1/terms/shard2 to Terms{values={core_node7=0, core_node8=0}, version=1}
   [junit4]   2> 3996068 INFO  (qtp1005567289-41530) [n:localhost:64804_solr c:testCloudExamplePrompt1 s:shard1 r:core_node5 x:testCloudExamplePrompt1_shard1_replica_n2] o.a.s.c.ZkController I am the leader, no recovery necessary
   [junit4]   2> 3996396 INFO  (qtp1005567289-41531) [n:localhost:64804_solr c:testCloudExamplePrompt1 s:shard2 r:core_node8 x:testCloudExamplePrompt1_shard2_replica_n6] o.a.s.c.ShardLeaderElectionContext Enough replicas found to continue.
   [junit4]   2> 3996396 INFO  (qtp1005567289-41531) [n:localhost:64804_solr c:testCloudExamplePrompt1 s:shard2 r:core_node8 x:testCloudExamplePrompt1_shard2_replica_n6] o.a.s.c.ShardLeaderElectionContext I may be the new leader - try and sync
   [junit4]   2> 3996396 INFO  (qtp1005567289-41531) [n:localhost:64804_solr c:testCloudExamplePrompt1 s:shard2 r:core_node8 x:testCloudExamplePrompt1_shard2_replica_n6] o.a.s.c.SyncStrategy Sync replicas to http://localhost:64804/solr/testCloudExamplePrompt1_shard2_replica_n6/
   [junit4]   2> 3996397 INFO  (qtp1005567289-41531) [n:localhost:64804_solr c:testCloudExamplePrompt1 s:shard2 r:core_node8 x:testCloudExamplePrompt1_shard2_replica_n6] o.a.s.c.SyncStrategy Leader's attempt to sync with shard failed, moving to the next candidate
   [junit4]   2> 3996397 INFO  (qtp1005567289-41531) [n:localhost:64804_solr c:testCloudExamplePrompt1 s:shard2 r:core_node8 x:testCloudExamplePrompt1_shard2_replica_n6] o.a.s.c.ShardLeaderElectionContext We failed sync, but we have no versions - we can't sync in that case - we were active before, so become leader anyway
   [junit4]   2> 3996397 INFO  (qtp1005567289-41531) [n:localhost:64804_solr c:testCloudExamplePrompt1 s:shard2 r:core_node8 x:testCloudExamplePrompt1_shard2_replica_n6] o.a.s.c.ShardLeaderElectionContext Found all replicas participating in election, clear LIR
   [junit4]   2> 3996403 INFO  (qtp1005567289-41531) [n:localhost:64804_solr c:testCloudExamplePrompt1 s:shard2 r:core_node8 x:testCloudExamplePrompt1_shard2_replica_n6] o.a.s.c.ShardLeaderElectionContext I am the new leader: http://localhost:64804/solr/testCloudExamplePrompt1_shard2_replica_n6/ shard2
   [junit4]   2> 3996554 INFO  (qtp1005567289-41531) [n:localhost:64804_solr c:testCloudExamplePrompt1 s:shard2 r:core_node8 x:testCloudExamplePrompt1_shard2_replica_n6] o.a.s.c.ZkController I am the leader, no recovery necessary
   [junit4]   2> 3996948 INFO  (qtp1005567289-41533) [n:localhost:64804_solr    ] o.a.s.h.a.CollectionsHandler Wait for new collection to be active for at most 30 seconds. Check all shard replicas
   [junit4]   2> 3997953 INFO  (OverseerCollectionConfigSetProcessor-72483420286550019-localhost:64804_solr-n_0000000000) [    ] o.a.s.c.OverseerTaskQueue Response ZK path: /overseer/collection-queue-work/qnr-0000000000 doesn't exist.  Requestor may have disconnected from ZooKeeper
   [junit4]   2> 3997969 WARN  (Thread-7693) [    ] o.a.s.c.SolrConfig Couldn't add files from /export/home/jenkins/workspace/Lucene-Solr-master-Solaris/solr/build/solr-core/test/J1/temp/solr.util.TestSolrCLIRunExample_CBEBEECC579C6C71-001/tempDir-002/node1/testCloudExamplePrompt1_shard1_replica_n1/../../../../contrib/extraction/lib filtered by .*\.jar to classpath: /export/home/jenkins/workspace/Lucene-Solr-master-Solaris/solr/build/solr-core/test/J1/temp/solr.util.TestSolrCLIRunExample_CBEBEECC579C6C71-001/tempDir-002/node1/testCloudExamplePrompt1_shard1_replica_n1/../../../../contrib/extraction/lib
   [junit4]   2> 3997969 WARN  (Thread-7693) [    ] o.a.s.c.SolrConfig Couldn't add files from /export/home/jenkins/workspace/Lucene-Solr-master-Solaris/solr/build/solr-core/test/J1/temp/solr.util.TestSolrCLIRunExample_CBEBEECC579C6C71-001/tempDir-002/node1/testCloudExamplePrompt1_shard1_replica_n1/../../../../dist filtered by solr-cell-\d.*\.jar to classpath: /export/home/jenkins/workspace/Lucene-Solr-master-Solaris/solr/build/solr-core/test/J1/temp/solr.util.TestSolrCLIRunExample_CBEBEECC579C6C71-001/tempDir-002/node1/testCloudExamplePrompt1_shard1_replica_n1/../../../../dist
   [junit4]   2> 3997969 WARN  (Thread-7693) [    ] o.a.s.c.SolrConfig Couldn't add files from /export/home/jenkins/workspace/Lucene-Solr-master-Solaris/solr/build/solr-core/test/J1/temp/solr.util.TestSolrCLIRunExample_CBEBEECC579C6C71-001/tempDir-002/node1/testCloudExamplePrompt1_shard1_replica_n1/../../../../contrib/clustering/lib filtered by .*\.jar to classpath: /export/home/jenkins/workspace/Lucene-Solr-master-Solaris/solr/build/solr-core/test/J1/temp/solr.util.TestSolrCLIRunExample_CBEBEECC579C6C71-001/tempDir-002/node1/testCloudExamplePrompt1_shard1_replica_n1/../../../../contrib/clustering/lib
   [junit4]   2> 3997969 WARN  (Thread-7693) [    ] o.a.s.c.SolrConfig Couldn't add files from /export/home/jenkins/workspace/Lucene-Solr-master-Solaris/solr/build/solr-core/test/J1/temp/solr.util.TestSolrCLIRunExample_CBEBEECC579C6C71-001/tempDir-002/node1/testCloudExamplePrompt1_shard1_replica_n1/../../../../dist filtered by solr-clustering-\d.*\.jar to classpath: /export/home/jenkins/workspace/Lucene-Solr-master-Solaris/solr/build/solr-core/test/J1/temp/solr.util.TestSolrCLIRunExample_CBEBEECC579C6C71-001/tempDir-002/node1/testCloudExamplePrompt1_shard1_replica_n1/../../../../dist
   [junit4]   2> 3997969 WARN  (Thread-7693) [    ] o.a.s.c.SolrConfig Couldn't add files from /export/home/jenkins/workspace/Lucene-Solr-master-Solaris/solr/build/solr-core/test/J1/temp/solr.util.TestSolrCLIRunExample_CBEBEECC579C6C71-001/tempDir-002/node1/testCloudExamplePrompt1_shard1_replica_n1/../../../../contrib/langid/lib filtered by .*\.jar to classpath: /export/home/jenkins/workspace/Lucene-Solr-master-Solaris/solr/build/solr-core/test/J1/temp/solr.util.TestSolrCLIRunExample_CBEBEECC579C6C71-001/tempDir-002/node1/testCloudExamplePrompt1_shard1_replica_n1/../../../../contrib/langid/lib
   [junit4]   2> 3997969 WARN  (Thread-7693) [    ] o.a.s.c.SolrConfig Couldn't add files from /export/home/jenkins/workspace/Lucene-Solr-master-Solaris/solr/build/solr-core/test/J1/temp/solr.util.TestSolrCLIRunExample_CBEBEECC579C6C71-001/tempDir-002/node1/testCloudExamplePrompt1_shard1_replica_n1/../../../../dist filtered by solr-langid-\d.*\.jar to classpath: /export/home/jenkins/workspace/Lucene-Solr-master-Solaris/solr/build/solr-core/test/J1/temp/solr.util.TestSolrCLIRunExample_CBEBEECC579C6C71-001/tempDir-002/node1/testCloudExamplePrompt1_shard1_replica_n1/../../../../dist
   [junit4]   2> 3997970 WARN  (Thread-7693) [    ] o.a.s.c.SolrConfig Couldn't add files from /export/home/jenkins/workspace/Lucene-Solr-master-Solaris/solr/build/solr-core/test/J1/temp/solr.util.TestSolrCLIRunExample_CBEBEECC579C6C71-001/tempDir-002/node1/testCloudExamplePrompt1_shard1_replica_n1/../../../../contrib/velocity/lib filtered by .*\.jar to classpath: /export/home/jenkins/workspace/Lucene-Solr-master-Solaris/solr/build/solr-core/test/J1/temp/solr.util.TestSolrCLIRunExample_CBEBEECC579C6C71-001/tempDir-002/node1/testCloudExamplePrompt1_shard1_replica_n1/../../../../contrib/velocity/lib
   [junit4]   2> 3997970 WARN  (Thread-7693) [    ] o.a.s.c.SolrConfig Couldn't add files from /export/home/jenkins/workspace/Lucene-Solr-master-Solaris/solr/build/solr-core/test/J1/temp/solr.util.TestSolrCLIRunExample_CBEBEECC579C6C71-001/tempDir-002/node1/testCloudExamplePrompt1_shard1_replica_n1/../../../../dist filtered by solr-velocity-\d.*\.jar to classpath: /export/home/jenkins/workspace/Lucene-Solr-master-Solaris/solr/build/solr-core/test/J1/temp/solr.util.TestSolrCLIRunExample_CBEBEECC579C6C71-001/tempDir-002/node1/testCloudExamplePrompt1_shard1_replica_n1/../../../..

[...truncated too long message...]

	|                  |            modules            ||   artifacts   |
	|       conf       | number| search|dwnlded|evicted|| number|dwnlded|
	---------------------------------------------------------------------
	|      default     |   1   |   0   |   0   |   0   ||   1   |   0   |
	---------------------------------------------------------------------

-init-totals:

-test:
    [mkdir] Created dir: /export/home/jenkins/workspace/Lucene-Solr-master-Solaris/solr/build/solr-core/test
[junit4:pickseed] Seed property 'tests.seed' already defined: CBEBEECC579C6C71
    [mkdir] Created dir: /export/home/jenkins/workspace/Lucene-Solr-master-Solaris/solr/build/solr-core/test/temp
   [junit4] <JUnit4> says ¡Hola! Master seed: CBEBEECC579C6C71
   [junit4] Executing 5 suites with 2 JVMs.
   [junit4] 
   [junit4] Started J1 PID(20915@serv1-vm3).
   [junit4] Started J0 PID(20914@serv1-vm3).
   [junit4] Suite: org.apache.solr.util.TestSolrCLIRunExample
   [junit4] OK      23.6s J1 | TestSolrCLIRunExample.testInteractiveSolrCloudExampleWithAutoScalingPolicy
   [junit4] OK      5.71s J1 | TestSolrCLIRunExample.testTechproductsExample
   [junit4] OK      9.31s J1 | TestSolrCLIRunExample.testInteractiveSolrCloudExample
   [junit4] OK      0.05s J1 | TestSolrCLIRunExample.testFailExecuteScript
   [junit4] OK      10.9s J1 | TestSolrCLIRunExample.testSchemalessExample
   [junit4] Completed [1/5] on J1 in 51.97s, 5 tests
   [junit4] 
   [junit4] Suite: org.apache.solr.util.TestSolrCLIRunExample
   [junit4] OK      22.3s J0 | TestSolrCLIRunExample.testInteractiveSolrCloudExampleWithAutoScalingPolicy
   [junit4] OK      12.3s J0 | TestSolrCLIRunExample.testTechproductsExample
   [junit4] OK      10.8s J0 | TestSolrCLIRunExample.testInteractiveSolrCloudExample
   [junit4] OK      0.01s J0 | TestSolrCLIRunExample.testFailExecuteScript
   [junit4] OK      10.7s J0 | TestSolrCLIRunExample.testSchemalessExample
   [junit4] Completed [2/5] on J0 in 58.51s, 5 tests
   [junit4] 
   [junit4] Duplicate suite name used with XML reports: org.apache.solr.util.TestSolrCLIRunExample. This may confuse tools that process XML reports. Set 'ignoreDuplicateSuites' to true to skip this message.
   [junit4] Suite: org.apache.solr.util.TestSolrCLIRunExample
   [junit4] OK      14.8s J0 | TestSolrCLIRunExample.testInteractiveSolrCloudExampleWithAutoScalingPolicy
   [junit4] OK      8.77s J0 | TestSolrCLIRunExample.testTechproductsExample
   [junit4] OK      11.4s J0 | TestSolrCLIRunExample.testInteractiveSolrCloudExample
   [junit4] OK      0.01s J0 | TestSolrCLIRunExample.testFailExecuteScript
   [junit4] OK      2.54s J0 | TestSolrCLIRunExample.testSchemalessExample
   [junit4] Completed [3/5] on J0 in 37.54s, 5 tests
   [junit4] 
   [junit4] Suite: org.apache.solr.util.TestSolrCLIRunExample
   [junit4] OK      14.5s J1 | TestSolrCLIRunExample.testInteractiveSolrCloudExampleWithAutoScalingPolicy
   [junit4] OK      14.7s J1 | TestSolrCLIRunExample.testTechproductsExample
   [junit4] OK      11.4s J1 | TestSolrCLIRunExample.testInteractiveSolrCloudExample
   [junit4] OK      0.01s J1 | TestSolrCLIRunExample.testFailExecuteScript
   [junit4] OK      6.31s J1 | TestSolrCLIRunExample.testSchemalessExample
   [junit4] Completed [4/5] on J1 in 46.98s, 5 tests
   [junit4] 
   [junit4] Suite: org.apache.solr.util.TestSolrCLIRunExample
   [junit4] OK      12.2s J0 | TestSolrCLIRunExample.testInteractiveSolrCloudExampleWithAutoScalingPolicy
   [junit4] OK      7.16s J0 | TestSolrCLIRunExample.testTechproductsExample
   [junit4] OK      7.64s J0 | TestSolrCLIRunExample.testInteractiveSolrCloudExample
   [junit4] OK      0.01s J0 | TestSolrCLIRunExample.testFailExecuteScript
   [junit4] OK      10.5s J0 | TestSolrCLIRunExample.testSchemalessExample
   [junit4] Completed [5/5] on J0 in 37.52s, 5 tests
   [junit4] 
   [junit4] JVM J0:     0.69 ..   135.45 =   134.75s
   [junit4] JVM J1:     0.69 ..   101.10 =   100.41s
   [junit4] Execution time total: 2 minutes 15 seconds
   [junit4] Tests summary: 5 suites, 25 tests
   [junit4] Could not remove temporary path: /export/home/jenkins/workspace/Lucene-Solr-master-Solaris/solr/build/solr-core/test/J0 (java.nio.file.DirectoryNotEmptyException: Remaining files: [/export/home/jenkins/workspace/Lucene-Solr-master-Solaris/solr/build/solr-core/test/J0/temp])
   [junit4] Could not remove temporary path: /export/home/jenkins/workspace/Lucene-Solr-master-Solaris/solr/build/solr-core/test/J1 (java.nio.file.DirectoryNotEmptyException: Remaining files: [/export/home/jenkins/workspace/Lucene-Solr-master-Solaris/solr/build/solr-core/test/J1/temp])
     [echo] 5 slowest tests:
[junit4:tophints] 120.04s | org.apache.solr.cloud.TestTlogReplica
[junit4:tophints] 117.00s | org.apache.solr.update.SoftAutoCommitTest
[junit4:tophints] 115.56s | org.apache.solr.cloud.ZkFailoverTest
[junit4:tophints] 114.92s | org.apache.solr.cloud.DeleteReplicaTest
[junit4:tophints] 114.02s | org.apache.solr.cloud.MoveReplicaHDFSTest

-check-totals:

test-nocompile:

BUILD SUCCESSFUL
Total time: 2 minutes 18 seconds
[repro] Failures:
[repro]   0/5 failed: org.apache.solr.util.TestSolrCLIRunExample
[repro] Exiting with code 0
+ mv lucene/build lucene/build.repro
+ mv solr/build solr/build.repro
+ mv lucene/build.orig lucene/build
+ mv solr/build.orig solr/build
Archiving artifacts
Setting ANT_1_8_2_HOME=/export/home/jenkins/tools/hudson.tasks.Ant_AntInstallation/ANT_1.8.2
java.lang.InterruptedException: no matches found within 10000
	at hudson.FilePath$ValidateAntFileMask.hasMatch(FilePath.java:2843)
	at hudson.FilePath$ValidateAntFileMask.invoke(FilePath.java:2722)
	at hudson.FilePath$ValidateAntFileMask.invoke(FilePath.java:2703)
	at hudson.FilePath$FileCallableWrapper.call(FilePath.java:3082)
Also:   hudson.remoting.Channel$CallSiteStackTrace: Remote call to Solaris VBOX
		at hudson.remoting.Channel.attachCallSiteStackTrace(Channel.java:1741)
		at hudson.remoting.UserRequest$ExceptionResponse.retrieve(UserRequest.java:357)
		at hudson.remoting.Channel.call(Channel.java:955)
		at hudson.FilePath.act(FilePath.java:1089)
		at hudson.FilePath.act(FilePath.java:1078)
		at hudson.FilePath.validateAntFileMask(FilePath.java:2701)
		at hudson.tasks.ArtifactArchiver.perform(ArtifactArchiver.java:243)
		at hudson.tasks.BuildStepCompatibilityLayer.perform(BuildStepCompatibilityLayer.java:81)
		at hudson.tasks.BuildStepMonitor$1.perform(BuildStepMonitor.java:20)
		at hudson.model.AbstractBuild$AbstractBuildExecution.perform(AbstractBuild.java:744)
		at hudson.model.AbstractBuild$AbstractBuildExecution.performAllBuildSteps(AbstractBuild.java:690)
		at hudson.model.Build$BuildExecution.post2(Build.java:186)
		at hudson.model.AbstractBuild$AbstractBuildExecution.post(AbstractBuild.java:635)
		at hudson.model.Run.execute(Run.java:1840)
		at hudson.model.FreeStyleBuild.run(FreeStyleBuild.java:43)
		at hudson.model.ResourceController.execute(ResourceController.java:97)
		at hudson.model.Executor.run(Executor.java:429)
Caused: hudson.FilePath$TunneledInterruptedException
	at hudson.FilePath$FileCallableWrapper.call(FilePath.java:3084)
	at hudson.remoting.UserRequest.perform(UserRequest.java:212)
	at hudson.remoting.UserRequest.perform(UserRequest.java:54)
	at hudson.remoting.Request$2.run(Request.java:369)
	at hudson.remoting.InterceptingExecutorService$1.call(InterceptingExecutorService.java:72)
	at java.util.concurrent.FutureTask.run(FutureTask.java:266)
	at java.util.concurrent.ThreadPoolExecutor.runWorker(ThreadPoolExecutor.java:1149)
	at java.util.concurrent.ThreadPoolExecutor$Worker.run(ThreadPoolExecutor.java:624)
	at java.lang.Thread.run(Thread.java:748)
Caused: java.lang.InterruptedException: java.lang.InterruptedException: no matches found within 10000
	at hudson.FilePath.act(FilePath.java:1091)
	at hudson.FilePath.act(FilePath.java:1078)
	at hudson.FilePath.validateAntFileMask(FilePath.java:2701)
	at hudson.tasks.ArtifactArchiver.perform(ArtifactArchiver.java:243)
	at hudson.tasks.BuildStepCompatibilityLayer.perform(BuildStepCompatibilityLayer.java:81)
	at hudson.tasks.BuildStepMonitor$1.perform(BuildStepMonitor.java:20)
	at hudson.model.AbstractBuild$AbstractBuildExecution.perform(AbstractBuild.java:744)
	at hudson.model.AbstractBuild$AbstractBuildExecution.performAllBuildSteps(AbstractBuild.java:690)
	at hudson.model.Build$BuildExecution.post2(Build.java:186)
	at hudson.model.AbstractBuild$AbstractBuildExecution.post(AbstractBuild.java:635)
	at hudson.model.Run.execute(Run.java:1840)
	at hudson.model.FreeStyleBuild.run(FreeStyleBuild.java:43)
	at hudson.model.ResourceController.execute(ResourceController.java:97)
	at hudson.model.Executor.run(Executor.java:429)
No artifacts found that match the file pattern "**/*.events,heapdumps/**,**/*_pid*.log". Configuration error?
[WARNINGS] Parsing warnings in console log with parser Java Compiler (javac)
Setting ANT_1_8_2_HOME=/export/home/jenkins/tools/hudson.tasks.Ant_AntInstallation/ANT_1.8.2
Setting ANT_1_8_2_HOME=/export/home/jenkins/tools/hudson.tasks.Ant_AntInstallation/ANT_1.8.2
<Git Blamer> Using GitBlamer to create author and commit information for all warnings.
<Git Blamer> GIT_COMMIT=14e132b29f498fb00992c86d81b477329b5588f2, workspace=/export/home/jenkins/workspace/Lucene-Solr-master-Solaris
[WARNINGS] Computing warning deltas based on reference build #1960
Recording test results
Setting ANT_1_8_2_HOME=/export/home/jenkins/tools/hudson.tasks.Ant_AntInstallation/ANT_1.8.2
Build step 'Publish JUnit test result report' changed build result to UNSTABLE
Email was triggered for: Unstable (Test Failures)
Sending email for trigger: Unstable (Test Failures)
Setting ANT_1_8_2_HOME=/export/home/jenkins/tools/hudson.tasks.Ant_AntInstallation/ANT_1.8.2
Setting ANT_1_8_2_HOME=/export/home/jenkins/tools/hudson.tasks.Ant_AntInstallation/ANT_1.8.2
Setting ANT_1_8_2_HOME=/export/home/jenkins/tools/hudson.tasks.Ant_AntInstallation/ANT_1.8.2
Setting ANT_1_8_2_HOME=/export/home/jenkins/tools/hudson.tasks.Ant_AntInstallation/ANT_1.8.2

Mime
View raw message