lucene-dev mailing list archives

Site index · List index
Message view « Date » · « Thread »
Top « Date » · « Thread »
From Policeman Jenkins Server <jenk...@thetaphi.de>
Subject [JENKINS] Lucene-Solr-master-Linux (64bit/jdk-9.0.4) - Build # 22463 - Unstable!
Date Mon, 16 Jul 2018 13:44:34 GMT
Build: https://jenkins.thetaphi.de/job/Lucene-Solr-master-Linux/22463/
Java: 64bit/jdk-9.0.4 -XX:-UseCompressedOops -XX:+UseParallelGC

5 tests failed.
FAILED:  org.apache.lucene.util.TestPriorityQueue.testIteratorRandom

Error Message:


Stack Trace:
java.lang.AssertionError
	at __randomizedtesting.SeedInfo.seed([AE039D81F02325E0:D8450D529C6FD2DA]:0)
	at org.apache.lucene.util.TestPriorityQueue$IntegerQueue.lessThan(TestPriorityQueue.java:36)
	at org.apache.lucene.util.TestPriorityQueue$IntegerQueue.lessThan(TestPriorityQueue.java:28)
	at org.apache.lucene.util.PriorityQueue.upHeap(PriorityQueue.java:264)
	at org.apache.lucene.util.PriorityQueue.add(PriorityQueue.java:141)
	at org.apache.lucene.util.TestPriorityQueue.testIteratorRandom(TestPriorityQueue.java:241)
	at java.base/jdk.internal.reflect.NativeMethodAccessorImpl.invoke0(Native Method)
	at java.base/jdk.internal.reflect.NativeMethodAccessorImpl.invoke(NativeMethodAccessorImpl.java:62)
	at java.base/jdk.internal.reflect.DelegatingMethodAccessorImpl.invoke(DelegatingMethodAccessorImpl.java:43)
	at java.base/java.lang.reflect.Method.invoke(Method.java:564)
	at com.carrotsearch.randomizedtesting.RandomizedRunner.invoke(RandomizedRunner.java:1737)
	at com.carrotsearch.randomizedtesting.RandomizedRunner$8.evaluate(RandomizedRunner.java:934)
	at com.carrotsearch.randomizedtesting.RandomizedRunner$9.evaluate(RandomizedRunner.java:970)
	at com.carrotsearch.randomizedtesting.RandomizedRunner$10.evaluate(RandomizedRunner.java:984)
	at org.apache.lucene.util.TestRuleSetupTeardownChained$1.evaluate(TestRuleSetupTeardownChained.java:49)
	at org.apache.lucene.util.AbstractBeforeAfterRule$1.evaluate(AbstractBeforeAfterRule.java:45)
	at org.apache.lucene.util.TestRuleThreadAndTestName$1.evaluate(TestRuleThreadAndTestName.java:48)
	at org.apache.lucene.util.TestRuleIgnoreAfterMaxFailures$1.evaluate(TestRuleIgnoreAfterMaxFailures.java:64)
	at org.apache.lucene.util.TestRuleMarkFailure$1.evaluate(TestRuleMarkFailure.java:47)
	at com.carrotsearch.randomizedtesting.rules.StatementAdapter.evaluate(StatementAdapter.java:36)
	at com.carrotsearch.randomizedtesting.ThreadLeakControl$StatementRunner.run(ThreadLeakControl.java:368)
	at com.carrotsearch.randomizedtesting.ThreadLeakControl.forkTimeoutingTask(ThreadLeakControl.java:817)
	at com.carrotsearch.randomizedtesting.ThreadLeakControl$3.evaluate(ThreadLeakControl.java:468)
	at com.carrotsearch.randomizedtesting.RandomizedRunner.runSingleTest(RandomizedRunner.java:943)
	at com.carrotsearch.randomizedtesting.RandomizedRunner$5.evaluate(RandomizedRunner.java:829)
	at com.carrotsearch.randomizedtesting.RandomizedRunner$6.evaluate(RandomizedRunner.java:879)
	at com.carrotsearch.randomizedtesting.RandomizedRunner$7.evaluate(RandomizedRunner.java:890)
	at org.apache.lucene.util.AbstractBeforeAfterRule$1.evaluate(AbstractBeforeAfterRule.java:45)
	at com.carrotsearch.randomizedtesting.rules.StatementAdapter.evaluate(StatementAdapter.java:36)
	at org.apache.lucene.util.TestRuleStoreClassName$1.evaluate(TestRuleStoreClassName.java:41)
	at com.carrotsearch.randomizedtesting.rules.NoShadowingOrOverridesOnMethodsRule$1.evaluate(NoShadowingOrOverridesOnMethodsRule.java:40)
	at com.carrotsearch.randomizedtesting.rules.NoShadowingOrOverridesOnMethodsRule$1.evaluate(NoShadowingOrOverridesOnMethodsRule.java:40)
	at com.carrotsearch.randomizedtesting.rules.StatementAdapter.evaluate(StatementAdapter.java:36)
	at com.carrotsearch.randomizedtesting.rules.StatementAdapter.evaluate(StatementAdapter.java:36)
	at org.apache.lucene.util.TestRuleAssertionsRequired$1.evaluate(TestRuleAssertionsRequired.java:53)
	at org.apache.lucene.util.TestRuleMarkFailure$1.evaluate(TestRuleMarkFailure.java:47)
	at org.apache.lucene.util.TestRuleIgnoreAfterMaxFailures$1.evaluate(TestRuleIgnoreAfterMaxFailures.java:64)
	at org.apache.lucene.util.TestRuleIgnoreTestSuites$1.evaluate(TestRuleIgnoreTestSuites.java:54)
	at com.carrotsearch.randomizedtesting.rules.StatementAdapter.evaluate(StatementAdapter.java:36)
	at com.carrotsearch.randomizedtesting.ThreadLeakControl$StatementRunner.run(ThreadLeakControl.java:368)
	at java.base/java.lang.Thread.run(Thread.java:844)


FAILED:  org.apache.lucene.util.TestPriorityQueue.testIteratorRandom

Error Message:


Stack Trace:
java.lang.AssertionError
	at __randomizedtesting.SeedInfo.seed([AE039D81F02325E0:D8450D529C6FD2DA]:0)
	at org.apache.lucene.util.TestPriorityQueue$IntegerQueue.lessThan(TestPriorityQueue.java:36)
	at org.apache.lucene.util.TestPriorityQueue$IntegerQueue.lessThan(TestPriorityQueue.java:28)
	at org.apache.lucene.util.PriorityQueue.upHeap(PriorityQueue.java:264)
	at org.apache.lucene.util.PriorityQueue.add(PriorityQueue.java:141)
	at org.apache.lucene.util.TestPriorityQueue.testIteratorRandom(TestPriorityQueue.java:241)
	at java.base/jdk.internal.reflect.NativeMethodAccessorImpl.invoke0(Native Method)
	at java.base/jdk.internal.reflect.NativeMethodAccessorImpl.invoke(NativeMethodAccessorImpl.java:62)
	at java.base/jdk.internal.reflect.DelegatingMethodAccessorImpl.invoke(DelegatingMethodAccessorImpl.java:43)
	at java.base/java.lang.reflect.Method.invoke(Method.java:564)
	at com.carrotsearch.randomizedtesting.RandomizedRunner.invoke(RandomizedRunner.java:1737)
	at com.carrotsearch.randomizedtesting.RandomizedRunner$8.evaluate(RandomizedRunner.java:934)
	at com.carrotsearch.randomizedtesting.RandomizedRunner$9.evaluate(RandomizedRunner.java:970)
	at com.carrotsearch.randomizedtesting.RandomizedRunner$10.evaluate(RandomizedRunner.java:984)
	at org.apache.lucene.util.TestRuleSetupTeardownChained$1.evaluate(TestRuleSetupTeardownChained.java:49)
	at org.apache.lucene.util.AbstractBeforeAfterRule$1.evaluate(AbstractBeforeAfterRule.java:45)
	at org.apache.lucene.util.TestRuleThreadAndTestName$1.evaluate(TestRuleThreadAndTestName.java:48)
	at org.apache.lucene.util.TestRuleIgnoreAfterMaxFailures$1.evaluate(TestRuleIgnoreAfterMaxFailures.java:64)
	at org.apache.lucene.util.TestRuleMarkFailure$1.evaluate(TestRuleMarkFailure.java:47)
	at com.carrotsearch.randomizedtesting.rules.StatementAdapter.evaluate(StatementAdapter.java:36)
	at com.carrotsearch.randomizedtesting.ThreadLeakControl$StatementRunner.run(ThreadLeakControl.java:368)
	at com.carrotsearch.randomizedtesting.ThreadLeakControl.forkTimeoutingTask(ThreadLeakControl.java:817)
	at com.carrotsearch.randomizedtesting.ThreadLeakControl$3.evaluate(ThreadLeakControl.java:468)
	at com.carrotsearch.randomizedtesting.RandomizedRunner.runSingleTest(RandomizedRunner.java:943)
	at com.carrotsearch.randomizedtesting.RandomizedRunner$5.evaluate(RandomizedRunner.java:829)
	at com.carrotsearch.randomizedtesting.RandomizedRunner$6.evaluate(RandomizedRunner.java:879)
	at com.carrotsearch.randomizedtesting.RandomizedRunner$7.evaluate(RandomizedRunner.java:890)
	at org.apache.lucene.util.AbstractBeforeAfterRule$1.evaluate(AbstractBeforeAfterRule.java:45)
	at com.carrotsearch.randomizedtesting.rules.StatementAdapter.evaluate(StatementAdapter.java:36)
	at org.apache.lucene.util.TestRuleStoreClassName$1.evaluate(TestRuleStoreClassName.java:41)
	at com.carrotsearch.randomizedtesting.rules.NoShadowingOrOverridesOnMethodsRule$1.evaluate(NoShadowingOrOverridesOnMethodsRule.java:40)
	at com.carrotsearch.randomizedtesting.rules.NoShadowingOrOverridesOnMethodsRule$1.evaluate(NoShadowingOrOverridesOnMethodsRule.java:40)
	at com.carrotsearch.randomizedtesting.rules.StatementAdapter.evaluate(StatementAdapter.java:36)
	at com.carrotsearch.randomizedtesting.rules.StatementAdapter.evaluate(StatementAdapter.java:36)
	at org.apache.lucene.util.TestRuleAssertionsRequired$1.evaluate(TestRuleAssertionsRequired.java:53)
	at org.apache.lucene.util.TestRuleMarkFailure$1.evaluate(TestRuleMarkFailure.java:47)
	at org.apache.lucene.util.TestRuleIgnoreAfterMaxFailures$1.evaluate(TestRuleIgnoreAfterMaxFailures.java:64)
	at org.apache.lucene.util.TestRuleIgnoreTestSuites$1.evaluate(TestRuleIgnoreTestSuites.java:54)
	at com.carrotsearch.randomizedtesting.rules.StatementAdapter.evaluate(StatementAdapter.java:36)
	at com.carrotsearch.randomizedtesting.ThreadLeakControl$StatementRunner.run(ThreadLeakControl.java:368)
	at java.base/java.lang.Thread.run(Thread.java:844)


FAILED:  org.apache.lucene.util.TestPriorityQueue.testIteratorRandom

Error Message:


Stack Trace:
java.lang.AssertionError
	at __randomizedtesting.SeedInfo.seed([AE039D81F02325E0:D8450D529C6FD2DA]:0)
	at org.apache.lucene.util.TestPriorityQueue$IntegerQueue.lessThan(TestPriorityQueue.java:36)
	at org.apache.lucene.util.TestPriorityQueue$IntegerQueue.lessThan(TestPriorityQueue.java:28)
	at org.apache.lucene.util.PriorityQueue.upHeap(PriorityQueue.java:264)
	at org.apache.lucene.util.PriorityQueue.add(PriorityQueue.java:141)
	at org.apache.lucene.util.TestPriorityQueue.testIteratorRandom(TestPriorityQueue.java:241)
	at java.base/jdk.internal.reflect.NativeMethodAccessorImpl.invoke0(Native Method)
	at java.base/jdk.internal.reflect.NativeMethodAccessorImpl.invoke(NativeMethodAccessorImpl.java:62)
	at java.base/jdk.internal.reflect.DelegatingMethodAccessorImpl.invoke(DelegatingMethodAccessorImpl.java:43)
	at java.base/java.lang.reflect.Method.invoke(Method.java:564)
	at com.carrotsearch.randomizedtesting.RandomizedRunner.invoke(RandomizedRunner.java:1737)
	at com.carrotsearch.randomizedtesting.RandomizedRunner$8.evaluate(RandomizedRunner.java:934)
	at com.carrotsearch.randomizedtesting.RandomizedRunner$9.evaluate(RandomizedRunner.java:970)
	at com.carrotsearch.randomizedtesting.RandomizedRunner$10.evaluate(RandomizedRunner.java:984)
	at org.apache.lucene.util.TestRuleSetupTeardownChained$1.evaluate(TestRuleSetupTeardownChained.java:49)
	at org.apache.lucene.util.AbstractBeforeAfterRule$1.evaluate(AbstractBeforeAfterRule.java:45)
	at org.apache.lucene.util.TestRuleThreadAndTestName$1.evaluate(TestRuleThreadAndTestName.java:48)
	at org.apache.lucene.util.TestRuleIgnoreAfterMaxFailures$1.evaluate(TestRuleIgnoreAfterMaxFailures.java:64)
	at org.apache.lucene.util.TestRuleMarkFailure$1.evaluate(TestRuleMarkFailure.java:47)
	at com.carrotsearch.randomizedtesting.rules.StatementAdapter.evaluate(StatementAdapter.java:36)
	at com.carrotsearch.randomizedtesting.ThreadLeakControl$StatementRunner.run(ThreadLeakControl.java:368)
	at com.carrotsearch.randomizedtesting.ThreadLeakControl.forkTimeoutingTask(ThreadLeakControl.java:817)
	at com.carrotsearch.randomizedtesting.ThreadLeakControl$3.evaluate(ThreadLeakControl.java:468)
	at com.carrotsearch.randomizedtesting.RandomizedRunner.runSingleTest(RandomizedRunner.java:943)
	at com.carrotsearch.randomizedtesting.RandomizedRunner$5.evaluate(RandomizedRunner.java:829)
	at com.carrotsearch.randomizedtesting.RandomizedRunner$6.evaluate(RandomizedRunner.java:879)
	at com.carrotsearch.randomizedtesting.RandomizedRunner$7.evaluate(RandomizedRunner.java:890)
	at org.apache.lucene.util.AbstractBeforeAfterRule$1.evaluate(AbstractBeforeAfterRule.java:45)
	at com.carrotsearch.randomizedtesting.rules.StatementAdapter.evaluate(StatementAdapter.java:36)
	at org.apache.lucene.util.TestRuleStoreClassName$1.evaluate(TestRuleStoreClassName.java:41)
	at com.carrotsearch.randomizedtesting.rules.NoShadowingOrOverridesOnMethodsRule$1.evaluate(NoShadowingOrOverridesOnMethodsRule.java:40)
	at com.carrotsearch.randomizedtesting.rules.NoShadowingOrOverridesOnMethodsRule$1.evaluate(NoShadowingOrOverridesOnMethodsRule.java:40)
	at com.carrotsearch.randomizedtesting.rules.StatementAdapter.evaluate(StatementAdapter.java:36)
	at com.carrotsearch.randomizedtesting.rules.StatementAdapter.evaluate(StatementAdapter.java:36)
	at org.apache.lucene.util.TestRuleAssertionsRequired$1.evaluate(TestRuleAssertionsRequired.java:53)
	at org.apache.lucene.util.TestRuleMarkFailure$1.evaluate(TestRuleMarkFailure.java:47)
	at org.apache.lucene.util.TestRuleIgnoreAfterMaxFailures$1.evaluate(TestRuleIgnoreAfterMaxFailures.java:64)
	at org.apache.lucene.util.TestRuleIgnoreTestSuites$1.evaluate(TestRuleIgnoreTestSuites.java:54)
	at com.carrotsearch.randomizedtesting.rules.StatementAdapter.evaluate(StatementAdapter.java:36)
	at com.carrotsearch.randomizedtesting.ThreadLeakControl$StatementRunner.run(ThreadLeakControl.java:368)
	at java.base/java.lang.Thread.run(Thread.java:844)


FAILED:  org.apache.lucene.util.TestPriorityQueue.testIteratorRandom

Error Message:


Stack Trace:
java.lang.AssertionError
	at __randomizedtesting.SeedInfo.seed([AE039D81F02325E0:D8450D529C6FD2DA]:0)
	at org.apache.lucene.util.TestPriorityQueue$IntegerQueue.lessThan(TestPriorityQueue.java:36)
	at org.apache.lucene.util.TestPriorityQueue$IntegerQueue.lessThan(TestPriorityQueue.java:28)
	at org.apache.lucene.util.PriorityQueue.upHeap(PriorityQueue.java:264)
	at org.apache.lucene.util.PriorityQueue.add(PriorityQueue.java:141)
	at org.apache.lucene.util.TestPriorityQueue.testIteratorRandom(TestPriorityQueue.java:241)
	at java.base/jdk.internal.reflect.NativeMethodAccessorImpl.invoke0(Native Method)
	at java.base/jdk.internal.reflect.NativeMethodAccessorImpl.invoke(NativeMethodAccessorImpl.java:62)
	at java.base/jdk.internal.reflect.DelegatingMethodAccessorImpl.invoke(DelegatingMethodAccessorImpl.java:43)
	at java.base/java.lang.reflect.Method.invoke(Method.java:564)
	at com.carrotsearch.randomizedtesting.RandomizedRunner.invoke(RandomizedRunner.java:1737)
	at com.carrotsearch.randomizedtesting.RandomizedRunner$8.evaluate(RandomizedRunner.java:934)
	at com.carrotsearch.randomizedtesting.RandomizedRunner$9.evaluate(RandomizedRunner.java:970)
	at com.carrotsearch.randomizedtesting.RandomizedRunner$10.evaluate(RandomizedRunner.java:984)
	at org.apache.lucene.util.TestRuleSetupTeardownChained$1.evaluate(TestRuleSetupTeardownChained.java:49)
	at org.apache.lucene.util.AbstractBeforeAfterRule$1.evaluate(AbstractBeforeAfterRule.java:45)
	at org.apache.lucene.util.TestRuleThreadAndTestName$1.evaluate(TestRuleThreadAndTestName.java:48)
	at org.apache.lucene.util.TestRuleIgnoreAfterMaxFailures$1.evaluate(TestRuleIgnoreAfterMaxFailures.java:64)
	at org.apache.lucene.util.TestRuleMarkFailure$1.evaluate(TestRuleMarkFailure.java:47)
	at com.carrotsearch.randomizedtesting.rules.StatementAdapter.evaluate(StatementAdapter.java:36)
	at com.carrotsearch.randomizedtesting.ThreadLeakControl$StatementRunner.run(ThreadLeakControl.java:368)
	at com.carrotsearch.randomizedtesting.ThreadLeakControl.forkTimeoutingTask(ThreadLeakControl.java:817)
	at com.carrotsearch.randomizedtesting.ThreadLeakControl$3.evaluate(ThreadLeakControl.java:468)
	at com.carrotsearch.randomizedtesting.RandomizedRunner.runSingleTest(RandomizedRunner.java:943)
	at com.carrotsearch.randomizedtesting.RandomizedRunner$5.evaluate(RandomizedRunner.java:829)
	at com.carrotsearch.randomizedtesting.RandomizedRunner$6.evaluate(RandomizedRunner.java:879)
	at com.carrotsearch.randomizedtesting.RandomizedRunner$7.evaluate(RandomizedRunner.java:890)
	at org.apache.lucene.util.AbstractBeforeAfterRule$1.evaluate(AbstractBeforeAfterRule.java:45)
	at com.carrotsearch.randomizedtesting.rules.StatementAdapter.evaluate(StatementAdapter.java:36)
	at org.apache.lucene.util.TestRuleStoreClassName$1.evaluate(TestRuleStoreClassName.java:41)
	at com.carrotsearch.randomizedtesting.rules.NoShadowingOrOverridesOnMethodsRule$1.evaluate(NoShadowingOrOverridesOnMethodsRule.java:40)
	at com.carrotsearch.randomizedtesting.rules.NoShadowingOrOverridesOnMethodsRule$1.evaluate(NoShadowingOrOverridesOnMethodsRule.java:40)
	at com.carrotsearch.randomizedtesting.rules.StatementAdapter.evaluate(StatementAdapter.java:36)
	at com.carrotsearch.randomizedtesting.rules.StatementAdapter.evaluate(StatementAdapter.java:36)
	at org.apache.lucene.util.TestRuleAssertionsRequired$1.evaluate(TestRuleAssertionsRequired.java:53)
	at org.apache.lucene.util.TestRuleMarkFailure$1.evaluate(TestRuleMarkFailure.java:47)
	at org.apache.lucene.util.TestRuleIgnoreAfterMaxFailures$1.evaluate(TestRuleIgnoreAfterMaxFailures.java:64)
	at org.apache.lucene.util.TestRuleIgnoreTestSuites$1.evaluate(TestRuleIgnoreTestSuites.java:54)
	at com.carrotsearch.randomizedtesting.rules.StatementAdapter.evaluate(StatementAdapter.java:36)
	at com.carrotsearch.randomizedtesting.ThreadLeakControl$StatementRunner.run(ThreadLeakControl.java:368)
	at java.base/java.lang.Thread.run(Thread.java:844)


FAILED:  org.apache.solr.handler.component.InfixSuggestersTest.testShutdownDuringBuild

Error Message:
junit.framework.AssertionFailedError: Unexpected wrapped exception type, expected CoreIsClosedException

Stack Trace:
java.util.concurrent.ExecutionException: junit.framework.AssertionFailedError: Unexpected wrapped exception type, expected CoreIsClosedException
	at __randomizedtesting.SeedInfo.seed([6E7FF223503CEE32:B1F2909C6E55BB50]:0)
	at java.base/java.util.concurrent.FutureTask.report(FutureTask.java:122)
	at java.base/java.util.concurrent.FutureTask.get(FutureTask.java:191)
	at org.apache.solr.handler.component.InfixSuggestersTest.testShutdownDuringBuild(InfixSuggestersTest.java:130)
	at java.base/jdk.internal.reflect.NativeMethodAccessorImpl.invoke0(Native Method)
	at java.base/jdk.internal.reflect.NativeMethodAccessorImpl.invoke(NativeMethodAccessorImpl.java:62)
	at java.base/jdk.internal.reflect.DelegatingMethodAccessorImpl.invoke(DelegatingMethodAccessorImpl.java:43)
	at java.base/java.lang.reflect.Method.invoke(Method.java:564)
	at com.carrotsearch.randomizedtesting.RandomizedRunner.invoke(RandomizedRunner.java:1737)
	at com.carrotsearch.randomizedtesting.RandomizedRunner$8.evaluate(RandomizedRunner.java:934)
	at com.carrotsearch.randomizedtesting.RandomizedRunner$9.evaluate(RandomizedRunner.java:970)
	at com.carrotsearch.randomizedtesting.RandomizedRunner$10.evaluate(RandomizedRunner.java:984)
	at com.carrotsearch.randomizedtesting.rules.SystemPropertiesRestoreRule$1.evaluate(SystemPropertiesRestoreRule.java:57)
	at org.apache.lucene.util.TestRuleSetupTeardownChained$1.evaluate(TestRuleSetupTeardownChained.java:49)
	at org.apache.lucene.util.AbstractBeforeAfterRule$1.evaluate(AbstractBeforeAfterRule.java:45)
	at org.apache.lucene.util.TestRuleThreadAndTestName$1.evaluate(TestRuleThreadAndTestName.java:48)
	at org.apache.lucene.util.TestRuleIgnoreAfterMaxFailures$1.evaluate(TestRuleIgnoreAfterMaxFailures.java:64)
	at org.apache.lucene.util.TestRuleMarkFailure$1.evaluate(TestRuleMarkFailure.java:47)
	at com.carrotsearch.randomizedtesting.rules.StatementAdapter.evaluate(StatementAdapter.java:36)
	at com.carrotsearch.randomizedtesting.ThreadLeakControl$StatementRunner.run(ThreadLeakControl.java:368)
	at com.carrotsearch.randomizedtesting.ThreadLeakControl.forkTimeoutingTask(ThreadLeakControl.java:817)
	at com.carrotsearch.randomizedtesting.ThreadLeakControl$3.evaluate(ThreadLeakControl.java:468)
	at com.carrotsearch.randomizedtesting.RandomizedRunner.runSingleTest(RandomizedRunner.java:943)
	at com.carrotsearch.randomizedtesting.RandomizedRunner$5.evaluate(RandomizedRunner.java:829)
	at com.carrotsearch.randomizedtesting.RandomizedRunner$6.evaluate(RandomizedRunner.java:879)
	at com.carrotsearch.randomizedtesting.RandomizedRunner$7.evaluate(RandomizedRunner.java:890)
	at com.carrotsearch.randomizedtesting.rules.StatementAdapter.evaluate(StatementAdapter.java:36)
	at com.carrotsearch.randomizedtesting.rules.SystemPropertiesRestoreRule$1.evaluate(SystemPropertiesRestoreRule.java:57)
	at org.apache.lucene.util.AbstractBeforeAfterRule$1.evaluate(AbstractBeforeAfterRule.java:45)
	at com.carrotsearch.randomizedtesting.rules.StatementAdapter.evaluate(StatementAdapter.java:36)
	at org.apache.lucene.util.TestRuleStoreClassName$1.evaluate(TestRuleStoreClassName.java:41)
	at com.carrotsearch.randomizedtesting.rules.NoShadowingOrOverridesOnMethodsRule$1.evaluate(NoShadowingOrOverridesOnMethodsRule.java:40)
	at com.carrotsearch.randomizedtesting.rules.NoShadowingOrOverridesOnMethodsRule$1.evaluate(NoShadowingOrOverridesOnMethodsRule.java:40)
	at com.carrotsearch.randomizedtesting.rules.StatementAdapter.evaluate(StatementAdapter.java:36)
	at com.carrotsearch.randomizedtesting.rules.StatementAdapter.evaluate(StatementAdapter.java:36)
	at org.apache.lucene.util.TestRuleAssertionsRequired$1.evaluate(TestRuleAssertionsRequired.java:53)
	at org.apache.lucene.util.TestRuleMarkFailure$1.evaluate(TestRuleMarkFailure.java:47)
	at org.apache.lucene.util.TestRuleIgnoreAfterMaxFailures$1.evaluate(TestRuleIgnoreAfterMaxFailures.java:64)
	at org.apache.lucene.util.TestRuleIgnoreTestSuites$1.evaluate(TestRuleIgnoreTestSuites.java:54)
	at com.carrotsearch.randomizedtesting.rules.StatementAdapter.evaluate(StatementAdapter.java:36)
	at com.carrotsearch.randomizedtesting.ThreadLeakControl$StatementRunner.run(ThreadLeakControl.java:368)
	at java.base/java.lang.Thread.run(Thread.java:844)
Caused by: junit.framework.AssertionFailedError: Unexpected wrapped exception type, expected CoreIsClosedException
	at org.apache.lucene.util.LuceneTestCase.expectThrows(LuceneTestCase.java:2696)
	at org.apache.solr.handler.component.InfixSuggestersTest.lambda$testShutdownDuringBuild$3(InfixSuggestersTest.java:121)
	at java.base/java.util.concurrent.FutureTask.run(FutureTask.java:264)
	at org.apache.solr.common.util.ExecutorUtil$MDCAwareThreadPoolExecutor.lambda$execute$0(ExecutorUtil.java:209)
	at java.base/java.util.concurrent.ThreadPoolExecutor.runWorker(ThreadPoolExecutor.java:1167)
	at java.base/java.util.concurrent.ThreadPoolExecutor$Worker.run(ThreadPoolExecutor.java:641)
	... 1 more
Caused by: java.lang.RuntimeException: Exception during query
	at org.apache.solr.SolrTestCaseJ4.assertQ(SolrTestCaseJ4.java:917)
	at org.apache.solr.SolrTestCaseJ4.assertQ(SolrTestCaseJ4.java:877)
	at org.apache.solr.handler.component.InfixSuggestersTest.lambda$testShutdownDuringBuild$2(InfixSuggestersTest.java:122)
	at org.apache.lucene.util.LuceneTestCase.expectThrows(LuceneTestCase.java:2688)
	... 6 more
Caused by: org.apache.solr.common.SolrException: SolrCoreState already closed.
	at org.apache.solr.update.DefaultSolrCoreState.lock(DefaultSolrCoreState.java:186)
	at org.apache.solr.update.DefaultSolrCoreState.getIndexWriter(DefaultSolrCoreState.java:121)
	at org.apache.solr.update.SolrCoreState.getTragicException(SolrCoreState.java:198)
	at org.apache.solr.core.CoreContainer.checkTragicException(CoreContainer.java:1812)
	at org.apache.solr.handler.RequestHandlerBase.handleRequest(RequestHandlerBase.java:212)
	at org.apache.solr.core.SolrCore.execute(SolrCore.java:2541)
	at org.apache.solr.util.TestHarness.query(TestHarness.java:337)
	at org.apache.solr.util.TestHarness.query(TestHarness.java:319)
	at org.apache.solr.SolrTestCaseJ4.assertQ(SolrTestCaseJ4.java:891)
	... 9 more




Build Log:
[...truncated 294 lines...]
   [junit4] Suite: org.apache.lucene.util.TestPriorityQueue
   [junit4]   2> NOTE: reproduce with: ant test  -Dtestcase=TestPriorityQueue -Dtests.method=testIteratorRandom -Dtests.seed=AE039D81F02325E0 -Dtests.multiplier=3 -Dtests.slow=true -Dtests.locale=zh-Hans-HK -Dtests.timezone=US/Pacific -Dtests.asserts=true -Dtests.file.encoding=UTF-8
   [junit4] FAILURE 0.01s J1 | TestPriorityQueue.testIteratorRandom <<<
   [junit4]    > Throwable #1: java.lang.AssertionError
   [junit4]    > 	at __randomizedtesting.SeedInfo.seed([AE039D81F02325E0:D8450D529C6FD2DA]:0)
   [junit4]    > 	at org.apache.lucene.util.TestPriorityQueue$IntegerQueue.lessThan(TestPriorityQueue.java:36)
   [junit4]    > 	at org.apache.lucene.util.TestPriorityQueue$IntegerQueue.lessThan(TestPriorityQueue.java:28)
   [junit4]    > 	at org.apache.lucene.util.PriorityQueue.upHeap(PriorityQueue.java:264)
   [junit4]    > 	at org.apache.lucene.util.PriorityQueue.add(PriorityQueue.java:141)
   [junit4]    > 	at org.apache.lucene.util.TestPriorityQueue.testIteratorRandom(TestPriorityQueue.java:241)
   [junit4]    > 	at java.base/jdk.internal.reflect.NativeMethodAccessorImpl.invoke0(Native Method)
   [junit4]    > 	at java.base/jdk.internal.reflect.NativeMethodAccessorImpl.invoke(NativeMethodAccessorImpl.java:62)
   [junit4]    > 	at java.base/jdk.internal.reflect.DelegatingMethodAccessorImpl.invoke(DelegatingMethodAccessorImpl.java:43)
   [junit4]    > 	at java.base/java.lang.reflect.Method.invoke(Method.java:564)
   [junit4]    > 	at java.base/java.lang.Thread.run(Thread.java:844)
   [junit4]   2> NOTE: test params are: codec=Asserting(Lucene70): {}, docValues:{}, maxPointsInLeafNode=523, maxMBSortInHeap=7.990517431071455, sim=Asserting(org.apache.lucene.search.similarities.AssertingSimilarity@1daeeb76), locale=zh-Hans-HK, timezone=US/Pacific
   [junit4]   2> NOTE: Linux 4.15.0-24-generic amd64/Oracle Corporation 9.0.4 (64-bit)/cpus=8,threads=1,free=488209840,total=519569408
   [junit4]   2> NOTE: All tests run in this JVM: [TestIndexWriterUnicode, TestBytesRefHash, TestMutableValues, TestPriorityQueue]
   [junit4] Completed [14/497 (1!)] on J1 in 0.33s, 10 tests, 1 failure <<< FAILURES!

[...truncated 14123 lines...]
   [junit4] Suite: org.apache.solr.handler.component.InfixSuggestersTest
   [junit4]   2> Creating dataDir: /home/jenkins/workspace/Lucene-Solr-master-Linux/solr/build/solr-core/test/J2/temp/solr.handler.component.InfixSuggestersTest_6E7FF223503CEE32-001/init-core-data-001
   [junit4]   2> 1892362 WARN  (SUITE-InfixSuggestersTest-seed#[6E7FF223503CEE32]-worker) [    ] o.a.s.SolrTestCaseJ4 startTrackingSearchers: numOpens=23 numCloses=23
   [junit4]   2> 1892362 INFO  (SUITE-InfixSuggestersTest-seed#[6E7FF223503CEE32]-worker) [    ] o.a.s.SolrTestCaseJ4 Using PointFields (NUMERIC_POINTS_SYSPROP=true) w/NUMERIC_DOCVALUES_SYSPROP=true
   [junit4]   2> 1892362 INFO  (SUITE-InfixSuggestersTest-seed#[6E7FF223503CEE32]-worker) [    ] o.a.s.SolrTestCaseJ4 Randomized ssl (true) and clientAuth (false) via: @org.apache.solr.util.RandomizeSSL(reason="", ssl=0.0/0.0, value=0.0/0.0, clientAuth=0.0/0.0)
   [junit4]   2> 1892363 INFO  (SUITE-InfixSuggestersTest-seed#[6E7FF223503CEE32]-worker) [    ] o.a.s.SolrTestCaseJ4 SecureRandom sanity checks: test.solr.allowed.securerandom=null & java.security.egd=file:/dev/./urandom
   [junit4]   2> 1892363 INFO  (SUITE-InfixSuggestersTest-seed#[6E7FF223503CEE32]-worker) [    ] o.a.s.SolrTestCaseJ4 ####initCore
   [junit4]   2> 1892363 INFO  (SUITE-InfixSuggestersTest-seed#[6E7FF223503CEE32]-worker) [    ] o.a.s.c.SolrResourceLoader [null] Added 2 libs to classloader, from paths: [/home/jenkins/workspace/Lucene-Solr-master-Linux/solr/core/src/test-files/solr/collection1/lib, /home/jenkins/workspace/Lucene-Solr-master-Linux/solr/core/src/test-files/solr/collection1/lib/classes]
   [junit4]   2> 1892382 INFO  (SUITE-InfixSuggestersTest-seed#[6E7FF223503CEE32]-worker) [    ] o.a.s.c.SolrConfig Using Lucene MatchVersion: 8.0.0
   [junit4]   2> 1892414 INFO  (SUITE-InfixSuggestersTest-seed#[6E7FF223503CEE32]-worker) [    ] o.a.s.s.IndexSchema [null] Schema name=test
   [junit4]   2> 1892554 INFO  (SUITE-InfixSuggestersTest-seed#[6E7FF223503CEE32]-worker) [    ] o.a.s.s.IndexSchema Loaded schema test/1.0 with uniqueid field id
   [junit4]   2> 1892970 INFO  (SUITE-InfixSuggestersTest-seed#[6E7FF223503CEE32]-worker) [    ] o.a.s.c.TransientSolrCoreCacheDefault Allocating transient cache for 2147483647 transient cores
   [junit4]   2> 1892971 INFO  (SUITE-InfixSuggestersTest-seed#[6E7FF223503CEE32]-worker) [    ] o.a.s.h.a.MetricsHistoryHandler No .system collection, keeping metrics history in memory.
   [junit4]   2> 1892983 INFO  (SUITE-InfixSuggestersTest-seed#[6E7FF223503CEE32]-worker) [    ] o.a.s.m.r.SolrJmxReporter JMX monitoring for 'solr.node' (registry 'solr.node') enabled at server: com.sun.jmx.mbeanserver.JmxMBeanServer@6635a491
   [junit4]   2> 1892991 INFO  (SUITE-InfixSuggestersTest-seed#[6E7FF223503CEE32]-worker) [    ] o.a.s.m.r.SolrJmxReporter JMX monitoring for 'solr.jvm' (registry 'solr.jvm') enabled at server: com.sun.jmx.mbeanserver.JmxMBeanServer@6635a491
   [junit4]   2> 1892991 INFO  (SUITE-InfixSuggestersTest-seed#[6E7FF223503CEE32]-worker) [    ] o.a.s.m.r.SolrJmxReporter JMX monitoring for 'solr.jetty' (registry 'solr.jetty') enabled at server: com.sun.jmx.mbeanserver.JmxMBeanServer@6635a491
   [junit4]   2> 1892997 INFO  (coreLoadExecutor-8185-thread-1) [    x:collection1] o.a.s.c.SolrResourceLoader [null] Added 2 libs to classloader, from paths: [/home/jenkins/workspace/Lucene-Solr-master-Linux/solr/core/src/test-files/solr/collection1/lib, /home/jenkins/workspace/Lucene-Solr-master-Linux/solr/core/src/test-files/solr/collection1/lib/classes]
   [junit4]   2> 1893022 INFO  (coreLoadExecutor-8185-thread-1) [    x:collection1] o.a.s.c.SolrConfig Using Lucene MatchVersion: 8.0.0
   [junit4]   2> 1893082 INFO  (coreLoadExecutor-8185-thread-1) [    x:collection1] o.a.s.s.IndexSchema [collection1] Schema name=test
   [junit4]   2> 1893194 INFO  (coreLoadExecutor-8185-thread-1) [    x:collection1] o.a.s.s.IndexSchema Loaded schema test/1.0 with uniqueid field id
   [junit4]   2> 1893208 INFO  (coreLoadExecutor-8185-thread-1) [    x:collection1] o.a.s.c.CoreContainer Creating SolrCore 'collection1' using configuration from instancedir /home/jenkins/workspace/Lucene-Solr-master-Linux/solr/core/src/test-files/solr/collection1, trusted=true
   [junit4]   2> 1893209 INFO  (coreLoadExecutor-8185-thread-1) [    x:collection1] o.a.s.m.r.SolrJmxReporter JMX monitoring for 'solr.core.collection1' (registry 'solr.core.collection1') enabled at server: com.sun.jmx.mbeanserver.JmxMBeanServer@6635a491
   [junit4]   2> 1893209 INFO  (coreLoadExecutor-8185-thread-1) [    x:collection1] o.a.s.c.SolrCore solr.RecoveryStrategy.Builder
   [junit4]   2> 1893209 INFO  (coreLoadExecutor-8185-thread-1) [    x:collection1] o.a.s.c.SolrCore [[collection1] ] Opening new SolrCore at [/home/jenkins/workspace/Lucene-Solr-master-Linux/solr/core/src/test-files/solr/collection1], dataDir=[/home/jenkins/workspace/Lucene-Solr-master-Linux/solr/build/solr-core/test/J2/temp/solr.handler.component.InfixSuggestersTest_6E7FF223503CEE32-001/init-core-data-001/]
   [junit4]   2> 1893210 INFO  (coreLoadExecutor-8185-thread-1) [    x:collection1] o.a.s.u.RandomMergePolicy RandomMergePolicy wrapping class org.apache.lucene.index.LogDocMergePolicy: [LogDocMergePolicy: minMergeSize=1000, mergeFactor=32, maxMergeSize=9223372036854775807, maxMergeSizeForForcedMerge=9223372036854775807, calibrateSizeByDeletes=false, maxMergeDocs=2147483647, maxCFSSegmentSizeMB=8.796093022207999E12, noCFSRatio=0.0]
   [junit4]   2> 1893280 INFO  (coreLoadExecutor-8185-thread-1) [    x:collection1] o.a.s.u.CommitTracker Hard AutoCommit: disabled
   [junit4]   2> 1893281 INFO  (coreLoadExecutor-8185-thread-1) [    x:collection1] o.a.s.u.CommitTracker Soft AutoCommit: disabled
   [junit4]   2> 1893281 INFO  (coreLoadExecutor-8185-thread-1) [    x:collection1] o.a.s.u.RandomMergePolicy RandomMergePolicy wrapping class org.apache.lucene.index.TieredMergePolicy: [TieredMergePolicy: maxMergeAtOnce=26, maxMergeAtOnceExplicit=50, maxMergedSegmentMB=80.4990234375, floorSegmentMB=0.3076171875, forceMergeDeletesPctAllowed=5.7126096354298745, segmentsPerTier=28.0, maxCFSSegmentSizeMB=8.796093022207999E12, noCFSRatio=1.0, reclaimDeletesWeight=0.6482474024410427
   [junit4]   2> 1893282 INFO  (coreLoadExecutor-8185-thread-1) [    x:collection1] o.a.s.s.SolrIndexSearcher Opening [Searcher@3fae975[collection1] main]
   [junit4]   2> 1893282 WARN  (coreLoadExecutor-8185-thread-1) [    x:collection1] o.a.s.r.ManagedResourceStorage Cannot write to config directory /home/jenkins/workspace/Lucene-Solr-master-Linux/solr/core/src/test-files/solr/collection1/conf; switching to use InMemory storage instead.
   [junit4]   2> 1893283 INFO  (coreLoadExecutor-8185-thread-1) [    x:collection1] o.a.s.h.c.SuggestComponent Initializing SuggestComponent
   [junit4]   2> 1893283 INFO  (coreLoadExecutor-8185-thread-1) [    x:collection1] o.a.s.s.s.SolrSuggester init: {name=shortRandomAnalyzingInfixSuggester,lookupImpl=AnalyzingInfixLookupFactory,dictionaryImpl=RandomTestDictionaryFactory,randDictMaxItems=100,indexPath=short_random_analyzing_infix_suggester,suggestAnalyzerFieldType=text,buildOnCommit=false,buildOnStartup=false}
   [junit4]   2> 1893289 INFO  (coreLoadExecutor-8185-thread-1) [    x:collection1] o.a.s.s.s.SolrSuggester Dictionary loaded with params: {name=shortRandomAnalyzingInfixSuggester,lookupImpl=AnalyzingInfixLookupFactory,dictionaryImpl=RandomTestDictionaryFactory,randDictMaxItems=100,indexPath=short_random_analyzing_infix_suggester,suggestAnalyzerFieldType=text,buildOnCommit=false,buildOnStartup=false}
   [junit4]   2> 1893290 INFO  (coreLoadExecutor-8185-thread-1) [    x:collection1] o.a.s.h.c.SuggestComponent Initializing SuggestComponent
   [junit4]   2> 1893290 INFO  (coreLoadExecutor-8185-thread-1) [    x:collection1] o.a.s.s.s.SolrSuggester init: {name=longRandomAnalyzingInfixSuggester,lookupImpl=AnalyzingInfixLookupFactory,dictionaryImpl=RandomTestDictionaryFactory,randDictMaxItems=100000,indexPath=long_random_analyzing_infix_suggester,suggestAnalyzerFieldType=text,buildOnCommit=false,buildOnStartup=false}
   [junit4]   2> 1893290 INFO  (coreLoadExecutor-8185-thread-1) [    x:collection1] o.a.s.s.s.SolrSuggester Dictionary loaded with params: {name=longRandomAnalyzingInfixSuggester,lookupImpl=AnalyzingInfixLookupFactory,dictionaryImpl=RandomTestDictionaryFactory,randDictMaxItems=100000,indexPath=long_random_analyzing_infix_suggester,suggestAnalyzerFieldType=text,buildOnCommit=false,buildOnStartup=false}
   [junit4]   2> 1893290 INFO  (coreLoadExecutor-8185-thread-1) [    x:collection1] o.a.s.h.c.SuggestComponent Initializing SuggestComponent
   [junit4]   2> 1893290 INFO  (coreLoadExecutor-8185-thread-1) [    x:collection1] o.a.s.s.s.SolrSuggester init: {name=shortRandomBlendedInfixSuggester,lookupImpl=BlendedInfixLookupFactory,dictionaryImpl=RandomTestDictionaryFactory,randDictMaxItems=100,blenderType=position_linear,suggestAnalyzerFieldType=text,indexPath=short_random_blended_infix_suggester,highlight=true,buildOnStartup=false,buildOnCommit=false}
   [junit4]   2> 1893290 INFO  (coreLoadExecutor-8185-thread-1) [    x:collection1] o.a.s.s.s.SolrSuggester Dictionary loaded with params: {name=shortRandomBlendedInfixSuggester,lookupImpl=BlendedInfixLookupFactory,dictionaryImpl=RandomTestDictionaryFactory,randDictMaxItems=100,blenderType=position_linear,suggestAnalyzerFieldType=text,indexPath=short_random_blended_infix_suggester,highlight=true,buildOnStartup=false,buildOnCommit=false}
   [junit4]   2> 1893290 INFO  (coreLoadExecutor-8185-thread-1) [    x:collection1] o.a.s.h.ReplicationHandler Commits will be reserved for 10000ms.
   [junit4]   2> 1893291 INFO  (SUITE-InfixSuggestersTest-seed#[6E7FF223503CEE32]-worker) [    ] o.a.s.SolrTestCaseJ4 ####initCore end
   [junit4]   2> 1893293 INFO  (searcherExecutor-8186-thread-1-processing-x:collection1) [    x:collection1] o.a.s.c.SolrCore [collection1] Registered new searcher Searcher@3fae975[collection1] main{ExitableDirectoryReader(UninvertingDirectoryReader())}
   [junit4]   2> 1893293 INFO  (TEST-InfixSuggestersTest.testShutdownDuringBuild-seed#[6E7FF223503CEE32]) [    ] o.a.s.SolrTestCaseJ4 ###Starting testShutdownDuringBuild
   [junit4]   2> 1893294 INFO  (AnalyzingInfixSuggesterTest-7533-thread-1) [    ] o.a.s.h.c.SuggestComponent SuggestComponent prepare with : qt=/suggest_analyzing_infix_long_dictionary&suggest=true&suggest.buildAll=true&wt=xml&indent=off
   [junit4]   2> 1893295 INFO  (AnalyzingInfixSuggesterTest-7533-thread-1) [    ] o.a.s.s.s.SolrSuggester SolrSuggester.build(longRandomAnalyzingInfixSuggester)
   [junit4]   2> 1893394 INFO  (TEST-InfixSuggestersTest.testShutdownDuringBuild-seed#[6E7FF223503CEE32]) [    ] o.a.s.c.CoreContainer Shutting down CoreContainer instance=102635286
   [junit4]   2> 1893394 INFO  (TEST-InfixSuggestersTest.testShutdownDuringBuild-seed#[6E7FF223503CEE32]) [    ] o.a.s.m.SolrMetricManager Closing metric reporters for registry=solr.node, tag=null
   [junit4]   2> 1893394 INFO  (TEST-InfixSuggestersTest.testShutdownDuringBuild-seed#[6E7FF223503CEE32]) [    ] o.a.s.m.r.SolrJmxReporter Closing reporter [org.apache.solr.metrics.reporters.SolrJmxReporter@72547a7b: rootName = null, domain = solr.node, service url = null, agent id = null] for registry solr.node / com.codahale.metrics.MetricRegistry@34b31c56
   [junit4]   2> 1893401 INFO  (TEST-InfixSuggestersTest.testShutdownDuringBuild-seed#[6E7FF223503CEE32]) [    ] o.a.s.m.SolrMetricManager Closing metric reporters for registry=solr.jvm, tag=null
   [junit4]   2> 1893401 INFO  (TEST-InfixSuggestersTest.testShutdownDuringBuild-seed#[6E7FF223503CEE32]) [    ] o.a.s.m.r.SolrJmxReporter Closing reporter [org.apache.solr.metrics.reporters.SolrJmxReporter@6a9eb9b9: rootName = null, domain = solr.jvm, service url = null, agent id = null] for registry solr.jvm / com.codahale.metrics.MetricRegistry@56388e0
   [junit4]   2> 1893404 INFO  (TEST-InfixSuggestersTest.testShutdownDuringBuild-seed#[6E7FF223503CEE32]) [    ] o.a.s.m.SolrMetricManager Closing metric reporters for registry=solr.jetty, tag=null
   [junit4]   2> 1893404 INFO  (TEST-InfixSuggestersTest.testShutdownDuringBuild-seed#[6E7FF223503CEE32]) [    ] o.a.s.m.r.SolrJmxReporter Closing reporter [org.apache.solr.metrics.reporters.SolrJmxReporter@499a928b: rootName = null, domain = solr.jetty, service url = null, agent id = null] for registry solr.jetty / com.codahale.metrics.MetricRegistry@e80f621
   [junit4]   2> 1893428 INFO  (coreCloseExecutor-8190-thread-1) [    x:collection1] o.a.s.c.SolrCore [collection1]  CLOSING SolrCore org.apache.solr.core.SolrCore@27dd5595
   [junit4]   2> 1893428 INFO  (coreCloseExecutor-8190-thread-1) [    x:collection1] o.a.s.m.SolrMetricManager Closing metric reporters for registry=solr.core.collection1, tag=27dd5595
   [junit4]   2> 1893428 INFO  (coreCloseExecutor-8190-thread-1) [    x:collection1] o.a.s.m.r.SolrJmxReporter Closing reporter [org.apache.solr.metrics.reporters.SolrJmxReporter@4aa874e4: rootName = null, domain = solr.core.collection1, service url = null, agent id = null] for registry solr.core.collection1 / com.codahale.metrics.MetricRegistry@1e352471
   [junit4]   2> 1893734 ERROR (AnalyzingInfixSuggesterTest-7533-thread-1) [    ] o.a.s.SolrTestCaseJ4 REQUEST FAILED: qt=/suggest_analyzing_infix_long_dictionary&suggest.buildAll=true&wt=xml:org.apache.solr.common.SolrException: SolrCoreState already closed.
   [junit4]   2> 	at org.apache.solr.update.DefaultSolrCoreState.lock(DefaultSolrCoreState.java:186)
   [junit4]   2> 	at org.apache.solr.update.DefaultSolrCoreState.getIndexWriter(DefaultSolrCoreState.java:121)
   [junit4]   2> 	at org.apache.solr.update.SolrCoreState.getTragicException(SolrCoreState.java:198)
   [junit4]   2> 	at org.apache.solr.core.CoreContainer.checkTragicException(CoreContainer.java:1812)
   [junit4]   2> 	at org.apache.solr.handler.RequestHandlerBase.handleRequest(RequestHandlerBase.java:212)
   [junit4]   2> 	at org.apache.solr.core.SolrCore.execute(SolrCore.java:2541)
   [junit4]   2> 	at org.apache.solr.util.TestHarness.query(TestHarness.java:337)
   [junit4]   2> 	at org.apache.solr.util.TestHarness.query(TestHarness.java:319)
   [junit4]   2> 	at org.apache.solr.SolrTestCaseJ4.assertQ(SolrTestCaseJ4.java:891)
   [junit4]   2> 	at org.apache.solr.SolrTestCaseJ4.assertQ(SolrTestCaseJ4.java:877)
   [junit4]   2> 	at org.apache.solr.handler.component.InfixSuggestersTest.lambda$testShutdownDuringBuild$2(InfixSuggestersTest.java:122)
   [junit4]   2> 	at org.apache.lucene.util.LuceneTestCase.expectThrows(LuceneTestCase.java:2688)
   [junit4]   2> 	at org.apache.solr.handler.component.InfixSuggestersTest.lambda$testShutdownDuringBuild$3(InfixSuggestersTest.java:121)
   [junit4]   2> 	at java.base/java.util.concurrent.FutureTask.run(FutureTask.java:264)
   [junit4]   2> 	at org.apache.solr.common.util.ExecutorUtil$MDCAwareThreadPoolExecutor.lambda$execute$0(ExecutorUtil.java:209)
   [junit4]   2> 	at java.base/java.util.concurrent.ThreadPoolExecutor.runWorker(ThreadPoolExecutor.java:1167)
   [junit4]   2> 	at java.base/java.util.concurrent.ThreadPoolExecutor$Worker.run(ThreadPoolExecutor.java:641)
   [junit4]   2> 	at java.base/java.lang.Thread.run(Thread.java:844)
   [junit4]   2> 
   [junit4]   2> 1893740 INFO  (TEST-InfixSuggestersTest.testShutdownDuringBuild-seed#[6E7FF223503CEE32]) [    ] o.a.s.SolrTestCaseJ4 ####initCore
   [junit4]   2> 1893741 INFO  (TEST-InfixSuggestersTest.testShutdownDuringBuild-seed#[6E7FF223503CEE32]) [    ] o.a.s.c.SolrResourceLoader [null] Added 2 libs to classloader, from paths: [/home/jenkins/workspace/Lucene-Solr-master-Linux/solr/core/src/test-files/solr/collection1/lib, /home/jenkins/workspace/Lucene-Solr-master-Linux/solr/core/src/test-files/solr/collection1/lib/classes]
   [junit4]   2> 1893757 INFO  (TEST-InfixSuggestersTest.testShutdownDuringBuild-seed#[6E7FF223503CEE32]) [    ] o.a.s.c.SolrConfig Using Lucene MatchVersion: 8.0.0
   [junit4]   2> 1893764 INFO  (TEST-InfixSuggestersTest.testShutdownDuringBuild-seed#[6E7FF223503CEE32]) [    ] o.a.s.s.IndexSchema [null] Schema name=test
   [junit4]   2> 1893860 INFO  (TEST-InfixSuggestersTest.testShutdownDuringBuild-seed#[6E7FF223503CEE32]) [    ] o.a.s.s.IndexSchema Loaded schema test/1.0 with uniqueid field id
   [junit4]   2> 1893968 INFO  (TEST-InfixSuggestersTest.testShutdownDuringBuild-seed#[6E7FF223503CEE32]) [    ] o.a.s.c.TransientSolrCoreCacheDefault Allocating transient cache for 2147483647 transient cores
   [junit4]   2> 1893968 INFO  (TEST-InfixSuggestersTest.testShutdownDuringBuild-seed#[6E7FF223503CEE32]) [    ] o.a.s.h.a.MetricsHistoryHandler No .system collection, keeping metrics history in memory.
   [junit4]   2> 1893981 INFO  (TEST-InfixSuggestersTest.testShutdownDuringBuild-seed#[6E7FF223503CEE32]) [    ] o.a.s.m.r.SolrJmxReporter JMX monitoring for 'solr.node' (registry 'solr.node') enabled at server: com.sun.jmx.mbeanserver.JmxMBeanServer@6635a491
   [junit4]   2> 1893990 INFO  (TEST-InfixSuggestersTest.testShutdownDuringBuild-seed#[6E7FF223503CEE32]) [    ] o.a.s.m.r.SolrJmxReporter JMX monitoring for 'solr.jvm' (registry 'solr.jvm') enabled at server: com.sun.jmx.mbeanserver.JmxMBeanServer@6635a491
   [junit4]   2> 1893990 INFO  (TEST-InfixSuggestersTest.testShutdownDuringBuild-seed#[6E7FF223503CEE32]) [    ] o.a.s.m.r.SolrJmxReporter JMX monitoring for 'solr.jetty' (registry 'solr.jetty') enabled at server: com.sun.jmx.mbeanserver.JmxMBeanServer@6635a491
   [junit4]   2> 1893991 INFO  (coreLoadExecutor-8200-thread-1) [    x:collection1] o.a.s.c.SolrResourceLoader [null] Added 2 libs to classloader, from paths: [/home/jenkins/workspace/Lucene-Solr-master-Linux/solr/core/src/test-files/solr/collection1/lib, /home/jenkins/workspace/Lucene-Solr-master-Linux/solr/core/src/test-files/solr/collection1/lib/classes]
   [junit4]   2> 1894006 INFO  (coreLoadExecutor-8200-thread-1) [    x:collection1] o.a.s.c.SolrConfig Using Lucene MatchVersion: 8.0.0
   [junit4]   2> 1894013 INFO  (coreLoadExecutor-8200-thread-1) [    x:collection1] o.a.s.s.IndexSchema [collection1] Schema name=test
   [junit4]   2> 1894090 INFO  (coreLoadExecutor-8200-thread-1) [    x:collection1] o.a.s.s.IndexSchema Loaded schema test/1.0 with uniqueid field id
   [junit4]   2> 1894098 INFO  (coreLoadExecutor-8200-thread-1) [    x:collection1] o.a.s.c.CoreContainer Creating SolrCore 'collection1' using configuration from instancedir /home/jenkins/workspace/Lucene-Solr-master-Linux/solr/core/src/test-files/solr/collection1, trusted=true
   [junit4]   2> 1894098 INFO  (coreLoadExecutor-8200-thread-1) [    x:collection1] o.a.s.m.r.SolrJmxReporter JMX monitoring for 'solr.core.collection1' (registry 'solr.core.collection1') enabled at server: com.sun.jmx.mbeanserver.JmxMBeanServer@6635a491
   [junit4]   2> 1894098 INFO  (coreLoadExecutor-8200-thread-1) [    x:collection1] o.a.s.c.SolrCore solr.RecoveryStrategy.Builder
   [junit4]   2> 1894098 INFO  (coreLoadExecutor-8200-thread-1) [    x:collection1] o.a.s.c.SolrCore [[collection1] ] Opening new SolrCore at [/home/jenkins/workspace/Lucene-Solr-master-Linux/solr/core/src/test-files/solr/collection1], dataDir=[/home/jenkins/workspace/Lucene-Solr-master-Linux/solr/build/solr-core/test/J2/temp/solr.handler.component.InfixSuggestersTest_6E7FF223503CEE32-001/init-core-data-001/]
   [junit4]   2> 1894137 INFO  (coreLoadExecutor-8200-thread-1) [    x:collection1] o.a.s.u.CommitTracker Hard AutoCommit: disabled
   [junit4]   2> 1894137 INFO  (coreLoadExecutor-8200-thread-1) [    x:collection1] o.a.s.u.CommitTracker Soft AutoCommit: disabled
   [junit4]   2> 1894138 INFO  (coreLoadExecutor-8200-thread-1) [    x:collection1] o.a.s.u.RandomMergePolicy RandomMergePolicy wrapping class org.apache.lucene.index.LogDocMergePolicy: [LogDocMergePolicy: minMergeSize=1000, mergeFactor=32, maxMergeSize=9223372036854775807, maxMergeSizeForForcedMerge=9223372036854775807, calibrateSizeByDeletes=false, maxMergeDocs=2147483647, maxCFSSegmentSizeMB=8.796093022207999E12, noCFSRatio=0.0]
   [junit4]   2> 1894138 INFO  (coreLoadExecutor-8200-thread-1) [    x:collection1] o.a.s.s.SolrIndexSearcher Opening [Searcher@33cee1cc[collection1] main]
   [junit4]   2> 1894138 WARN  (coreLoadExecutor-8200-thread-1) [    x:collection1] o.a.s.r.ManagedResourceStorage Cannot write to config directory /home/jenkins/workspace/Lucene-Solr-master-Linux/solr/core/src/test-files/solr/collection1/conf; switching to use InMemory storage instead.
   [junit4]   2> 1894139 INFO  (coreLoadExecutor-8200-thread-1) [    x:collection1] o.a.s.h.c.SuggestComponent Initializing SuggestComponent
   [junit4]   2> 1894139 INFO  (coreLoadExecutor-8200-thread-1) [    x:collection1] o.a.s.s.s.SolrSuggester init: {name=shortRandomAnalyzingInfixSuggester,lookupImpl=AnalyzingInfixLookupFactory,dictionaryImpl=RandomTestDictionaryFactory,randDictMaxItems=100,indexPath=short_random_analyzing_infix_suggester,suggestAnalyzerFieldType=text,buildOnCommit=false,buildOnStartup=false}
   [junit4]   2> 1894139 INFO  (coreLoadExecutor-8200-thread-1) [    x:collection1] o.a.s.s.s.SolrSuggester Dictionary loaded with params: {name=shortRandomAnalyzingInfixSuggester,lookupImpl=AnalyzingInfixLookupFactory,dictionaryImpl=RandomTestDictionaryFactory,randDictMaxItems=100,indexPath=short_random_analyzing_infix_suggester,suggestAnalyzerFieldType=text,buildOnCommit=false,buildOnStartup=false}
   [junit4]   2> 1894139 INFO  (coreLoadExecutor-8200-thread-1) [    x:collection1] o.a.s.h.c.SuggestComponent Initializing SuggestComponent
   [junit4]   2> 1894139 INFO  (coreLoadExecutor-8200-thread-1) [    x:collection1] o.a.s.s.s.SolrSuggester init: {name=longRandomAnalyzingInfixSuggester,lookupImpl=AnalyzingInfixLookupFactory,dictionaryImpl=RandomTestDictionaryFactory,randDictMaxItems=100000,indexPath=long_random_analyzing_infix_suggester,suggestAnalyzerFieldType=text,buildOnCommit=false,buildOnStartup=false}
   [junit4]   2> 1894140 INFO  (coreLoadExecutor-8200-thread-1) [    x:collection1] o.a.s.s.s.SolrSuggester Dictionary loaded with params: {name=longRandomAnalyzingInfixSuggester,lookupImpl=AnalyzingInfixLookupFactory,dictionaryImpl=RandomTestDictionaryFactory,randDictMaxItems=100000,indexPath=long_random_analyzing_infix_suggester,suggestAnalyzerFieldType=text,buildOnCommit=false,buildOnStartup=false}
   [junit4]   2> 1894140 INFO  (coreLoadExecutor-8200-thread-1) [    x:collection1] o.a.s.h.c.SuggestComponent Initializing SuggestComponent
   [junit4]   2> 1894140 INFO  (coreLoadExecutor-8200-thread-1) [    x:collection1] o.a.s.s.s.SolrSuggester init: {name=shortRandomBlendedInfixSuggester,lookupImpl=BlendedInfixLookupFactory,dictionaryImpl=RandomTestDictionaryFactory,randDictMaxItems=100,blenderType=position_linear,suggestAnalyzerFieldType=text,indexPath=short_random_blended_infix_suggester,highlight=true,buildOnStartup=false,buildOnCommit=false}
   [junit4]   2> 1894140 INFO  (coreLoadExecutor-8200-thread-1) [    x:collection1] o.a.s.s.s.SolrSuggester Dictionary loaded with params: {name=shortRandomBlendedInfixSuggester,lookupImpl=BlendedInfixLookupFactory,dictionaryImpl=RandomTestDictionaryFactory,randDictMaxItems=100,blenderType=position_linear,suggestAnalyzerFieldType=text,indexPath=short_random_blended_infix_suggester,highlight=true,buildOnStartup=false,buildOnCommit=false}
   [junit4]   2> 1894140 INFO  (coreLoadExecutor-8200-thread-1) [    x:collection1] o.a.s.h.ReplicationHandler Commits will be reserved for 10000ms.
   [junit4]   2> 1894140 INFO  (searcherExecutor-8201-thread-1-processing-x:collection1) [    x:collection1] o.a.s.c.SolrCore [collection1] Registered new searcher Searcher@33cee1cc[collection1] main{ExitableDirectoryReader(UninvertingDirectoryReader())}
   [junit4]   2> 1894141 INFO  (TEST-InfixSuggestersTest.testShutdownDuringBuild-seed#[6E7FF223503CEE32]) [    ] o.a.s.SolrTestCaseJ4 ####initCore end
   [junit4]   2> 1894141 INFO  (TEST-InfixSuggestersTest.testShutdownDuringBuild-seed#[6E7FF223503CEE32]) [    ] o.a.s.SolrTestCaseJ4 ###Ending testShutdownDuringBuild
   [junit4]   2> NOTE: reproduce with: ant test  -Dtestcase=InfixSuggestersTest -Dtests.method=testShutdownDuringBuild -Dtests.seed=6E7FF223503CEE32 -Dtests.multiplier=3 -Dtests.slow=true -Dtests.locale=cy-GB -Dtests.timezone=Asia/Macau -Dtests.asserts=true -Dtests.file.encoding=UTF-8
   [junit4] ERROR   0.85s J2 | InfixSuggestersTest.testShutdownDuringBuild <<<
   [junit4]    > Throwable #1: java.util.concurrent.ExecutionException: junit.framework.AssertionFailedError: Unexpected wrapped exception type, expected CoreIsClosedException
   [junit4]    > 	at __randomizedtesting.SeedInfo.seed([6E7FF223503CEE32:B1F2909C6E55BB50]:0)
   [junit4]    > 	at java.base/java.util.concurrent.FutureTask.report(FutureTask.java:122)
   [junit4]    > 	at java.base/java.util.concurrent.FutureTask.get(FutureTask.java:191)
   [junit4]    > 	at org.apache.solr.handler.component.InfixSuggestersTest.testShutdownDuringBuild(InfixSuggestersTest.java:130)
   [junit4]    > 	at java.base/jdk.internal.reflect.NativeMethodAccessorImpl.invoke0(Native Method)
   [junit4]    > 	at java.base/jdk.internal.reflect.NativeMethodAccessorImpl.invoke(NativeMethodAccessorImpl.java:62)
   [junit4]    > 	at java.base/jdk.internal.reflect.DelegatingMethodAccessorImpl.invoke(DelegatingMethodAccessorImpl.java:43)
   [junit4]    > 	at java.base/java.lang.reflect.Method.invoke(Method.java:564)
   [junit4]    > 	at java.base/java.lang.Thread.run(Thread.java:844)
   [junit4]    > Caused by: junit.framework.AssertionFailedError: Unexpected wrapped exception type, expected CoreIsClosedException
   [junit4]    > 	at org.apache.lucene.util.LuceneTestCase.expectThrows(LuceneTestCase.java:2696)
   [junit4]    > 	at org.apache.solr.handler.component.InfixSuggestersTest.lambda$testShutdownDuringBuild$3(InfixSuggestersTest.java:121)
   [junit4]    > 	at java.base/java.util.concurrent.FutureTask.run(FutureTask.java:264)
   [junit4]    > 	at org.apache.solr.common.util.ExecutorUtil$MDCAwareThreadPoolExecutor.lambda$execute$0(ExecutorUtil.java:209)
   [junit4]    > 	at java.base/java.util.concurrent.ThreadPoolExecutor.runWorker(ThreadPoolExecutor.java:1167)
   [junit4]    > 	at java.base/java.util.concurrent.ThreadPoolExecutor$Worker.run(ThreadPoolExecutor.java:641)
   [junit4]    > 	... 1 more
   [junit4]    > Caused by: java.lang.RuntimeException: Exception during query
   [junit4]    > 	at org.apache.solr.SolrTestCaseJ4.assertQ(SolrTestCaseJ4.java:917)
   [junit4]    > 	at org.apache.solr.SolrTestCaseJ4.assertQ(SolrTestCaseJ4.java:877)
   [junit4]    > 	at org.apache.solr.handler.component.InfixSuggestersTest.lambda$testShutdownDuringBuild$2(InfixSuggestersTest.java:122)
   [junit4]    > 	at org.apache.lucene.util.LuceneTestCase.expectThrows(LuceneTestCase.java:2688)
   [junit4]    > 	... 6 more
   [junit4]    > Caused by: org.apache.solr.common.SolrException: SolrCoreState already closed.
   [junit4]    > 	at org.apache.solr.update.DefaultSolrCoreState.lock(DefaultSolrCoreState.java:186)
   [junit4]    > 	at org.apache.solr.update.DefaultSolrCoreState.getIndexWriter(DefaultSolrCoreState.java:121)
   [junit4]    > 	at org.apache.solr.update.SolrCoreState.getTragicException(SolrCoreState.java:198)
   [junit4]    > 	at org.apache.solr.core.CoreContainer.checkTragicException(CoreContainer.java:1812)
   [junit4]    > 	at org.apache.solr.handler.RequestHandlerBase.handleRequest(RequestHandlerBase.java:212)
   [junit4]    > 	at org.apache.solr.core.SolrCore.execute(SolrCore.java:2541)
   [junit4]    > 	at org.apache.solr.util.TestHarness.query(TestHarness.java:337)
   [junit4]    > 	at org.apache.solr.util.TestHarness.query(TestHarness.java:319)
   [junit4]    > 	at org.apache.solr.SolrTestCaseJ4.assertQ(SolrTestCaseJ4.java:891)
   [junit4]    > 	... 9 more
   [junit4]   2> 1894144 INFO  (TEST-InfixSuggestersTest.testTwoSuggestersBuildThenReload-seed#[6E7FF223503CEE32]) [    ] o.a.s.SolrTestCaseJ4 ###Starting testTwoSuggestersBuildThenReload
   [junit4]   2> 1894144 INFO  (TEST-InfixSuggestersTest.testTwoSuggestersBuildThenReload-seed#[6E7FF223503CEE32]) [    ] o.a.s.h.c.SuggestComponent SuggestComponent prepare with : qt=/suggest_analyzing_infix_short_dictionary&suggest=true&suggest.buildAll=true&wt=xml&indent=off
   [junit4]   2> 1894144 INFO  (TEST-InfixSuggestersTest.testTwoSuggestersBuildThenReload-seed#[6E7FF223503CEE32]) [    ] o.a.s.s.s.SolrSuggester SolrSuggester.build(shortRandomAnalyzingInfixSuggester)
   [junit4]   2> 1894150 INFO  (TEST-InfixSuggestersTest.testTwoSuggestersBuildThenReload-seed#[6E7FF223503CEE32]) [    ] o.a.s.s.s.RandomTestDictionaryFactory org.apache.solr.spelling.suggest.RandomTestDictionaryFactory$RandomTestDictionary.enabled.shortRandomAnalyzingInfixSuggester disabled after emitting 100 items.
   [junit4]   2> 1894498 INFO  (TEST-InfixSuggestersTest.testTwoSuggestersBuildThenReload-seed#[6E7FF223503CEE32]) [    ] o.a.s.h.c.SuggestComponent SuggestComponent process with : qt=/suggest_analyzing_infix_short_dictionary&suggest=true&suggest.buildAll=true&wt=xml&indent=off
   [junit4]   2> 1894498 INFO  (TEST-InfixSuggestersTest.testTwoSuggestersBuildThenReload-seed#[6E7FF223503CEE32]) [    ] o.a.s.c.S.Request [collection1]  webapp=null path=null params={qt=/suggest_analyzing_infix_short_dictionary&suggest.buildAll=true&wt=xml} status=0 QTime=354
   [junit4]   2> 1894499 ERROR (TEST-InfixSuggestersTest.testTwoSuggestersBuildThenReload-seed#[6E7FF223503CEE32]) [    ] o.a.s.c.CorePropertiesLocator Couldn't load core descriptor from /home/jenkins/workspace/Lucene-Solr-master-Linux/solr/core/src/test-files/solr/collection1/core.properties:java.nio.file.NoSuchFileException: /home/jenkins/workspace/Lucene-Solr-master-Linux/solr/core/src/test-files/solr/collection1/core.properties
   [junit4]   2> 1894500 INFO  (TEST-InfixSuggestersTest.testTwoSuggestersBuildThenReload-seed#[6E7FF223503CEE32]) [    ] o.a.s.c.SolrResourceLoader [null] Added 2 libs to classloader, from paths: [/home/jenkins/workspace/Lucene-Solr-master-Linux/solr/core/src/test-files/solr/collection1/lib, /home/jenkins/workspace/Lucene-Solr-master-Linux/solr/core/src/test-files/solr/collection1/lib/classes]
   [junit4]   2> 1894513 INFO  (TEST-InfixSuggestersTest.testTwoSuggestersBuildThenReload-seed#[6E7FF223503CEE32]) [    ] o.a.s.c.SolrConfig Using Lucene MatchVersion: 8.0.0
   [junit4]   2> 1894520 INFO  (TEST-InfixSuggestersTest.testTwoSuggestersBuildThenReload-seed#[6E7FF223503CEE32]) [    ] o.a.s.s.IndexSchema [collection1] Schema name=test
   [junit4]   2> 1894608 INFO  (TEST-InfixSuggestersTest.testTwoSuggestersBuildThenReload-seed#[6E7FF223503CEE32]) [    ] o.a.s.s.IndexSchema Loaded schema test/1.0 with uniqueid field id
   [junit4]   2> 1894613 INFO  (TEST-InfixSuggestersTest.testTwoSuggestersBuildThenReload-seed#[6E7FF223503CEE32]) [    ] o.a.s.c.CoreContainer Reloading SolrCore 'collection1' using configuration from instancedir /home/jenkins/workspace/Lucene-Solr-master-Linux/solr/core/src/test-files/solr/collection1
   [junit4]   2> 1894634 INFO  (TEST-InfixSuggestersTest.testTwoSuggestersBuildThenReload-seed#[6E7FF223503CEE32]) [    x:collection1] o.a.s.m.r.SolrJmxReporter JMX monitoring for 'solr.core.collection1' (registry 'solr.core.collection1') enabled at server: com.sun.jmx.mbeanserver.JmxMBeanServer@6635a491
   [junit4]   2> 1894634 INFO  (TEST-InfixSuggestersTest.testTwoSuggestersBuildThenReload-seed#[6E7FF223503CEE32]) [    x:collection1] o.a.s.c.SolrCore [[collection1] ] Opening new SolrCore at [/home/jenkins/workspace/Lucene-Solr-master-Linux/solr/core/src/test-files/solr/collection1], dataDir=[/home/jenkins/workspace/Lucene-Solr-master-Linux/solr/build/solr-core/test/J2/temp/solr.handler.component.InfixSuggestersTest_6E7FF223503CEE32-001/init-core-data-001/]
   [junit4]   2> 1894667 INFO  (TEST-InfixSuggestersTest.testTwoSuggestersBuildThenReload-seed#[6E7FF223503CEE32]) [    x:collection1] o.a.s.u.CommitTracker Hard AutoCommit: disabled
   [junit4]   2> 1894667 INFO  (TEST-InfixSuggestersTest.testTwoSuggestersBuildThenReload-seed#[6E7FF223503CEE32]) [    x:collection1] o.a.s.u.CommitTracker Soft AutoCommit: disabled
   [junit4]   2> 1894668 INFO  (TEST-InfixSuggestersTest.testTwoSuggestersBuildThenReload-seed#[6E7FF223503CEE32]) [    x:collection1] o.a.s.s.SolrIndexSearcher Opening [Searcher@45332b26[collection1] main]
   [junit4]   2> 1894668 WARN  (TEST-InfixSuggestersTest.testTwoSuggestersBuildThenReload-seed#[6E7FF223503CEE32]) [    x:collection1] o.a.s.r.ManagedResourceStorage Cannot write to config directory /home/jenkins/workspace/Lucene-Solr-master-Linux/solr/core/src/test-files/solr/collection1/conf; switching to use InMemory storage instead.
   [junit4]   2> 1894669 INFO  (TEST-InfixSuggestersTest.testTwoSuggestersBuildThenReload-seed#[6E7FF223503CEE32]) [    x:collection1] o.a.s.h.c.SuggestComponent Initializing SuggestComponent
   [junit4]   2> 1894669 INFO  (TEST-InfixSuggestersTest.testTwoSuggestersBuildThenReload-seed#[6E7FF223503CEE32]) [    x:collection1] o.a.s.s.s.SolrSuggester init: {name=shortRandomAnalyzingInfixSuggester,lookupImpl=AnalyzingInfixLookupFactory,dictionaryImpl=RandomTestDictionaryFactory,randDictMaxItems=100,indexPath=short_random_analyzing_infix_suggester,suggestAnalyzerFieldType=text,buildOnCommit=false,buildOnStartup=false}
   [junit4]   2> 1894669 INFO  (TEST-InfixSuggestersTest.testTwoSuggestersBuildThenReload-seed#[6E7FF223503CEE32]) [    x:collection1] o.a.s.s.s.SolrSuggester Dictionary loaded with params: {name=shortRandomAnalyzingInfixSuggester,lookupImpl=AnalyzingInfixLookupFactory,dictionaryImpl=RandomTestDictionaryFactory,randDictMaxItems=100,indexPath=short_random_analyzing_infix_suggester,suggestAnalyzerFieldType=text,buildOnCommit=false,buildOnStartup=false}
   [junit4]   2> 1894669 INFO  (TEST-InfixSuggestersTest.testTwoSuggestersBuildThenReload-seed#[6E7FF223503CEE32]) [    x:collection1] o.a.s.h.c.SuggestComponent Initializing SuggestComponent
   [junit4]   2> 1894669 INFO  (TEST-InfixSuggestersTest.testTwoSuggestersBuildThenReload-seed#[6E7FF223503CEE32]) [    x:collection1] o.a.s.s.s.SolrSuggester init: {name=longRandomAnalyzingInfixSuggester,lookupImpl=AnalyzingInfixLookupFactory,dictionaryImpl=RandomTestDictionaryFactory,randDictMaxItems=100000,indexPath=long_random_analyzing_infix_suggester,suggestAnalyzerFieldType=text,buildOnCommit=false,buildOnStartup=false}
   [junit4]   2> 1894670 INFO  (TEST-InfixSuggestersTest.testTwoSuggestersBuildThenReload-seed#[6E7FF223503CEE32]) [    x:collection1] o.a.s.s.s.SolrSuggester Dictionary loaded with params: {name=longRandomAnalyzingInfixSuggester,lookupImpl=AnalyzingInfixLookupFactory,dictionaryImpl=RandomTestDictionaryFactory,randDictMaxItems=100000,indexPath=long_random_analyzing_infix_suggester,suggestAnalyzerFieldType=text,buildOnCommit=false,buildOnStartup=false}
   [junit4]   2> 1894670 INFO  (TEST-InfixSuggestersTest.testTwoSuggestersBuildThenReload-seed#[6E7FF223503CEE32]) [    x:collection1] o.a.s.h.c.SuggestComponent Initializing SuggestComponent
   [junit4]   2> 1894670 INFO  (TEST-InfixSuggestersTest.testTwoSuggestersBuildThenReload-seed#[6E7FF223503CEE32]) [    x:collection1] o.a.s.s.s.SolrSuggester init: {name=shortRandomBlendedInfixSuggester,lookupImpl=BlendedInfixLookupFactory,dictionaryImpl=RandomTestDictionaryFactory,randDictMaxItems=100,blenderType=position_linear,suggestAnalyzerFieldType=text,indexPath=short_random_blended_infix_suggester,highlight=true,buildOnStartup=false,buildOnCommit=false}
   [junit4]   2> 1894670 INFO  (TEST-InfixSuggestersTest.testTwoSuggestersBuildThenReload-seed#[6E7FF223503CEE32]) [    x:collection1] o.a.s.s.s.SolrSuggester Dictionary loaded with params: {name=shortRandomBlendedInfixSuggester,lookupImpl=BlendedInfixLookupFactory,dictionaryImpl=RandomTestDictionaryFactory,randDictMaxItems=100,blenderType=position_linear,suggestAnalyzerFieldType=text,indexPath=short_random_blended_infix_suggester,highlight=true,buildOnStartup=false,buildOnCommit=false}
   [junit4]   2> 1894670 INFO  (TEST-InfixSuggestersTest.testTwoSuggestersBuildThenReload-seed#[6E7FF223503CEE32]) [    x:collection1] o.a.s.h.ReplicationHandler Commits will be reserved for 10000ms.
   [junit4]   2> 1894670 INFO  (TEST-InfixSuggestersTest.testTwoSuggestersBuildThenReload-seed#[6E7FF223503CEE32]) [    x:collection1] o.a.s.u.RandomMergePolicy RandomMergePolicy wrapping class org.apache.lucene.index.LogDocMergePolicy: [LogDocMergePolicy: minMergeSize=1000, mergeFactor=11, maxMergeSize=9223372036854775807, maxMergeSizeForForcedMerge=9223372036854775807, calibrateSizeByDeletes=true, maxMergeDocs=2147483647, maxCFSSegmentSizeMB=8.796093022207999E12, noCFSRatio=0.4216934460010745]
   [junit4]   2> 1894671 INFO  (TEST-InfixSuggestersTest.testTwoSuggestersBuildThenReload-seed#[6E7FF223503CEE32]) [    x:collection1] o.a.s.u.DefaultSolrCoreState New IndexWriter is ready to be used.
   [junit4]   2> 1894671 INFO  (searcherExecutor-8205-thread-1-processing-x:collection1) [    x:collection1] o.a.s.c.SolrCore [collection1] Registered new searcher Searcher@45332b26[collection1] main{ExitableDirectoryReader(UninvertingDirectoryReader())}
   [junit4]   2> 1894671 INFO  (TEST-InfixSuggestersTest.testTwoSuggestersBuildThenReload-seed#[6E7FF223503CEE32]) [    x:collection1] o.a.s.s.SolrIndexSearcher Opening [Searcher@163bd8dd[collection1] main]
   [junit4]   2> 1894672 INFO  (TEST-InfixSuggestersTest.testTwoSuggestersBuildThenReload-seed#[6E7FF223503CEE32]) [    x:collection1] o.a.s.c.SolrCore [collection1]  CLOSING SolrCore org.apache.solr.core.SolrCore@c211b47
   [junit4]   2> 1894672 INFO  (TEST-InfixSuggestersTest.testTwoSuggestersBuildThenReload-seed#[6E7FF223503CEE32]) [    x:collection1] o.a.s.m.SolrMetricManager Closing metric reporters for registry=solr.core.collection1, tag=c211b47
   [junit4]   2> 1894672 INFO  (TEST-InfixSuggestersTest.testTwoSuggestersBuildThenReload-seed#[6E7FF223503CEE32]) [    x:collection1] o.a.s.m.r.SolrJmxReporter Closing reporter [org.apache.solr.metrics.reporters.SolrJmxReporter@6cdc0aa5: rootName = null, domain = solr.core.collection1, service url = null, agent id = null] for registry solr.core.collection1 / com.codahale.metrics.MetricRegistry@68c78b48
   [junit4]   2> 1894672 INFO  (searcherExecutor-8205-thread-1-processing-x:collection1) [    x:collection1] o.a.s.c.SolrCore [collection1] Registered new searcher Searcher@163bd8dd[collection1] main{ExitableDirectoryReader(UninvertingDirectoryReader())}
   [junit4]   2> 1894679 INFO  (TEST-InfixSuggestersTest.testTwoSuggestersBuildThenReload-seed#[6E7FF223503CEE32]) [    x:collection1] o.a.s.h.c.SuggestComponent SuggestComponent prepare with : qt=/suggest_blended_infix_short_dictionary&suggest.onlyMorePopular=true&indent=off&suggest.count=10&suggest=true&suggest.collate=true&suggest.buildAll=true&suggest.dictionary=shortRandomBlendedInfixSuggester&wt=xml
   [junit4]   2> 1894679 INFO  (TEST-InfixSuggestersTest.testTwoSuggestersBuildThenReload-seed#[6E7FF223503CEE32]) [    x:collection1] o.a.s.s.s.SolrSuggester SolrSuggester.build(shortRandomBlendedInfixSuggester)
   [junit4]   2> 1894692 INFO  (TEST-InfixSuggestersTest.testTwoSuggestersBuildThenReload-seed#[6E7FF223503CEE32]) [    x:collection1] o.a.s.s.s.RandomTestDictionaryFactory org.apache.solr.spelling.suggest.RandomTestDictionaryFactory$RandomTestDictionary.enabled.shortRandomBlendedInfixSuggester disabled after emitting 100 items.
   [junit4]   2> 1894867 INFO  (TEST-InfixSuggestersTest.testTwoSuggestersBuildThenReload-seed#[6E7FF223503CEE32]) [    x:collection1] o.a.s.h.c.SuggestComponent SuggestComponent process with : qt=/suggest_blended_infix_short_dictionary&suggest.onlyMorePopular=true&indent=off&suggest.count=10&suggest=true&suggest.collate=true&suggest.buildAll=true&suggest.dictionary=shortRandomBlendedInfixSuggester&wt=xml
   [junit4]   2> 1894867 INFO  (TEST-InfixSuggestersTest.testTwoSuggestersBuildThenReload-seed#[6E7FF223503CEE32]) [    x:collection1] o.a.s.c.S.Request [collection1]  webapp=null path=null params={qt=/suggest_blended_infix_short_dictionary&suggest.buildAll=true&wt=xml} status=0 QTime=187
   [junit4]   2> 1894867 ERROR (TEST-InfixSuggestersTest.testTwoSuggestersBuildThenReload-seed#[6E7FF223503CEE32]) [    x:collection1] o.a.s.c.CorePropertiesLocator Couldn't load core descriptor from /home/jenkins/workspace/Lucene-Solr-master-Linux/solr/core/src/test-files/solr/collection1/core.properties:java.nio.file.NoSuchFileException: /home/jenkins/workspace/Lucene-Solr-master-Linux/solr/core/src/test-files/solr/collection1/core.properties
   [junit4]   2> 1894868 INFO  (TEST-InfixSuggestersTest.testTwoSuggestersBuildThenReload-seed#[6E7FF223503CEE32]) [    x:collection1] o.a.s.c.SolrResourceLoader [null] Added 2 libs to classloader, from paths: [/home/jenkins/workspace/Lucene-Solr-master-Linux/solr/core/src/test-files/solr/collection1/lib, /home/jenkins/workspace/Lucene-Solr-master-Linux/solr/core/src/test-files/solr/collection1/lib/classes]
   [junit4]   2> 1894892 INFO  (TEST-InfixSuggestersTest.testTwoSuggestersBuildThenReload-seed#[6E7FF223503CEE32]) [    x:collection1] o.a.s.c.SolrConfig Using Lucene MatchVersion: 8.0.0
   [junit4]   2> 1894902 INFO  (TEST-InfixSuggestersTest.testTwoSuggestersBuildThenReload-seed#[6E7FF223503CEE32]) [    x:collection1] o.a.s.s.IndexSchema [collection1] Schema name=test
   [junit4]   2> 1894985 INFO  (TEST-InfixSuggestersTest.testTwoSuggestersBuildThenReload-seed#[6E7FF223503CEE32]) [    x:collection1] o.a.s.s.IndexSchema Loaded schema test/1.0 with uniqueid field id
   [junit4]   2> 1894990 INFO  (TEST-InfixSuggestersTest.testTwoSuggestersBuildThenReload-seed#[6E7FF223503CEE32]) [    x:collection1] o.a.s.c.CoreContainer Reloading SolrCore 'collection1' using configuration from instancedir /home/jenkins/workspace/Lucene-Solr-master-Linux/solr/core/src/test-files/solr/collection1
   [junit4]   2> 1895006 INFO  (TEST-InfixSuggestersTest.testTwoSuggestersBuildThenReload-seed#[6E7FF223503CEE32]) [    x:collection1] o.a.s.m.r.SolrJmxReporter JMX monitoring for 'solr.core.collection1' (registry 'solr.core.collection1') enabled at server: com.sun.jmx.mbeanserver.JmxMBeanServer@6635a491
   [junit4]   2> 1895006 INFO  (TEST-InfixSuggestersTest.testTwoSuggestersBuildThenReload-seed#[6E7FF223503CEE32]) [    x:collection1] o.a.s.c.SolrCore [[collection1] ] Opening new SolrCore at [/home/jenkins/workspace/Lucene-Solr-master-Linux/solr/core/src/test-files/solr/collection1], dataDir=[/home/jenkins/workspace/Lucene-Solr-master-Linux/solr/build/solr-core/test/J2/temp/solr.handler.component.InfixSuggestersTest_6E7FF223503CEE32-001/init-core-data-001/]
   [junit4]   2> 1895037 INFO  (TEST-InfixSuggestersTest.testTwoSuggestersBuildThenReload-seed#[6E7FF223503CEE32]) [    x:collection1] o.a.s.u.CommitTracker Hard AutoCommit: disabled
   [junit4]   2> 1895037 INFO  (TEST-InfixSuggestersTest.testTwoSuggestersBuildThenReload-seed#[6E7FF223503CEE32]) [    x:collection1] o.a.s.u.CommitTracker Soft AutoCommit: disabled
   [junit4]   2> 1895038 INFO  (TEST-InfixSuggestersTest.testTwoSuggestersBuildThenReload-seed#[6E7FF223503CEE32]) [    x:collection1] o.a.s.s.SolrIndexSearcher Opening [Searcher@fef7820[collection1] main]
   [junit4]   2> 1895039 WARN  (TEST-InfixSuggestersTest.testTwoSuggestersBuildThenReload-seed#[6E7FF223503CEE32]) [    x:collection1] o.a.s.r.ManagedResourceStorage Cannot write to config directory /home/jenkins/workspace/Lucene-Solr-master-Linux/solr/core/src/test-files/solr/collection1/conf; switching to use InMemory storage instead.
   [junit4]   2> 1895039 INFO  (TEST-InfixSuggestersTest.testTwoSuggestersBuildThenReload-seed#[6E7FF223503CEE32]) [    x:collection1] o.a.s.h.c.SuggestComponent Initializing SuggestComponent
   [junit4]   2> 1895039 INFO  (TEST-InfixSuggestersTest.testTwoSuggestersBuildThenReload-seed#[6E7FF223503CEE32]) [    x:collection1] o.a.s.s.s.SolrSuggester init: {name=shortRandomAnalyzingInfixSuggester,lookupImpl=AnalyzingInfixLookupFactory,dictionaryImpl=RandomTestDictionaryFactory,randDictMaxItems=100,indexPath=short_random_analyzing_infix_suggester,suggestAnalyzerFieldType=text,buildOnCommit=false,buildOnStartup=false}
   [junit4]   2> 1895040 INFO  (TEST-InfixSuggestersTest.testTwoSuggestersBuildThenReload-seed#[6E7FF223503CEE32]) [    x:collection1] o.a.s.s.s.SolrSuggester Dictionary loaded with params: {name=shortRandomAnalyzingInfixSuggester,lookupImpl=AnalyzingInfixLookupFactory,dictionaryImpl=RandomTestDictionaryFactory,randDictMaxItems=100,indexPath=short_random_analyzing_infix_suggester,suggestAnalyzerFieldType=text,buildOnCommit=false,buildOnStartup=false}
   [junit4]   2> 1895040 INFO  (TEST-InfixSuggestersTest.testTwoSuggestersBuildThenReload-seed#[6E7FF223503CEE32]) [    x:collection1] o.a.s.h.c.SuggestComponent Initializing SuggestComponent
   [junit4]   2> 1895040 INFO  (TEST-InfixSuggestersTest.testTwoSuggestersBuildThenReload-seed#[6E7FF223503CEE32]) [    x:collection1] o.a.s.s.s.SolrSuggester init: {name=longRandomAnalyzingInfixSuggester,lookupImpl=AnalyzingInfixLookupFactory,dictionaryImpl=RandomTestDictionaryFactory,randDictMaxItems=100000,indexPath=long_random_analyzing_infix_suggester,suggestAnalyzerFieldType=text,buildOnCommit=false,buildOnStartup=false}
   [junit4]   2> 1895040 INFO  (TEST-InfixSuggestersTest.testTwoSuggestersBuildThenReload-seed#[6E7FF223503CEE32]) [    x:collection1] o.a.s.s.s.SolrSuggester Dictionary loaded with params: {name=longRandomAnalyzingInfixSuggester,lookupImpl=AnalyzingInfixLookupFactory,dictionaryImpl=RandomTestDictionaryFactory,randDictMaxItems=100000,indexPath=long_random_analyzing_infix_suggester,suggestAnalyzerFieldType=text,buildOnCommit=false,buildOnStartup=false}
   [junit4]   2> 1895040 INFO  (TEST-InfixSuggestersTest.testTwoSuggestersBuildThenReload-seed#[6E7FF223503CEE32]) [    x:collection1] o.a.s.h.c.SuggestComponent Initializing SuggestComponent
   [junit4]   2> 1895040 INFO  (TEST-InfixSuggestersTest.testTwoSuggestersBuildThenReload-seed#[6E7FF223503CEE32]) [    x:collection1] o.a.s.s.s.SolrSuggester init: {name=shortRandomBlendedInfixSuggester,lookupImpl=BlendedInfixLookupFactory,dictionaryImpl=RandomTestDictionaryFactory,randDictMaxItems=100,blenderType=position_linear,suggestAnalyzerFieldType=text,indexPath=short_random_blended_infix_suggester,highlight=true,buildOnStartup=false,buildOnCommit=false}
   [junit4]   2> 1895041 INFO  (TEST-InfixSuggestersTest.testTwoSuggestersBuildThenReload-seed#[6E7FF223503CEE32]) [    x:collection1] o.a.s.s.s.SolrSuggester Dictionary loaded with params: {name=shortRandomBlendedInfixSuggester,lookupImpl=BlendedInfixLookupFactory,dictionaryImpl=RandomTestDictionaryFactory,randDictMaxItems=100,blenderType=position_linear,suggestAnalyzerFieldType=text,indexPath=short_random_blended_infix_suggester,highlight=true,buildOnStartup=false,buildOnCommit=false}
   [junit4]   2> 1895041 INFO  (TEST-InfixSuggestersTest.testTwoSuggestersBuildThenReload-seed#[6E7FF223503CEE32]) [    x:collection1] o.a.s.h.ReplicationHandler Commits will be reserved for 10000ms.
   [junit4]   2> 1895048 INFO  (TEST-InfixSuggestersTest.testTwoSuggestersBuildThenReload-seed#[6E7FF223503CEE32]) [    x:collection1] o.a.s.u.RandomMergePolicy RandomMergePolicy wrapping class org.apache.lucene.index.AlcoholicMergePolicy: [AlcoholicMergePolicy: minMergeSize=0, mergeFactor=10, maxMergeSize=244137142, maxMergeSizeForForcedMerge=9223372036854775807, calibrateSizeByDeletes=true, maxMergeDocs=2147483647, maxCFSSegmentSizeMB=8.796093022207999E12, noCFSRatio=0.1]
   [junit4]   2> 1895048 INFO  (TEST-InfixSuggestersTest.testTwoSuggestersBuildThenReload-seed#[6E7FF223503CEE32]) [    x:collection1] o.a.s.u.DefaultSolrCoreState New IndexWriter is ready to be used.
   [junit4]   2> 1895049 INFO  (searcherExecutor-8209-thread-1-processing-x:collection1) [    x:collection1] o.a.s.c.SolrCore [collection1] Registered new searcher Searcher@fef7820[collection1] main{ExitableDirectoryReader(UninvertingDirectoryReader())}
   [junit4]   2> 1895050 INFO  (TEST-InfixSuggestersTest.testTwoSuggestersBuildThenReload-seed#[6E7FF223503CEE32]) [    x:collection1] o.a.s.s.SolrIndexSearcher Opening [Searcher@28db4bfd[collection1] main]
   [junit4]   2> 1895050 INFO  (TEST-InfixSuggestersTest.testTwoSuggestersBuildThenReload-seed#[6E7FF223503CEE32]) [    x:collection1] o.a.s.c.SolrCore [collection1]  CLOSING SolrCore org.apache.solr.core.SolrCore@63e13a9c
   [junit4]   2> 1895050 INFO  (TEST-InfixSuggestersTest.testTwoSuggestersBuildThenReload-seed#[6E7FF223503CEE32]) [    x:collection1] o.a.s.m.SolrMetricManager Closing metric reporters for registry=solr.core.collection1, tag=63e13a9c
   [junit4]   2> 1895050 INFO  (TEST-InfixSuggestersTest.testTwoSuggestersBuildThenReload-seed#[6E7FF223503CEE32]) [    x:collection1] o.a.s.m.r.SolrJmxReporter Closing reporter [org.apache.solr.metrics.reporters.SolrJmxReporter@6cbdb3a5: rootName = null, domain = solr.core.collection1, service url = null, agent id = null] for registry solr.core.collection1 / com.codahale.metrics.MetricRegistry@68c78b48
   [junit4]   2> 1895051 INFO  (searcherExecutor-8209-thread-1-processing-x:collection1) [    x:collection1] o.a.s.c.SolrCore [collection1] Registered new searcher Searcher@28db4bfd[collection1] main{ExitableDirectoryReader(UninvertingDirectoryReader())}
   [junit4]   2> 1895056 INFO  (TEST-InfixSuggestersTest.testTwoSuggestersBuildThenReload-seed#[6E7FF223503CEE32]) [    x:collection1] o.a.s.SolrTestCaseJ4 ###Ending testTwoSuggestersBuildThenReload
   [junit4]   2> 1895058 INFO  (TEST-InfixSuggestersTest.testBlendedInfixSuggesterBuildThenReload-seed#[6E7FF223503CEE32]) [    x:collection1] o.a.s.SolrTestCaseJ4 ###Starting testBlendedInfixSuggesterBuildThenReload
   [junit4]   2> 1895058 INFO  (TEST-InfixSuggestersTest.testBlendedInfixSuggesterBuildThenReload-seed#[6E7FF223503CEE32]) [    x:collection1] o.a.s.h.c.SuggestComponent SuggestComponent prepare with : qt=/suggest_blended_infix_short_dictionary&suggest.onlyMorePopular=true&indent=off&suggest.count=10&suggest=true&suggest.collate=true&suggest.buildAll=true&suggest.dictionary=shortRandomBlendedInfixSuggester&wt=xml
   [junit4]   2> 1895058 INFO  (TEST-InfixSuggestersTest.testBlendedInfixSuggesterBuildThenReload-seed#[6E7FF223503CEE32]) [    x:collection1] o.a.s.s.s.SolrSuggester SolrSuggester.build(shortRandomBlendedInfixSuggester)
   [junit4]   2> 1895069 INFO  (TEST-InfixSuggestersTest.testBlendedInfixSuggesterBuildThenReload-seed#[6E7FF223503CEE32]) [    x:collection1] o.a.s.s.s.RandomTestDictionaryFactory org.apache.solr.spelling.suggest.RandomTestDictionaryFactory$RandomTestDictionary.enabled.shortRandomBlendedInfixSuggester disabled after emitting 100 items.
   [junit4]   2> 1895206 INFO  (TEST-InfixSuggestersTest.testBlendedInfixSuggesterBuildThenReload-seed#[6E7FF223503CEE32]) [    x:collection1] o.a.s.h.c.SuggestComponent SuggestComponent process with : qt=/suggest_blended_infix_short_dictionary&suggest.onlyMorePopular=true&indent=off&suggest.count=10&suggest=true&suggest.collate=true&suggest.buildAll=true&suggest.dictionary=shortRandomBlendedInfixSuggester&wt=xml
   [junit4]   2> 1895206 INFO  (TEST-InfixSuggestersTest.testBlendedInfixSuggesterBuildThenReload-seed#[6E7FF223503CEE32]) [    x:collection1] o.a.s.c.S.Request [collection1]  webapp=null path=null params={qt=/suggest_blended_infix_short_dictionary&suggest.buildAll=true&wt=xml} status=0 QTime=148
   [junit4]   2> 1895206 ERROR (TEST-InfixSuggestersTest.testBlendedInfixSuggesterBuildThenReload-seed#[6E7FF223503CEE32]) [    x:collection1] o.a.s.c.CorePropertiesLocator Couldn't load core descriptor from /home/jenkins/workspace/Lucene-Solr-master-Linux/solr/core/src/test-files/solr/collection1/core.properties:java.nio.file.NoSuchFileException: /home/jenkins/workspace/Lucene-Solr-master-Linux/solr/core/src/test-files/solr/collection1/core.properties
   [junit4]   2> 1895207 INFO  (TEST-InfixSuggestersTest.testBlendedInfixSuggesterBuildThenReload-seed#[6E7FF223503CEE32]) [    x:collection1] o.a.s.c.SolrResourceLoader [null] Added 2 libs to classloader, from paths: [/home/jenkins/workspace/Lucene-Solr-master-Linux/solr/core/src/test-files/solr/collection1/lib, /home/jenkins/workspace/Lucene-Solr-master-Linux/solr/core/src/test-files/solr/collection1/lib/classes]
   [junit4]   2> 1895219 INFO  (TEST-InfixSuggestersTest.testBlendedInfixSuggesterBuildThenReload-seed#[6E7FF223503CEE32]) [    x:collection1] o.a.s.c.SolrConfig Using Lucene MatchVersion: 8.0.0
   [junit4]   2> 1895226 INFO  (TEST-InfixSuggestersTest.testBlendedInfixSuggesterBuildThenReload-seed#[6E7FF223503CEE32]) [    x:collection1] o.a.s.s.IndexSchema [collection1] Schema name=test
   [junit4]   2> 1895308 INFO  (TEST-InfixSuggestersTest.testBlendedInfixSuggesterBuildThenReload-seed#[6E7FF223503CEE32]) [    x:collection1] o.a.s.s.IndexSchema Loaded schema test/1.0 with uniqueid field id
   [junit4]   2> 1895314 INFO  (TEST-InfixSuggestersTest.testBlendedInfixSuggesterBuildThenReload-seed#[6E7FF223503CEE32]) [    x:collection1] o.a.s.c.CoreContainer Reloading SolrCore 'collection1' using configuration from instancedir /home/jenkins/workspace/Lucene-Solr-master-Linux/solr/core/src/test-files/solr/collection1
   [junit4]   2> 1895331 INFO  (TEST-InfixSuggestersTest.testBlendedInfixSuggesterBuildThenReload-seed#[6E7FF223503CEE32]) [    x:collection1] o.a.s.m.r.SolrJmxReporter JMX monitoring for 'solr.core.collection1' (registry 'solr.core.collection1') enabled at server: com.sun.jmx.mbeanserver.JmxMBeanServer@6635a491
   [junit4]   2> 1895331 INFO  (TEST-InfixSuggestersTest.testBlendedInfixSuggesterBuildThenReload-seed#[6E7FF223503CEE32]) [    x:collection1] o.a.s.c.SolrCore [[collection1] ] Opening new SolrCore at [/home/jenkins/workspace/Lucene-Solr-master-Linux/solr/core/src/test-files/solr/collection1], dataDir=[/home/jenkins/workspace/Lucene-Solr-master-Linux/solr/build/solr-core/test/J2/temp/solr.handler.component.InfixSuggestersTest_6E7FF223503CEE32-001/init-core-data-001/]
   [junit4]   2> 1895369 INFO  (TEST-InfixSuggestersTest.testBlendedInfixSuggesterBuildThenReload-seed#[6E7FF223503CEE32]) [    x:collection1] o.a.s.u.CommitTracker Hard AutoCommit: disabled
   [junit4]   2> 1895369 INFO  (TEST-InfixSuggestersTest.testBlendedInfixSuggesterBuildThenReload-seed#[6E7FF223503CEE32]) [    x:collection1] o.a.s.u.CommitTracker Soft AutoCommit: disabled
   [junit4]   2> 1895370 INFO  (TEST-InfixSuggestersTest.testBlendedInfixSuggesterBuildThenReload-seed#[6E7FF223503CEE32]) [    x:collection1] o.a.s.s.SolrIndexSearcher Opening [Searcher@1dd119f0[collection1] main]
   [junit4]   2> 1895370 WARN  (TEST-InfixSuggestersTest.testBlendedInfixSuggesterBuildThenReload-seed#[6E7FF223503CEE32]) [    x:collection1] o.a.s.r.ManagedResourceStorage Cannot write to config directory /home/jenkins/workspace/Lucene-Solr-master-Linux/solr/core/src/test-files/solr/collection1/conf; switching to use InMemory storage instead.
   [junit4]   2> 1895371 INFO  (TEST-InfixSuggestersTest.testBlendedInfixSuggesterBuildThenReload-seed#[6E7FF223503CEE32]) [    x:collection1] o.a.s.h.c.SuggestComponent Initializing SuggestComponent
   [junit4]   2> 1895371 INFO  (TEST-InfixSuggestersTest.testBlendedInfixSuggesterBuildThenReload-seed#[6E7FF223503CEE32]) [    x:collection1] o.a.s.s.s.SolrSuggester init: {name=shortRandomAnalyzingInfixSuggester,lookupImpl=AnalyzingInfixLookupFactory,dictionaryImpl=RandomTestDictionaryFactory,randDictMaxItems=100,indexPath=short_random_analyzing_infix_suggester,suggestAnalyzerFieldType=text,buildOnCommit=false,buildOnStartup=false}
   [junit4]   2> 1895372 INFO  (TEST-InfixSuggestersTest.testBlendedInfixSuggesterBuildThenReload-seed#[6E7FF223503CEE32]) [    x:collection1] o.a.s.s.s.SolrSuggester Dictionary loaded with params: {name=shortRandomAnalyzingInfixSuggester,lookupImpl=AnalyzingInfixLookupFactory,dictionaryImpl=RandomTestDictionaryFactory,randDictMaxItems=100,indexPath=short_random_analyzing_infix_suggester,suggestAnalyzerFieldType=text,buildOnCommit=false,buildOnStartup=false}
   [junit4]   2> 1895372 INFO  (TEST-InfixSuggestersTest.testBlendedInfixSuggesterBuildThenReload-seed#[6E7FF223503CEE32]) [    x:collection1] o.a.s.h.c.SuggestComponent Initializing SuggestComponent
   [junit4]   2> 1895372 INFO  (TEST-InfixSuggestersTest.testBlendedInfixSuggesterBuildThenReload-seed#[6E7FF223503CEE32]) [    x:collection1] o.a.s.s.s.SolrSuggester init: {name=longRandomAnalyzingInfixSuggester,lookupImpl=AnalyzingInfixLookupFactory,dictionaryImpl=RandomTestDictionaryFactory,randDictMaxItems=100000,indexPath=long_random_analyzing_infix_suggester,suggestAnalyzerFieldType=text,buildOnCommit=false,buildOnStartup=false}
   [junit4]   2> 1895372 INFO  (TEST-InfixSuggestersTest.testBlendedInfixSuggesterBuildThenReload-seed#[6E7FF223503CEE32]) [    x:collection1] o.a.s.s.s.SolrSuggester Dictionary loaded with params: {name=longRandomAnalyzingInfixSuggester,lookupImpl=AnalyzingInfixLookupFactory,dictionaryImpl=RandomTestDictionaryFactory,randDictMaxItems=100000,indexPath=long_random_analyzing_infix_suggester,suggestAnalyzerFieldType=text,buildOnCommit=false,buildOnStartup=false}
   [junit4]   2> 1895372 INFO  (TEST-InfixSuggestersTest.testBlendedInfixSuggesterBuildThenReload-seed#[6E7FF223503CEE32]) [    x:collection1] o.a.s.h.c.SuggestComponent Initializing SuggestComponent
   [junit4]   2> 1895372 INFO  (TEST-InfixSuggestersTest.testBlendedInfixSuggesterBuildThenReload-seed#[6E7FF223503CEE32]) [    x:collection1] o.a.s.s.s.SolrSuggester init: {name=shortRandomBlendedInfixSuggester,lookupImpl=BlendedInfixLookupFactory,dictionaryImpl=RandomTestDictionaryFactory,randDictMaxItems=100,blenderType=position_linear,suggestAnalyzerFieldType=text,indexPath=short_random_blended_infix_suggester,highlight=true,buildOnStartup=false,buildOnCommit=false}
   [junit4]   2> 1895373 INFO  (TEST-InfixSuggestersTest.testBlendedInfixSuggesterBuildThenReload-seed#[6E7FF223503CEE32]) [    x:collection1] o.a.s.s.s.SolrSuggester Dictionary loaded with params: {name=shortRandomBlendedInfixSuggester,lookupImpl=BlendedInfixLookupFactory,dictionaryImpl=RandomTestDictionaryFactory,randDictMaxItems=100,blenderType=position_linear,suggestAnalyzerFieldType=text,indexPath=short_random_blended_infix_suggester,highlight=true,buildOnStartup=false,buildOnCommit=false}
   [junit4]   2> 1895373 INFO  (TEST-InfixSuggestersTest.testBlendedInfixSuggesterBuildThenReload-seed#[6E7FF223503CEE32]) [    x:collection1] o.a.s.h.ReplicationHandler Commits will be reserved for 10000ms.
   [junit4]   2> 1895374 INFO  (TEST-InfixSuggestersTest.testBlendedInfixSuggesterBuildThenReload-seed#[6E7FF223503CEE32]) [    x:collection1] o.a.s.u.RandomMergePolicy RandomMergePolicy wrapping class org.apache.lucene.index.LogByteSizeMergePolicy: [LogByteSizeMergePolicy: minMergeSize=1677721, mergeFactor=34, maxMergeSize=2147483648, maxMergeSizeForForcedMerge=9223372036854775807, calibrateSizeByDeletes=false, maxMergeDocs=2147483647, maxCFSSegmentSizeMB=8.796093022207999E12, noCFSRatio=1.0]
   [junit4]   2> 1895374 INFO  (TEST-InfixSuggestersTest.testBlendedInfixSuggesterBuildThenReload-seed#[6E7FF223503CEE32]) [    x:collection1] o.a.s.u.DefaultSolrCoreState New IndexWriter is ready to be used.
   [junit4]   2> 1895375 INFO  (searcherExecutor-8213-thread-1-processing-x:collection1) [    x:collection1] o.a.s.c.SolrCore [collection1] Registered new searcher Searcher@1dd119f0[collection1] main{ExitableDirectoryReader(UninvertingDirectoryReader())}
   [junit4]   2> 1895375 INFO  (TEST-InfixSuggestersTest.testBlendedInfixSuggesterBuildThenReload-seed#[6E7FF223503CEE32]) [    x:collection1] o.a.s.s.SolrIndexSearcher Opening [Searcher@538895f9[collection1] main]
   [junit4]   2> 1895376 INFO  (TEST-InfixSuggestersTest.testBlendedInfixSuggesterBuildThenReload-seed#[6E7FF223503CEE32]) [    x:collection1] o.a.s.c.SolrCore [collection1]  CLOSING SolrCore org.apache.solr.core.SolrCore@44d726f6
   [junit4]   2> 1895376 INFO  (TEST-InfixSuggestersTest.testBlendedInfixSuggesterBuildThenReload-seed#[6E7FF223503CEE32]) [    x:collection1] o.a.s.m.SolrMetricManager Closing metric reporters for registry=solr.core.collection1, tag=44d726f6
   [junit4]   2> 1895376 INFO  (TEST-InfixSuggestersTest.testBlendedInfixSuggesterBuildThenReload-seed#[6E7FF223503CEE32]) [    x:collection1] o.a.s.m.r.SolrJmxReporter Closing reporter [org.apache.solr.metrics.reporters.SolrJmxReporter@68144933: rootName = null, domain = solr.core.collection1, service url = null, agent id = null] for registry solr.core.collection1 / com.codahale.metrics.MetricRegistry@68c78b48
   [junit4]   2> 1895377 INFO  (searcherExecutor-8213-thread-1-processing-x:collection1) [    x:collection1] o.a.s.c.SolrCore [collection1] Registered new searcher Searcher@538895f9[collection1] main{ExitableDirectoryReader(UninvertingDirectoryReader())}
   [junit4]   2> 1895385 INFO  (TEST-InfixSuggestersTest.testBlendedInfixSuggesterBuildThenReload-seed#[6E7FF223503CEE32]) [    x:collection1] o.a.s.SolrTestCaseJ4 ###Ending testBlendedInfixSuggesterBuildThenReload
   [junit4]   2> 1895386 INFO  (TEST-InfixSuggestersTest.test2xBuildReload-seed#[6E7FF223503CEE32]) [    x:collection1] o.a.s.SolrTestCaseJ4 ###Starting test2xBuildReload
   [junit4]   2> 1895386 INFO  (TEST-InfixSuggestersTest.test2xBuildReload-seed#[6E7FF223503CEE32]) [    x:collection1] o.a.s.h.c.SuggestComponent SuggestComponent prepare with : qt=/suggest_analyzing_infix_short_dictionary&suggest=true&suggest.buildAll=true&wt=xml&indent=off
   [junit4]   2> 1895386 INFO  (TEST-InfixSuggestersTest.test2xBuildReload-seed#[6E7FF223503CEE32]) [    x:collection1] o.a.s.s.s.SolrSuggester SolrSuggester.build(shortRandomAnalyzingInfixSuggester)
   [junit4]   2> 1895391 INFO  (TEST-InfixSuggestersTest.test2xBuildReload-seed#[6E7FF223503CEE32]) [    x:collection1] o.a.s.s.s.RandomTestDictionaryFactory org.apache.solr.spelling.suggest.RandomTestDictionaryFactory$RandomTestDictionary.enabled.shortRandomAnalyzingInfixSuggester disabled after emitting 100 items.
   [junit4]   2> 1895606 INFO  (TEST-InfixSuggestersTest.test2xBuildReload-seed#[6E7FF223503CEE32]) [    x:collection1] o.a.s.h.c.SuggestComponent SuggestComponent process with : qt=/suggest_analyzing_infix_short_dictionary&suggest=true&suggest.buildAll=true&wt=xml&indent=off
   [junit4]   2> 1895606 INFO  (TEST-InfixSuggestersTest.test2xBuildReload-seed#[6E7FF223503CEE32]) [    x:collection1] o.a.s.c.S.Request [collection1]  webapp=null path=null params={qt=/suggest_analyzing_infix_short_dictionary&suggest.buildAll=true&wt=xml} status=0 QTime=220
   [junit4]   2> 1895607 ERROR (TEST-InfixSuggestersTest.test2xBuildReload-seed#[6E7FF223503CEE32]) [    x:collection1] o.a.s.c.CorePropertiesLocator Couldn't load core descriptor from /home/jenkins/workspace/Lucene-Solr-master-Linux/solr/core/src/test-files/solr/collection1/core.properties:java.nio.file.NoSuchFileException: /home/jenkins/workspace/Lucene-Solr-master-Linux/solr/core/src/test-files/solr/collection1/core.properties
   [junit4]   2> 1895607 INFO  (TEST-InfixSuggestersTest.test2xBuildReload-seed#[6E7FF223503CEE32]) [    x:collection1] o.a.s.c.SolrResourceLoader [null] Added 2 libs to classloader, from paths: [/home/jenkins/workspace/Lucene-Solr-master-Linux/solr/core/src/test-files/solr/collection1/lib, /home/jenkins/workspace/Lucene-Solr-master-Linux/solr/core/src/test-files/solr/collection1/lib/classes]
   [junit4]   2> 1895621 INFO  (TEST-InfixSuggestersTest.test2xBuildReload-seed#[6E7FF223503CEE32]) [    x:collection1] o.a.s.c.SolrConfig Using Lucene MatchVersion: 8.0.0
   [junit4]   2> 1895638 INFO  (TEST-InfixSuggestersTest.test2xBuildReload-seed#[6E7FF223503CEE32]) [    x:collection1] o.a.s.s.IndexSchema [collection1] Schema name=test
   [junit4]   2> 1895720 INFO  (TEST-InfixSuggestersTest.test2xBuildReload-seed#[6E7FF223503CEE32]) [    x:collection1] o.a.s.s.IndexSchema Loaded schema test/1.0 with uniqueid field id
   [junit4]   2> 1895728 INFO  (TEST-InfixSuggestersTest.test2xBuildReload-seed#[6E7FF223503CEE32]) [    x:collection1] o.a.s.c.CoreContainer Reloading SolrCore 'collection1' using configuration from instancedir /home/jenkins/workspace/Lucene-Solr-master-Linux/solr/core/src/test-files/solr/collection1
   [junit4]   2> 1895750 INFO  (TEST-InfixSuggestersTest.test2xBuildReload-seed#[6E7FF223503CEE32]) [    x:collection1] o.a.s.m.r.SolrJmxReporter JMX monitoring for 'solr.core.collection1' (registry 'solr.core.collection1') enabled at server: com.sun.jmx.mbeanserver.JmxMBeanServer@6635a491
   [junit4]   2> 1895750 INFO  (TEST-InfixSuggestersTest.test2xBuildReload-seed#[6E7FF223503CEE32]) [    x:collection1] o.a.s.c.SolrCore [[collection1] ] Opening new SolrCore at [/home/jenkins/workspace/Lucene-Solr-master-Linux/solr/core/src/test-files/solr/collection1], dataDir=[/home/jenkins/workspace/Lucene-Solr-master-Linux/solr/build/solr-core/test/J2/temp/solr.handler.component.InfixSuggestersTest_6E7FF223503CEE32-001/init-core-data-001/]
   [junit4]   2> 1

[...truncated too long message...]

rations.
    [javac] Note: Recompile with -Xlint:unchecked for details.
    [javac] Creating empty /home/jenkins/workspace/Lucene-Solr-master-Linux/solr/build/solr-core/classes/test/org/apache/solr/cloud/autoscaling/sim/package-info.class
     [copy] Copying 1 file to /home/jenkins/workspace/Lucene-Solr-master-Linux/solr/build/solr-core/classes/test

common-solr.compile-test:

compile-test:

BUILD SUCCESSFUL
Total time: 56 seconds
[repro] ant test-nocompile -Dtests.dups=5 -Dtests.maxfailures=5 -Dtests.class="*.InfixSuggestersTest" -Dtests.showOutput=onerror "-Dargs=-XX:-UseCompressedOops -XX:+UseParallelGC" -Dtests.seed=6E7FF223503CEE32 -Dtests.multiplier=3 -Dtests.slow=true -Dtests.locale=cy-GB -Dtests.timezone=Asia/Macau -Dtests.asserts=true -Dtests.file.encoding=UTF-8
Buildfile: /home/jenkins/workspace/Lucene-Solr-master-Linux/solr/core/build.xml

-clover.disable:

ivy-configure:
[ivy:configure] :: Apache Ivy 2.4.0 - 20141213170938 :: http://ant.apache.org/ivy/ ::
[ivy:configure] :: loading settings :: file = /home/jenkins/workspace/Lucene-Solr-master-Linux/lucene/top-level-ivy-settings.xml

install-junit4-taskdef:

ivy-availability-check:
[loadresource] Do not set property disallowed.ivy.jars.list as its length is 0.

-ivy-fail-disallowed-ivy-version:

ivy-fail:

resolve-groovy:
[ivy:cachepath] :: resolving dependencies :: org.codehaus.groovy#groovy-all-caller;working
[ivy:cachepath] 	confs: [default]
[ivy:cachepath] 	found org.codehaus.groovy#groovy-all;2.4.15 in public
[ivy:cachepath] :: resolution report :: resolve 10ms :: artifacts dl 0ms
	---------------------------------------------------------------------
	|                  |            modules            ||   artifacts   |
	|       conf       | number| search|dwnlded|evicted|| number|dwnlded|
	---------------------------------------------------------------------
	|      default     |   1   |   0   |   0   |   0   ||   1   |   0   |
	---------------------------------------------------------------------

-init-totals:

-test:
    [mkdir] Created dir: /home/jenkins/workspace/Lucene-Solr-master-Linux/solr/build/solr-core/test
[junit4:pickseed] Seed property 'tests.seed' already defined: 6E7FF223503CEE32
    [mkdir] Created dir: /home/jenkins/workspace/Lucene-Solr-master-Linux/solr/build/solr-core/test/temp
   [junit4] <JUnit4> says g'day! Master seed: 6E7FF223503CEE32
   [junit4] Executing 5 suites with 3 JVMs.
   [junit4] 
   [junit4] Started J1 PID(20388@serv1.sd-datasolutions.de).
   [junit4] Started J0 PID(20389@serv1.sd-datasolutions.de).
   [junit4] Started J2 PID(20390@serv1.sd-datasolutions.de).
   [junit4] Suite: org.apache.solr.handler.component.InfixSuggestersTest
   [junit4] OK      1.67s J1 | InfixSuggestersTest.testShutdownDuringBuild
   [junit4] OK      1.87s J1 | InfixSuggestersTest.testTwoSuggestersBuildThenReload
   [junit4] OK      0.64s J1 | InfixSuggestersTest.testBlendedInfixSuggesterBuildThenReload
   [junit4] OK      1.61s J1 | InfixSuggestersTest.test2xBuildReload
   [junit4] OK      1.12s J1 | InfixSuggestersTest.testBuildThen2xReload
   [junit4] OK      1.68s J1 | InfixSuggestersTest.testReloadDuringBuild
   [junit4] OK      0.77s J1 | InfixSuggestersTest.testAnalyzingInfixSuggesterBuildThenReload
   [junit4] Completed [1/5] on J1 in 15.00s, 7 tests
   [junit4] 
   [junit4] Suite: org.apache.solr.handler.component.InfixSuggestersTest
   [junit4] OK      2.21s J0 | InfixSuggestersTest.testShutdownDuringBuild
   [junit4] OK      1.69s J0 | InfixSuggestersTest.testTwoSuggestersBuildThenReload
   [junit4] OK      0.80s J0 | InfixSuggestersTest.testBlendedInfixSuggesterBuildThenReload
   [junit4] OK      1.43s J0 | InfixSuggestersTest.test2xBuildReload
   [junit4] OK      1.51s J0 | InfixSuggestersTest.testBuildThen2xReload
   [junit4] OK      1.75s J0 | InfixSuggestersTest.testReloadDuringBuild
   [junit4] OK      0.47s J0 | InfixSuggestersTest.testAnalyzingInfixSuggesterBuildThenReload
   [junit4] Completed [2/5] on J0 in 15.34s, 7 tests
   [junit4] 
   [junit4] Duplicate suite name used with XML reports: org.apache.solr.handler.component.InfixSuggestersTest. This may confuse tools that process XML reports. Set 'ignoreDuplicateSuites' to true to skip this message.
   [junit4] Suite: org.apache.solr.handler.component.InfixSuggestersTest
   [junit4] OK      1.68s J2 | InfixSuggestersTest.testShutdownDuringBuild
   [junit4] OK      2.16s J2 | InfixSuggestersTest.testTwoSuggestersBuildThenReload
   [junit4] OK      1.01s J2 | InfixSuggestersTest.testBlendedInfixSuggesterBuildThenReload
   [junit4] OK      1.40s J2 | InfixSuggestersTest.test2xBuildReload
   [junit4] OK      1.39s J2 | InfixSuggestersTest.testBuildThen2xReload
   [junit4] OK      2.00s J2 | InfixSuggestersTest.testReloadDuringBuild
   [junit4] OK      0.64s J2 | InfixSuggestersTest.testAnalyzingInfixSuggesterBuildThenReload
   [junit4] Completed [3/5] on J2 in 16.01s, 7 tests
   [junit4] 
   [junit4] Suite: org.apache.solr.handler.component.InfixSuggestersTest
   [junit4] OK      0.97s J1 | InfixSuggestersTest.testShutdownDuringBuild
   [junit4] OK      0.58s J1 | InfixSuggestersTest.testTwoSuggestersBuildThenReload
   [junit4] OK      0.32s J1 | InfixSuggestersTest.testBlendedInfixSuggesterBuildThenReload
   [junit4] OK      0.52s J1 | InfixSuggestersTest.test2xBuildReload
   [junit4] OK      0.45s J1 | InfixSuggestersTest.testBuildThen2xReload
   [junit4] OK      0.94s J1 | InfixSuggestersTest.testReloadDuringBuild
   [junit4] OK      0.33s J1 | InfixSuggestersTest.testAnalyzingInfixSuggesterBuildThenReload
   [junit4] Completed [4/5] on J1 in 5.10s, 7 tests
   [junit4] 
   [junit4] Suite: org.apache.solr.handler.component.InfixSuggestersTest
   [junit4] OK      0.92s J0 | InfixSuggestersTest.testShutdownDuringBuild
   [junit4] OK      0.58s J0 | InfixSuggestersTest.testTwoSuggestersBuildThenReload
   [junit4] OK      0.33s J0 | InfixSuggestersTest.testBlendedInfixSuggesterBuildThenReload
   [junit4] OK      0.52s J0 | InfixSuggestersTest.test2xBuildReload
   [junit4] OK      0.54s J0 | InfixSuggestersTest.testBuildThen2xReload
   [junit4] OK      1.09s J0 | InfixSuggestersTest.testReloadDuringBuild
   [junit4] OK      0.27s J0 | InfixSuggestersTest.testAnalyzingInfixSuggesterBuildThenReload
   [junit4] Completed [5/5] on J0 in 5.16s, 7 tests
   [junit4] 
   [junit4] JVM J0:     0.64 ..    22.12 =    21.47s
   [junit4] JVM J1:     0.64 ..    21.86 =    21.22s
   [junit4] JVM J2:     0.65 ..    17.77 =    17.13s
   [junit4] Execution time total: 22 seconds
   [junit4] Tests summary: 5 suites, 35 tests
   [junit4] Could not remove temporary path: /home/jenkins/workspace/Lucene-Solr-master-Linux/solr/build/solr-core/test/J2 (java.nio.file.DirectoryNotEmptyException: Remaining files: [/home/jenkins/workspace/Lucene-Solr-master-Linux/solr/build/solr-core/test/J2/temp])
   [junit4] Could not remove temporary path: /home/jenkins/workspace/Lucene-Solr-master-Linux/solr/build/solr-core/test/J1 (java.nio.file.DirectoryNotEmptyException: Remaining files: [/home/jenkins/workspace/Lucene-Solr-master-Linux/solr/build/solr-core/test/J1/temp])
   [junit4] Could not remove temporary path: /home/jenkins/workspace/Lucene-Solr-master-Linux/solr/build/solr-core/test/J0 (java.nio.file.DirectoryNotEmptyException: Remaining files: [/home/jenkins/workspace/Lucene-Solr-master-Linux/solr/build/solr-core/test/J0/temp])
     [echo] 5 slowest tests:
[junit4:tophints] 116.46s | org.apache.solr.update.SoftAutoCommitTest
[junit4:tophints] 108.25s | org.apache.solr.cloud.ZkFailoverTest
[junit4:tophints] 105.75s | org.apache.solr.cloud.TestTlogReplica
[junit4:tophints] 103.70s | org.apache.solr.cloud.DeleteReplicaTest
[junit4:tophints]  97.68s | org.apache.solr.cloud.TestPullReplicaErrorHandling

-check-totals:
WARNING: An illegal reflective access operation has occurred
WARNING: Illegal reflective access by org.codehaus.groovy.reflection.CachedClass (file:/home/jenkins/.ivy2/cache/org.codehaus.groovy/groovy-all/jars/groovy-all-2.4.15.jar) to method java.lang.Object.finalize()
WARNING: Please consider reporting this to the maintainers of org.codehaus.groovy.reflection.CachedClass
WARNING: Use --illegal-access=warn to enable warnings of further illegal reflective access operations
WARNING: All illegal access operations will be denied in a future release

test-nocompile:

BUILD SUCCESSFUL
Total time: 24 seconds
[repro] Failures:
[repro]   0/5 failed: org.apache.solr.handler.component.InfixSuggestersTest
[repro]   5/5 failed: org.apache.lucene.util.TestPriorityQueue
[repro] Exiting with code 256
+ mv lucene/build lucene/build.repro
+ mv solr/build solr/build.repro
+ mv lucene/build.orig lucene/build
+ mv solr/build.orig solr/build
Archiving artifacts
Setting ANT_1_8_2_HOME=/var/lib/jenkins/tools/hudson.tasks.Ant_AntInstallation/ANT_1.8.2
[WARNINGS] Parsing warnings in console log with parser Java Compiler (javac)
Setting ANT_1_8_2_HOME=/var/lib/jenkins/tools/hudson.tasks.Ant_AntInstallation/ANT_1.8.2
Setting ANT_1_8_2_HOME=/var/lib/jenkins/tools/hudson.tasks.Ant_AntInstallation/ANT_1.8.2
<Git Blamer> Using GitBlamer to create author and commit information for all warnings.
<Git Blamer> GIT_COMMIT=c97f27b06c1d7c250e9596a9bc7bf5ca11ef6ad3, workspace=/var/lib/jenkins/workspace/Lucene-Solr-master-Linux
[WARNINGS] Computing warning deltas based on reference build #22462
Recording test results
Setting ANT_1_8_2_HOME=/var/lib/jenkins/tools/hudson.tasks.Ant_AntInstallation/ANT_1.8.2
Build step 'Publish JUnit test result report' changed build result to UNSTABLE
Email was triggered for: Unstable (Test Failures)
Sending email for trigger: Unstable (Test Failures)
Setting ANT_1_8_2_HOME=/var/lib/jenkins/tools/hudson.tasks.Ant_AntInstallation/ANT_1.8.2
Setting ANT_1_8_2_HOME=/var/lib/jenkins/tools/hudson.tasks.Ant_AntInstallation/ANT_1.8.2
Setting ANT_1_8_2_HOME=/var/lib/jenkins/tools/hudson.tasks.Ant_AntInstallation/ANT_1.8.2
Setting ANT_1_8_2_HOME=/var/lib/jenkins/tools/hudson.tasks.Ant_AntInstallation/ANT_1.8.2

Mime
View raw message