lucene-dev mailing list archives

Site index · List index
Message view « Date » · « Thread »
Top « Date » · « Thread »
From Apache Jenkins Server <jenk...@builds.apache.org>
Subject [JENKINS] Lucene-Solr-Tests-master - Build # 2579 - Unstable
Date Sun, 01 Jul 2018 08:58:12 GMT
Build: https://builds.apache.org/job/Lucene-Solr-Tests-master/2579/

1 tests failed.
FAILED:  org.apache.solr.cloud.autoscaling.MetricTriggerIntegrationTest.testMetricTrigger

Error Message:
The trigger did not fire at all

Stack Trace:
java.lang.AssertionError: The trigger did not fire at all
	at __randomizedtesting.SeedInfo.seed([D7A7C3D0F062A551:6DABF45FAF8A731E]:0)
	at org.junit.Assert.fail(Assert.java:93)
	at org.junit.Assert.assertTrue(Assert.java:43)
	at org.apache.solr.cloud.autoscaling.MetricTriggerIntegrationTest.testMetricTrigger(MetricTriggerIntegrationTest.java:196)
	at sun.reflect.NativeMethodAccessorImpl.invoke0(Native Method)
	at sun.reflect.NativeMethodAccessorImpl.invoke(NativeMethodAccessorImpl.java:62)
	at sun.reflect.DelegatingMethodAccessorImpl.invoke(DelegatingMethodAccessorImpl.java:43)
	at java.lang.reflect.Method.invoke(Method.java:498)
	at com.carrotsearch.randomizedtesting.RandomizedRunner.invoke(RandomizedRunner.java:1737)
	at com.carrotsearch.randomizedtesting.RandomizedRunner$8.evaluate(RandomizedRunner.java:934)
	at com.carrotsearch.randomizedtesting.RandomizedRunner$9.evaluate(RandomizedRunner.java:970)
	at com.carrotsearch.randomizedtesting.RandomizedRunner$10.evaluate(RandomizedRunner.java:984)
	at com.carrotsearch.randomizedtesting.rules.SystemPropertiesRestoreRule$1.evaluate(SystemPropertiesRestoreRule.java:57)
	at org.apache.lucene.util.TestRuleSetupTeardownChained$1.evaluate(TestRuleSetupTeardownChained.java:49)
	at org.apache.lucene.util.AbstractBeforeAfterRule$1.evaluate(AbstractBeforeAfterRule.java:45)
	at org.apache.lucene.util.TestRuleThreadAndTestName$1.evaluate(TestRuleThreadAndTestName.java:48)
	at org.apache.lucene.util.TestRuleIgnoreAfterMaxFailures$1.evaluate(TestRuleIgnoreAfterMaxFailures.java:64)
	at org.apache.lucene.util.TestRuleMarkFailure$1.evaluate(TestRuleMarkFailure.java:47)
	at com.carrotsearch.randomizedtesting.rules.StatementAdapter.evaluate(StatementAdapter.java:36)
	at com.carrotsearch.randomizedtesting.ThreadLeakControl$StatementRunner.run(ThreadLeakControl.java:368)
	at com.carrotsearch.randomizedtesting.ThreadLeakControl.forkTimeoutingTask(ThreadLeakControl.java:817)
	at com.carrotsearch.randomizedtesting.ThreadLeakControl$3.evaluate(ThreadLeakControl.java:468)
	at com.carrotsearch.randomizedtesting.RandomizedRunner.runSingleTest(RandomizedRunner.java:943)
	at com.carrotsearch.randomizedtesting.RandomizedRunner$5.evaluate(RandomizedRunner.java:829)
	at com.carrotsearch.randomizedtesting.RandomizedRunner$6.evaluate(RandomizedRunner.java:879)
	at com.carrotsearch.randomizedtesting.RandomizedRunner$7.evaluate(RandomizedRunner.java:890)
	at com.carrotsearch.randomizedtesting.rules.StatementAdapter.evaluate(StatementAdapter.java:36)
	at com.carrotsearch.randomizedtesting.rules.SystemPropertiesRestoreRule$1.evaluate(SystemPropertiesRestoreRule.java:57)
	at org.apache.lucene.util.AbstractBeforeAfterRule$1.evaluate(AbstractBeforeAfterRule.java:45)
	at com.carrotsearch.randomizedtesting.rules.StatementAdapter.evaluate(StatementAdapter.java:36)
	at org.apache.lucene.util.TestRuleStoreClassName$1.evaluate(TestRuleStoreClassName.java:41)
	at com.carrotsearch.randomizedtesting.rules.NoShadowingOrOverridesOnMethodsRule$1.evaluate(NoShadowingOrOverridesOnMethodsRule.java:40)
	at com.carrotsearch.randomizedtesting.rules.NoShadowingOrOverridesOnMethodsRule$1.evaluate(NoShadowingOrOverridesOnMethodsRule.java:40)
	at com.carrotsearch.randomizedtesting.rules.StatementAdapter.evaluate(StatementAdapter.java:36)
	at com.carrotsearch.randomizedtesting.rules.StatementAdapter.evaluate(StatementAdapter.java:36)
	at com.carrotsearch.randomizedtesting.rules.StatementAdapter.evaluate(StatementAdapter.java:36)
	at org.apache.lucene.util.TestRuleAssertionsRequired$1.evaluate(TestRuleAssertionsRequired.java:53)
	at org.apache.lucene.util.TestRuleMarkFailure$1.evaluate(TestRuleMarkFailure.java:47)
	at org.apache.lucene.util.TestRuleIgnoreAfterMaxFailures$1.evaluate(TestRuleIgnoreAfterMaxFailures.java:64)
	at org.apache.lucene.util.TestRuleIgnoreTestSuites$1.evaluate(TestRuleIgnoreTestSuites.java:54)
	at com.carrotsearch.randomizedtesting.rules.StatementAdapter.evaluate(StatementAdapter.java:36)
	at com.carrotsearch.randomizedtesting.ThreadLeakControl$StatementRunner.run(ThreadLeakControl.java:368)
	at java.lang.Thread.run(Thread.java:748)




Build Log:
[...truncated 12673 lines...]
   [junit4] Suite: org.apache.solr.cloud.autoscaling.MetricTriggerIntegrationTest
   [junit4]   2> Creating dataDir: /home/jenkins/jenkins-slave/workspace/Lucene-Solr-Tests-master/solr/build/solr-core/test/J1/temp/solr.cloud.autoscaling.MetricTriggerIntegrationTest_D7A7C3D0F062A551-001/init-core-data-001
   [junit4]   2> 543838 WARN  (SUITE-MetricTriggerIntegrationTest-seed#[D7A7C3D0F062A551]-worker) [    ] o.a.s.SolrTestCaseJ4 startTrackingSearchers: numOpens=2 numCloses=2
   [junit4]   2> 543838 INFO  (SUITE-MetricTriggerIntegrationTest-seed#[D7A7C3D0F062A551]-worker) [    ] o.a.s.SolrTestCaseJ4 Using TrieFields (NUMERIC_POINTS_SYSPROP=false) w/NUMERIC_DOCVALUES_SYSPROP=true
   [junit4]   2> 543918 INFO  (SUITE-MetricTriggerIntegrationTest-seed#[D7A7C3D0F062A551]-worker) [    ] o.a.s.SolrTestCaseJ4 Randomized ssl (false) and clientAuth (false) via: @org.apache.solr.util.RandomizeSSL(reason=, ssl=NaN, value=NaN, clientAuth=NaN)
   [junit4]   2> 543918 INFO  (SUITE-MetricTriggerIntegrationTest-seed#[D7A7C3D0F062A551]-worker) [    ] o.a.s.SolrTestCaseJ4 SecureRandom sanity checks: test.solr.allowed.securerandom=null & java.security.egd=file:/dev/./urandom
   [junit4]   2> 543918 INFO  (SUITE-MetricTriggerIntegrationTest-seed#[D7A7C3D0F062A551]-worker) [    ] o.a.s.c.MiniSolrCloudCluster Starting cluster of 2 servers in /home/jenkins/jenkins-slave/workspace/Lucene-Solr-Tests-master/solr/build/solr-core/test/J1/temp/solr.cloud.autoscaling.MetricTriggerIntegrationTest_D7A7C3D0F062A551-001/tempDir-001
   [junit4]   2> 543919 INFO  (SUITE-MetricTriggerIntegrationTest-seed#[D7A7C3D0F062A551]-worker) [    ] o.a.s.c.ZkTestServer STARTING ZK TEST SERVER
   [junit4]   2> 543954 INFO  (Thread-268) [    ] o.a.s.c.ZkTestServer client port:0.0.0.0/0.0.0.0:0
   [junit4]   2> 543954 INFO  (Thread-268) [    ] o.a.s.c.ZkTestServer Starting server
   [junit4]   2> 544028 ERROR (Thread-268) [    ] o.a.z.s.ZooKeeperServer ZKShutdownHandler is not registered, so ZooKeeper server won't take any action on ERROR or SHUTDOWN server state changes
   [junit4]   2> 544094 INFO  (SUITE-MetricTriggerIntegrationTest-seed#[D7A7C3D0F062A551]-worker) [    ] o.a.s.c.ZkTestServer start zk server on port:35252
   [junit4]   2> 544263 INFO  (zkConnectionManagerCallback-252-thread-1) [    ] o.a.s.c.c.ConnectionManager zkClient has connected
   [junit4]   2> 544415 INFO  (jetty-launcher-249-thread-2) [    ] o.e.j.s.Server jetty-9.4.11.v20180605; built: 2018-06-05T18:24:03.829Z; git: d5fc0523cfa96bfebfbda19606cad384d772f04c; jvm 1.8.0_172-b11
   [junit4]   2> 544416 INFO  (jetty-launcher-249-thread-2) [    ] o.e.j.s.session DefaultSessionIdManager workerName=node0
   [junit4]   2> 544416 INFO  (jetty-launcher-249-thread-2) [    ] o.e.j.s.session No SessionScavenger set, using defaults
   [junit4]   2> 544417 INFO  (jetty-launcher-249-thread-2) [    ] o.e.j.s.session node0 Scavenging every 600000ms
   [junit4]   2> 544417 INFO  (jetty-launcher-249-thread-2) [    ] o.e.j.s.h.ContextHandler Started o.e.j.s.ServletContextHandler@7ac1cb86{/solr,null,AVAILABLE}
   [junit4]   2> 544518 INFO  (jetty-launcher-249-thread-2) [    ] o.e.j.s.AbstractConnector Started ServerConnector@2d3ede64{HTTP/1.1,[http/1.1]}{127.0.0.1:35551}
   [junit4]   2> 544518 INFO  (jetty-launcher-249-thread-2) [    ] o.e.j.s.Server Started @544687ms
   [junit4]   2> 544518 INFO  (jetty-launcher-249-thread-2) [    ] o.a.s.c.s.e.JettySolrRunner Jetty properties: {hostContext=/solr, hostPort=35551}
   [junit4]   2> 544519 ERROR (jetty-launcher-249-thread-2) [    ] o.a.s.u.StartupLoggingUtils Missing Java Option solr.log.dir. Logging may be missing or incomplete.
   [junit4]   2> 544519 INFO  (jetty-launcher-249-thread-2) [    ] o.a.s.s.SolrDispatchFilter Using logger factory org.apache.logging.slf4j.Log4jLoggerFactory
   [junit4]   2> 544519 INFO  (jetty-launcher-249-thread-2) [    ] o.a.s.s.SolrDispatchFilter  ___      _       Welcome to Apache Solr™ version 8.0.0
   [junit4]   2> 544519 INFO  (jetty-launcher-249-thread-2) [    ] o.a.s.s.SolrDispatchFilter / __| ___| |_ _   Starting in cloud mode on port null
   [junit4]   2> 544519 INFO  (jetty-launcher-249-thread-2) [    ] o.a.s.s.SolrDispatchFilter \__ \/ _ \ | '_|  Install dir: null
   [junit4]   2> 544519 INFO  (jetty-launcher-249-thread-2) [    ] o.a.s.s.SolrDispatchFilter |___/\___/_|_|    Start time: 2018-07-01T07:02:32.158Z
   [junit4]   2> 544560 INFO  (jetty-launcher-249-thread-1) [    ] o.e.j.s.Server jetty-9.4.11.v20180605; built: 2018-06-05T18:24:03.829Z; git: d5fc0523cfa96bfebfbda19606cad384d772f04c; jvm 1.8.0_172-b11
   [junit4]   2> 544664 INFO  (jetty-launcher-249-thread-1) [    ] o.e.j.s.session DefaultSessionIdManager workerName=node0
   [junit4]   2> 544664 INFO  (jetty-launcher-249-thread-1) [    ] o.e.j.s.session No SessionScavenger set, using defaults
   [junit4]   2> 544664 INFO  (jetty-launcher-249-thread-1) [    ] o.e.j.s.session node0 Scavenging every 600000ms
   [junit4]   2> 544678 INFO  (jetty-launcher-249-thread-1) [    ] o.e.j.s.h.ContextHandler Started o.e.j.s.ServletContextHandler@22dc4efa{/solr,null,AVAILABLE}
   [junit4]   2> 544679 INFO  (jetty-launcher-249-thread-1) [    ] o.e.j.s.AbstractConnector Started ServerConnector@2467b683{HTTP/1.1,[http/1.1]}{127.0.0.1:41748}
   [junit4]   2> 544679 INFO  (jetty-launcher-249-thread-1) [    ] o.e.j.s.Server Started @544848ms
   [junit4]   2> 544679 INFO  (jetty-launcher-249-thread-1) [    ] o.a.s.c.s.e.JettySolrRunner Jetty properties: {hostContext=/solr, hostPort=41748}
   [junit4]   2> 544679 ERROR (jetty-launcher-249-thread-1) [    ] o.a.s.u.StartupLoggingUtils Missing Java Option solr.log.dir. Logging may be missing or incomplete.
   [junit4]   2> 544679 INFO  (jetty-launcher-249-thread-1) [    ] o.a.s.s.SolrDispatchFilter Using logger factory org.apache.logging.slf4j.Log4jLoggerFactory
   [junit4]   2> 544679 INFO  (jetty-launcher-249-thread-1) [    ] o.a.s.s.SolrDispatchFilter  ___      _       Welcome to Apache Solr™ version 8.0.0
   [junit4]   2> 544679 INFO  (jetty-launcher-249-thread-1) [    ] o.a.s.s.SolrDispatchFilter / __| ___| |_ _   Starting in cloud mode on port null
   [junit4]   2> 544679 INFO  (jetty-launcher-249-thread-1) [    ] o.a.s.s.SolrDispatchFilter \__ \/ _ \ | '_|  Install dir: null
   [junit4]   2> 544679 INFO  (jetty-launcher-249-thread-1) [    ] o.a.s.s.SolrDispatchFilter |___/\___/_|_|    Start time: 2018-07-01T07:02:32.318Z
   [junit4]   2> 544753 INFO  (zkConnectionManagerCallback-254-thread-1) [    ] o.a.s.c.c.ConnectionManager zkClient has connected
   [junit4]   2> 544861 INFO  (zkConnectionManagerCallback-256-thread-1) [    ] o.a.s.c.c.ConnectionManager zkClient has connected
   [junit4]   2> 544931 INFO  (jetty-launcher-249-thread-2) [    ] o.a.s.s.SolrDispatchFilter solr.xml found in ZooKeeper. Loading...
   [junit4]   2> 544955 INFO  (jetty-launcher-249-thread-1) [    ] o.a.s.s.SolrDispatchFilter solr.xml found in ZooKeeper. Loading...
   [junit4]   2> 545997 INFO  (jetty-launcher-249-thread-2) [    ] o.a.s.c.ZkContainer Zookeeper client=127.0.0.1:35252/solr
   [junit4]   2> 546106 INFO  (zkConnectionManagerCallback-260-thread-1) [    ] o.a.s.c.c.ConnectionManager zkClient has connected
   [junit4]   2> 546434 INFO  (zkConnectionManagerCallback-262-thread-1) [    ] o.a.s.c.c.ConnectionManager zkClient has connected
   [junit4]   2> 547136 INFO  (jetty-launcher-249-thread-1) [    ] o.a.s.c.ZkContainer Zookeeper client=127.0.0.1:35252/solr
   [junit4]   2> 547276 INFO  (zkConnectionManagerCallback-268-thread-1) [    ] o.a.s.c.c.ConnectionManager zkClient has connected
   [junit4]   2> 547479 INFO  (zkConnectionManagerCallback-270-thread-1) [    ] o.a.s.c.c.ConnectionManager zkClient has connected
   [junit4]   2> 547540 INFO  (jetty-launcher-249-thread-2) [n:127.0.0.1:35551_solr    ] o.a.s.c.Overseer Overseer (id=null) closing
   [junit4]   2> 547541 INFO  (jetty-launcher-249-thread-2) [n:127.0.0.1:35551_solr    ] o.a.s.c.OverseerElectionContext I am going to be the leader 127.0.0.1:35551_solr
   [junit4]   2> 547560 INFO  (jetty-launcher-249-thread-2) [n:127.0.0.1:35551_solr    ] o.a.s.c.Overseer Overseer (id=72894223504244740-127.0.0.1:35551_solr-n_0000000000) starting
   [junit4]   2> 547635 INFO  (jetty-launcher-249-thread-1) [n:127.0.0.1:41748_solr    ] o.a.s.c.Overseer Overseer (id=null) closing
   [junit4]   2> 547637 INFO  (jetty-launcher-249-thread-1) [n:127.0.0.1:41748_solr    ] o.a.s.c.ZkController Register node as live in ZooKeeper:/live_nodes/127.0.0.1:41748_solr
   [junit4]   2> 547727 INFO  (zkCallback-261-thread-1) [    ] o.a.s.c.c.ZkStateReader Updated live nodes from ZooKeeper... (0) -> (1)
   [junit4]   2> 547729 INFO  (zkCallback-269-thread-1) [    ] o.a.s.c.c.ZkStateReader Updated live nodes from ZooKeeper... (0) -> (1)
   [junit4]   2> 547751 INFO  (zkConnectionManagerCallback-277-thread-1) [    ] o.a.s.c.c.ConnectionManager zkClient has connected
   [junit4]   2> 547780 INFO  (jetty-launcher-249-thread-2) [n:127.0.0.1:35551_solr    ] o.a.s.c.c.ZkStateReader Updated live nodes from ZooKeeper... (0) -> (1)
   [junit4]   2> 547781 INFO  (jetty-launcher-249-thread-2) [n:127.0.0.1:35551_solr    ] o.a.s.c.s.i.ZkClientClusterStateProvider Cluster at 127.0.0.1:35252/solr ready
   [junit4]   2> 547853 DEBUG (OverseerAutoScalingTriggerThread-72894223504244740-127.0.0.1:35551_solr-n_0000000000) [    ] o.a.s.c.a.OverseerTriggerThread Adding .auto_add_replicas and .scheduled_maintenance triggers
   [junit4]   2> 547854 DEBUG (OverseerAutoScalingTriggerThread-72894223504244740-127.0.0.1:35551_solr-n_0000000000) [    ] o.a.s.c.a.OverseerTriggerThread Refreshing /autoscaling.json with znode version 1
   [junit4]   2> 547855 DEBUG (OverseerAutoScalingTriggerThread-72894223504244740-127.0.0.1:35551_solr-n_0000000000) [    ] o.a.s.c.a.OverseerTriggerThread Current znodeVersion 1, lastZnodeVersion -1
   [junit4]   2> 547855 DEBUG (OverseerAutoScalingTriggerThread-72894223504244740-127.0.0.1:35551_solr-n_0000000000) [    ] o.a.s.c.a.OverseerTriggerThread Processed trigger updates upto znodeVersion 1
   [junit4]   2> 547869 INFO  (jetty-launcher-249-thread-2) [n:127.0.0.1:35551_solr    ] o.a.s.c.TransientSolrCoreCacheDefault Allocating transient cache for 2147483647 transient cores
   [junit4]   2> 547869 INFO  (jetty-launcher-249-thread-2) [n:127.0.0.1:35551_solr    ] o.a.s.c.ZkController Register node as live in ZooKeeper:/live_nodes/127.0.0.1:35551_solr
   [junit4]   2> 547889 INFO  (zkCallback-261-thread-1) [    ] o.a.s.c.c.ZkStateReader Updated live nodes from ZooKeeper... (1) -> (2)
   [junit4]   2> 547907 DEBUG (OverseerAutoScalingTriggerThread-72894223504244740-127.0.0.1:35551_solr-n_0000000000) [    ] o.a.s.c.a.NodeLostTrigger NodeLostTrigger .auto_add_replicas - Initial livenodes: [127.0.0.1:41748_solr]
   [junit4]   2> 547934 DEBUG (OverseerAutoScalingTriggerThread-72894223504244740-127.0.0.1:35551_solr-n_0000000000) [    ] o.a.s.c.a.OverseerTriggerThread -- clean old nodeAdded markers
   [junit4]   2> 547963 INFO  (zkCallback-269-thread-1) [    ] o.a.s.c.c.ZkStateReader Updated live nodes from ZooKeeper... (1) -> (2)
   [junit4]   2> 547971 DEBUG (OverseerAutoScalingTriggerThread-72894223504244740-127.0.0.1:35551_solr-n_0000000000) [    ] o.a.s.c.a.OverseerTriggerThread Current znodeVersion 1, lastZnodeVersion 1
   [junit4]   2> 548007 DEBUG (ScheduledTrigger-494-thread-3) [    ] o.a.s.c.a.NodeLostTrigger Running NodeLostTrigger: .auto_add_replicas with currently live nodes: 1
   [junit4]   2> 548055 INFO  (jetty-launcher-249-thread-2) [n:127.0.0.1:35551_solr    ] o.a.s.h.a.MetricsHistoryHandler No .system collection, keeping metrics history in memory.
   [junit4]   2> 548060 INFO  (zkCallback-276-thread-1) [    ] o.a.s.c.c.ZkStateReader Updated live nodes from ZooKeeper... (1) -> (2)
   [junit4]   2> 548156 INFO  (zkConnectionManagerCallback-282-thread-1) [    ] o.a.s.c.c.ConnectionManager zkClient has connected
   [junit4]   2> 548228 INFO  (jetty-launcher-249-thread-1) [n:127.0.0.1:41748_solr    ] o.a.s.c.c.ZkStateReader Updated live nodes from ZooKeeper... (0) -> (2)
   [junit4]   2> 548229 INFO  (jetty-launcher-249-thread-1) [n:127.0.0.1:41748_solr    ] o.a.s.c.s.i.ZkClientClusterStateProvider Cluster at 127.0.0.1:35252/solr ready
   [junit4]   2> 548256 INFO  (jetty-launcher-249-thread-2) [n:127.0.0.1:35551_solr    ] o.a.s.m.r.SolrJmxReporter JMX monitoring for 'solr_35551.solr.node' (registry 'solr.node') enabled at server: com.sun.jmx.mbeanserver.JmxMBeanServer@36a49728
   [junit4]   2> 548279 INFO  (jetty-launcher-249-thread-1) [n:127.0.0.1:41748_solr    ] o.a.s.h.a.MetricsHistoryHandler No .system collection, keeping metrics history in memory.
   [junit4]   2> 548309 INFO  (jetty-launcher-249-thread-2) [n:127.0.0.1:35551_solr    ] o.a.s.m.r.SolrJmxReporter JMX monitoring for 'solr_35551.solr.jvm' (registry 'solr.jvm') enabled at server: com.sun.jmx.mbeanserver.JmxMBeanServer@36a49728
   [junit4]   2> 548309 INFO  (jetty-launcher-249-thread-2) [n:127.0.0.1:35551_solr    ] o.a.s.m.r.SolrJmxReporter JMX monitoring for 'solr_35551.solr.jetty' (registry 'solr.jetty') enabled at server: com.sun.jmx.mbeanserver.JmxMBeanServer@36a49728
   [junit4]   2> 548310 INFO  (jetty-launcher-249-thread-2) [n:127.0.0.1:35551_solr    ] o.a.s.c.CorePropertiesLocator Found 0 core definitions underneath /home/jenkins/jenkins-slave/workspace/Lucene-Solr-Tests-master/solr/build/solr-core/test/J1/temp/solr.cloud.autoscaling.MetricTriggerIntegrationTest_D7A7C3D0F062A551-001/tempDir-001/node2/.
   [junit4]   2> 548476 INFO  (jetty-launcher-249-thread-1) [n:127.0.0.1:41748_solr    ] o.a.s.m.r.SolrJmxReporter JMX monitoring for 'solr_41748.solr.node' (registry 'solr.node') enabled at server: com.sun.jmx.mbeanserver.JmxMBeanServer@36a49728
   [junit4]   2> 548858 INFO  (jetty-launcher-249-thread-1) [n:127.0.0.1:41748_solr    ] o.a.s.m.r.SolrJmxReporter JMX monitoring for 'solr_41748.solr.jvm' (registry 'solr.jvm') enabled at server: com.sun.jmx.mbeanserver.JmxMBeanServer@36a49728
   [junit4]   2> 548858 INFO  (jetty-launcher-249-thread-1) [n:127.0.0.1:41748_solr    ] o.a.s.m.r.SolrJmxReporter JMX monitoring for 'solr_41748.solr.jetty' (registry 'solr.jetty') enabled at server: com.sun.jmx.mbeanserver.JmxMBeanServer@36a49728
   [junit4]   2> 548859 INFO  (jetty-launcher-249-thread-1) [n:127.0.0.1:41748_solr    ] o.a.s.c.CorePropertiesLocator Found 0 core definitions underneath /home/jenkins/jenkins-slave/workspace/Lucene-Solr-Tests-master/solr/build/solr-core/test/J1/temp/solr.cloud.autoscaling.MetricTriggerIntegrationTest_D7A7C3D0F062A551-001/tempDir-001/node1/.
   [junit4]   2> 549179 DEBUG (ScheduledTrigger-494-thread-1) [    ] o.a.s.c.a.NodeLostTrigger Running NodeLostTrigger: .auto_add_replicas with currently live nodes: 2
   [junit4]   2> 549661 INFO  (zkConnectionManagerCallback-286-thread-1) [    ] o.a.s.c.c.ConnectionManager zkClient has connected
   [junit4]   2> 549819 INFO  (zkConnectionManagerCallback-291-thread-1) [    ] o.a.s.c.c.ConnectionManager zkClient has connected
   [junit4]   2> 550258 INFO  (SUITE-MetricTriggerIntegrationTest-seed#[D7A7C3D0F062A551]-worker) [    ] o.a.s.c.c.ZkStateReader Updated live nodes from ZooKeeper... (0) -> (2)
   [junit4]   2> 550303 INFO  (SUITE-MetricTriggerIntegrationTest-seed#[D7A7C3D0F062A551]-worker) [    ] o.a.s.c.s.i.ZkClientClusterStateProvider Cluster at 127.0.0.1:35252/solr ready
   [junit4]   2> 550507 DEBUG (ScheduledTrigger-494-thread-4) [    ] o.a.s.c.a.NodeLostTrigger Running NodeLostTrigger: .auto_add_replicas with currently live nodes: 2
   [junit4]   2> 550871 INFO  (qtp150884408-2070) [n:127.0.0.1:41748_solr    ] o.a.s.s.HttpSolrCall [admin] webapp=null path=/admin/metrics params={prefix=CONTAINER.fs.usableSpace,CORE.coreName&wt=javabin&version=2&group=solr.node,solr.core} status=0 QTime=376
   [junit4]   2> 551154 INFO  (qtp1769847339-2064) [n:127.0.0.1:35551_solr    ] o.a.s.s.HttpSolrCall [admin] webapp=null path=/admin/metrics params={prefix=CONTAINER.fs.usableSpace,CORE.coreName&wt=javabin&version=2&group=solr.node,solr.core} status=0 QTime=0
   [junit4]   2> 551226 DEBUG (qtp150884408-2076) [n:127.0.0.1:41748_solr    ] o.a.s.c.a.AutoScalingHandler Verified autoscaling configuration
   [junit4]   2> 551234 DEBUG (zkCallback-276-thread-1) [    ] o.a.s.c.a.OverseerTriggerThread Refreshing /autoscaling.json with znode version 2
   [junit4]   2> 551249 INFO  (qtp150884408-2076) [n:127.0.0.1:41748_solr    ] o.a.s.s.HttpSolrCall [admin] webapp=null path=/admin/autoscaling params={wt=javabin&version=2} status=0 QTime=839
   [junit4]   2> 551251 DEBUG (OverseerAutoScalingTriggerThread-72894223504244740-127.0.0.1:35551_solr-n_0000000000) [    ] o.a.s.c.a.OverseerTriggerThread Processed trigger updates upto znodeVersion 2
   [junit4]   2> 551252 DEBUG (OverseerAutoScalingTriggerThread-72894223504244740-127.0.0.1:35551_solr-n_0000000000) [    ] o.a.s.c.a.OverseerTriggerThread -- clean old nodeAdded markers
   [junit4]   2> 551253 DEBUG (OverseerAutoScalingTriggerThread-72894223504244740-127.0.0.1:35551_solr-n_0000000000) [    ] o.a.s.c.a.OverseerTriggerThread Current znodeVersion 2, lastZnodeVersion 2
   [junit4]   2> 551586 DEBUG (ScheduledTrigger-494-thread-4) [    ] o.a.s.c.a.NodeLostTrigger Running NodeLostTrigger: .auto_add_replicas with currently live nodes: 2
   [junit4]   2> 552648 DEBUG (ScheduledTrigger-494-thread-4) [    ] o.a.s.c.a.NodeLostTrigger Running NodeLostTrigger: .auto_add_replicas with currently live nodes: 2
   [junit4]   2> 553706 DEBUG (ScheduledTrigger-494-thread-4) [    ] o.a.s.c.a.NodeLostTrigger Running NodeLostTrigger: .auto_add_replicas with currently live nodes: 2
   [junit4]   2> 553997 INFO  (TEST-MetricTriggerIntegrationTest.testMetricTrigger-seed#[D7A7C3D0F062A551]) [    ] o.a.s.SolrTestCaseJ4 ###Starting testMetricTrigger
   [junit4]   2> 554076 INFO  (zkConnectionManagerCallback-293-thread-1) [    ] o.a.s.c.c.ConnectionManager zkClient has connected
   [junit4]   2> 554146 INFO  (qtp150884408-2071) [n:127.0.0.1:41748_solr    ] o.a.s.h.a.CollectionsHandler Invoked Collection Action :create with params collection.configName=conf&maxShardsPerNode=2&name=testMetricTrigger&nrtReplicas=2&action=CREATE&numShards=2&wt=javabin&version=2 and sendToOCPQueue=true
   [junit4]   2> 554251 INFO  (OverseerThreadFactory-496-thread-1) [    ] o.a.s.c.a.c.CreateCollectionCmd Create collection testMetricTrigger
   [junit4]   2> 554478 INFO  (OverseerStateUpdate-72894223504244740-127.0.0.1:35551_solr-n_0000000000) [    ] o.a.s.c.o.SliceMutator createReplica() {
   [junit4]   2>   "operation":"ADDREPLICA",
   [junit4]   2>   "collection":"testMetricTrigger",
   [junit4]   2>   "shard":"shard1",
   [junit4]   2>   "core":"testMetricTrigger_shard1_replica_n1",
   [junit4]   2>   "state":"down",
   [junit4]   2>   "base_url":"http://127.0.0.1:41748/solr",
   [junit4]   2>   "type":"NRT",
   [junit4]   2>   "waitForFinalState":"false"} 
   [junit4]   2> 554515 INFO  (OverseerStateUpdate-72894223504244740-127.0.0.1:35551_solr-n_0000000000) [    ] o.a.s.c.o.SliceMutator createReplica() {
   [junit4]   2>   "operation":"ADDREPLICA",
   [junit4]   2>   "collection":"testMetricTrigger",
   [junit4]   2>   "shard":"shard1",
   [junit4]   2>   "core":"testMetricTrigger_shard1_replica_n3",
   [junit4]   2>   "state":"down",
   [junit4]   2>   "base_url":"http://127.0.0.1:35551/solr",
   [junit4]   2>   "type":"NRT",
   [junit4]   2>   "waitForFinalState":"false"} 
   [junit4]   2> 554567 INFO  (OverseerStateUpdate-72894223504244740-127.0.0.1:35551_solr-n_0000000000) [    ] o.a.s.c.o.SliceMutator createReplica() {
   [junit4]   2>   "operation":"ADDREPLICA",
   [junit4]   2>   "collection":"testMetricTrigger",
   [junit4]   2>   "shard":"shard2",
   [junit4]   2>   "core":"testMetricTrigger_shard2_replica_n5",
   [junit4]   2>   "state":"down",
   [junit4]   2>   "base_url":"http://127.0.0.1:41748/solr",
   [junit4]   2>   "type":"NRT",
   [junit4]   2>   "waitForFinalState":"false"} 
   [junit4]   2> 554602 INFO  (OverseerStateUpdate-72894223504244740-127.0.0.1:35551_solr-n_0000000000) [    ] o.a.s.c.o.SliceMutator createReplica() {
   [junit4]   2>   "operation":"ADDREPLICA",
   [junit4]   2>   "collection":"testMetricTrigger",
   [junit4]   2>   "shard":"shard2",
   [junit4]   2>   "core":"testMetricTrigger_shard2_replica_n6",
   [junit4]   2>   "state":"down",
   [junit4]   2>   "base_url":"http://127.0.0.1:35551/solr",
   [junit4]   2>   "type":"NRT",
   [junit4]   2>   "waitForFinalState":"false"} 
   [junit4]   2> 554711 DEBUG (ScheduledTrigger-494-thread-4) [    ] o.a.s.c.a.NodeLostTrigger Running NodeLostTrigger: .auto_add_replicas with currently live nodes: 2
   [junit4]   2> 554863 INFO  (qtp150884408-2074) [n:127.0.0.1:41748_solr    x:testMetricTrigger_shard1_replica_n1] o.a.s.h.a.CoreAdminOperation core create command qt=/admin/cores&coreNodeName=core_node2&collection.configName=conf&newCollection=true&name=testMetricTrigger_shard1_replica_n1&action=CREATE&numShards=2&collection=testMetricTrigger&shard=shard1&wt=javabin&version=2&replicaType=NRT
   [junit4]   2> 554864 INFO  (qtp150884408-2074) [n:127.0.0.1:41748_solr    x:testMetricTrigger_shard1_replica_n1] o.a.s.c.TransientSolrCoreCacheDefault Allocating transient cache for 2147483647 transient cores
   [junit4]   2> 554968 INFO  (qtp150884408-2075) [n:127.0.0.1:41748_solr    x:testMetricTrigger_shard2_replica_n5] o.a.s.h.a.CoreAdminOperation core create command qt=/admin/cores&coreNodeName=core_node7&collection.configName=conf&newCollection=true&name=testMetricTrigger_shard2_replica_n5&action=CREATE&numShards=2&collection=testMetricTrigger&shard=shard2&wt=javabin&version=2&replicaType=NRT
   [junit4]   2> 554968 INFO  (qtp1769847339-2059) [n:127.0.0.1:35551_solr    x:testMetricTrigger_shard2_replica_n6] o.a.s.h.a.CoreAdminOperation core create command qt=/admin/cores&coreNodeName=core_node8&collection.configName=conf&newCollection=true&name=testMetricTrigger_shard2_replica_n6&action=CREATE&numShards=2&collection=testMetricTrigger&shard=shard2&wt=javabin&version=2&replicaType=NRT
   [junit4]   2> 555045 INFO  (qtp1769847339-2060) [n:127.0.0.1:35551_solr    x:testMetricTrigger_shard1_replica_n3] o.a.s.h.a.CoreAdminOperation core create command qt=/admin/cores&coreNodeName=core_node4&collection.configName=conf&newCollection=true&name=testMetricTrigger_shard1_replica_n3&action=CREATE&numShards=2&collection=testMetricTrigger&shard=shard1&wt=javabin&version=2&replicaType=NRT
   [junit4]   2> 555739 DEBUG (ScheduledTrigger-494-thread-4) [    ] o.a.s.c.a.NodeLostTrigger Running NodeLostTrigger: .auto_add_replicas with currently live nodes: 2
   [junit4]   2> 556059 INFO  (qtp150884408-2074) [n:127.0.0.1:41748_solr c:testMetricTrigger s:shard1 r:core_node2 x:testMetricTrigger_shard1_replica_n1] o.a.s.c.SolrConfig Using Lucene MatchVersion: 8.0.0
   [junit4]   2> 556153 INFO  (qtp150884408-2074) [n:127.0.0.1:41748_solr c:testMetricTrigger s:shard1 r:core_node2 x:testMetricTrigger_shard1_replica_n1] o.a.s.s.IndexSchema [testMetricTrigger_shard1_replica_n1] Schema name=minimal
   [junit4]   2> 556205 INFO  (qtp150884408-2075) [n:127.0.0.1:41748_solr c:testMetricTrigger s:shard2 r:core_node7 x:testMetricTrigger_shard2_replica_n5] o.a.s.c.SolrConfig Using Lucene MatchVersion: 8.0.0
   [junit4]   2> 556343 WARN  (qtp150884408-2074) [n:127.0.0.1:41748_solr c:testMetricTrigger s:shard1 r:core_node2 x:testMetricTrigger_shard1_replica_n1] o.a.s.c.SolrResourceLoader Solr loaded a deprecated plugin/analysis class [solr.TrieIntField]. Please consult documentation how to replace it accordingly.
   [junit4]   2> 556379 WARN  (qtp150884408-2074) [n:127.0.0.1:41748_solr c:testMetricTrigger s:shard1 r:core_node2 x:testMetricTrigger_shard1_replica_n1] o.a.s.c.SolrResourceLoader Solr loaded a deprecated plugin/analysis class [solr.TrieLongField]. Please consult documentation how to replace it accordingly.
   [junit4]   2> 556395 INFO  (qtp150884408-2075) [n:127.0.0.1:41748_solr c:testMetricTrigger s:shard2 r:core_node7 x:testMetricTrigger_shard2_replica_n5] o.a.s.s.IndexSchema [testMetricTrigger_shard2_replica_n5] Schema name=minimal
   [junit4]   2> 556452 INFO  (qtp150884408-2074) [n:127.0.0.1:41748_solr c:testMetricTrigger s:shard1 r:core_node2 x:testMetricTrigger_shard1_replica_n1] o.a.s.s.IndexSchema Loaded schema minimal/1.1 with uniqueid field id
   [junit4]   2> 556453 INFO  (qtp150884408-2074) [n:127.0.0.1:41748_solr c:testMetricTrigger s:shard1 r:core_node2 x:testMetricTrigger_shard1_replica_n1] o.a.s.c.CoreContainer Creating SolrCore 'testMetricTrigger_shard1_replica_n1' using configuration from collection testMetricTrigger, trusted=true
   [junit4]   2> 556596 INFO  (qtp150884408-2074) [n:127.0.0.1:41748_solr c:testMetricTrigger s:shard1 r:core_node2 x:testMetricTrigger_shard1_replica_n1] o.a.s.m.r.SolrJmxReporter JMX monitoring for 'solr_41748.solr.core.testMetricTrigger.shard1.replica_n1' (registry 'solr.core.testMetricTrigger.shard1.replica_n1') enabled at server: com.sun.jmx.mbeanserver.JmxMBeanServer@36a49728
   [junit4]   2> 556597 INFO  (qtp150884408-2074) [n:127.0.0.1:41748_solr c:testMetricTrigger s:shard1 r:core_node2 x:testMetricTrigger_shard1_replica_n1] o.a.s.c.SolrCore solr.RecoveryStrategy.Builder
   [junit4]   2> 556597 INFO  (qtp150884408-2074) [n:127.0.0.1:41748_solr c:testMetricTrigger s:shard1 r:core_node2 x:testMetricTrigger_shard1_replica_n1] o.a.s.c.SolrCore [[testMetricTrigger_shard1_replica_n1] ] Opening new SolrCore at [/home/jenkins/jenkins-slave/workspace/Lucene-Solr-Tests-master/solr/build/solr-core/test/J1/temp/solr.cloud.autoscaling.MetricTriggerIntegrationTest_D7A7C3D0F062A551-001/tempDir-001/node1/testMetricTrigger_shard1_replica_n1], dataDir=[/home/jenkins/jenkins-slave/workspace/Lucene-Solr-Tests-master/solr/build/solr-core/test/J1/temp/solr.cloud.autoscaling.MetricTriggerIntegrationTest_D7A7C3D0F062A551-001/tempDir-001/node1/./testMetricTrigger_shard1_replica_n1/data/]
   [junit4]   2> 556613 INFO  (qtp150884408-2075) [n:127.0.0.1:41748_solr c:testMetricTrigger s:shard2 r:core_node7 x:testMetricTrigger_shard2_replica_n5] o.a.s.s.IndexSchema Loaded schema minimal/1.1 with uniqueid field id
   [junit4]   2> 556613 INFO  (qtp150884408-2075) [n:127.0.0.1:41748_solr c:testMetricTrigger s:shard2 r:core_node7 x:testMetricTrigger_shard2_replica_n5] o.a.s.c.CoreContainer Creating SolrCore 'testMetricTrigger_shard2_replica_n5' using configuration from collection testMetricTrigger, trusted=true
   [junit4]   2> 556613 INFO  (qtp150884408-2075) [n:127.0.0.1:41748_solr c:testMetricTrigger s:shard2 r:core_node7 x:testMetricTrigger_shard2_replica_n5] o.a.s.m.r.SolrJmxReporter JMX monitoring for 'solr_41748.solr.core.testMetricTrigger.shard2.replica_n5' (registry 'solr.core.testMetricTrigger.shard2.replica_n5') enabled at server: com.sun.jmx.mbeanserver.JmxMBeanServer@36a49728
   [junit4]   2> 556613 INFO  (qtp150884408-2075) [n:127.0.0.1:41748_solr c:testMetricTrigger s:shard2 r:core_node7 x:testMetricTrigger_shard2_replica_n5] o.a.s.c.SolrCore solr.RecoveryStrategy.Builder
   [junit4]   2> 556613 INFO  (qtp150884408-2075) [n:127.0.0.1:41748_solr c:testMetricTrigger s:shard2 r:core_node7 x:testMetricTrigger_shard2_replica_n5] o.a.s.c.SolrCore [[testMetricTrigger_shard2_replica_n5] ] Opening new SolrCore at [/home/jenkins/jenkins-slave/workspace/Lucene-Solr-Tests-master/solr/build/solr-core/test/J1/temp/solr.cloud.autoscaling.MetricTriggerIntegrationTest_D7A7C3D0F062A551-001/tempDir-001/node1/testMetricTrigger_shard2_replica_n5], dataDir=[/home/jenkins/jenkins-slave/workspace/Lucene-Solr-Tests-master/solr/build/solr-core/test/J1/temp/solr.cloud.autoscaling.MetricTriggerIntegrationTest_D7A7C3D0F062A551-001/tempDir-001/node1/./testMetricTrigger_shard2_replica_n5/data/]
   [junit4]   2> 556687 INFO  (qtp1769847339-2060) [n:127.0.0.1:35551_solr c:testMetricTrigger s:shard1 r:core_node4 x:testMetricTrigger_shard1_replica_n3] o.a.s.c.SolrConfig Using Lucene MatchVersion: 8.0.0
   [junit4]   2> 556742 DEBUG (ScheduledTrigger-494-thread-4) [    ] o.a.s.c.a.NodeLostTrigger Running NodeLostTrigger: .auto_add_replicas with currently live nodes: 2
   [junit4]   2> 556752 INFO  (qtp1769847339-2059) [n:127.0.0.1:35551_solr c:testMetricTrigger s:shard2 r:core_node8 x:testMetricTrigger_shard2_replica_n6] o.a.s.c.SolrConfig Using Lucene MatchVersion: 8.0.0
   [junit4]   2> 556869 INFO  (qtp1769847339-2060) [n:127.0.0.1:35551_solr c:testMetricTrigger s:shard1 r:core_node4 x:testMetricTrigger_shard1_replica_n3] o.a.s.s.IndexSchema [testMetricTrigger_shard1_replica_n3] Schema name=minimal
   [junit4]   2> 557146 INFO  (qtp1769847339-2060) [n:127.0.0.1:35551_solr c:testMetricTrigger s:shard1 r:core_node4 x:testMetricTrigger_shard1_replica_n3] o.a.s.s.IndexSchema Loaded schema minimal/1.1 with uniqueid field id
   [junit4]   2> 557146 INFO  (qtp1769847339-2060) [n:127.0.0.1:35551_solr c:testMetricTrigger s:shard1 r:core_node4 x:testMetricTrigger_shard1_replica_n3] o.a.s.c.CoreContainer Creating SolrCore 'testMetricTrigger_shard1_replica_n3' using configuration from collection testMetricTrigger, trusted=true
   [junit4]   2> 557147 INFO  (qtp1769847339-2060) [n:127.0.0.1:35551_solr c:testMetricTrigger s:shard1 r:core_node4 x:testMetricTrigger_shard1_replica_n3] o.a.s.m.r.SolrJmxReporter JMX monitoring for 'solr_35551.solr.core.testMetricTrigger.shard1.replica_n3' (registry 'solr.core.testMetricTrigger.shard1.replica_n3') enabled at server: com.sun.jmx.mbeanserver.JmxMBeanServer@36a49728
   [junit4]   2> 557147 INFO  (qtp1769847339-2060) [n:127.0.0.1:35551_solr c:testMetricTrigger s:shard1 r:core_node4 x:testMetricTrigger_shard1_replica_n3] o.a.s.c.SolrCore solr.RecoveryStrategy.Builder
   [junit4]   2> 557147 INFO  (qtp1769847339-2060) [n:127.0.0.1:35551_solr c:testMetricTrigger s:shard1 r:core_node4 x:testMetricTrigger_shard1_replica_n3] o.a.s.c.SolrCore [[testMetricTrigger_shard1_replica_n3] ] Opening new SolrCore at [/home/jenkins/jenkins-slave/workspace/Lucene-Solr-Tests-master/solr/build/solr-core/test/J1/temp/solr.cloud.autoscaling.MetricTriggerIntegrationTest_D7A7C3D0F062A551-001/tempDir-001/node2/testMetricTrigger_shard1_replica_n3], dataDir=[/home/jenkins/jenkins-slave/workspace/Lucene-Solr-Tests-master/solr/build/solr-core/test/J1/temp/solr.cloud.autoscaling.MetricTriggerIntegrationTest_D7A7C3D0F062A551-001/tempDir-001/node2/./testMetricTrigger_shard1_replica_n3/data/]
   [junit4]   2> 557187 INFO  (qtp1769847339-2059) [n:127.0.0.1:35551_solr c:testMetricTrigger s:shard2 r:core_node8 x:testMetricTrigger_shard2_replica_n6] o.a.s.s.IndexSchema [testMetricTrigger_shard2_replica_n6] Schema name=minimal
   [junit4]   2> 557259 INFO  (qtp1769847339-2059) [n:127.0.0.1:35551_solr c:testMetricTrigger s:shard2 r:core_node8 x:testMetricTrigger_shard2_replica_n6] o.a.s.s.IndexSchema Loaded schema minimal/1.1 with uniqueid field id
   [junit4]   2> 557259 INFO  (qtp1769847339-2059) [n:127.0.0.1:35551_solr c:testMetricTrigger s:shard2 r:core_node8 x:testMetricTrigger_shard2_replica_n6] o.a.s.c.CoreContainer Creating SolrCore 'testMetricTrigger_shard2_replica_n6' using configuration from collection testMetricTrigger, trusted=true
   [junit4]   2> 557259 INFO  (qtp1769847339-2059) [n:127.0.0.1:35551_solr c:testMetricTrigger s:shard2 r:core_node8 x:testMetricTrigger_shard2_replica_n6] o.a.s.m.r.SolrJmxReporter JMX monitoring for 'solr_35551.solr.core.testMetricTrigger.shard2.replica_n6' (registry 'solr.core.testMetricTrigger.shard2.replica_n6') enabled at server: com.sun.jmx.mbeanserver.JmxMBeanServer@36a49728
   [junit4]   2> 557260 INFO  (qtp1769847339-2059) [n:127.0.0.1:35551_solr c:testMetricTrigger s:shard2 r:core_node8 x:testMetricTrigger_shard2_replica_n6] o.a.s.c.SolrCore solr.RecoveryStrategy.Builder
   [junit4]   2> 557260 INFO  (qtp1769847339-2059) [n:127.0.0.1:35551_solr c:testMetricTrigger s:shard2 r:core_node8 x:testMetricTrigger_shard2_replica_n6] o.a.s.c.SolrCore [[testMetricTrigger_shard2_replica_n6] ] Opening new SolrCore at [/home/jenkins/jenkins-slave/workspace/Lucene-Solr-Tests-master/solr/build/solr-core/test/J1/temp/solr.cloud.autoscaling.MetricTriggerIntegrationTest_D7A7C3D0F062A551-001/tempDir-001/node2/testMetricTrigger_shard2_replica_n6], dataDir=[/home/jenkins/jenkins-slave/workspace/Lucene-Solr-Tests-master/solr/build/solr-core/test/J1/temp/solr.cloud.autoscaling.MetricTriggerIntegrationTest_D7A7C3D0F062A551-001/tempDir-001/node2/./testMetricTrigger_shard2_replica_n6/data/]
   [junit4]   2> 557746 DEBUG (ScheduledTrigger-494-thread-4) [    ] o.a.s.c.a.NodeLostTrigger Running NodeLostTrigger: .auto_add_replicas with currently live nodes: 2
   [junit4]   2> 558150 INFO  (qtp150884408-2075) [n:127.0.0.1:41748_solr c:testMetricTrigger s:shard2 r:core_node7 x:testMetricTrigger_shard2_replica_n5] o.a.s.u.UpdateHandler Using UpdateLog implementation: org.apache.solr.update.UpdateLog
   [junit4]   2> 558150 INFO  (qtp150884408-2075) [n:127.0.0.1:41748_solr c:testMetricTrigger s:shard2 r:core_node7 x:testMetricTrigger_shard2_replica_n5] o.a.s.u.UpdateLog Initializing UpdateLog: dataDir=null defaultSyncLevel=FLUSH numRecordsToKeep=100 maxNumLogsToKeep=10 numVersionBuckets=65536
   [junit4]   2> 558151 INFO  (qtp150884408-2075) [n:127.0.0.1:41748_solr c:testMetricTrigger s:shard2 r:core_node7 x:testMetricTrigger_shard2_replica_n5] o.a.s.u.CommitTracker Hard AutoCommit: disabled
   [junit4]   2> 558151 INFO  (qtp150884408-2075) [n:127.0.0.1:41748_solr c:testMetricTrigger s:shard2 r:core_node7 x:testMetricTrigger_shard2_replica_n5] o.a.s.u.CommitTracker Soft AutoCommit: disabled
   [junit4]   2> 558165 INFO  (qtp150884408-2074) [n:127.0.0.1:41748_solr c:testMetricTrigger s:shard1 r:core_node2 x:testMetricTrigger_shard1_replica_n1] o.a.s.u.UpdateHandler Using UpdateLog implementation: org.apache.solr.update.UpdateLog
   [junit4]   2> 558165 INFO  (qtp150884408-2074) [n:127.0.0.1:41748_solr c:testMetricTrigger s:shard1 r:core_node2 x:testMetricTrigger_shard1_replica_n1] o.a.s.u.UpdateLog Initializing UpdateLog: dataDir=null defaultSyncLevel=FLUSH numRecordsToKeep=100 maxNumLogsToKeep=10 numVersionBuckets=65536
   [junit4]   2> 558166 INFO  (qtp150884408-2074) [n:127.0.0.1:41748_solr c:testMetricTrigger s:shard1 r:core_node2 x:testMetricTrigger_shard1_replica_n1] o.a.s.u.CommitTracker Hard AutoCommit: disabled
   [junit4]   2> 558166 INFO  (qtp150884408-2074) [n:127.0.0.1:41748_solr c:testMetricTrigger s:shard1 r:core_node2 x:testMetricTrigger_shard1_replica_n1] o.a.s.u.CommitTracker Soft AutoCommit: disabled
   [junit4]   2> 558186 INFO  (qtp150884408-2074) [n:127.0.0.1:41748_solr c:testMetricTrigger s:shard1 r:core_node2 x:testMetricTrigger_shard1_replica_n1] o.a.s.s.SolrIndexSearcher Opening [Searcher@3719316a[testMetricTrigger_shard1_replica_n1] main]
   [junit4]   2> 558201 INFO  (qtp150884408-2075) [n:127.0.0.1:41748_solr c:testMetricTrigger s:shard2 r:core_node7 x:testMetricTrigger_shard2_replica_n5] o.a.s.s.SolrIndexSearcher Opening [Searcher@6ec2c13c[testMetricTrigger_shard2_replica_n5] main]
   [junit4]   2> 558217 INFO  (qtp150884408-2074) [n:127.0.0.1:41748_solr c:testMetricTrigger s:shard1 r:core_node2 x:testMetricTrigger_shard1_replica_n1] o.a.s.r.ManagedResourceStorage Configured ZooKeeperStorageIO with znodeBase: /configs/conf
   [junit4]   2> 558218 INFO  (qtp150884408-2074) [n:127.0.0.1:41748_solr c:testMetricTrigger s:shard1 r:core_node2 x:testMetricTrigger_shard1_replica_n1] o.a.s.r.ManagedResourceStorage Loaded null at path _rest_managed.json using ZooKeeperStorageIO:path=/configs/conf
   [junit4]   2> 558218 INFO  (qtp150884408-2074) [n:127.0.0.1:41748_solr c:testMetricTrigger s:shard1 r:core_node2 x:testMetricTrigger_shard1_replica_n1] o.a.s.h.ReplicationHandler Commits will be reserved for 10000ms.
   [junit4]   2> 558219 INFO  (qtp150884408-2074) [n:127.0.0.1:41748_solr c:testMetricTrigger s:shard1 r:core_node2 x:testMetricTrigger_shard1_replica_n1] o.a.s.u.UpdateLog Could not find max version in index or recent updates, using new clock 1604770663873118208
   [junit4]   2> 558237 INFO  (qtp150884408-2074) [n:127.0.0.1:41748_solr c:testMetricTrigger s:shard1 r:core_node2 x:testMetricTrigger_shard1_replica_n1] o.a.s.c.ZkShardTerms Successful update of terms at /collections/testMetricTrigger/terms/shard1 to Terms{values={core_node2=0}, version=0}
   [junit4]   2> 558237 INFO  (qtp150884408-2075) [n:127.0.0.1:41748_solr c:testMetricTrigger s:shard2 r:core_node7 x:testMetricTrigger_shard2_replica_n5] o.a.s.r.ManagedResourceStorage Configured ZooKeeperStorageIO with znodeBase: /configs/conf
   [junit4]   2> 558274 INFO  (qtp150884408-2075) [n:127.0.0.1:41748_solr c:testMetricTrigger s:shard2 r:core_node7 x:testMetricTrigger_shard2_replica_n5] o.a.s.r.ManagedResourceStorage Loaded null at path _rest_managed.json using ZooKeeperStorageIO:path=/configs/conf
   [junit4]   2> 558275 INFO  (qtp150884408-2075) [n:127.0.0.1:41748_solr c:testMetricTrigger s:shard2 r:core_node7 x:testMetricTrigger_shard2_replica_n5] o.a.s.h.ReplicationHandler Commits will be reserved for 10000ms.
   [junit4]   2> 558293 INFO  (qtp150884408-2074) [n:127.0.0.1:41748_solr c:testMetricTrigger s:shard1 r:core_node2 x:testMetricTrigger_shard1_replica_n1] o.a.s.c.ShardLeaderElectionContext Waiting until we see more replicas up for shard shard1: total=2 found=1 timeoutin=9999ms
   [junit4]   2> 558294 INFO  (qtp150884408-2075) [n:127.0.0.1:41748_solr c:testMetricTrigger s:shard2 r:core_node7 x:testMetricTrigger_shard2_replica_n5] o.a.s.u.UpdateLog Could not find max version in index or recent updates, using new clock 1604770663951761408
   [junit4]   2> 558350 INFO  (searcherExecutor-505-thread-1-processing-n:127.0.0.1:41748_solr x:testMetricTrigger_shard1_replica_n1 c:testMetricTrigger s:shard1 r:core_node2) [n:127.0.0.1:41748_solr c:testMetricTrigger s:shard1 r:core_node2 x:testMetricTrigger_shard1_replica_n1] o.a.s.c.SolrCore [testMetricTrigger_shard1_replica_n1] Registered new searcher Searcher@3719316a[testMetricTrigger_shard1_replica_n1] main{ExitableDirectoryReader(UninvertingDirectoryReader())}
   [junit4]   2> 558363 INFO  (qtp1769847339-2060) [n:127.0.0.1:35551_solr c:testMetricTrigger s:shard1 r:core_node4 x:testMetricTrigger_shard1_replica_n3] o.a.s.u.UpdateHandler Using UpdateLog implementation: org.apache.solr.update.UpdateLog
   [junit4]   2> 558363 INFO  (qtp1769847339-2060) [n:127.0.0.1:35551_solr c:testMetricTrigger s:shard1 r:core_node4 x:testMetricTrigger_shard1_replica_n3] o.a.s.u.UpdateLog Initializing UpdateLog: dataDir=null defaultSyncLevel=FLUSH numRecordsToKeep=100 maxNumLogsToKeep=10 numVersionBuckets=65536
   [junit4]   2> 558364 INFO  (qtp1769847339-2060) [n:127.0.0.1:35551_solr c:testMetricTrigger s:shard1 r:core_node4 x:testMetricTrigger_shard1_replica_n3] o.a.s.u.CommitTracker Hard AutoCommit: disabled
   [junit4]   2> 558364 INFO  (qtp1769847339-2060) [n:127.0.0.1:35551_solr c:testMetricTrigger s:shard1 r:core_node4 x:testMetricTrigger_shard1_replica_n3] o.a.s.u.CommitTracker Soft AutoCommit: disabled
   [junit4]   2> 558367 INFO  (qtp1769847339-2060) [n:127.0.0.1:35551_solr c:testMetricTrigger s:shard1 r:core_node4 x:testMetricTrigger_shard1_replica_n3] o.a.s.s.SolrIndexSearcher Opening [Searcher@5c3ec7aa[testMetricTrigger_shard1_replica_n3] main]
   [junit4]   2> 558437 INFO  (searcherExecutor-506-thread-1-processing-n:127.0.0.1:41748_solr x:testMetricTrigger_shard2_replica_n5 c:testMetricTrigger s:shard2 r:core_node7) [n:127.0.0.1:41748_solr c:testMetricTrigger s:shard2 r:core_node7 x:testMetricTrigger_shard2_replica_n5] o.a.s.c.SolrCore [testMetricTrigger_shard2_replica_n5] Registered new searcher Searcher@6ec2c13c[testMetricTrigger_shard2_replica_n5] main{ExitableDirectoryReader(UninvertingDirectoryReader())}
   [junit4]   2> 558583 INFO  (qtp1769847339-2060) [n:127.0.0.1:35551_solr c:testMetricTrigger s:shard1 r:core_node4 x:testMetricTrigger_shard1_replica_n3] o.a.s.r.ManagedResourceStorage Configured ZooKeeperStorageIO with znodeBase: /configs/conf
   [junit4]   2> 558584 INFO  (qtp1769847339-2060) [n:127.0.0.1:35551_solr c:testMetricTrigger s:shard1 r:core_node4 x:testMetricTrigger_shard1_replica_n3] o.a.s.r.ManagedResourceStorage Loaded null at path _rest_managed.json using ZooKeeperStorageIO:path=/configs/conf
   [junit4]   2> 558584 INFO  (qtp1769847339-2060) [n:127.0.0.1:35551_solr c:testMetricTrigger s:shard1 r:core_node4 x:testMetricTrigger_shard1_replica_n3] o.a.s.h.ReplicationHandler Commits will be reserved for 10000ms.
   [junit4]   2> 558585 INFO  (qtp1769847339-2060) [n:127.0.0.1:35551_solr c:testMetricTrigger s:shard1 r:core_node4 x:testMetricTrigger_shard1_replica_n3] o.a.s.u.UpdateLog Could not find max version in index or recent updates, using new clock 1604770664256897024
   [junit4]   2> 558606 INFO  (searcherExecutor-507-thread-1-processing-n:127.0.0.1:35551_solr x:testMetricTrigger_shard1_replica_n3 c:testMetricTrigger s:shard1 r:core_node4) [n:127.0.0.1:35551_solr c:testMetricTrigger s:shard1 r:core_node4 x:testMetricTrigger_shard1_replica_n3] o.a.s.c.SolrCore [testMetricTrigger_shard1_replica_n3] Registered new searcher Searcher@5c3ec7aa[testMetricTrigger_shard1_replica_n3] main{ExitableDirectoryReader(UninvertingDirectoryReader())}
   [junit4]   2> 558621 INFO  (qtp150884408-2075) [n:127.0.0.1:41748_solr c:testMetricTrigger s:shard2 r:core_node7 x:testMetricTrigger_shard2_replica_n5] o.a.s.c.ZkShardTerms Successful update of terms at /collections/testMetricTrigger/terms/shard2 to Terms{values={core_node7=0}, version=0}
   [junit4]   2> 558676 INFO  (qtp1769847339-2059) [n:127.0.0.1:35551_solr c:testMetricTrigger s:shard2 r:core_node8 x:testMetricTrigger_shard2_replica_n6] o.a.s.u.UpdateHandler Using UpdateLog implementation: org.apache.solr.update.UpdateLog
   [junit4]   2> 558676 INFO  (qtp1769847339-2059) [n:127.0.0.1:35551_solr c:testMetricTrigger s:shard2 r:core_node8 x:testMetricTrigger_shard2_replica_n6] o.a.s.u.UpdateLog Initializing UpdateLog: dataDir=null defaultSyncLevel=FLUSH numRecordsToKeep=100 maxNumLogsToKeep=10 numVersionBuckets=65536
   [junit4]   2> 558678 INFO  (qtp1769847339-2059) [n:127.0.0.1:35551_solr c:testMetricTrigger s:shard2 r:core_node8 x:testMetricTrigger_shard2_replica_n6] o.a.s.u.CommitTracker Hard AutoCommit: disabled
   [junit4]   2> 558678 INFO  (qtp1769847339-2059) [n:127.0.0.1:35551_solr c:testMetricTrigger s:shard2 r:core_node8 x:testMetricTrigger_shard2_replica_n6] o.a.s.u.CommitTracker Soft AutoCommit: disabled
   [junit4]   2> 558692 INFO  (qtp1769847339-2059) [n:127.0.0.1:35551_solr c:testMetricTrigger s:shard2 r:core_node8 x:testMetricTrigger_shard2_replica_n6] o.a.s.s.SolrIndexSearcher Opening [Searcher@3aaf1234[testMetricTrigger_shard2_replica_n6] main]
   [junit4]   2> 558693 INFO  (qtp150884408-2075) [n:127.0.0.1:41748_solr c:testMetricTrigger s:shard2 r:core_node7 x:testMetricTrigger_shard2_replica_n5] o.a.s.c.ShardLeaderElectionContext Waiting until we see more replicas up for shard shard2: total=2 found=1 timeoutin=9998ms
   [junit4]   2> 558694 INFO  (qtp1769847339-2059) [n:127.0.0.1:35551_solr c:testMetricTrigger s:shard2 r:core_node8 x:testMetricTrigger_shard2_replica_n6] o.a.s.r.ManagedResourceStorage Configured ZooKeeperStorageIO with znodeBase: /configs/conf
   [junit4]   2> 558694 INFO  (qtp1769847339-2059) [n:127.0.0.1:35551_solr c:testMetricTrigger s:shard2 r:core_node8 x:testMetricTrigger_shard2_replica_n6] o.a.s.r.ManagedResourceStorage Loaded null at path _rest_managed.json using ZooKeeperStorageIO:path=/configs/conf
   [junit4]   2> 558695 INFO  (qtp1769847339-2060) [n:127.0.0.1:35551_solr c:testMetricTrigger s:shard1 r:core_node4 x:testMetricTrigger_shard1_replica_n3] o.a.s.c.ZkShardTerms Successful update of terms at /collections/testMetricTrigger/terms/shard1 to Terms{values={core_node2=0, core_node4=0}, version=1}
   [junit4]   2> 558695 INFO  (qtp1769847339-2059) [n:127.0.0.1:35551_solr c:testMetricTrigger s:shard2 r:core_node8 x:testMetricTrigger_shard2_replica_n6] o.a.s.h.ReplicationHandler Commits will be reserved for 10000ms.
   [junit4]   2> 558695 INFO  (qtp1769847339-2059) [n:127.0.0.1:35551_solr c:testMetricTrigger s:shard2 r:core_node8 x:testMetricTrigger_shard2_replica_n6] o.a.s.u.UpdateLog Could not find max version in index or recent updates, using new clock 1604770664372240384
   [junit4]   2> 558768 INFO  (searcherExecutor-508-thread-1-processing-n:127.0.0.1:35551_solr x:testMetricTrigger_shard2_replica_n6 c:testMetricTrigger s:shard2 r:core_node8) [n:127.0.0.1:35551_solr c:testMetricTrigger s:shard2 r:core_node8 x:testMetricTrigger_shard2_replica_n6] o.a.s.c.SolrCore [testMetricTrigger_shard2_replica_n6] Registered new searcher Searcher@3aaf1234[testMetricTrigger_shard2_replica_n6] main{ExitableDirectoryReader(UninvertingDirectoryReader())}
   [junit4]   2> 558797 DEBUG (ScheduledTrigger-494-thread-4) [    ] o.a.s.c.a.NodeLostTrigger Running NodeLostTrigger: .auto_add_replicas with currently live nodes: 2
   [junit4]   2> 558876 INFO  (qtp150884408-2074) [n:127.0.0.1:41748_solr c:testMetricTrigger s:shard1 r:core_node2 x:testMetricTrigger_shard1_replica_n1] o.a.s.c.ShardLeaderElectionContext Enough replicas found to continue.
   [junit4]   2> 558877 INFO  (qtp150884408-2074) [n:127.0.0.1:41748_solr c:testMetricTrigger s:shard1 r:core_node2 x:testMetricTrigger_shard1_replica_n1] o.a.s.c.ShardLeaderElectionContext I may be the new leader - try and sync
   [junit4]   2> 558877 INFO  (qtp150884408-2074) [n:127.0.0.1:41748_solr c:testMetricTrigger s:shard1 r:core_node2 x:testMetricTrigger_shard1_replica_n1] o.a.s.c.SyncStrategy Sync replicas to http://127.0.0.1:41748/solr/testMetricTrigger_shard1_replica_n1/
   [junit4]   2> 558878 INFO  (qtp150884408-2074) [n:127.0.0.1:41748_solr c:testMetricTrigger s:shard1 r:core_node2 x:testMetricTrigger_shard1_replica_n1] o.a.s.u.PeerSync PeerSync: core=testMetricTrigger_shard1_replica_n1 url=http://127.0.0.1:41748/solr START replicas=[http://127.0.0.1:35551/solr/testMetricTrigger_shard1_replica_n3/] nUpdates=100
   [junit4]   2> 558903 INFO  (qtp150884408-2074) [n:127.0.0.1:41748_solr c:testMetricTrigger s:shard1 r:core_node2 x:testMetricTrigger_shard1_replica_n1] o.a.s.u.PeerSync PeerSync: core=testMetricTrigger_shard1_replica_n1 url=http://127.0.0.1:41748/solr DONE.  We have no versions.  sync failed.
   [junit4]   2> 559220 INFO  (qtp1769847339-2063) [n:127.0.0.1:35551_solr c:testMetricTrigger s:shard1 r:core_node4 x:testMetricTrigger_shard1_replica_n3] o.a.s.c.S.Request [testMetricTrigger_shard1_replica_n3]  webapp=/solr path=/get params={distrib=false&qt=/get&fingerprint=false&getVersions=100&wt=javabin&version=2} status=0 QTime=68
   [junit4]   2> 559226 INFO  (qtp1769847339-2059) [n:127.0.0.1:35551_solr c:testMetricTrigger s:shard2 r:core_node8 x:testMetricTrigger_shard2_replica_n6] o.a.s.c.ZkShardTerms Successful update of terms at /collections/testMetricTrigger/terms/shard2 to Terms{values={core_node7=0, core_node8=0}, version=1}
   [junit4]   2> 559276 INFO  (qtp150884408-2074) [n:127.0.0.1:41748_solr c:testMetricTrigger s:shard1 r:core_node2 x:testMetricTrigger_shard1_replica_n1] o.a.s.c.SyncStrategy Leader's attempt to sync with shard failed, moving to the next candidate
   [junit4]   2> 559276 INFO  (qtp150884408-2074) [n:127.0.0.1:41748_solr c:testMetricTrigger s:shard1 r:core_node2 x:testMetricTrigger_shard1_replica_n1] o.a.s.c.ShardLeaderElectionContext We failed sync, but we have no versions - we can't sync in that case - we were active before, so become leader anyway
   [junit4]   2> 559276 INFO  (qtp150884408-2074) [n:127.0.0.1:41748_solr c:testMetricTrigger s:shard1 r:core_node2 x:testMetricTrigger_shard1_replica_n1] o.a.s.c.ShardLeaderElectionContext Found all replicas participating in election, clear LIR
   [junit4]   2> 559309 INFO  (qtp150884408-2075) [n:127.0.0.1:41748_solr c:testMetricTrigger s:shard2 r:core_node7 x:testMetricTrigger_shard2_replica_n5] o.a.s.c.ShardLeaderElectionContext Enough replicas found to continue.
   [junit4]   2> 559310 INFO  (qtp150884408-2075) [n:127.0.0.1:41748_solr c:testMetricTrigger s:shard2 r:core_node7 x:testMetricTrigger_shard2_replica_n5] o.a.s.c.ShardLeaderElectionContext I may be the new leader - try and sync
   [junit4]   2> 559310 INFO  (qtp150884408-2075) [n:127.0.0.1:41748_solr c:testMetricTrigger s:shard2 r:core_node7 x:testMetricTrigger_shard2_replica_n5] o.a.s.c.SyncStrategy Sync replicas to http://127.0.0.1:41748/solr/testMetricTrigger_shard2_replica_n5/
   [junit4]   2> 559330 INFO  (qtp150884408-2075) [n:127.0.0.1:41748_solr c:testMetricTrigger s:shard2 r:core_node7 x:testMetricTrigger_shard2_replica_n5] o.a.s.u.PeerSync PeerSync: core=testMetricTrigger_shard2_replica_n5 url=http://127.0.0.1:41748/solr START replicas=[http://127.0.0.1:35551/solr/testMetricTrigger_shard2_replica_n6/] nUpdates=100
   [junit4]   2> 559330 INFO  (qtp150884408-2075) [n:127.0.0.1:41748_solr c:testMetricTrigger s:shard2 r:core_node7 x:testMetricTrigger_shard2_replica_n5] o.a.s.u.PeerSync PeerSync: core=testMetricTrigger_shard2_replica_n5 url=http://127.0.0.1:41748/solr DONE.  We have no versions.  sync failed.
   [junit4]   2> 559440 INFO  (qtp1769847339-2064) [n:127.0.0.1:35551_solr c:testMetricTrigger s:shard2 r:core_node8 x:testMetricTrigger_shard2_replica_n6] o.a.s.c.S.Request [testMetricTrigger_shard2_replica_n6]  webapp=/solr path=/get params={distrib=false&qt=/get&fingerprint=false&getVersions=100&wt=javabin&version=2} status=0 QTime=50
   [junit4]   2> 559442 INFO  (qtp150884408-2075) [n:127.0.0.1:41748_solr c:testMetricTrigger s:shard2 r:core_node7 x:testMetricTrigger_shard2_replica_n5] o.a.s.c.SyncStrategy Leader's attempt to sync with shard failed, moving to the next candidate
   [junit4]   2> 559442 INFO  (qtp150884408-2075) [n:127.0.0.1:41748_solr c:testMetricTrigger s:shard2 r:core_node7 x:testMetricTrigger_shard2_replica_n5] o.a.s.c.ShardLeaderElectionContext We failed sync, but we have no versions - we can't sync in that case - we were active before, so become leader anyway
   [junit4]   2> 559442 INFO  (qtp150884408-2075) [n:127.0.0.1:41748_solr c:testMetricTrigger s:shard2 r:core_node7 x:testMetricTrigger_shard2_replica_n5] o.a.s.c.ShardLeaderElectionContext Found all replicas participating in election, clear LIR
   [junit4]   2> 559517 INFO  (qtp150884408-2074) [n:127.0.0.1:41748_solr c:testMetricTrigger s:shard1 r:core_node2 x:testMetricTrigger_shard1_replica_n1] o.a.s.c.ShardLeaderElectionContext I am the new leader: http://127.0.0.1:41748/solr/testMetricTrigger_shard1_replica_n1/ shard1
   [junit4]   2> 559534 INFO  (qtp150884408-2075) [n:127.0.0.1:41748_solr c:testMetricTrigger s:shard2 r:core_node7 x:testMetricTrigger_shard2_replica_n5] o.a.s.c.ShardLeaderElectionContext I am the new leader: http://127.0.0.1:41748/solr/testMetricTrigger_shard2_replica_n5/ shard2
   [junit4]   2> 559717 INFO  (qtp150884408-2075) [n:127.0.0.1:41748_solr c:testMetricTrigger s:shard2 r:core_node7 x:testMetricTrigger_shard2_replica_n5] o.a.s.c.ZkController I am the leader, no recovery necessary
   [junit4]   2> 559719 INFO  (qtp150884408-2075) [n:127.0.0.1:41748_solr c:testMetricTrigger s:shard2 r:core_node7 x:testMetricTrigger_shard2_replica_n5] o.a.s.s.HttpSolrCall [admin] webapp=null path=/admin/cores params={qt=/admin/cores&coreNodeName=core_node7&collection.configName=conf&newCollection=true&name=testMetricTrigger_shard2_replica_n5&action=CREATE&numShards=2&collection=testMetricTrigger&shard=shard2&wt=javabin&version=2&replicaType=NRT} status=0 QTime=4751
   [junit4]   2> 559753 INFO  (qtp150884408-2074) [n:127.0.0.1:41748_solr c:testMetricTrigger s:shard1 r:core_node2 x:testMetricTrigger_shard1_replica_n1] o.a.s.c.ZkController I am the leader, no recovery necessary
   [junit4]   2> 559755 INFO  (qtp150884408-2074) [n:127.0.0.1:41748_solr c:testMetricTrigger s:shard1 r:core_node2 x:testMetricTrigger_shard1_replica_n1] o.a.s.s.HttpSolrCall [admin] webapp=null path=/admin/cores params={qt=/admin/cores&coreNodeName=core_node2&collection.configName=conf&newCollection=true&name=testMetricTrigger_shard1_replica_n1&action=CREATE&numShards=2&collection=testMetricTrigger&shard=shard1&wt=javabin&version=2&replicaType=NRT} status=0 QTime=4892
   [junit4]   2> 559807 DEBUG (ScheduledTrigger-494-thread-4) [    ] o.a.s.c.a.NodeLostTrigger Running NodeLostTrigger: .auto_add_replicas with currently live nodes: 2
   [junit4]   2> 559860 INFO  (qtp1769847339-2060) [n:127.0.0.1:35551_solr c:testMetricTrigger s:shard1 r:core_node4 x:testMetricTrigger_shard1_replica_n3] o.a.s.s.HttpSolrCall [admin] webapp=null path=/admin/cores params={qt=/admin/cores&coreNodeName=core_node4&collection.configName=conf&newCollection=true&name=testMetricTrigger_shard1_replica_n3&action=CREATE&numShards=2&collection=testMetricTrigger&shard=shard1&wt=javabin&version=2&replicaType=NRT} status=0 QTime=4815
   [junit4]   2> 559984 INFO  (zkCallback-261-thread-3) [    ] o.a.s.c.c.ZkStateReader A cluster state change: [WatchedEvent state:SyncConnected type:NodeDataChanged path:/collections/testMetricTrigger/state.json] for collection [testMetricTrigger] has occurred - updating... (live nodes size: [2])
   [junit4]   2> 559997 INFO  (zkCallback-269-thread-3) [    ] o.a.s.c.c.ZkStateReader A cluster state change: [WatchedEvent state:SyncConnected type:NodeDataChanged path:/collections/testMetricTrigger/state.json] for collection [testMetricTrigger] has occurred - updating... (live nodes size: [2])
   [junit4]   2> 560267 INFO  (qtp1769847339-2059) [n:127.0.0.1:35551_solr c:testMetricTrigger s:shard2 r:core_node8 x:testMetricTrigger_shard2_replica_n6] o.a.s.s.HttpSolrCall [admin] webapp=null path=/admin/cores params={qt=/admin/cores&coreNodeName=core_node8&collection.configName=conf&newCollection=true&name=testMetricTrigger_shard2_replica_n6&action=CREATE&numShards=2&collection=testMetricTrigger&shard=shard2&wt=javabin&version=2&replicaType=NRT} status=0 QTime=5299
   [junit4]   2> 560425 INFO  (qtp150884408-2071) [n:127.0.0.1:41748_solr    ] o.a.s.h.a.CollectionsHandler Wait for new collection to be active for at most 30 seconds. Check all shard replicas
   [junit4]   2> 560441 INFO  (zkCallback-261-thread-3) [    ] o.a.s.c.c.ZkStateReader A cluster state change: [WatchedEvent state:SyncConnected type:NodeDataChanged path:/collections/testMetricTrigger/state.json] for collection [testMetricTrigger] has occurred - updating... (live nodes size: [2])
   [junit4]   2> 560448 INFO  (zkCallback-269-thread-3) [    ] o.a.s.c.c.ZkStateReader A cluster state change: [WatchedEvent state:SyncConnected type:NodeDataChanged path:/collections/testMetricTrigger/state.json] for collection [testMetricTrigger] has occurred - updating... (live nodes size: [2])
   [junit4]   2> 560812 DEBUG (ScheduledTrigger-494-thread-4) [    ] o.a.s.c.a.NodeLostTrigger Running NodeLostTrigger: .auto_add_replicas with currently live nodes: 2
   [junit4]   2> 561426 INFO  (qtp150884408-2071) [n:127.0.0.1:41748_solr    ] o.a.s.s.HttpSolrCall [admin] webapp=null path=/admin/collections params={collection.configName=conf&maxShardsPerNode=2&name=testMetricTrigger&nrtReplicas=2&action=CREATE&numShards=2&wt=javabin&version=2} status=0 QTime=7279
   [junit4]   2> 561599 INFO  (qtp150884408-2070) [n:127.0.0.1:41748_solr    ] o.a.s.s.HttpSolrCall [admin] webapp=null path=/admin/metrics params={wt=javabin&version=2&key=solr.core.testMetricTrigger.shard1.replica_n1:INDEX.sizeInBytes&key=solr.core.testMetricTrigger.shard2.replica_n5:INDEX.sizeInBytes} status=0 QTime=71
   [junit4]   2> 561603 INFO  (qtp150884408-2070) [n:127.0.0.1:41748_solr    ] o.a.s.s.HttpSolrCall [admin] webapp=null path=/admin/metrics params={prefix=CONTAINER.fs.usableSpace,CORE.coreName&wt=javabin&version=2&group=solr.node,solr.core} status=0 QTime=2
   [junit4]   2> 561688 INFO  (qtp1769847339-2066) [n:127.0.0.1:35551_solr    ] o.a.s.s.HttpSolrCall [admin] webapp=null path=/admin/metrics params={wt=javabin&version=2&key=solr.core.testMetricTrigger.shard1.replica_n3:INDEX.sizeInBytes&key=solr.core.testMetricTrigger.shard2.replica_n6:INDEX.sizeInBytes} status=0 QTime=39
   [junit4]   2> 561741 INFO  (qtp1769847339-2066) [n:127.0.0.1:35551_solr    ] o.a.s.s.HttpSolrCall [admin] webapp=null path=/admin/metrics params={prefix=CONTAINER.fs.usableSpace,CORE.coreName&wt=javabin&version=2&group=solr.node,solr.core} status=0 QTime=3
   [junit4]   2> 561758 DEBUG (qtp150884408-2073) [n:127.0.0.1:41748_solr    ] o.a.s.c.a.AutoScalingHandler Verified autoscaling configuration
   [junit4]   2> 561760 INFO  (qtp150884408-2073) [n:127.0.0.1:41748_solr    ] o.a.s.s.HttpSolrCall [admin] webapp=null path=/admin/autoscaling params={wt=javabin&version=2} status=0 QTime=289
   [junit4]   2> 561776 DEBUG (zkCallback-276-thread-1) [    ] o.a.s.c.a.OverseerTriggerThread Refreshing /autoscaling.json with znode version 3
   [junit4]   2> 561794 DEBUG (OverseerAutoScalingTriggerThread-72894223504244740-127.0.0.1:35551_solr-n_0000000000) [    ] o.a.s.c.a.OverseerTriggerThread Processed trigger updates upto znodeVersion 3
   [junit4]   2> 561813 DEBUG (ScheduledTrigger-494-thread-4) [    ] o.a.s.c.a.NodeLostTrigger Running NodeLostTrigger: .auto_add_replicas with currently live nodes: 2
   [junit4]   2> 561879 DEBUG (OverseerAutoScalingTriggerThread-72894223504244740-127.0.0.1:35551_solr-n_0000000000) [    ] o.a.s.c.a.OverseerTriggerThread -- clean old nodeAdded markers
   [junit4]   2> 561880 DEBUG (OverseerAutoScalingTriggerThread-72894223504244740-127.0.0.1:35551_solr-n_0000000000) [    ] o.a.s.c.a.OverseerTriggerThread Current znodeVersion 3, lastZnodeVersion 3
   [junit4]   2> 561904 INFO  (qtp150884408-2075) [n:127.0.0.1:41748_solr    ] o.a.s.s.HttpSolrCall [admin] webapp=null path=/admin/metrics params={wt=javabin&version=2&key=solr.core.testMetricTrigger.shard1.replica_n1:INDEX.sizeInBytes&key=solr.core.testMetricTrigger.shard2.replica_n5:INDEX.sizeInBytes} status=0 QTime=32
   [junit4]   2> 561906 INFO  (qtp150884408-2075) [n:127.0.0.1:41748_solr    ] o.a.s.s.HttpSolrCall [admin] webapp=null path=/admin/metrics params={prefix=CONTAINER.fs.usableSpace,CORE.coreName&wt=javabin&version=2&group=solr.node,solr.core} status=0 QTime=1
   [junit4]   2> 561907 INFO  (qtp1769847339-2064) [n:127.0.0.1:35551_solr    ] o.a.s.s.HttpSolrCall [admin] webapp=null path=/admin/metrics params={wt=javabin&version=2&key=solr.core.testMetricTrigger.shard1.replica_n3:INDEX.sizeInBytes&key=solr.core.testMetricTrigger.shard2.replica_n6:INDEX.sizeInBytes} status=0 QTime=0
   [junit4]   2> 561929 INFO  (qtp150884408-2073) [n:127.0.0.1:41748_solr    ] o.a.s.s.HttpSolrCall [admin] webapp=null path=/admin/metrics params={wt=javabin&version=2&key=solr.core.testMetricTrigger.shard1.replica_n1:INDEX.sizeInBytes} status=0 QTime=0
   [junit4]   2> 561942 INFO  (qtp1769847339-2066) [n:127.0.0.1:35551_solr    ] o.a.s.s.HttpSolrCall [admin] webapp=null path=/admin/metrics params={prefix=CONTAINER.fs.usableSpace,CORE.coreName&wt=javabin&version=2&group=solr.node,solr.core} status=0 QTime=1
   [junit4]   2> 561943 DEBUG (qtp150884408-2074) [n:127.0.0.1:41748_solr    ] o.a.s.c.a.AutoScalingHandler Verified autoscaling configuration
   [junit4]   2> 561956 INFO  (qtp150884408-2074) [n:127.0.0.1:41748_solr    ] o.a.s.s.HttpSolrCall [admin] webapp=null path=/admin/autoscaling params={wt=javabin&version=2} status=0 QTime=181
   [junit4]   2> 561987 INFO  (TEST-MetricTriggerIntegrationTest.testMetricTrigger-seed#[D7A7C3D0F062A551]) [    ] o.e.j.s.Server jetty-9.4.11.v20180605; built: 2018-06-05T18:24:03.829Z; git: d5fc0523cfa96bfebfbda19606cad384d772f04c; jvm 1.8.0_172-b11
   [junit4]   2> 561988 DEBUG (zkCallback-276-thread-1) [    ] o.a.s.c.a.OverseerTriggerThread Refreshing /autoscaling.json with znode version 4
   [junit4]   2> 561989 DEBUG (OverseerAutoScalingTriggerThread-72894223504244740-127.0.0.1:35551_solr-n_0000000000) [    ] o.a.s.c.a.OverseerTriggerThread Processed trigger updates upto znodeVersion 4
   [junit4]   2> 562014 INFO  (qtp1769847339-2066) [n:127.0.0.1:35551_solr    ] o.a.s.s.HttpSolrCall [admin] webapp=null path=/admin/metrics params={wt=javabin&version=2&key=solr.core.testMetricTrigger.shard1.replica_n1:INDEX.sizeInBytes} status=0 QTime=0
   [junit4]   2> 562030 INFO  (TEST-MetricTriggerIntegrationTest.testMetricTrigger-seed#[D7A7C3D0F062A551]) [    ] o.e.j.s.session DefaultSessionIdManager workerName=node0
   [junit4]   2> 562030 INFO  (TEST-MetricTriggerIntegrationTest.testMetricTrigger-seed#[D7A7C3D0F062A551]) [    ] o.e.j.s.session No SessionScavenger set, using defaults
   [junit4]   2> 562030 INFO  (TEST-MetricTriggerIntegrationTest.testMetricTrigger-seed#[D7A7C3D0F062A551]) [    ] o.e.j.s.session node0 Scavenging every 600000ms
   [junit4]   2> 562031 INFO  (TEST-MetricTriggerIntegrationTest.testMetricTrigger-seed#[D7A7C3D0F062A551]) [    ] o.e.j.s.h.ContextHandler Started o.e.j.s.ServletContextHandler@3658f59c{/solr,null,AVAILABLE}
   [junit4]   2> 562031 INFO  (TEST-MetricTriggerIntegrationTest.testMetricTrigger-seed#[D7A7C3D0F062A551]) [    ] o.e.j.s.AbstractConnector Started ServerConnector@76d0a504{HTTP/1.1,[http/1.1]}{127.0.0.1:40133}
   [junit4]   2> 562031 INFO  (TEST-MetricTriggerIntegrationTest.testMetricTrigger-seed#[D7A7C3D0F062A551]) [    ] o.e.j.s.Server Started @562200ms
   [junit4]   2> 562031 INFO  (TEST-MetricTriggerIntegrationTest.testMetricTrigger-seed#[D7A7C3D0F062A551]) [    ] o.a.s.c.s.e.JettySolrRunner Jetty properties: {hostContext=/solr, hostPort=40133}
   [junit4]   2> 562031 ERROR (TEST-MetricTriggerIntegrationTest.testMetricTrigger-seed#[D7A7C3D0F062A551]) [    ] o.a.s.u.StartupLoggingUtils Missing Java Option solr.log.dir. Logging may be missing or incomplete.
   [junit4]   2> 562176 INFO  (TEST-MetricTriggerIntegrationTest.testMetricTrigger-seed#[D7A7C3D0F062A551]) [    ] o.a.s.s.SolrDispatchFilter Using logger factory org.apache.logging.slf4j.Log4jLoggerFactory
   [junit4]   2> 562176 INFO  (TEST-MetricTriggerIntegrationTest.testMetricTrigger-seed#[D7A7C3D0F062A551]) [    ] o.a.s.s.SolrDispatchFilter  ___      _       Welcome to Apache Solr™ version 8.0.0
   [junit4]   2> 562176 INFO  (TEST-MetricTriggerIntegrationTest.testMetricTrigger-seed#[D7A7C3D0F062A551]) [    ] o.a.s.s.SolrDispatchFilter / __| ___| |_ _   Starting in cloud mode on port null
   [junit4]   2> 562176 INFO  (TEST-MetricTriggerIntegrationTest.testMetricTrigger-seed#[D7A7C3D0F062A551]) [    ] o.a.s.s.SolrDispatchFilter \__ \/ _ \ | '_|  Install dir: null
   [junit4]   2> 562177 INFO  (TEST-MetricTriggerIntegrationTest.testMetricTrigger-seed#[D7A7C3D0F062A551]) [    ] o.a.s.s.SolrDispatchFilter |___/\___/_|_|    Start time: 2018-07-01T07:02:49.816Z
   [junit4]   2> 562228 DEBUG (OverseerAutoScalingTriggerThread-72894223504244740-127.0.0.1:35551_solr-n_0000000000) [    ] o.a.s.c.a.OverseerTriggerThread -- clean old nodeAdded markers
   [junit4]   2> 562228 DEBUG (OverseerAutoScalingTriggerThread-72894223504244740-127.0.0.1:35551_solr-n_0000000000) [    ] o.a.s.c.a.OverseerTriggerThread Current znodeVersion 4, lastZnodeVersion 4
   [junit4]   2> 562228 INFO  (OverseerCollectionConfigSetProcessor-72894223504244740-127.0.0.1:35551_solr-n_0000000000) [    ] o.a.s.c.OverseerTaskQueue Response ZK path: /overseer/collection-queue-work/qnr-0000000000 doesn't exist.  Requestor may have disconnected from ZooKeeper
   [junit4]   2> 562278 INFO  (zkConnectionManagerCallback-295-thread-1) [    ] o.a.s.c.c.ConnectionManager zkClient has connected
   [junit4]   2> 562404 INFO  (TEST-MetricTriggerIntegrationTest.testMetricTrigger-seed#[D7A7C3D0F062A551]) [    ] o.a.s.s.SolrDispatchFilter solr.xml found in ZooKeeper. Loading...
   [junit4]   2> 562813 DEBUG (ScheduledTrigger-494-thread-3) [    ] o.a.s.c.a.NodeLostTrigger Running NodeLostTrigger: .auto_add_replicas with currently live nodes: 2
   [junit4]   2> 563153 INFO  (TEST-MetricTriggerIntegrationTest.testMetricTrigger-seed#[D7A7C3D0F062A551]) [    ] o.a.s.c.ZkContainer Zookeeper client=127.0.0.1:35252/solr
   [junit4]   2> 563225 INFO  (zkConnectionManagerCallback-299-thread-1) [    ] o.a.s.c.c.ConnectionManager zkClient has connected
   [junit4]   2> 563447 INFO  (zkConnectionManagerCallback-301-thread-1) [    ] o.a.s.c.c.ConnectionManager zkClient has connected
   [junit4]   2> 563506 INFO  (qtp150884408-2077) [n:127.0.0.1:41748_solr    ] o.a.s.s.HttpSolrCall [admin] webapp=null path=/admin/metrics params={wt=javabin&version=2&key=solr.core.testMetricTrigger.shard1.replica_n1:INDEX.sizeInBytes} status=0 QTime=0
   [junit4]   2> 563557 INFO  (qtp1769847339-2066) [n:127.0.0.1:35551_solr    ] o.a.s.s.HttpSolrCall [admin] webapp=null path=/admin/metrics params={wt=javabin&version=2&key=solr.core.testMetricTrigger.shard1.replica_n1:INDEX.sizeInBytes} status=0 QTime=0
   [junit4]   2> 563608 INFO  (TEST-MetricTriggerIntegrationTest.testMetricTrigger-seed#[D7A7C3D0F062A551]) [n:127.0.0.1:40133_solr    ] o.a.s.c.c.ZkStateReader Updated live nodes from ZooKeeper... (0) -> (2)
   [junit4]   2> 563610 INFO  (TEST-MetricTriggerIntegrationTest.testMetricTrigger-seed#[D7A7C3D0F062A551]) [n:127.0.0.1:40133_solr    ] o.a.s.c.Overseer Overseer (id=null) closing
   [junit4]   2> 563628 INFO  (TEST-MetricTriggerIntegrationTest.testMetricTrigger-seed#[D7A7C3D0F062A551]) [n:127.0.0.1:40133_solr    ] o.a.s.c.TransientSolrCoreCacheDefault Allocating transient cache for 2147483647 transient cores
   [junit4]   2> 563628 INFO  (TEST-MetricTriggerIntegrationTest.testMetricTrigger-seed#[D7A7C3D0F062A551]) [n:127.0.0.1:40133_solr    ] o.a.s.c.ZkController Register node as live in ZooKeeper:/live_nodes/127.0.0.1:40133_solr
   [junit4]   2> 563665 INFO  (zkCallback-276-thread-1) [    ] o.a.s.c.c.ZkStateReader Updated live nodes from ZooKeeper... (2) -> (3)
   [junit4]   2> 563666 INFO  (zkCallback-281-thread-1) [    ] o.a.s.c.c.ZkStateReader Updated live nodes from ZooKeeper... (2) -> (3)
   [junit4]   2> 563666 INFO  (zkCallback-269-thread-3) [    ] o.a.s.c.c.ZkStateReader Updated live nodes from ZooKeeper... (2) -> (3)
   [junit4]   2> 563683 INFO  (zkCallback-300-thread-1) [    ] o.a.s.c.c.ZkStateReader Updated live nodes from ZooKeeper... (2) -> (3)
   [junit4]   2> 563685 INFO  (zkCallback-261-thread-3) [    ] o.a.s.c.c.ZkStateReader Updated live nodes from ZooKeeper... (2) -> (3)
   [junit4]   2> 563689 INFO  (zkCallback-290-thread-1) [    ] o.a.s.c.c.ZkStateReader Updated live nodes from ZooKeeper... (2) -> (3)
   [junit4]   2> 563814 DEBUG (ScheduledTrigger-494-thread-2) [    ] o.a.s.c.a.NodeLostTrigger Running NodeLostTrigger: .auto_add_replicas with currently live nodes: 3
   [junit4]   2> 563921 INFO  (zkConnectionManagerCallback-308-thread-1) [    ] o.a.s.c.c.ConnectionManager zkClient has connected
   [junit4]   2> 563939 INFO  (TEST-MetricTriggerIntegrationTest.testMetricTrigger-seed#[D7A7C3D0F062A551]) [n:127.0.0.1:40133_solr    ] o.a.s.c.c.ZkStateReader Updated live nodes from ZooKeeper... (0) -> (3)
   [junit4]   2> 563940 INFO  (TEST-MetricTriggerIntegrationTest.testMetricTrigger-seed#[D7A7C3D0F062A551]) [n:127.0.0.1:40133_solr    ] o.a.s.c.s.i.ZkClientClusterStateProvider Cluster at 127.0.0.1:35252/solr ready
   [junit4]   2> 563973 INFO  (TEST-MetricTriggerIntegrationTest.testMetricTrigger-seed#[D7A7C3D0F062A551]) [n:127.0.0.1:40133_solr    ] o.a.s.h.a.MetricsHistoryHandler No .system collection, keeping metrics history in memory.
   [junit4]   2> 564048 INFO  (TEST-MetricTriggerIntegrationTest.testMetricTrigger-seed#[D7A7C3D0F062A551]) [n:127.0.0.1:40133_solr    ] o.a.s.m.r.SolrJmxReporter JMX monitoring for 'solr_40133.solr.node' (registry 'solr.node') enabled at server: com.sun.jmx.mbeanserver.JmxMBeanServer@36a49728
   [junit4]   2> 564085 INFO  (TEST-MetricTriggerIntegrationTest.testMetricTrigger-seed#[D7A7C3D0F062A551]) [n:127.0.0.1:40133_solr    ] o.a.s.m.r.SolrJmxReporter JMX monitoring for 'solr_40133.solr.jvm' (registry 'solr.jvm') enabled at server: com.sun.jmx.mbeanserver.JmxMBeanServer@36a49728
   [junit4]   2> 564086 INFO  (TEST-MetricTriggerIntegrationTest.testMetricTrigger-seed#[D7A7C3D0F062A551]) [n:127.0.0.1:40133_solr    ] o.a.s.m.r.SolrJmxReporter JMX monitoring for 'solr_40133.solr.jetty' (registry 'solr.jetty') enabled at server: com.sun.jmx.mbeanserver.JmxMBeanServer@36a49728
   [junit4]   2> 564087 INFO  (TEST-MetricTriggerIntegrationTest.testMetricTrigger-seed#[D7A7C3D0F062A551]) [n:127.0.0.1:40133_solr    ] o.a.s.c.CorePropertiesLocator Found 0 core definitions underneath /home/jenkins/jenkins-slave/workspace/Lucene-Solr-Tests-master/solr/build/solr-core/test/J1/temp/solr.cloud.autoscaling.MetricTriggerIntegrationTest_D7A7C3D0F062A551-001/tempDir-001/node3/.
   [junit4]   2> 564303 INFO  (TEST-MetricTriggerIntegrationTest.testMetricTrigger-seed#[D7A7C3D0F062A551]) [    ] o.e.j.s.Server jetty-9.4.11.v20180605; built: 2018-06-05T18:24:03.829Z; git: d5fc0523cfa96bfebfbda19606cad384d772f04c; jvm 1.8.0_172-b11
   [junit4]   2> 564312 INFO  (TEST-MetricTriggerIntegrationTest.testMetricTrigger-seed#[D7A7C3D0F062A551]) [    ] o.e.j.s.session DefaultSessionIdManager workerName=node0
   [junit4]   2> 564312 INFO  (TEST-MetricTriggerIntegrationTest.testMetricTrigger-seed#[D7A7C3D0F062A551]) [    ] o.e.j.s.session No SessionScavenger set, using defaults
   [junit4]   2> 564312 INFO  (TEST-MetricTriggerIntegrationTest.testMetricTrigger-seed#[D7A7C3D0F062A551]) [    ] o.e.j.s.session node0 Scavenging every 600000ms
   [junit4]   2> 564312 INFO  (TEST-MetricTriggerIntegrationTest.testMetricTrigger-seed#[D7A7C3D0F062A551]) [    ] o.e.j.s.h.ContextHandler Started o.e.j.s.ServletContextHandler@4897f7dd{/solr,null,AVAILABLE}
   [junit4]   2> 564313 INFO  (TEST-MetricTriggerIntegrationTest.testMetricTrigger-seed#[D7A7C3D0F062A551]) [    ] o.e.j.s.AbstractConnector Started ServerConnector@2e2cb138{HTTP/1.1,[http/1.1]}{127.0.0.1:35794}
   [junit4]   2> 564313 INFO  (TEST-MetricTriggerIntegrationTest.testMetricTrigger-seed#[D7A7C3D0F062A551]) [    ] o.e.j.s.Server Started @564482ms
   [junit4]   2> 564313 INFO  (TEST-MetricTriggerIntegrationTest.testMetricTrigger-seed#[D7A7C3D0F062A551]) [    ] o.a.s.c.s.e.JettySolrRunner Jetty properties: {hostContext=/solr, hostPort=35794}
   [junit4]   2> 564313 ERROR (TEST-MetricTriggerIntegrationTest.testMetricTrigger-seed#[D7A7C3D0F062A551]) [    ] o.a.s.u.StartupLoggingUtils Missing Java Option solr.log.dir. Logging may be missing or incomplete.
   [junit4]   2> 564313 INFO  (TEST-MetricTriggerIntegrationTest.testMetricTrigger-seed#[D7A7C3D0F062A551]) [    ] o.a.s.s.SolrDispatchFilter Using logger factory org.apache.logging.slf4j.Log4jLoggerFactory
   [junit4]   2> 564313 INFO  (TEST-MetricTriggerIntegrationTest.testMetricTrigger-seed#[D7A7C3D0F062A551]) [    ] o.a.s.s.SolrDispatchFilter  ___      _       Welcome to Apache Solr™ version 8.0.0
   [junit4]   2> 564313 INFO  (TEST-MetricTriggerIntegrationTest.testMetricTrigger-seed#[D7A7C3D0F062A551]) [    ] o.a.s.s.SolrDispatchFilter / __| ___| |_ _   Starting in cloud mode on port null
   [junit4]   2> 564313 INFO  (TEST-MetricTriggerIntegrationTest.testMetricTrigger-seed#[D7A7C3D0F062A551]) [    ] o.a.s.s.SolrDispatchFilter \__ \/ _ \ | '_|  Install dir: null
   [junit4]   2> 564314 INFO  (TEST-MetricTriggerIntegrationTest.testMetricTrigger-seed#[D7A7C3D0F062A551]) [    ] o.a.s.s.SolrDispatchFilter |___/\___/_|_|    Start time: 2018-07-01T07:02:51.952Z
   [junit4]   2> 564364 INFO  (zkConnectionManagerCallback-311-thread-1) [    ] o.a.s.c.c.ConnectionManager zkClient has connected
   [junit4]   2> 564400 INFO  (TEST-MetricTriggerIntegrationTest.testMetricTrigger-seed#[D7A7C3D0F062A551]) [    ] o.a.s.s.SolrDispatchFilter solr.xml found in ZooKeeper. Loading...
   [junit4]   2> 574400 WARN  (TEST-MetricTriggerIntegrationTest.testMetricTrigger-seed#[D7A7C3D0F062A551]-SendThread(127.0.0.1:35252)) [    ] o.a.z.ClientCnxn Client session timed out, have not heard from server in 10460ms for sessionid 0x102f8e8fa26000f
   [junit4]   2> 574432 WARN  (jetty-launcher-249-thread-2-SendThread(127.0.0.1:35252)) [    ] o.a.z.ClientCnxn Client session timed out, have not heard from server in 10618ms for sessionid 0x102f8e8fa260007
   [junit4]   2> 574432 WARN  (SUITE-MetricTriggerIntegrationTest-seed#[D7A7C3D0F062A551]-worker-SendThread(127.0.0.1:35252)) [    ] o.a.z.ClientCnxn Client session timed out, have not heard from server in 10743ms for sessionid 0x102f8e8fa26000a
   [junit4]   2> 574432 WARN  (jetty-launcher-249-thread-1-SendThread(127.0.0.1:35252)) [    ] o.a.z.ClientCnxn Client session timed out, have not heard from server in 10766ms for sessionid 0x102f8e8fa260008
   [junit4]   2> 574436 DEBUG (ScheduledTrigger-494-thread-4) [    ] o.a.s.c.a.NodeLostTrigger Running NodeLostTrigger: .auto_add_replicas with currently live nodes: 3
   [junit4]   2> 574615 WARN  (zkConnectionManagerCallback-291-thread-1) [    ] o.a.s.c.c.ConnectionManager Watcher org.apache.solr.common.cloud.ConnectionManager@5412aefd name: ZooKeeperConnection Watcher:127.0.0.1:35252/solr got event WatchedEvent state:Disconnected type:None path:null path: null type: None
   [junit4]   2> 574615 WARN  (zkConnectionManagerCallback-291-thread-1) [    ] o.a.s.c.c.ConnectionManager zkClient has disconnected
   [junit4]   2> 574652 WARN  (zkConnectionManagerCallback-282-thread-1) [    ] o.a.s.c.c.ConnectionManager Watcher org.apache.solr.common.cloud.ConnectionManager@21d01898 name: ZooKeeperConnection Watcher:127.0.0.1:35252/solr got event WatchedEvent state:Disconnected type:None path:null path: null type: None
   [junit4]   2> 574652 WARN  (zkConnectionManagerCallback-282-thread-1) [    ] o.a.s.c.c.ConnectionManager zkClient has disconnected
   [junit4]   2> 574705 WARN  (zkConnectionManagerCallback-277-thread-1) [    ] o.a.s.c.c.ConnectionManager Watcher org.apache.solr.common.cloud.ConnectionManager@1672cfe4 name: ZooKeeperConnection Watcher:127.0.0.1:35252/solr got event WatchedEvent state:Disconnected type:None path:null path: null type: None
   [junit4]   2> 574705 WARN  (zkConnectionManagerCallback-277-thread-1) [    ] o.a.s.c.c.ConnectionManager zkClient has disconnected
   [junit4]   2> 574742 WARN  (zkConnectionManagerCallback-308-thread-1) [    ] o.a.s.c.c.ConnectionManager Watcher org.apache.solr.common.cloud.ConnectionManager@1e8e4c09 name: ZooKeeperConnection Watcher:127.0.0.1:35252/solr got event WatchedEvent state:Disconnected type:None path:null path: null type: None
   [junit4]   2> 574742 WARN  (zkConnectionManagerCallback-308-thread-1) [    ] o.a.s.c.c.ConnectionManager zkClient has disconnected
   [junit4]   2> 575093 INFO  (TEST-MetricTriggerIntegrationTest.testMetricTrigger-seed#[D7A7C3D0F062A551]) [    ] o.a.s.c.ZkContainer Zookeeper client=127.0.0.1:35252/solr
   [junit4]   2> 575167 INFO  (zkConnectionManagerCallback-315-thread-1) [    ] o.a.s.c.c.ConnectionManager zkClient has connected
   [junit4]   2> 575384 INFO  (zkConnectionManagerCallback-317-thread-1) [    ] o.a.s.c.c.ConnectionManager zkClient has connected
   [junit4]   2> 575437 DEBUG (ScheduledTrigger-494-thread-4) [    ] o.a.s.c.a.NodeLostTrigger Running NodeLostTrigger: .auto_add_replicas with currently live nodes: 3
   [junit4]   2> 575460 INFO  (TEST-MetricTriggerIntegrationTest.testMetricTrigger-seed#[D7A7C3D0F062A551]) [n:127.0.0.1:35794_solr    ] o.a.s.c.c.ZkStateReader Updated live nodes from ZooKeeper... (0) -> (3)
   [junit4]   2> 575479 INFO  (TEST-MetricTriggerIntegrationTest.testMetricTrigger-seed#[D7A7C3D0F062A551]) [n:127.0.0.1:35794_solr    ] o.a.s.c.Overseer Overseer (id=null) closing
   [junit4]   2> 575480 INFO  (TEST-MetricTriggerIntegrationTest.testMetricTrigger-seed#[D7A7C3D0F062A551]) [n:127.0.0.1:35794_solr    ] o.a.s.c.TransientSolrCoreCacheDefault Allocating transient cache for 2147483647 transient cores
   [junit4]   2> 575481 INFO  (TEST-MetricTriggerIntegrationTest.testMetricTrigger-seed#[D7A7C3D0F062A551]) [n:127.0.0.1:35794_solr    ] o.a.s.c.ZkController Register node as live in ZooKeeper:/live_nodes/127.0.0.1:35794_solr
   [junit4]   2> 575497 INFO  (zkCallback-316-thread-1) [    ] o.a.s.c.c.ZkStateReader Updated live nodes from ZooKeeper... (3) -> (4)
   [junit4]   2> 575515 INFO  (zkCallback-300-thread-1) [    ] o.a.s.c.c.ZkStateReader Updated live nodes from ZooKeeper... (3) -> (4)
   [junit4]   2> 575515 INFO  (zkCallback-269-thread-3) [    ] o.a.s.c.c.ZkStateReader Updated live nodes from ZooKeeper... (3) -> (4)
   [junit4]   2> 575515 INFO  (zkCallback-261-thread-1) [    ] o.a.s.c.c.ZkStateReader Updated live nodes from ZooKeeper... (3) -> (4)
   [junit4]   2> 575746 INFO  (zkConnectionManagerCallback-324-thread-1) [    ] o.a.s.c.c.ConnectionManager zkClient has connected
   [junit4]   2> 575803 WARN  (TEST-MetricTriggerIntegrationTest.testMetricTrigger-seed#[D7A7C3D0F062A551]-SendThread(127.0.0.1:35252)) [    ] o.a.z.ClientCnxn Unable to reconnect to ZooKeeper service, session 0x102f8e8fa26000f has expired
   [junit4]   2> 575804 WARN  (zkConnectionManagerCallback-308-thread-1) [    ] o.a.s.c.c.ConnectionManager Watcher org.apache.solr.common.cloud.ConnectionManager@1e8e4c09 name: ZooKeeperConnection Watcher:127.0.0.1:35252/solr got event WatchedEvent state:Expired type:None path:null path: null type: None
   [junit4]   2> 575804 WARN  (jetty-launcher-249-thread-1-SendThread(127.0.0.1:35252)) [    ] o.a.z.ClientCnxn Unable to reconnect to ZooKeeper service, session 0x102f8e8fa260008 has expired
   [junit4]   2> 575888 WARN  (zkConnectionManagerCallback-282-thread-1) [    ] o.a.s.c.c.ConnectionManager Watcher org.apache.solr.common.cloud.ConnectionManager@21d01898 name: ZooKeeperConnection Watcher:127.0.0.1:35252/solr got event WatchedEvent state:Expired type:None path:null path: null type: None
   [junit4]   2> 575888 WARN  (zkConnectionManagerCallback-282-thread-1) [    ] o.a.s.c.c.ConnectionManager Our previous ZooKeeper session was expired. Attempting to reconnect to recover relationship with ZooKeeper...
   [junit4]   2> 575889 WARN  (zkConnectionManagerCallback-282-thread-1) [    ] o.a.s.c.c.DefaultConnectionStrategy Connection expired - starting a new one...
   [junit4]   2> 575912 WARN  (zkConnectionManagerCallback-308-thread-1) [    ] o.a.s.c.c.ConnectionManager Our previous ZooKeeper session was expired. Attempting to reconnect to recover relationship with ZooKeeper...
   [junit4]   2> 575912 WARN  (zkConnectionManagerCallback-308-thread-1) [    ] o.a.s.c.c.DefaultConnectionStrategy Connection expired - starting a new one...
   [junit4]   2> 575961 INFO  (zkConnectionManagerCallback-282-thread-1-EventThread) [    ] o.a.s.c.c.ConnectionManager zkClient has connected
   [junit4]   2> 575961 INFO  (zkConnectionManagerCallback-282-thread-1) [    ] o.a.s.c.c.ConnectionManager Connection with ZooKeeper reestablished.
   [junit4]   2> 575984 INFO  (zkConnectionManagerCallback-308-thread-1-EventThread) [    ] o.a.s.c.c.ConnectionManager zkClient has connected
   [junit4]   2> 575984 INFO  (zkConnectionManagerCallback-308-thread-1) [    ] o.a.s.c.c.ConnectionManager Connection with ZooKeeper reestablished.
   [junit4]   2> 576071 INFO  (TEST-MetricTriggerIntegrationTest.testMetricTrigger-seed#[D7A7C3D0F062A551]) [n:127.0.0.1:35794_solr    ] o.a.s.c.c.ZkStateReader Updated live nodes from ZooKeeper... (0) -> (4)
   [junit4]   2> 576108 INFO  (zkConnectionManagerCallback-282-thread-1) [    ] o.a.s.c.c.ZkStateReader Updated live nodes from ZooKeeper... (3) -> (4)
   [junit4]   2> 576108 INFO  (zkConnectionManagerCallback-308-thread-1) [    ] o.a.s.c.c.ZkStateReader Updated live nodes from ZooKeeper... (3) -> (4)
   [junit4]   2> 576144 INFO  (TEST-MetricTriggerIntegrationTest.testMetricTrigger-seed#[D7A7C3D0F062A551]) [n:127.0.0.1:35794_solr    ] o.a.s.c.s.i.ZkClientClusterStateProvider Cluster at 127.0.0.1:35252/solr ready
   [junit4]   2> 576145 INFO  (TEST-MetricTriggerIntegrationTest.testMetricTrigger-seed#[D7A7C3D0F062A551]) [n:127.0.0.1:35794_solr    ] o.a.s.h.a.MetricsHistoryHandler No .system collection, keeping metrics history in memory.
   [junit4]   2> 576152 WARN  (jetty-launcher-249-thread-2-SendThread(127.0.0.1:35252)) [    ] o.a.z.ClientCnxn Unable to reconnect to ZooKeeper service, session 0x102f8e8fa260007 has expired
   [junit4]   2> 576157 ERROR (ScheduledTrigger-494-thread-1) [    ] o.a.s.c.a.ScheduledTriggers Unexpected exception from trigger: metric_trigger
   [junit4]   2> org.apache.solr.common.SolrException: Could not load collection from ZK: testMetricTrigger
   [junit4]   2> 	at org.apache.solr.common.cloud.ZkStateReader.getCollectionLive(ZkStateReader.java:1316) ~[java/:?]
   [junit4]   2> 	at org.apache.solr.common.cloud.ZkStateReader$LazyCollectionRef.get(ZkStateReader.java:732) ~[java/:?]
   [junit4]   2> 	at org.apache.solr.common.cloud.ClusterState$CollectionRef.get(ClusterState.java:386) ~[java/:?]
   [junit4]   2> 	at org.apache.solr.cloud.autoscaling.MetricTrigger.run(MetricTrigger.java:129) ~[java/:?]
   [junit4]   2> 	at org.apache.solr.cloud.autoscaling.ScheduledTriggers$TriggerWrapper.run(ScheduledTriggers.java:588) [java/:?]
   [junit4]   2> 	at java.util.concurrent.Executors$RunnableAdapter.call(Executors.java:511) [?:1.8.0_172]
   [junit4]   2> 	at java.util.concurrent.FutureTask.runAndReset(FutureTask.java:308) [?:1.8.0_172]
   [junit4]   2> 	at java.util.concurrent.ScheduledThreadPoolExecutor$ScheduledFutureTask.access$301(ScheduledThreadPoolExecutor.java:180) [?:1.8.0_172]
   [junit4]   2> 	at java.util.concurrent.ScheduledThreadPoolExecutor$ScheduledFutureTask.run(ScheduledThreadPoolExecutor.java:294) [?:1.8.0_172]
   [junit4]   2> 	at java.util.concurrent.ThreadPoolExecutor.runWorker(ThreadPoolExecutor.java:1149) [?:1.8.0_172]
   [junit4]   2> 	at java.util.concurrent.ThreadPoolExecutor$Worker.run(ThreadPoolExecutor.java:624) [?:1.8.0_172]
   [junit4]   2> 	at java.lang.Thread.run(Thread.java:748) [?:1.8.0_172]
   [junit4]   2> Caused by: org.apache.zookeeper.KeeperException$SessionExpiredException: KeeperErrorCode = Session expired for /collections/testMetricTrigger/state.json
   [junit4]   2> 	at org.apache.zookeeper.KeeperException.create(KeeperException.java:130) ~[zookeeper-3.4.11.jar:3.4.11-37e277162d567b55a07d1755f0b31c32e93c01a0]
   [junit4]   2> 	at org.apache.zookeeper.KeeperException.create(KeeperException.java:54) ~[zookeeper-3.4.11.jar:3.4.11-37e277162d567b55a07d1755f0b31c32e93c01a0]
   [junit4]   2> 	at org.apache.zookeeper.ZooKeeper.getData(ZooKeeper.java:1215) ~[zookeeper-3.4.11.jar:3.4.11-37e277162d567b55a07d1755f0b31c32e93c01a0]
   [junit4]   2> 	at org.apache.solr.common.cloud.SolrZkClient.lambda$getData$5(SolrZkClient.java:341) ~[java/:?]
   [junit4]   2> 	at org.apache.solr.common.cloud.ZkCmdExecutor.retryOperation(ZkCmdExecutor.java:60) ~[java/:?]
   [junit4]   2> 	at org.apache.solr.common.cloud.SolrZkClient.getData(SolrZkClient.java:341) ~[java/:?]
   [junit4]   2> 	at org.apache.solr.common.cloud.ZkStateReader.fetchCollectionState(ZkStateReader.java:1328) ~[java/:?]
   [junit4]   2> 	at org.apache.solr.common.cloud.ZkStateReader.getCollectionLive(ZkStateReader.java:1314) ~[java/:?]
   [junit4]   2> 	... 11 more
   [junit4]   2> 576158 WARN  (ScheduledTrigger-494-thread-1) [    ] o.a.s.c.a.TriggerBase Exception updating trigger state '/autoscaling/triggerState/metric_trigger'
   [junit4]   2> org.apache.zookeeper.KeeperException$SessionExpiredException: KeeperErrorCode = Session expired for /autoscaling/triggerState/metric_trigger
   [junit4]   2> 	at org.apache.zookeeper.KeeperException.create(KeeperException.java:130) ~[zookeeper-3.4.11.jar:3.4.11-37e277162d567b55a07d1755f0b31c32e93c01a0]
   [junit4]   2> 	at org.apache.zookeeper.KeeperException.create(KeeperException.java:54) ~[zookeeper-3.4.11.jar:3.4.11-37e277162d567b55a07d1755f0b31c32e93c01a0]
   [junit4]   2> 	at org.apache.zookeeper.ZooKeeper.exists(ZooKeeper.java:1105) ~[zookeeper-3.4.11.jar:3.4.11-37e277162d567b55a07d1755f0b31c32e93c01a0]
   [junit4]   2> 	at org.apache.solr.common.cloud.SolrZkClient.lambda$exists$3(SolrZkClient.java:317) ~[java/:?]
   [junit4]   2> 	at org.apache.solr.common.cloud.ZkCmdExecutor.retryOperation(ZkCmdExecutor.java:60) ~[java/:?]
   [junit4]   2> 	at org.apache.solr.common.cloud.SolrZkClient.exists(SolrZkClient.java:317) ~[java/:?]
   [junit4]   2> 	at org.apache.solr.client.solrj.impl.ZkDistribStateManager.hasData(ZkDistribStateManager.java:58) ~[java/:?]
   [junit4]   2> 	at org.apache.solr.cloud.autoscaling.TriggerBase.saveState(TriggerBase.java:234) [java/:?]
   [junit4]   2> 	at org.apache.solr.cloud.autoscaling.ScheduledTriggers$TriggerWrapper.run(ScheduledTriggers.java:595) [java/:?]
   [junit4]   2> 	at java.util.concurrent.Executors$RunnableAdapter.call(Executors.java:511) [?:1.8.0_172]
   [junit4]   2> 	at java.util.concurrent.FutureTask.runAndReset(FutureTask.java:308) [?:1.8.0_172]
   [junit4]   2> 	at java.util.concurrent.ScheduledThreadPoolExecutor$ScheduledFutureTask.access$301(ScheduledThreadPoolExecutor.java:180) [?:1.8.0_172]
   [junit4]   2> 	at java.util.concurrent.ScheduledThreadPoolExecutor$ScheduledFutureTask.run(ScheduledThreadPoolExecutor.java:294) [?:1.8.0_172]
   [junit4]   2> 	at java.util.concurrent.ThreadPoolExecutor.runWorker(ThreadPoolExecutor.java:1149) [?:1.8.0_172]
   [junit4]   2> 	at java.util.concurrent.ThreadPoolExecutor$Worker.run(ThreadPoolExecutor.java:624) [?:1.8.0_172]
   [junit4]   2> 	at java.lang.Thread.run(Thread.java:748) [?:1.8.0_172]
   [junit4]   2> 576164 WARN  (zkConnectionManagerCallback-277-thread-1) [    ] o.a.s.c.c.ConnectionManager Watcher org.apache.solr.co

[...truncated too long message...]

-settings.xml

resolve:

ivy-availability-check:
[loadresource] Do not set property disallowed.ivy.jars.list as its length is 0.

-ivy-fail-disallowed-ivy-version:

ivy-fail:

ivy-configure:
[ivy:configure] :: loading settings :: file = /home/jenkins/jenkins-slave/workspace/Lucene-Solr-Tests-master/lucene/top-level-ivy-settings.xml

resolve:

ivy-availability-check:
[loadresource] Do not set property disallowed.ivy.jars.list as its length is 0.

-ivy-fail-disallowed-ivy-version:

ivy-fail:

ivy-configure:
[ivy:configure] :: loading settings :: file = /home/jenkins/jenkins-slave/workspace/Lucene-Solr-Tests-master/lucene/top-level-ivy-settings.xml

resolve:

ivy-availability-check:
[loadresource] Do not set property disallowed.ivy.jars.list as its length is 0.

-ivy-fail-disallowed-ivy-version:

ivy-fail:

ivy-configure:
[ivy:configure] :: loading settings :: file = /home/jenkins/jenkins-slave/workspace/Lucene-Solr-Tests-master/lucene/top-level-ivy-settings.xml

resolve:

ivy-availability-check:
[loadresource] Do not set property disallowed.ivy.jars.list as its length is 0.

-ivy-fail-disallowed-ivy-version:

ivy-fail:

ivy-configure:
[ivy:configure] :: loading settings :: file = /home/jenkins/jenkins-slave/workspace/Lucene-Solr-Tests-master/lucene/top-level-ivy-settings.xml

resolve:

jar-checksums:
    [mkdir] Created dir: /home/jenkins/jenkins-slave/workspace/Lucene-Solr-Tests-master/lucene/null456438406
     [copy] Copying 39 files to /home/jenkins/jenkins-slave/workspace/Lucene-Solr-Tests-master/lucene/null456438406
   [delete] Deleting directory /home/jenkins/jenkins-slave/workspace/Lucene-Solr-Tests-master/lucene/null456438406

resolve-example:

ivy-availability-check:
[loadresource] Do not set property disallowed.ivy.jars.list as its length is 0.

-ivy-fail-disallowed-ivy-version:

ivy-fail:

ivy-configure:
[ivy:configure] :: loading settings :: file = /home/jenkins/jenkins-slave/workspace/Lucene-Solr-Tests-master/lucene/top-level-ivy-settings.xml

resolve:

resolve-server:

ivy-availability-check:
[loadresource] Do not set property disallowed.ivy.jars.list as its length is 0.

-ivy-fail-disallowed-ivy-version:

ivy-fail:

ivy-fail:

ivy-configure:
[ivy:configure] :: loading settings :: file = /home/jenkins/jenkins-slave/workspace/Lucene-Solr-Tests-master/lucene/top-level-ivy-settings.xml

resolve:

resolve:

ivy-availability-check:
[loadresource] Do not set property disallowed.ivy.jars.list as its length is 0.

-ivy-fail-disallowed-ivy-version:

ivy-fail:

ivy-fail:

ivy-configure:
[ivy:configure] :: loading settings :: file = /home/jenkins/jenkins-slave/workspace/Lucene-Solr-Tests-master/lucene/top-level-ivy-settings.xml

resolve:

ivy-availability-check:
[loadresource] Do not set property disallowed.ivy.jars.list as its length is 0.

-ivy-fail-disallowed-ivy-version:

ivy-fail:

ivy-fail:

ivy-configure:
[ivy:configure] :: loading settings :: file = /home/jenkins/jenkins-slave/workspace/Lucene-Solr-Tests-master/lucene/top-level-ivy-settings.xml

resolve:

ivy-availability-check:
[loadresource] Do not set property disallowed.ivy.jars.list as its length is 0.

-ivy-fail-disallowed-ivy-version:

ivy-fail:

ivy-configure:
[ivy:configure] :: loading settings :: file = /home/jenkins/jenkins-slave/workspace/Lucene-Solr-Tests-master/lucene/top-level-ivy-settings.xml

resolve:

ivy-availability-check:
[loadresource] Do not set property disallowed.ivy.jars.list as its length is 0.

-ivy-fail-disallowed-ivy-version:

ivy-fail:

ivy-fail:

ivy-configure:
[ivy:configure] :: loading settings :: file = /home/jenkins/jenkins-slave/workspace/Lucene-Solr-Tests-master/lucene/top-level-ivy-settings.xml

resolve:

ivy-availability-check:
[loadresource] Do not set property disallowed.ivy.jars.list as its length is 0.

-ivy-fail-disallowed-ivy-version:

ivy-fail:

ivy-configure:
[ivy:configure] :: loading settings :: file = /home/jenkins/jenkins-slave/workspace/Lucene-Solr-Tests-master/lucene/top-level-ivy-settings.xml

resolve:

ivy-availability-check:
[loadresource] Do not set property disallowed.ivy.jars.list as its length is 0.

-ivy-fail-disallowed-ivy-version:

ivy-fail:

ivy-fail:

ivy-configure:
[ivy:configure] :: loading settings :: file = /home/jenkins/jenkins-slave/workspace/Lucene-Solr-Tests-master/lucene/top-level-ivy-settings.xml

resolve:

ivy-availability-check:
[loadresource] Do not set property disallowed.ivy.jars.list as its length is 0.

-ivy-fail-disallowed-ivy-version:

ivy-fail:

ivy-fail:

ivy-configure:
[ivy:configure] :: loading settings :: file = /home/jenkins/jenkins-slave/workspace/Lucene-Solr-Tests-master/lucene/top-level-ivy-settings.xml

resolve:

ivy-availability-check:
[loadresource] Do not set property disallowed.ivy.jars.list as its length is 0.

-ivy-fail-disallowed-ivy-version:

ivy-fail:

ivy-fail:

ivy-configure:
[ivy:configure] :: loading settings :: file = /home/jenkins/jenkins-slave/workspace/Lucene-Solr-Tests-master/lucene/top-level-ivy-settings.xml

resolve:

ivy-availability-check:
[loadresource] Do not set property disallowed.ivy.jars.list as its length is 0.

-ivy-fail-disallowed-ivy-version:

ivy-fail:

ivy-fail:

ivy-configure:
[ivy:configure] :: loading settings :: file = /home/jenkins/jenkins-slave/workspace/Lucene-Solr-Tests-master/lucene/top-level-ivy-settings.xml

resolve:

ivy-availability-check:
[loadresource] Do not set property disallowed.ivy.jars.list as its length is 0.

-ivy-fail-disallowed-ivy-version:

ivy-fail:

ivy-fail:

ivy-configure:
[ivy:configure] :: loading settings :: file = /home/jenkins/jenkins-slave/workspace/Lucene-Solr-Tests-master/lucene/top-level-ivy-settings.xml

resolve:

ivy-availability-check:
[loadresource] Do not set property disallowed.ivy.jars.list as its length is 0.

-ivy-fail-disallowed-ivy-version:

ivy-fail:

ivy-fail:

ivy-configure:
[ivy:configure] :: loading settings :: file = /home/jenkins/jenkins-slave/workspace/Lucene-Solr-Tests-master/lucene/top-level-ivy-settings.xml

resolve:

ivy-availability-check:
[loadresource] Do not set property disallowed.ivy.jars.list as its length is 0.

-ivy-fail-disallowed-ivy-version:

ivy-fail:

ivy-fail:

ivy-configure:
[ivy:configure] :: loading settings :: file = /home/jenkins/jenkins-slave/workspace/Lucene-Solr-Tests-master/lucene/top-level-ivy-settings.xml

resolve:

ivy-availability-check:
[loadresource] Do not set property disallowed.ivy.jars.list as its length is 0.

-ivy-fail-disallowed-ivy-version:

ivy-fail:

ivy-fail:

ivy-configure:
[ivy:configure] :: loading settings :: file = /home/jenkins/jenkins-slave/workspace/Lucene-Solr-Tests-master/lucene/top-level-ivy-settings.xml

resolve:

ivy-availability-check:
[loadresource] Do not set property disallowed.ivy.jars.list as its length is 0.

-ivy-fail-disallowed-ivy-version:

ivy-fail:

ivy-fail:

ivy-configure:
[ivy:configure] :: loading settings :: file = /home/jenkins/jenkins-slave/workspace/Lucene-Solr-Tests-master/lucene/top-level-ivy-settings.xml

resolve:

ivy-availability-check:
[loadresource] Do not set property disallowed.ivy.jars.list as its length is 0.

-ivy-fail-disallowed-ivy-version:

ivy-fail:

ivy-fail:

ivy-configure:
[ivy:configure] :: loading settings :: file = /home/jenkins/jenkins-slave/workspace/Lucene-Solr-Tests-master/lucene/top-level-ivy-settings.xml

resolve:

ivy-availability-check:
[loadresource] Do not set property disallowed.ivy.jars.list as its length is 0.

-ivy-fail-disallowed-ivy-version:

ivy-fail:

ivy-fail:

ivy-configure:
[ivy:configure] :: loading settings :: file = /home/jenkins/jenkins-slave/workspace/Lucene-Solr-Tests-master/lucene/top-level-ivy-settings.xml

resolve:

jar-checksums:
    [mkdir] Created dir: /home/jenkins/jenkins-slave/workspace/Lucene-Solr-Tests-master/solr/null86964605
     [copy] Copying 247 files to /home/jenkins/jenkins-slave/workspace/Lucene-Solr-Tests-master/solr/null86964605
   [delete] Deleting directory /home/jenkins/jenkins-slave/workspace/Lucene-Solr-Tests-master/solr/null86964605

check-working-copy:
[ivy:cachepath] :: resolving dependencies :: org.eclipse.jgit#org.eclipse.jgit-caller;working
[ivy:cachepath] 	confs: [default]
[ivy:cachepath] 	found org.eclipse.jgit#org.eclipse.jgit;4.6.0.201612231935-r in public
[ivy:cachepath] 	found com.jcraft#jsch;0.1.53 in public
[ivy:cachepath] 	found com.googlecode.javaewah#JavaEWAH;1.1.6 in public
[ivy:cachepath] 	found org.apache.httpcomponents#httpclient;4.3.6 in public
[ivy:cachepath] 	found org.apache.httpcomponents#httpcore;4.3.3 in public
[ivy:cachepath] 	found commons-logging#commons-logging;1.1.3 in public
[ivy:cachepath] 	found commons-codec#commons-codec;1.6 in public
[ivy:cachepath] 	found org.slf4j#slf4j-api;1.7.2 in public
[ivy:cachepath] :: resolution report :: resolve 71ms :: artifacts dl 5ms
	---------------------------------------------------------------------
	|                  |            modules            ||   artifacts   |
	|       conf       | number| search|dwnlded|evicted|| number|dwnlded|
	---------------------------------------------------------------------
	|      default     |   8   |   0   |   0   |   0   ||   8   |   0   |
	---------------------------------------------------------------------
[wc-checker] Initializing working copy...
[wc-checker] SLF4J: Failed to load class "org.slf4j.impl.StaticLoggerBinder".
[wc-checker] SLF4J: Defaulting to no-operation (NOP) logger implementation
[wc-checker] SLF4J: See http://www.slf4j.org/codes.html#StaticLoggerBinder for further details.
[wc-checker] Checking working copy status...

-jenkins-base:

BUILD SUCCESSFUL
Total time: 202 minutes 11 seconds
Archiving artifacts
WARN: No artifacts found that match the file pattern "**/*.events,heapdumps/**,**/hs_err_pid*". Configuration error?
WARN: java.lang.InterruptedException: no matches found within 10000
Recording test results
Build step 'Publish JUnit test result report' changed build result to UNSTABLE
Email was triggered for: Unstable (Test Failures)
Sending email for trigger: Unstable (Test Failures)

Mime
View raw message