lucene-dev mailing list archives

Site index · List index
Message view « Date » · « Thread »
Top « Date » · « Thread »
From Policeman Jenkins Server <jenk...@thetaphi.de>
Subject [JENKINS] Lucene-Solr-7.x-Linux (64bit/jdk1.8.0_172) - Build # 2328 - Still Unstable!
Date Mon, 16 Jul 2018 02:34:52 GMT
Build: https://jenkins.thetaphi.de/job/Lucene-Solr-7.x-Linux/2328/
Java: 64bit/jdk1.8.0_172 -XX:+UseCompressedOops -XX:+UseParallelGC

4 tests failed.
FAILED:  org.apache.lucene.document.TestLatLonShapeQueries.testRandomMedium

Error Message:
wrong hit (first of possibly more):  FAIL: id=6472 should match but did not   query=LatLonShapeBoundingBoxQuery: field=shape:Rectangle(lat=-62.921879715286195 TO 0.0 lon=8.381903171539307E-8 TO 0.9999999403953552) docID=15772   polygon=[-4.190951585769653E-8, 0.0] [89.99999995809048, 0.0] [89.99999995809048, 179.99999991618097] [-4.190951585769653E-8, 0.0]    deleted?=false  rect=Rectangle(-62.921879715286195 TO 0.0 lon=8.381903171539307E-8 TO 0.9999999403953552)

Stack Trace:
java.lang.AssertionError: wrong hit (first of possibly more):

FAIL: id=6472 should match but did not
  query=LatLonShapeBoundingBoxQuery: field=shape:Rectangle(lat=-62.921879715286195 TO 0.0 lon=8.381903171539307E-8 TO 0.9999999403953552) docID=15772
  polygon=[-4.190951585769653E-8, 0.0] [89.99999995809048, 0.0] [89.99999995809048, 179.99999991618097] [-4.190951585769653E-8, 0.0] 
  deleted?=false  rect=Rectangle(-62.921879715286195 TO 0.0 lon=8.381903171539307E-8 TO 0.9999999403953552)
	at __randomizedtesting.SeedInfo.seed([B1406AEE368F6B32:C9E5D4677EA0854]:0)
	at org.junit.Assert.fail(Assert.java:93)
	at org.apache.lucene.document.TestLatLonShapeQueries.verifyRandomBBoxes(TestLatLonShapeQueries.java:262)
	at org.apache.lucene.document.TestLatLonShapeQueries.verify(TestLatLonShapeQueries.java:133)
	at org.apache.lucene.document.TestLatLonShapeQueries.doTestRandom(TestLatLonShapeQueries.java:129)
	at org.apache.lucene.document.TestLatLonShapeQueries.testRandomMedium(TestLatLonShapeQueries.java:101)
	at sun.reflect.NativeMethodAccessorImpl.invoke0(Native Method)
	at sun.reflect.NativeMethodAccessorImpl.invoke(NativeMethodAccessorImpl.java:62)
	at sun.reflect.DelegatingMethodAccessorImpl.invoke(DelegatingMethodAccessorImpl.java:43)
	at java.lang.reflect.Method.invoke(Method.java:498)
	at com.carrotsearch.randomizedtesting.RandomizedRunner.invoke(RandomizedRunner.java:1737)
	at com.carrotsearch.randomizedtesting.RandomizedRunner$8.evaluate(RandomizedRunner.java:934)
	at com.carrotsearch.randomizedtesting.RandomizedRunner$9.evaluate(RandomizedRunner.java:970)
	at com.carrotsearch.randomizedtesting.RandomizedRunner$10.evaluate(RandomizedRunner.java:984)
	at org.apache.lucene.util.TestRuleSetupTeardownChained$1.evaluate(TestRuleSetupTeardownChained.java:49)
	at org.apache.lucene.util.AbstractBeforeAfterRule$1.evaluate(AbstractBeforeAfterRule.java:45)
	at org.apache.lucene.util.TestRuleThreadAndTestName$1.evaluate(TestRuleThreadAndTestName.java:48)
	at org.apache.lucene.util.TestRuleIgnoreAfterMaxFailures$1.evaluate(TestRuleIgnoreAfterMaxFailures.java:64)
	at org.apache.lucene.util.TestRuleMarkFailure$1.evaluate(TestRuleMarkFailure.java:47)
	at com.carrotsearch.randomizedtesting.rules.StatementAdapter.evaluate(StatementAdapter.java:36)
	at com.carrotsearch.randomizedtesting.ThreadLeakControl$StatementRunner.run(ThreadLeakControl.java:368)
	at com.carrotsearch.randomizedtesting.ThreadLeakControl.forkTimeoutingTask(ThreadLeakControl.java:817)
	at com.carrotsearch.randomizedtesting.ThreadLeakControl$3.evaluate(ThreadLeakControl.java:468)
	at com.carrotsearch.randomizedtesting.RandomizedRunner.runSingleTest(RandomizedRunner.java:943)
	at com.carrotsearch.randomizedtesting.RandomizedRunner$5.evaluate(RandomizedRunner.java:829)
	at com.carrotsearch.randomizedtesting.RandomizedRunner$6.evaluate(RandomizedRunner.java:879)
	at com.carrotsearch.randomizedtesting.RandomizedRunner$7.evaluate(RandomizedRunner.java:890)
	at org.apache.lucene.util.AbstractBeforeAfterRule$1.evaluate(AbstractBeforeAfterRule.java:45)
	at com.carrotsearch.randomizedtesting.rules.StatementAdapter.evaluate(StatementAdapter.java:36)
	at org.apache.lucene.util.TestRuleStoreClassName$1.evaluate(TestRuleStoreClassName.java:41)
	at com.carrotsearch.randomizedtesting.rules.NoShadowingOrOverridesOnMethodsRule$1.evaluate(NoShadowingOrOverridesOnMethodsRule.java:40)
	at com.carrotsearch.randomizedtesting.rules.NoShadowingOrOverridesOnMethodsRule$1.evaluate(NoShadowingOrOverridesOnMethodsRule.java:40)
	at com.carrotsearch.randomizedtesting.rules.StatementAdapter.evaluate(StatementAdapter.java:36)
	at com.carrotsearch.randomizedtesting.rules.StatementAdapter.evaluate(StatementAdapter.java:36)
	at com.carrotsearch.randomizedtesting.rules.StatementAdapter.evaluate(StatementAdapter.java:36)
	at org.apache.lucene.util.TestRuleAssertionsRequired$1.evaluate(TestRuleAssertionsRequired.java:53)
	at org.apache.lucene.util.TestRuleMarkFailure$1.evaluate(TestRuleMarkFailure.java:47)
	at org.apache.lucene.util.TestRuleIgnoreAfterMaxFailures$1.evaluate(TestRuleIgnoreAfterMaxFailures.java:64)
	at org.apache.lucene.util.TestRuleIgnoreTestSuites$1.evaluate(TestRuleIgnoreTestSuites.java:54)
	at com.carrotsearch.randomizedtesting.rules.StatementAdapter.evaluate(StatementAdapter.java:36)
	at com.carrotsearch.randomizedtesting.ThreadLeakControl$StatementRunner.run(ThreadLeakControl.java:368)
	at java.lang.Thread.run(Thread.java:748)


FAILED:  org.apache.lucene.document.TestLatLonShapeQueries.testRandomMedium

Error Message:
wrong hit (first of possibly more):  FAIL: id=6472 should match but did not   query=LatLonShapeBoundingBoxQuery: field=shape:Rectangle(lat=-62.921879715286195 TO 0.0 lon=8.381903171539307E-8 TO 0.9999999403953552) docID=15772   polygon=[-4.190951585769653E-8, 0.0] [89.99999995809048, 0.0] [89.99999995809048, 179.99999991618097] [-4.190951585769653E-8, 0.0]    deleted?=false  rect=Rectangle(-62.921879715286195 TO 0.0 lon=8.381903171539307E-8 TO 0.9999999403953552)

Stack Trace:
java.lang.AssertionError: wrong hit (first of possibly more):

FAIL: id=6472 should match but did not
  query=LatLonShapeBoundingBoxQuery: field=shape:Rectangle(lat=-62.921879715286195 TO 0.0 lon=8.381903171539307E-8 TO 0.9999999403953552) docID=15772
  polygon=[-4.190951585769653E-8, 0.0] [89.99999995809048, 0.0] [89.99999995809048, 179.99999991618097] [-4.190951585769653E-8, 0.0] 
  deleted?=false  rect=Rectangle(-62.921879715286195 TO 0.0 lon=8.381903171539307E-8 TO 0.9999999403953552)
	at __randomizedtesting.SeedInfo.seed([B1406AEE368F6B32:C9E5D4677EA0854]:0)
	at org.junit.Assert.fail(Assert.java:93)
	at org.apache.lucene.document.TestLatLonShapeQueries.verifyRandomBBoxes(TestLatLonShapeQueries.java:262)
	at org.apache.lucene.document.TestLatLonShapeQueries.verify(TestLatLonShapeQueries.java:133)
	at org.apache.lucene.document.TestLatLonShapeQueries.doTestRandom(TestLatLonShapeQueries.java:129)
	at org.apache.lucene.document.TestLatLonShapeQueries.testRandomMedium(TestLatLonShapeQueries.java:101)
	at sun.reflect.NativeMethodAccessorImpl.invoke0(Native Method)
	at sun.reflect.NativeMethodAccessorImpl.invoke(NativeMethodAccessorImpl.java:62)
	at sun.reflect.DelegatingMethodAccessorImpl.invoke(DelegatingMethodAccessorImpl.java:43)
	at java.lang.reflect.Method.invoke(Method.java:498)
	at com.carrotsearch.randomizedtesting.RandomizedRunner.invoke(RandomizedRunner.java:1737)
	at com.carrotsearch.randomizedtesting.RandomizedRunner$8.evaluate(RandomizedRunner.java:934)
	at com.carrotsearch.randomizedtesting.RandomizedRunner$9.evaluate(RandomizedRunner.java:970)
	at com.carrotsearch.randomizedtesting.RandomizedRunner$10.evaluate(RandomizedRunner.java:984)
	at org.apache.lucene.util.TestRuleSetupTeardownChained$1.evaluate(TestRuleSetupTeardownChained.java:49)
	at org.apache.lucene.util.AbstractBeforeAfterRule$1.evaluate(AbstractBeforeAfterRule.java:45)
	at org.apache.lucene.util.TestRuleThreadAndTestName$1.evaluate(TestRuleThreadAndTestName.java:48)
	at org.apache.lucene.util.TestRuleIgnoreAfterMaxFailures$1.evaluate(TestRuleIgnoreAfterMaxFailures.java:64)
	at org.apache.lucene.util.TestRuleMarkFailure$1.evaluate(TestRuleMarkFailure.java:47)
	at com.carrotsearch.randomizedtesting.rules.StatementAdapter.evaluate(StatementAdapter.java:36)
	at com.carrotsearch.randomizedtesting.ThreadLeakControl$StatementRunner.run(ThreadLeakControl.java:368)
	at com.carrotsearch.randomizedtesting.ThreadLeakControl.forkTimeoutingTask(ThreadLeakControl.java:817)
	at com.carrotsearch.randomizedtesting.ThreadLeakControl$3.evaluate(ThreadLeakControl.java:468)
	at com.carrotsearch.randomizedtesting.RandomizedRunner.runSingleTest(RandomizedRunner.java:943)
	at com.carrotsearch.randomizedtesting.RandomizedRunner$5.evaluate(RandomizedRunner.java:829)
	at com.carrotsearch.randomizedtesting.RandomizedRunner$6.evaluate(RandomizedRunner.java:879)
	at com.carrotsearch.randomizedtesting.RandomizedRunner$7.evaluate(RandomizedRunner.java:890)
	at org.apache.lucene.util.AbstractBeforeAfterRule$1.evaluate(AbstractBeforeAfterRule.java:45)
	at com.carrotsearch.randomizedtesting.rules.StatementAdapter.evaluate(StatementAdapter.java:36)
	at org.apache.lucene.util.TestRuleStoreClassName$1.evaluate(TestRuleStoreClassName.java:41)
	at com.carrotsearch.randomizedtesting.rules.NoShadowingOrOverridesOnMethodsRule$1.evaluate(NoShadowingOrOverridesOnMethodsRule.java:40)
	at com.carrotsearch.randomizedtesting.rules.NoShadowingOrOverridesOnMethodsRule$1.evaluate(NoShadowingOrOverridesOnMethodsRule.java:40)
	at com.carrotsearch.randomizedtesting.rules.StatementAdapter.evaluate(StatementAdapter.java:36)
	at com.carrotsearch.randomizedtesting.rules.StatementAdapter.evaluate(StatementAdapter.java:36)
	at com.carrotsearch.randomizedtesting.rules.StatementAdapter.evaluate(StatementAdapter.java:36)
	at org.apache.lucene.util.TestRuleAssertionsRequired$1.evaluate(TestRuleAssertionsRequired.java:53)
	at org.apache.lucene.util.TestRuleMarkFailure$1.evaluate(TestRuleMarkFailure.java:47)
	at org.apache.lucene.util.TestRuleIgnoreAfterMaxFailures$1.evaluate(TestRuleIgnoreAfterMaxFailures.java:64)
	at org.apache.lucene.util.TestRuleIgnoreTestSuites$1.evaluate(TestRuleIgnoreTestSuites.java:54)
	at com.carrotsearch.randomizedtesting.rules.StatementAdapter.evaluate(StatementAdapter.java:36)
	at com.carrotsearch.randomizedtesting.ThreadLeakControl$StatementRunner.run(ThreadLeakControl.java:368)
	at java.lang.Thread.run(Thread.java:748)


FAILED:  org.apache.lucene.document.TestLatLonShapeQueries.testRandomMedium

Error Message:
wrong hit (first of possibly more):  FAIL: id=6472 should match but did not   query=LatLonShapeBoundingBoxQuery: field=shape:Rectangle(lat=-62.921879715286195 TO 0.0 lon=8.381903171539307E-8 TO 0.9999999403953552) docID=15772   polygon=[-4.190951585769653E-8, 0.0] [89.99999995809048, 0.0] [89.99999995809048, 179.99999991618097] [-4.190951585769653E-8, 0.0]    deleted?=false  rect=Rectangle(-62.921879715286195 TO 0.0 lon=8.381903171539307E-8 TO 0.9999999403953552)

Stack Trace:
java.lang.AssertionError: wrong hit (first of possibly more):

FAIL: id=6472 should match but did not
  query=LatLonShapeBoundingBoxQuery: field=shape:Rectangle(lat=-62.921879715286195 TO 0.0 lon=8.381903171539307E-8 TO 0.9999999403953552) docID=15772
  polygon=[-4.190951585769653E-8, 0.0] [89.99999995809048, 0.0] [89.99999995809048, 179.99999991618097] [-4.190951585769653E-8, 0.0] 
  deleted?=false  rect=Rectangle(-62.921879715286195 TO 0.0 lon=8.381903171539307E-8 TO 0.9999999403953552)
	at __randomizedtesting.SeedInfo.seed([B1406AEE368F6B32:C9E5D4677EA0854]:0)
	at org.junit.Assert.fail(Assert.java:93)
	at org.apache.lucene.document.TestLatLonShapeQueries.verifyRandomBBoxes(TestLatLonShapeQueries.java:262)
	at org.apache.lucene.document.TestLatLonShapeQueries.verify(TestLatLonShapeQueries.java:133)
	at org.apache.lucene.document.TestLatLonShapeQueries.doTestRandom(TestLatLonShapeQueries.java:129)
	at org.apache.lucene.document.TestLatLonShapeQueries.testRandomMedium(TestLatLonShapeQueries.java:101)
	at sun.reflect.NativeMethodAccessorImpl.invoke0(Native Method)
	at sun.reflect.NativeMethodAccessorImpl.invoke(NativeMethodAccessorImpl.java:62)
	at sun.reflect.DelegatingMethodAccessorImpl.invoke(DelegatingMethodAccessorImpl.java:43)
	at java.lang.reflect.Method.invoke(Method.java:498)
	at com.carrotsearch.randomizedtesting.RandomizedRunner.invoke(RandomizedRunner.java:1737)
	at com.carrotsearch.randomizedtesting.RandomizedRunner$8.evaluate(RandomizedRunner.java:934)
	at com.carrotsearch.randomizedtesting.RandomizedRunner$9.evaluate(RandomizedRunner.java:970)
	at com.carrotsearch.randomizedtesting.RandomizedRunner$10.evaluate(RandomizedRunner.java:984)
	at org.apache.lucene.util.TestRuleSetupTeardownChained$1.evaluate(TestRuleSetupTeardownChained.java:49)
	at org.apache.lucene.util.AbstractBeforeAfterRule$1.evaluate(AbstractBeforeAfterRule.java:45)
	at org.apache.lucene.util.TestRuleThreadAndTestName$1.evaluate(TestRuleThreadAndTestName.java:48)
	at org.apache.lucene.util.TestRuleIgnoreAfterMaxFailures$1.evaluate(TestRuleIgnoreAfterMaxFailures.java:64)
	at org.apache.lucene.util.TestRuleMarkFailure$1.evaluate(TestRuleMarkFailure.java:47)
	at com.carrotsearch.randomizedtesting.rules.StatementAdapter.evaluate(StatementAdapter.java:36)
	at com.carrotsearch.randomizedtesting.ThreadLeakControl$StatementRunner.run(ThreadLeakControl.java:368)
	at com.carrotsearch.randomizedtesting.ThreadLeakControl.forkTimeoutingTask(ThreadLeakControl.java:817)
	at com.carrotsearch.randomizedtesting.ThreadLeakControl$3.evaluate(ThreadLeakControl.java:468)
	at com.carrotsearch.randomizedtesting.RandomizedRunner.runSingleTest(RandomizedRunner.java:943)
	at com.carrotsearch.randomizedtesting.RandomizedRunner$5.evaluate(RandomizedRunner.java:829)
	at com.carrotsearch.randomizedtesting.RandomizedRunner$6.evaluate(RandomizedRunner.java:879)
	at com.carrotsearch.randomizedtesting.RandomizedRunner$7.evaluate(RandomizedRunner.java:890)
	at org.apache.lucene.util.AbstractBeforeAfterRule$1.evaluate(AbstractBeforeAfterRule.java:45)
	at com.carrotsearch.randomizedtesting.rules.StatementAdapter.evaluate(StatementAdapter.java:36)
	at org.apache.lucene.util.TestRuleStoreClassName$1.evaluate(TestRuleStoreClassName.java:41)
	at com.carrotsearch.randomizedtesting.rules.NoShadowingOrOverridesOnMethodsRule$1.evaluate(NoShadowingOrOverridesOnMethodsRule.java:40)
	at com.carrotsearch.randomizedtesting.rules.NoShadowingOrOverridesOnMethodsRule$1.evaluate(NoShadowingOrOverridesOnMethodsRule.java:40)
	at com.carrotsearch.randomizedtesting.rules.StatementAdapter.evaluate(StatementAdapter.java:36)
	at com.carrotsearch.randomizedtesting.rules.StatementAdapter.evaluate(StatementAdapter.java:36)
	at com.carrotsearch.randomizedtesting.rules.StatementAdapter.evaluate(StatementAdapter.java:36)
	at org.apache.lucene.util.TestRuleAssertionsRequired$1.evaluate(TestRuleAssertionsRequired.java:53)
	at org.apache.lucene.util.TestRuleMarkFailure$1.evaluate(TestRuleMarkFailure.java:47)
	at org.apache.lucene.util.TestRuleIgnoreAfterMaxFailures$1.evaluate(TestRuleIgnoreAfterMaxFailures.java:64)
	at org.apache.lucene.util.TestRuleIgnoreTestSuites$1.evaluate(TestRuleIgnoreTestSuites.java:54)
	at com.carrotsearch.randomizedtesting.rules.StatementAdapter.evaluate(StatementAdapter.java:36)
	at com.carrotsearch.randomizedtesting.ThreadLeakControl$StatementRunner.run(ThreadLeakControl.java:368)
	at java.lang.Thread.run(Thread.java:748)


FAILED:  org.apache.lucene.document.TestLatLonShapeQueries.testRandomMedium

Error Message:
wrong hit (first of possibly more):  FAIL: id=6472 should match but did not   query=LatLonShapeBoundingBoxQuery: field=shape:Rectangle(lat=-62.921879715286195 TO 0.0 lon=8.381903171539307E-8 TO 0.9999999403953552) docID=15772   polygon=[-4.190951585769653E-8, 0.0] [89.99999995809048, 0.0] [89.99999995809048, 179.99999991618097] [-4.190951585769653E-8, 0.0]    deleted?=false  rect=Rectangle(-62.921879715286195 TO 0.0 lon=8.381903171539307E-8 TO 0.9999999403953552)

Stack Trace:
java.lang.AssertionError: wrong hit (first of possibly more):

FAIL: id=6472 should match but did not
  query=LatLonShapeBoundingBoxQuery: field=shape:Rectangle(lat=-62.921879715286195 TO 0.0 lon=8.381903171539307E-8 TO 0.9999999403953552) docID=15772
  polygon=[-4.190951585769653E-8, 0.0] [89.99999995809048, 0.0] [89.99999995809048, 179.99999991618097] [-4.190951585769653E-8, 0.0] 
  deleted?=false  rect=Rectangle(-62.921879715286195 TO 0.0 lon=8.381903171539307E-8 TO 0.9999999403953552)
	at __randomizedtesting.SeedInfo.seed([B1406AEE368F6B32:C9E5D4677EA0854]:0)
	at org.junit.Assert.fail(Assert.java:93)
	at org.apache.lucene.document.TestLatLonShapeQueries.verifyRandomBBoxes(TestLatLonShapeQueries.java:262)
	at org.apache.lucene.document.TestLatLonShapeQueries.verify(TestLatLonShapeQueries.java:133)
	at org.apache.lucene.document.TestLatLonShapeQueries.doTestRandom(TestLatLonShapeQueries.java:129)
	at org.apache.lucene.document.TestLatLonShapeQueries.testRandomMedium(TestLatLonShapeQueries.java:101)
	at sun.reflect.NativeMethodAccessorImpl.invoke0(Native Method)
	at sun.reflect.NativeMethodAccessorImpl.invoke(NativeMethodAccessorImpl.java:62)
	at sun.reflect.DelegatingMethodAccessorImpl.invoke(DelegatingMethodAccessorImpl.java:43)
	at java.lang.reflect.Method.invoke(Method.java:498)
	at com.carrotsearch.randomizedtesting.RandomizedRunner.invoke(RandomizedRunner.java:1737)
	at com.carrotsearch.randomizedtesting.RandomizedRunner$8.evaluate(RandomizedRunner.java:934)
	at com.carrotsearch.randomizedtesting.RandomizedRunner$9.evaluate(RandomizedRunner.java:970)
	at com.carrotsearch.randomizedtesting.RandomizedRunner$10.evaluate(RandomizedRunner.java:984)
	at org.apache.lucene.util.TestRuleSetupTeardownChained$1.evaluate(TestRuleSetupTeardownChained.java:49)
	at org.apache.lucene.util.AbstractBeforeAfterRule$1.evaluate(AbstractBeforeAfterRule.java:45)
	at org.apache.lucene.util.TestRuleThreadAndTestName$1.evaluate(TestRuleThreadAndTestName.java:48)
	at org.apache.lucene.util.TestRuleIgnoreAfterMaxFailures$1.evaluate(TestRuleIgnoreAfterMaxFailures.java:64)
	at org.apache.lucene.util.TestRuleMarkFailure$1.evaluate(TestRuleMarkFailure.java:47)
	at com.carrotsearch.randomizedtesting.rules.StatementAdapter.evaluate(StatementAdapter.java:36)
	at com.carrotsearch.randomizedtesting.ThreadLeakControl$StatementRunner.run(ThreadLeakControl.java:368)
	at com.carrotsearch.randomizedtesting.ThreadLeakControl.forkTimeoutingTask(ThreadLeakControl.java:817)
	at com.carrotsearch.randomizedtesting.ThreadLeakControl$3.evaluate(ThreadLeakControl.java:468)
	at com.carrotsearch.randomizedtesting.RandomizedRunner.runSingleTest(RandomizedRunner.java:943)
	at com.carrotsearch.randomizedtesting.RandomizedRunner$5.evaluate(RandomizedRunner.java:829)
	at com.carrotsearch.randomizedtesting.RandomizedRunner$6.evaluate(RandomizedRunner.java:879)
	at com.carrotsearch.randomizedtesting.RandomizedRunner$7.evaluate(RandomizedRunner.java:890)
	at org.apache.lucene.util.AbstractBeforeAfterRule$1.evaluate(AbstractBeforeAfterRule.java:45)
	at com.carrotsearch.randomizedtesting.rules.StatementAdapter.evaluate(StatementAdapter.java:36)
	at org.apache.lucene.util.TestRuleStoreClassName$1.evaluate(TestRuleStoreClassName.java:41)
	at com.carrotsearch.randomizedtesting.rules.NoShadowingOrOverridesOnMethodsRule$1.evaluate(NoShadowingOrOverridesOnMethodsRule.java:40)
	at com.carrotsearch.randomizedtesting.rules.NoShadowingOrOverridesOnMethodsRule$1.evaluate(NoShadowingOrOverridesOnMethodsRule.java:40)
	at com.carrotsearch.randomizedtesting.rules.StatementAdapter.evaluate(StatementAdapter.java:36)
	at com.carrotsearch.randomizedtesting.rules.StatementAdapter.evaluate(StatementAdapter.java:36)
	at com.carrotsearch.randomizedtesting.rules.StatementAdapter.evaluate(StatementAdapter.java:36)
	at org.apache.lucene.util.TestRuleAssertionsRequired$1.evaluate(TestRuleAssertionsRequired.java:53)
	at org.apache.lucene.util.TestRuleMarkFailure$1.evaluate(TestRuleMarkFailure.java:47)
	at org.apache.lucene.util.TestRuleIgnoreAfterMaxFailures$1.evaluate(TestRuleIgnoreAfterMaxFailures.java:64)
	at org.apache.lucene.util.TestRuleIgnoreTestSuites$1.evaluate(TestRuleIgnoreTestSuites.java:54)
	at com.carrotsearch.randomizedtesting.rules.StatementAdapter.evaluate(StatementAdapter.java:36)
	at com.carrotsearch.randomizedtesting.ThreadLeakControl$StatementRunner.run(ThreadLeakControl.java:368)
	at java.lang.Thread.run(Thread.java:748)




Build Log:
[...truncated 9626 lines...]
   [junit4] Suite: org.apache.lucene.document.TestLatLonShapeQueries
   [junit4]   2> NOTE: reproduce with: ant test  -Dtestcase=TestLatLonShapeQueries -Dtests.method=testRandomMedium -Dtests.seed=B1406AEE368F6B32 -Dtests.multiplier=3 -Dtests.slow=true -Dtests.locale=ru-RU -Dtests.timezone=America/Puerto_Rico -Dtests.asserts=true -Dtests.file.encoding=ISO-8859-1
   [junit4] FAILURE 44.7s J0 | TestLatLonShapeQueries.testRandomMedium <<<
   [junit4]    > Throwable #1: java.lang.AssertionError: wrong hit (first of possibly more):
   [junit4]    > FAIL: id=6472 should match but did not
   [junit4]    >   query=LatLonShapeBoundingBoxQuery: field=shape:Rectangle(lat=-62.921879715286195 TO 0.0 lon=8.381903171539307E-8 TO 0.9999999403953552) docID=15772
   [junit4]    >   polygon=[-4.190951585769653E-8, 0.0] [89.99999995809048, 0.0] [89.99999995809048, 179.99999991618097] [-4.190951585769653E-8, 0.0] 
   [junit4]    >   deleted?=false  rect=Rectangle(-62.921879715286195 TO 0.0 lon=8.381903171539307E-8 TO 0.9999999403953552)
   [junit4]    > 	at __randomizedtesting.SeedInfo.seed([B1406AEE368F6B32:C9E5D4677EA0854]:0)
   [junit4]    > 	at org.apache.lucene.document.TestLatLonShapeQueries.verifyRandomBBoxes(TestLatLonShapeQueries.java:262)
   [junit4]    > 	at org.apache.lucene.document.TestLatLonShapeQueries.verify(TestLatLonShapeQueries.java:133)
   [junit4]    > 	at org.apache.lucene.document.TestLatLonShapeQueries.doTestRandom(TestLatLonShapeQueries.java:129)
   [junit4]    > 	at org.apache.lucene.document.TestLatLonShapeQueries.testRandomMedium(TestLatLonShapeQueries.java:101)
   [junit4]    > 	at java.lang.Thread.run(Thread.java:748)
   [junit4] IGNOR/A 0.00s J0 | TestLatLonShapeQueries.testRandomBig
   [junit4]    > Assumption #1: 'nightly' test group is disabled (@Nightly())
   [junit4]   2> NOTE: leaving temporary files on disk at: /home/jenkins/workspace/Lucene-Solr-7.x-Linux/lucene/build/sandbox/test/J0/temp/lucene.document.TestLatLonShapeQueries_B1406AEE368F6B32-001
   [junit4]   2> NOTE: test params are: codec=Asserting(Lucene70): {id=PostingsFormat(name=Asserting)}, docValues:{shape=DocValuesFormat(name=Memory), id=DocValuesFormat(name=Lucene70)}, maxPointsInLeafNode=422, maxMBSortInHeap=7.662765201926527, sim=RandomSimilarity(queryNorm=true): {}, locale=ru-RU, timezone=America/Puerto_Rico
   [junit4]   2> NOTE: Linux 4.15.0-24-generic amd64/Oracle Corporation 1.8.0_172 (64-bit)/cpus=8,threads=1,free=304365616,total=489160704
   [junit4]   2> NOTE: All tests run in this JVM: [TestFloatPointNearestNeighbor, TestLatLonShapeQueries]
   [junit4] Completed [21/24 (1!)] on J0 in 44.87s, 3 tests, 1 failure, 1 skipped <<< FAILURES!

[...truncated 53724 lines...]
[asciidoctor:convert] asciidoctor: ERROR: about-this-guide.adoc: line 1: invalid part, must have at least one section (e.g., chapter, appendix, etc.)
[asciidoctor:convert] asciidoctor: ERROR: solr-glossary.adoc: line 1: invalid part, must have at least one section (e.g., chapter, appendix, etc.)
     [java] Processed 2220 links (1775 relative) to 2998 anchors in 229 files
     [echo] Validated Links & Anchors via: /home/jenkins/workspace/Lucene-Solr-7.x-Linux/solr/build/solr-ref-guide/bare-bones-html/

-documentation-lint:
    [jtidy] Checking for broken html (such as invalid tags)...
   [delete] Deleting directory /home/jenkins/workspace/Lucene-Solr-7.x-Linux/lucene/build/jtidy_tmp
     [echo] Checking for broken links...
     [exec] 
     [exec] Crawl/parse...
     [exec] 
     [exec] Verify...
     [echo] Checking for malformed docs...

jar-checksums:

resolve:

ivy-availability-check:
[loadresource] Do not set property disallowed.ivy.jars.list as its length is 0.

-ivy-fail-disallowed-ivy-version:

ivy-fail:

ivy-configure:
[ivy:configure] :: loading settings :: file = /home/jenkins/workspace/Lucene-Solr-7.x-Linux/lucene/top-level-ivy-settings.xml

resolve:

ivy-availability-check:
[loadresource] Do not set property disallowed.ivy.jars.list as its length is 0.

-ivy-fail-disallowed-ivy-version:

ivy-fail:

ivy-configure:
[ivy:configure] :: loading settings :: file = /home/jenkins/workspace/Lucene-Solr-7.x-Linux/lucene/top-level-ivy-settings.xml

resolve:

resolve:

ivy-availability-check:
[loadresource] Do not set property disallowed.ivy.jars.list as its length is 0.

-ivy-fail-disallowed-ivy-version:

ivy-fail:

ivy-configure:
[ivy:configure] :: loading settings :: file = /home/jenkins/workspace/Lucene-Solr-7.x-Linux/lucene/top-level-ivy-settings.xml

resolve:

ivy-availability-check:
[loadresource] Do not set property disallowed.ivy.jars.list as its length is 0.

-ivy-fail-disallowed-ivy-version:

ivy-fail:

ivy-configure:
[ivy:configure] :: loading settings :: file = /home/jenkins/workspace/Lucene-Solr-7.x-Linux/lucene/top-level-ivy-settings.xml

resolve:

ivy-availability-check:
[loadresource] Do not set property disallowed.ivy.jars.list as its length is 0.

-ivy-fail-disallowed-ivy-version:

ivy-fail:

ivy-configure:
[ivy:configure] :: loading settings :: file = /home/jenkins/workspace/Lucene-Solr-7.x-Linux/lucene/top-level-ivy-settings.xml

resolve:

ivy-availability-check:
[loadresource] Do not set property disallowed.ivy.jars.list as its length is 0.

-ivy-fail-disallowed-ivy-version:

ivy-fail:

ivy-configure:
[ivy:configure] :: loading settings :: file = /home/jenkins/workspace/Lucene-Solr-7.x-Linux/lucene/top-level-ivy-settings.xml

resolve:

ivy-availability-check:
[loadresource] Do not set property disallowed.ivy.jars.list as its length is 0.

-ivy-fail-disallowed-ivy-version:

ivy-fail:

ivy-configure:
[ivy:configure] :: loading settings :: file = /home/jenkins/workspace/Lucene-Solr-7.x-Linux/lucene/top-level-ivy-settings.xml

resolve:

ivy-availability-check:
[loadresource] Do not set property disallowed.ivy.jars.list as its length is 0.

-ivy-fail-disallowed-ivy-version:

ivy-fail:

ivy-configure:
[ivy:configure] :: loading settings :: file = /home/jenkins/workspace/Lucene-Solr-7.x-Linux/lucene/top-level-ivy-settings.xml

resolve:

ivy-availability-check:
[loadresource] Do not set property disallowed.ivy.jars.list as its length is 0.

-ivy-fail-disallowed-ivy-version:

ivy-fail:

ivy-configure:
[ivy:configure] :: loading settings :: file = /home/jenkins/workspace/Lucene-Solr-7.x-Linux/lucene/top-level-ivy-settings.xml

resolve:

ivy-availability-check:
[loadresource] Do not set property disallowed.ivy.jars.list as its length is 0.

-ivy-fail-disallowed-ivy-version:

ivy-fail:

ivy-configure:
[ivy:configure] :: loading settings :: file = /home/jenkins/workspace/Lucene-Solr-7.x-Linux/lucene/top-level-ivy-settings.xml

resolve:

ivy-availability-check:
[loadresource] Do not set property disallowed.ivy.jars.list as its length is 0.

-ivy-fail-disallowed-ivy-version:

ivy-fail:

ivy-configure:
[ivy:configure] :: loading settings :: file = /home/jenkins/workspace/Lucene-Solr-7.x-Linux/lucene/top-level-ivy-settings.xml

resolve:

ivy-availability-check:
[loadresource] Do not set property disallowed.ivy.jars.list as its length is 0.

-ivy-fail-disallowed-ivy-version:

ivy-fail:

ivy-configure:
[ivy:configure] :: loading settings :: file = /home/jenkins/workspace/Lucene-Solr-7.x-Linux/lucene/top-level-ivy-settings.xml

resolve:

ivy-availability-check:
[loadresource] Do not set property disallowed.ivy.jars.list as its length is 0.

-ivy-fail-disallowed-ivy-version:

ivy-fail:

ivy-configure:
[ivy:configure] :: loading settings :: file = /home/jenkins/workspace/Lucene-Solr-7.x-Linux/lucene/top-level-ivy-settings.xml

resolve:

ivy-availability-check:
[loadresource] Do not set property disallowed.ivy.jars.list as its length is 0.

-ivy-fail-disallowed-ivy-version:

ivy-fail:

ivy-configure:
[ivy:configure] :: loading settings :: file = /home/jenkins/workspace/Lucene-Solr-7.x-Linux/lucene/top-level-ivy-settings.xml

resolve:

ivy-availability-check:
[loadresource] Do not set property disallowed.ivy.jars.list as its length is 0.

-ivy-fail-disallowed-ivy-version:

ivy-fail:

ivy-configure:
[ivy:configure] :: loading settings :: file = /home/jenkins/workspace/Lucene-Solr-7.x-Linux/lucene/top-level-ivy-settings.xml

resolve:

ivy-availability-check:
[loadresource] Do not set property disallowed.ivy.jars.list as its length is 0.

-ivy-fail-disallowed-ivy-version:

ivy-fail:

ivy-configure:
[ivy:configure] :: loading settings :: file = /home/jenkins/workspace/Lucene-Solr-7.x-Linux/lucene/top-level-ivy-settings.xml

resolve:

ivy-availability-check:
[loadresource] Do not set property disallowed.ivy.jars.list as its length is 0.

-ivy-fail-disallowed-ivy-version:

ivy-fail:

ivy-configure:
[ivy:configure] :: loading settings :: file = /home/jenkins/workspace/Lucene-Solr-7.x-Linux/lucene/top-level-ivy-settings.xml

resolve:

ivy-availability-check:
[loadresource] Do not set property disallowed.ivy.jars.list as its length is 0.

-ivy-fail-disallowed-ivy-version:

ivy-fail:

ivy-configure:
[ivy:configure] :: loading settings :: file = /home/jenkins/workspace/Lucene-Solr-7.x-Linux/lucene/top-level-ivy-settings.xml

resolve:

ivy-availability-check:
[loadresource] Do not set property disallowed.ivy.jars.list as its length is 0.

-ivy-fail-disallowed-ivy-version:

ivy-fail:

ivy-configure:
[ivy:configure] :: loading settings :: file = /home/jenkins/workspace/Lucene-Solr-7.x-Linux/lucene/top-level-ivy-settings.xml

resolve:

ivy-availability-check:
[loadresource] Do not set property disallowed.ivy.jars.list as its length is 0.

-ivy-fail-disallowed-ivy-version:

ivy-fail:

ivy-configure:
[ivy:configure] :: loading settings :: file = /home/jenkins/workspace/Lucene-Solr-7.x-Linux/lucene/top-level-ivy-settings.xml

resolve:

ivy-availability-check:
[loadresource] Do not set property disallowed.ivy.jars.list as its length is 0.

-ivy-fail-disallowed-ivy-version:

ivy-fail:

ivy-configure:
[ivy:configure] :: loading settings :: file = /home/jenkins/workspace/Lucene-Solr-7.x-Linux/lucene/top-level-ivy-settings.xml

resolve:

ivy-availability-check:
[loadresource] Do not set property disallowed.ivy.jars.list as its length is 0.

-ivy-fail-disallowed-ivy-version:

ivy-fail:

ivy-configure:
[ivy:configure] :: loading settings :: file = /home/jenkins/workspace/Lucene-Solr-7.x-Linux/lucene/top-level-ivy-settings.xml

resolve:

ivy-availability-check:
[loadresource] Do not set property disallowed.ivy.jars.list as its length is 0.

-ivy-fail-disallowed-ivy-version:

ivy-fail:

ivy-configure:
[ivy:configure] :: loading settings :: file = /home/jenkins/workspace/Lucene-Solr-7.x-Linux/lucene/top-level-ivy-settings.xml

resolve:

ivy-availability-check:
[loadresource] Do not set property disallowed.ivy.jars.list as its length is 0.

-ivy-fail-disallowed-ivy-version:

ivy-fail:

ivy-configure:
[ivy:configure] :: loading settings :: file = /home/jenkins/workspace/Lucene-Solr-7.x-Linux/lucene/top-level-ivy-settings.xml

resolve:

ivy-availability-check:
[loadresource] Do not set property disallowed.ivy.jars.list as its length is 0.

-ivy-fail-disallowed-ivy-version:

ivy-fail:

ivy-configure:
[ivy:configure] :: loading settings :: file = /home/jenkins/workspace/Lucene-Solr-7.x-Linux/lucene/top-level-ivy-settings.xml

resolve:

ivy-availability-check:
[loadresource] Do not set property disallowed.ivy.jars.list as its length is 0.

-ivy-fail-disallowed-ivy-version:

ivy-fail:

ivy-configure:
[ivy:configure] :: loading settings :: file = /home/jenkins/workspace/Lucene-Solr-7.x-Linux/lucene/top-level-ivy-settings.xml

common.resolve:

resolve:

ivy-availability-check:
[loadresource] Do not set property disallowed.ivy.jars.list as its length is 0.

-ivy-fail-disallowed-ivy-version:

ivy-fail:

ivy-configure:
[ivy:configure] :: loading settings :: file = /home/jenkins/workspace/Lucene-Solr-7.x-Linux/lucene/top-level-ivy-settings.xml

resolve:

ivy-availability-check:
[loadresource] Do not set property disallowed.ivy.jars.list as its length is 0.

-ivy-fail-disallowed-ivy-version:

ivy-fail:

ivy-configure:
[ivy:configure] :: loading settings :: file = /home/jenkins/workspace/Lucene-Solr-7.x-Linux/lucene/top-level-ivy-settings.xml

resolve:

ivy-availability-check:
[loadresource] Do not set property disallowed.ivy.jars.list as its length is 0.

-ivy-fail-disallowed-ivy-version:

ivy-fail:

ivy-configure:
[ivy:configure] :: loading settings :: file = /home/jenkins/workspace/Lucene-Solr-7.x-Linux/lucene/top-level-ivy-settings.xml

resolve:

ivy-availability-check:
[loadresource] Do not set property disallowed.ivy.jars.list as its length is 0.

-ivy-fail-disallowed-ivy-version:

ivy-fail:

ivy-configure:
[ivy:configure] :: loading settings :: file = /home/jenkins/workspace/Lucene-Solr-7.x-Linux/lucene/top-level-ivy-settings.xml

resolve:

ivy-availability-check:
[loadresource] Do not set property disallowed.ivy.jars.list as its length is 0.

-ivy-fail-disallowed-ivy-version:

ivy-fail:

ivy-configure:
[ivy:configure] :: loading settings :: file = /home/jenkins/workspace/Lucene-Solr-7.x-Linux/lucene/top-level-ivy-settings.xml

resolve:

jar-checksums:
    [mkdir] Created dir: /home/jenkins/workspace/Lucene-Solr-7.x-Linux/lucene/null1899977101
     [copy] Copying 36 files to /home/jenkins/workspace/Lucene-Solr-7.x-Linux/lucene/null1899977101
   [delete] Deleting directory /home/jenkins/workspace/Lucene-Solr-7.x-Linux/lucene/null1899977101

resolve-example:

ivy-availability-check:
[loadresource] Do not set property disallowed.ivy.jars.list as its length is 0.

-ivy-fail-disallowed-ivy-version:

ivy-fail:

ivy-configure:
[ivy:configure] :: loading settings :: file = /home/jenkins/workspace/Lucene-Solr-7.x-Linux/lucene/top-level-ivy-settings.xml

resolve:

resolve-server:

ivy-availability-check:
[loadresource] Do not set property disallowed.ivy.jars.list as its length is 0.

-ivy-fail-disallowed-ivy-version:

ivy-fail:

ivy-fail:

ivy-configure:
[ivy:configure] :: loading settings :: file = /home/jenkins/workspace/Lucene-Solr-7.x-Linux/lucene/top-level-ivy-settings.xml

resolve:

resolve:

ivy-availability-check:
[loadresource] Do not set property disallowed.ivy.jars.list as its length is 0.

-ivy-fail-disallowed-ivy-version:

ivy-fail:

ivy-fail:

ivy-configure:
[ivy:configure] :: loading settings :: file = /home/jenkins/workspace/Lucene-Solr-7.x-Linux/lucene/top-level-ivy-settings.xml

resolve:

ivy-availability-check:
[loadresource] Do not set property disallowed.ivy.jars.list as its length is 0.

-ivy-fail-disallowed-ivy-version:

ivy-fail:

ivy-fail:

ivy-configure:
[ivy:configure] :: loading settings :: file = /home/jenkins/workspace/Lucene-Solr-7.x-Linux/lucene/top-level-ivy-settings.xml

resolve:

ivy-availability-check:
[loadresource] Do not set property disallowed.ivy.jars.list as its length is 0.

-ivy-fail-disallowed-ivy-version:

ivy-fail:

ivy-configure:
[ivy:configure] :: loading settings :: file = /home/jenkins/workspace/Lucene-Solr-7.x-Linux/lucene/top-level-ivy-settings.xml

resolve:

ivy-availability-check:
[loadresource] Do not set property disallowed.ivy.jars.list as its length is 0.

-ivy-fail-disallowed-ivy-version:

ivy-fail:

ivy-fail:

ivy-configure:
[ivy:configure] :: loading settings :: file = /home/jenkins/workspace/Lucene-Solr-7.x-Linux/lucene/top-level-ivy-settings.xml

resolve:

ivy-availability-check:
[loadresource] Do not set property disallowed.ivy.jars.list as its length is 0.

-ivy-fail-disallowed-ivy-version:

ivy-fail:

ivy-configure:
[ivy:configure] :: loading settings :: file = /home/jenkins/workspace/Lucene-Solr-7.x-Linux/lucene/top-level-ivy-settings.xml

resolve:

ivy-availability-check:
[loadresource] Do not set property disallowed.ivy.jars.list as its length is 0.

-ivy-fail-disallowed-ivy-version:

ivy-fail:

ivy-fail:

ivy-configure:
[ivy:configure] :: loading settings :: file = /home/jenkins/workspace/Lucene-Solr-7.x-Linux/lucene/top-level-ivy-settings.xml

resolve:

ivy-availability-check:
[loadresource] Do not set property disallowed.ivy.jars.list as its length is 0.

-ivy-fail-disallowed-ivy-version:

ivy-fail:

ivy-fail:

ivy-configure:
[ivy:configure] :: loading settings :: file = /home/jenkins/workspace/Lucene-Solr-7.x-Linux/lucene/top-level-ivy-settings.xml

resolve:

ivy-availability-check:
[loadresource] Do not set property disallowed.ivy.jars.list as its length is 0.

-ivy-fail-disallowed-ivy-version:

ivy-fail:

ivy-fail:

ivy-configure:
[ivy:configure] :: loading settings :: file = /home/jenkins/workspace/Lucene-Solr-7.x-Linux/lucene/top-level-ivy-settings.xml

resolve:

ivy-availability-check:
[loadresource] Do not set property disallowed.ivy.jars.list as its length is 0.

-ivy-fail-disallowed-ivy-version:

ivy-fail:

ivy-fail:

ivy-configure:
[ivy:configure] :: loading settings :: file = /home/jenkins/workspace/Lucene-Solr-7.x-Linux/lucene/top-level-ivy-settings.xml

resolve:

ivy-availability-check:
[loadresource] Do not set property disallowed.ivy.jars.list as its length is 0.

-ivy-fail-disallowed-ivy-version:

ivy-fail:

ivy-fail:

ivy-configure:
[ivy:configure] :: loading settings :: file = /home/jenkins/workspace/Lucene-Solr-7.x-Linux/lucene/top-level-ivy-settings.xml

resolve:

ivy-availability-check:
[loadresource] Do not set property disallowed.ivy.jars.list as its length is 0.

-ivy-fail-disallowed-ivy-version:

ivy-fail:

ivy-fail:

ivy-configure:
[ivy:configure] :: loading settings :: file = /home/jenkins/workspace/Lucene-Solr-7.x-Linux/lucene/top-level-ivy-settings.xml

resolve:

ivy-availability-check:
[loadresource] Do not set property disallowed.ivy.jars.list as its length is 0.

-ivy-fail-disallowed-ivy-version:

ivy-fail:

ivy-fail:

ivy-configure:
[ivy:configure] :: loading settings :: file = /home/jenkins/workspace/Lucene-Solr-7.x-Linux/lucene/top-level-ivy-settings.xml

resolve:

ivy-availability-check:
[loadresource] Do not set property disallowed.ivy.jars.list as its length is 0.

-ivy-fail-disallowed-ivy-version:

ivy-fail:

ivy-fail:

ivy-configure:
[ivy:configure] :: loading settings :: file = /home/jenkins/workspace/Lucene-Solr-7.x-Linux/lucene/top-level-ivy-settings.xml

resolve:

ivy-availability-check:
[loadresource] Do not set property disallowed.ivy.jars.list as its length is 0.

-ivy-fail-disallowed-ivy-version:

ivy-fail:

ivy-fail:

ivy-configure:
[ivy:configure] :: loading settings :: file = /home/jenkins/workspace/Lucene-Solr-7.x-Linux/lucene/top-level-ivy-settings.xml

resolve:

ivy-availability-check:
[loadresource] Do not set property disallowed.ivy.jars.list as its length is 0.

-ivy-fail-disallowed-ivy-version:

ivy-fail:

ivy-fail:

ivy-configure:
[ivy:configure] :: loading settings :: file = /home/jenkins/workspace/Lucene-Solr-7.x-Linux/lucene/top-level-ivy-settings.xml

resolve:

jar-checksums:
    [mkdir] Created dir: /home/jenkins/workspace/Lucene-Solr-7.x-Linux/solr/null593563927
     [copy] Copying 241 files to /home/jenkins/workspace/Lucene-Solr-7.x-Linux/solr/null593563927
   [delete] Deleting directory /home/jenkins/workspace/Lucene-Solr-7.x-Linux/solr/null593563927

check-working-copy:
[ivy:cachepath] :: resolving dependencies :: org.eclipse.jgit#org.eclipse.jgit-caller;working
[ivy:cachepath] 	confs: [default]
[ivy:cachepath] 	found org.eclipse.jgit#org.eclipse.jgit;4.6.0.201612231935-r in public
[ivy:cachepath] 	found com.jcraft#jsch;0.1.53 in public
[ivy:cachepath] 	found com.googlecode.javaewah#JavaEWAH;1.1.6 in public
[ivy:cachepath] 	found org.apache.httpcomponents#httpclient;4.3.6 in public
[ivy:cachepath] 	found org.apache.httpcomponents#httpcore;4.3.3 in public
[ivy:cachepath] 	found commons-logging#commons-logging;1.1.3 in public
[ivy:cachepath] 	found commons-codec#commons-codec;1.6 in public
[ivy:cachepath] 	found org.slf4j#slf4j-api;1.7.2 in public
[ivy:cachepath] :: resolution report :: resolve 14ms :: artifacts dl 1ms
	---------------------------------------------------------------------
	|                  |            modules            ||   artifacts   |
	|       conf       | number| search|dwnlded|evicted|| number|dwnlded|
	---------------------------------------------------------------------
	|      default     |   8   |   0   |   0   |   0   ||   8   |   0   |
	---------------------------------------------------------------------
[wc-checker] Initializing working copy...
[wc-checker] SLF4J: Failed to load class "org.slf4j.impl.StaticLoggerBinder".
[wc-checker] SLF4J: Defaulting to no-operation (NOP) logger implementation
[wc-checker] SLF4J: See http://www.slf4j.org/codes.html#StaticLoggerBinder for further details.
[wc-checker] Checking working copy status...

-jenkins-base:

BUILD SUCCESSFUL
Total time: 74 minutes 4 seconds
Setting ANT_1_8_2_HOME=/var/lib/jenkins/tools/hudson.tasks.Ant_AntInstallation/ANT_1.8.2
[Lucene-Solr-7.x-Linux] $ /bin/sh -xe /tmp/jenkins2304297197514033303.sh
+ mv lucene/build lucene/build.orig
+ mv solr/build solr/build.orig
+ export ANT_HOME=/var/lib/jenkins/tools/hudson.tasks.Ant_AntInstallation/ANT_1.8.2
+ export PATH=/var/lib/jenkins/tools/hudson.tasks.Ant_AntInstallation/ANT_1.8.2/bin:/home/jenkins/tools/java/64bit/jdk1.8.0_172/bin:/usr/local/bin:/usr/bin:/bin:/usr/local/games:/usr/games
+ python3 -u dev-tools/scripts/reproduceJenkinsFailures.py --no-git https://jenkins.thetaphi.de/job/Lucene-Solr-7.x-Linux/2328/consoleText
[repro] Jenkins log URL: https://jenkins.thetaphi.de/job/Lucene-Solr-7.x-Linux/2328/consoleText

[repro] Revision: 1284688a6d6a3e36e7af4ac159ff9d557f0bdc34

[repro] Ant options: "-Dargs=-XX:+UseCompressedOops -XX:+UseParallelGC"
[repro] Repro line:  ant test  -Dtestcase=TestLatLonShapeQueries -Dtests.method=testRandomMedium -Dtests.seed=B1406AEE368F6B32 -Dtests.multiplier=3 -Dtests.slow=true -Dtests.locale=ru-RU -Dtests.timezone=America/Puerto_Rico -Dtests.asserts=true -Dtests.file.encoding=ISO-8859-1

[repro] ant clean
Buildfile: /home/jenkins/workspace/Lucene-Solr-7.x-Linux/build.xml

clean:

clean:

clean:

BUILD SUCCESSFUL
Total time: 0 seconds
[repro] Test suites by module:
[repro]    lucene/sandbox
[repro]       TestLatLonShapeQueries
[repro] ant compile-test
Buildfile: /home/jenkins/workspace/Lucene-Solr-7.x-Linux/lucene/sandbox/build.xml

-check-git-state:

-git-cleanroot:

-copy-git-state:
    [mkdir] Created dir: /home/jenkins/workspace/Lucene-Solr-7.x-Linux/lucene/build
     [copy] Copying 1 file to /home/jenkins/workspace/Lucene-Solr-7.x-Linux/lucene/build

git-autoclean:

ivy-availability-check:
[loadresource] Do not set property disallowed.ivy.jars.list as its length is 0.

-ivy-fail-disallowed-ivy-version:

ivy-fail:

ivy-configure:
[ivy:configure] :: Apache Ivy 2.4.0 - 20141213170938 :: http://ant.apache.org/ivy/ ::
[ivy:configure] :: loading settings :: file = /home/jenkins/workspace/Lucene-Solr-7.x-Linux/lucene/top-level-ivy-settings.xml

resolve:

common.init:

compile-lucene-core:

-check-git-state:

-git-cleanroot:

-copy-git-state:

git-autoclean:

ivy-availability-check:
[loadresource] Do not set property disallowed.ivy.jars.list as its length is 0.

-ivy-fail-disallowed-ivy-version:

ivy-fail:

ivy-configure:
[ivy:configure] :: loading settings :: file = /home/jenkins/workspace/Lucene-Solr-7.x-Linux/lucene/top-level-ivy-settings.xml

resolve:

init:

-clover.disable:

-clover.load:

-clover.classpath:

-clover.setup:

clover:

compile-core:
    [mkdir] Created dir: /home/jenkins/workspace/Lucene-Solr-7.x-Linux/lucene/build/core/classes/java
    [javac] Compiling 842 source files to /home/jenkins/workspace/Lucene-Solr-7.x-Linux/lucene/build/core/classes/java
    [javac] Note: Some input files use or override a deprecated API.
    [javac] Note: Recompile with -Xlint:deprecation for details.
    [javac] Creating empty /home/jenkins/workspace/Lucene-Solr-7.x-Linux/lucene/build/core/classes/java/org/apache/lucene/util/graph/package-info.class
    [javac] Creating empty /home/jenkins/workspace/Lucene-Solr-7.x-Linux/lucene/build/core/classes/java/org/apache/lucene/document/package-info.class
    [javac] Creating empty /home/jenkins/workspace/Lucene-Solr-7.x-Linux/lucene/build/core/classes/java/org/apache/lucene/package-info.class
    [javac] Creating empty /home/jenkins/workspace/Lucene-Solr-7.x-Linux/lucene/build/core/classes/java/org/apache/lucene/util/bkd/package-info.class
    [javac] Creating empty /home/jenkins/workspace/Lucene-Solr-7.x-Linux/lucene/build/core/classes/java/org/apache/lucene/codecs/compressing/package-info.class
    [javac] Creating empty /home/jenkins/workspace/Lucene-Solr-7.x-Linux/lucene/build/core/classes/java/org/apache/lucene/codecs/lucene60/package-info.class
    [javac] Creating empty /home/jenkins/workspace/Lucene-Solr-7.x-Linux/lucene/build/core/classes/java/org/apache/lucene/codecs/package-info.class
    [javac] Creating empty /home/jenkins/workspace/Lucene-Solr-7.x-Linux/lucene/build/core/classes/java/org/apache/lucene/util/package-info.class
    [javac] Creating empty /home/jenkins/workspace/Lucene-Solr-7.x-Linux/lucene/build/core/classes/java/org/apache/lucene/index/package-info.class
    [javac] Creating empty /home/jenkins/workspace/Lucene-Solr-7.x-Linux/lucene/build/core/classes/java/org/apache/lucene/util/fst/package-info.class
    [javac] Creating empty /home/jenkins/workspace/Lucene-Solr-7.x-Linux/lucene/build/core/classes/java/org/apache/lucene/analysis/tokenattributes/package-info.class
    [javac] Creating empty /home/jenkins/workspace/Lucene-Solr-7.x-Linux/lucene/build/core/classes/java/org/apache/lucene/search/package-info.class
    [javac] Creating empty /home/jenkins/workspace/Lucene-Solr-7.x-Linux/lucene/build/core/classes/java/org/apache/lucene/codecs/lucene62/package-info.class
    [javac] Creating empty /home/jenkins/workspace/Lucene-Solr-7.x-Linux/lucene/build/core/classes/java/org/apache/lucene/util/packed/package-info.class
    [javac] Creating empty /home/jenkins/workspace/Lucene-Solr-7.x-Linux/lucene/build/core/classes/java/org/apache/lucene/util/mutable/package-info.class
    [javac] Creating empty /home/jenkins/workspace/Lucene-Solr-7.x-Linux/lucene/build/core/classes/java/org/apache/lucene/codecs/lucene70/package-info.class
    [javac] Creating empty /home/jenkins/workspace/Lucene-Solr-7.x-Linux/lucene/build/core/classes/java/org/apache/lucene/codecs/perfield/package-info.class
    [javac] Creating empty /home/jenkins/workspace/Lucene-Solr-7.x-Linux/lucene/build/core/classes/java/org/apache/lucene/analysis/package-info.class
    [javac] Creating empty /home/jenkins/workspace/Lucene-Solr-7.x-Linux/lucene/build/core/classes/java/org/apache/lucene/analysis/standard/package-info.class
    [javac] Creating empty /home/jenkins/workspace/Lucene-Solr-7.x-Linux/lucene/build/core/classes/java/org/apache/lucene/store/package-info.class
    [javac] Creating empty /home/jenkins/workspace/Lucene-Solr-7.x-Linux/lucene/build/core/classes/java/org/apache/lucene/codecs/blocktree/package-info.class
    [javac] Creating empty /home/jenkins/workspace/Lucene-Solr-7.x-Linux/lucene/build/core/classes/java/org/apache/lucene/search/spans/package-info.class
    [javac] Creating empty /home/jenkins/workspace/Lucene-Solr-7.x-Linux/lucene/build/core/classes/java/org/apache/lucene/search/similarities/package-info.class
    [javac] Creating empty /home/jenkins/workspace/Lucene-Solr-7.x-Linux/lucene/build/core/classes/java/org/apache/lucene/util/automaton/package-info.class
    [javac] Creating empty /home/jenkins/workspace/Lucene-Solr-7.x-Linux/lucene/build/core/classes/java/org/apache/lucene/codecs/lucene50/package-info.class
    [javac] Creating empty /home/jenkins/workspace/Lucene-Solr-7.x-Linux/lucene/build/core/classes/java/org/apache/lucene/geo/package-info.class
     [copy] Copying 3 files to /home/jenkins/workspace/Lucene-Solr-7.x-Linux/lucene/build/core/classes/java

init:

compile-test:

-check-git-state:

-git-cleanroot:

-copy-git-state:

git-autoclean:

ivy-availability-check:

ivy-configure:
[ivy:configure] :: loading settings :: file = /home/jenkins/workspace/Lucene-Solr-7.x-Linux/lucene/top-level-ivy-settings.xml

resolve:

common.init:

compile-lucene-core:

init:

-clover.disable:

-clover.load:

-clover.classpath:

-clover.setup:

clover:

compile-core:
    [mkdir] Created dir: /home/jenkins/workspace/Lucene-Solr-7.x-Linux/lucene/build/sandbox/classes/java
    [javac] Compiling 60 source files to /home/jenkins/workspace/Lucene-Solr-7.x-Linux/lucene/build/sandbox/classes/java
    [javac] Note: Some input files use or override a deprecated API.
    [javac] Note: Recompile with -Xlint:deprecation for details.
    [javac] Creating empty /home/jenkins/workspace/Lucene-Solr-7.x-Linux/lucene/build/sandbox/classes/java/org/apache/lucene/search/intervals/package-info.class
    [javac] Creating empty /home/jenkins/workspace/Lucene-Solr-7.x-Linux/lucene/build/sandbox/classes/java/org/apache/lucene/codecs/idversion/package-info.class
    [javac] Creating empty /home/jenkins/workspace/Lucene-Solr-7.x-Linux/lucene/build/sandbox/classes/java/org/apache/lucene/payloads/package-info.class
    [javac] Creating empty /home/jenkins/workspace/Lucene-Solr-7.x-Linux/lucene/build/sandbox/classes/java/org/apache/lucene/sandbox/queries/package-info.class
     [copy] Copying 1 file to /home/jenkins/workspace/Lucene-Solr-7.x-Linux/lucene/build/sandbox/classes/java

compile-test-framework:

-check-git-state:

-git-cleanroot:

-copy-git-state:

git-autoclean:

ivy-availability-check:
[loadresource] Do not set property disallowed.ivy.jars.list as its length is 0.

-ivy-fail-disallowed-ivy-version:

ivy-fail:

ivy-configure:
[ivy:configure] :: loading settings :: file = /home/jenkins/workspace/Lucene-Solr-7.x-Linux/lucene/top-level-ivy-settings.xml

resolve:

init:

compile-lucene-core:

compile-codecs:

-check-git-state:

-git-cleanroot:

-copy-git-state:

git-autoclean:

ivy-availability-check:
[loadresource] Do not set property disallowed.ivy.jars.list as its length is 0.

-ivy-fail-disallowed-ivy-version:

ivy-fail:

ivy-configure:
[ivy:configure] :: loading settings :: file = /home/jenkins/workspace/Lucene-Solr-7.x-Linux/lucene/top-level-ivy-settings.xml

resolve:

common.init:

compile-lucene-core:

init:

-clover.disable:

-clover.load:

-clover.classpath:

-clover.setup:

clover:

compile-core:
    [mkdir] Created dir: /home/jenkins/workspace/Lucene-Solr-7.x-Linux/lucene/build/codecs/classes/java
    [javac] Compiling 67 source files to /home/jenkins/workspace/Lucene-Solr-7.x-Linux/lucene/build/codecs/classes/java
    [javac] Note: Some input files use or override a deprecated API.
    [javac] Note: Recompile with -Xlint:deprecation for details.
    [javac] Creating empty /home/jenkins/workspace/Lucene-Solr-7.x-Linux/lucene/build/codecs/classes/java/org/apache/lucene/codecs/bloom/package-info.class
    [javac] Creating empty /home/jenkins/workspace/Lucene-Solr-7.x-Linux/lucene/build/codecs/classes/java/org/apache/lucene/codecs/memory/package-info.class
    [javac] Creating empty /home/jenkins/workspace/Lucene-Solr-7.x-Linux/lucene/build/codecs/classes/java/org/apache/lucene/codecs/simpletext/package-info.class
    [javac] Creating empty /home/jenkins/workspace/Lucene-Solr-7.x-Linux/lucene/build/codecs/classes/java/org/apache/lucene/codecs/blockterms/package-info.class
    [javac] Creating empty /home/jenkins/workspace/Lucene-Solr-7.x-Linux/lucene/build/codecs/classes/java/org/apache/lucene/codecs/blocktreeords/package-info.class
     [copy] Copying 3 files to /home/jenkins/workspace/Lucene-Solr-7.x-Linux/lucene/build/codecs/classes/java

-clover.disable:

-clover.load:

-clover.classpath:

-clover.setup:

clover:

common.compile-core:
    [mkdir] Created dir: /home/jenkins/workspace/Lucene-Solr-7.x-Linux/lucene/build/test-framework/classes/java
    [javac] Compiling 191 source files to /home/jenkins/workspace/Lucene-Solr-7.x-Linux/lucene/build/test-framework/classes/java
    [javac] Note: Some input files use or override a deprecated API.
    [javac] Note: Recompile with -Xlint:deprecation for details.
    [javac] Creating empty /home/jenkins/workspace/Lucene-Solr-7.x-Linux/lucene/build/test-framework/classes/java/org/apache/lucene/codecs/asserting/package-info.class
    [javac] Creating empty /home/jenkins/workspace/Lucene-Solr-7.x-Linux/lucene/build/test-framework/classes/java/org/apache/lucene/codecs/ramonly/package-info.class
    [javac] Creating empty /home/jenkins/workspace/Lucene-Solr-7.x-Linux/lucene/build/test-framework/classes/java/org/apache/lucene/mockfile/package-info.class
    [javac] Creating empty /home/jenkins/workspace/Lucene-Solr-7.x-Linux/lucene/build/test-framework/classes/java/org/apache/lucene/codecs/cheapbastard/package-info.class
    [javac] Creating empty /home/jenkins/workspace/Lucene-Solr-7.x-Linux/lucene/build/test-framework/classes/java/org/apache/lucene/codecs/mockrandom/package-info.class
    [javac] Creating empty /home/jenkins/workspace/Lucene-Solr-7.x-Linux/lucene/build/test-framework/classes/java/org/apache/lucene/codecs/cranky/package-info.class
    [javac] Creating empty /home/jenkins/workspace/Lucene-Solr-7.x-Linux/lucene/build/test-framework/classes/java/org/apache/lucene/codecs/compressing/dummy/package-info.class
     [copy] Copying 4 files to /home/jenkins/workspace/Lucene-Solr-7.x-Linux/lucene/build/test-framework/classes/java

compile-core:

common.compile-test:
    [mkdir] Created dir: /home/jenkins/workspace/Lucene-Solr-7.x-Linux/lucene/build/sandbox/classes/test
    [javac] Compiling 26 source files to /home/jenkins/workspace/Lucene-Solr-7.x-Linux/lucene/build/sandbox/classes/test
    [javac] Note: /home/jenkins/workspace/Lucene-Solr-7.x-Linux/lucene/sandbox/src/test/org/apache/lucene/document/TestHalfFloatPoint.java uses or overrides a deprecated API.
    [javac] Note: Recompile with -Xlint:deprecation for details.

BUILD SUCCESSFUL
Total time: 9 seconds
[repro] ant test-nocompile -Dtests.dups=5 -Dtests.maxfailures=5 -Dtests.class="*.TestLatLonShapeQueries" -Dtests.showOutput=onerror "-Dargs=-XX:+UseCompressedOops -XX:+UseParallelGC" -Dtests.seed=B1406AEE368F6B32 -Dtests.multiplier=3 -Dtests.slow=true -Dtests.locale=ru-RU -Dtests.timezone=America/Puerto_Rico -Dtests.asserts=true -Dtests.file.encoding=ISO-8859-1
Buildfile: /home/jenkins/workspace/Lucene-Solr-7.x-Linux/lucene/sandbox/build.xml

-clover.disable:

ivy-configure:
[ivy:configure] :: Apache Ivy 2.4.0 - 20141213170938 :: http://ant.apache.org/ivy/ ::
[ivy:configure] :: loading settings :: file = /home/jenkins/workspace/Lucene-Solr-7.x-Linux/lucene/top-level-ivy-settings.xml

install-junit4-taskdef:

ivy-availability-check:
[loadresource] Do not set property disallowed.ivy.jars.list as its length is 0.

-ivy-fail-disallowed-ivy-version:

ivy-fail:

resolve-groovy:
[ivy:cachepath] :: resolving dependencies :: org.codehaus.groovy#groovy-all-caller;working
[ivy:cachepath] 	confs: [default]
[ivy:cachepath] 	found org.codehaus.groovy#groovy-all;2.4.15 in public
[ivy:cachepath] :: resolution report :: resolve 10ms :: artifacts dl 0ms
	---------------------------------------------------------------------
	|                  |            modules            ||   artifacts   |
	|       conf       | number| search|dwnlded|evicted|| number|dwnlded|
	---------------------------------------------------------------------
	|      default     |   1   |   0   |   0   |   0   ||   1   |   0   |
	---------------------------------------------------------------------

-init-totals:

-test:
    [mkdir] Created dir: /home/jenkins/workspace/Lucene-Solr-7.x-Linux/lucene/build/sandbox/test
[junit4:pickseed] Seed property 'tests.seed' already defined: B1406AEE368F6B32
    [mkdir] Created dir: /home/jenkins/workspace/Lucene-Solr-7.x-Linux/lucene/build/sandbox/test/temp
   [junit4] <JUnit4> says aloha! Master seed: B1406AEE368F6B32
   [junit4] Executing 5 suites with 3 JVMs.
   [junit4] 
   [junit4] Started J2 PID(4880@localhost).
   [junit4] Started J0 PID(4881@localhost).
   [junit4] Started J1 PID(4882@localhost).
   [junit4] Suite: org.apache.lucene.document.TestLatLonShapeQueries
   [junit4]   2> NOTE: reproduce with: ant test  -Dtestcase=TestLatLonShapeQueries -Dtests.method=testRandomMedium -Dtests.seed=B1406AEE368F6B32 -Dtests.multiplier=3 -Dtests.slow=true -Dtests.badapples=true -Dtests.locale=ru-RU -Dtests.timezone=America/Puerto_Rico -Dtests.asserts=true -Dtests.file.encoding=ISO-8859-1
   [junit4] FAILURE 41.1s J2 | TestLatLonShapeQueries.testRandomMedium <<<
   [junit4]    > Throwable #1: java.lang.AssertionError: wrong hit (first of possibly more):
   [junit4]    > FAIL: id=6472 should match but did not
   [junit4]    >   query=LatLonShapeBoundingBoxQuery: field=shape:Rectangle(lat=-62.921879715286195 TO 0.0 lon=8.381903171539307E-8 TO 0.9999999403953552) docID=15772
   [junit4]    >   polygon=[-4.190951585769653E-8, 0.0] [89.99999995809048, 0.0] [89.99999995809048, 179.99999991618097] [-4.190951585769653E-8, 0.0] 
   [junit4]    >   deleted?=false  rect=Rectangle(-62.921879715286195 TO 0.0 lon=8.381903171539307E-8 TO 0.9999999403953552)
   [junit4]    > 	at __randomizedtesting.SeedInfo.seed([B1406AEE368F6B32:C9E5D4677EA0854]:0)
   [junit4]    > 	at org.apache.lucene.document.TestLatLonShapeQueries.verifyRandomBBoxes(TestLatLonShapeQueries.java:262)
   [junit4]    > 	at org.apache.lucene.document.TestLatLonShapeQueries.verify(TestLatLonShapeQueries.java:133)
   [junit4]    > 	at org.apache.lucene.document.TestLatLonShapeQueries.doTestRandom(TestLatLonShapeQueries.java:129)
   [junit4]    > 	at org.apache.lucene.document.TestLatLonShapeQueries.testRandomMedium(TestLatLonShapeQueries.java:101)
   [junit4]    > 	at java.lang.Thread.run(Thread.java:748)
   [junit4] IGNOR/A 0.00s J2 | TestLatLonShapeQueries.testRandomBig
   [junit4]    > Assumption #1: 'nightly' test group is disabled (@Nightly())
   [junit4] OK      0.09s J2 | TestLatLonShapeQueries.testRandomTiny
   [junit4]   2> NOTE: leaving temporary files on disk at: /home/jenkins/workspace/Lucene-Solr-7.x-Linux/lucene/build/sandbox/test/J2/temp/lucene.document.TestLatLonShapeQueries_B1406AEE368F6B32-001
   [junit4]   2> NOTE: test params are: codec=Asserting(Lucene70): {id=PostingsFormat(name=Asserting)}, docValues:{shape=DocValuesFormat(name=Memory), id=DocValuesFormat(name=Lucene70)}, maxPointsInLeafNode=422, maxMBSortInHeap=7.662765201926527, sim=RandomSimilarity(queryNorm=true): {}, locale=ru-RU, timezone=America/Puerto_Rico
   [junit4]   2> NOTE: Linux 4.15.0-24-generic amd64/Oracle Corporation 1.8.0_172 (64-bit)/cpus=8,threads=1,free=261598016,total=477102080
   [junit4]   2> NOTE: All tests run in this JVM: [TestLatLonShapeQueries]
   [junit4] Completed [1/5 (1!)] on J2 in 41.53s, 3 tests, 1 failure, 1 skipped <<< FAILURES!
   [junit4] 
   [junit4] Suite: org.apache.lucene.document.TestLatLonShapeQueries
   [junit4]   2> NOTE: reproduce with: ant test  -Dtestcase=TestLatLonShapeQueries -Dtests.method=testRandomMedium -Dtests.seed=B1406AEE368F6B32 -Dtests.multiplier=3 -Dtests.slow=true -Dtests.badapples=true -Dtests.locale=ru-RU -Dtests.timezone=America/Puerto_Rico -Dtests.asserts=true -Dtests.file.encoding=ISO-8859-1
   [junit4] FAILURE 41.7s J0 | TestLatLonShapeQueries.testRandomMedium <<<
   [junit4]    > Throwable #1: java.lang.AssertionError: wrong hit (first of possibly more):
   [junit4]    > FAIL: id=6472 should match but did not
   [junit4]    >   query=LatLonShapeBoundingBoxQuery: field=shape:Rectangle(lat=-62.921879715286195 TO 0.0 lon=8.381903171539307E-8 TO 0.9999999403953552) docID=15772
   [junit4]    >   polygon=[-4.190951585769653E-8, 0.0] [89.99999995809048, 0.0] [89.99999995809048, 179.99999991618097] [-4.190951585769653E-8, 0.0] 
   [junit4]    >   deleted?=false  rect=Rectangle(-62.921879715286195 TO 0.0 lon=8.381903171539307E-8 TO 0.9999999403953552)
   [junit4]    > 	at __randomizedtesting.SeedInfo.seed([B1406AEE368F6B32:C9E5D4677EA0854]:0)
   [junit4]    > 	at org.apache.lucene.document.TestLatLonShapeQueries.verifyRandomBBoxes(TestLatLonShapeQueries.java:262)
   [junit4]    > 	at org.apache.lucene.document.TestLatLonShapeQueries.verify(TestLatLonShapeQueries.java:133)
   [junit4]    > 	at org.apache.lucene.document.TestLatLonShapeQueries.doTestRandom(TestLatLonShapeQueries.java:129)
   [junit4]    > 	at org.apache.lucene.document.TestLatLonShapeQueries.testRandomMedium(TestLatLonShapeQueries.java:101)
   [junit4]    > 	at java.lang.Thread.run(Thread.java:748)
   [junit4] IGNOR/A 0.00s J0 | TestLatLonShapeQueries.testRandomBig
   [junit4]    > Assumption #1: 'nightly' test group is disabled (@Nightly())
   [junit4] OK      0.09s J0 | TestLatLonShapeQueries.testRandomTiny
   [junit4]   2> NOTE: leaving temporary files on disk at: /home/jenkins/workspace/Lucene-Solr-7.x-Linux/lucene/build/sandbox/test/J0/temp/lucene.document.TestLatLonShapeQueries_B1406AEE368F6B32-001
   [junit4]   2> NOTE: test params are: codec=Asserting(Lucene70): {id=PostingsFormat(name=Asserting)}, docValues:{shape=DocValuesFormat(name=Memory), id=DocValuesFormat(name=Lucene70)}, maxPointsInLeafNode=422, maxMBSortInHeap=7.662765201926527, sim=RandomSimilarity(queryNorm=true): {}, locale=ru-RU, timezone=America/Puerto_Rico
   [junit4]   2> NOTE: Linux 4.15.0-24-generic amd64/Oracle Corporation 1.8.0_172 (64-bit)/cpus=8,threads=1,free=256813936,total=475529216
   [junit4]   2> NOTE: All tests run in this JVM: [TestLatLonShapeQueries]
   [junit4] Completed [2/5 (2!)] on J0 in 42.13s, 3 tests, 1 failure, 1 skipped <<< FAILURES!
   [junit4] 
   [junit4] Duplicate suite name used with XML reports: org.apache.lucene.document.TestLatLonShapeQueries. This may confuse tools that process XML reports. Set 'ignoreDuplicateSuites' to true to skip this message.
   [junit4] Suite: org.apache.lucene.document.TestLatLonShapeQueries
   [junit4]   2> NOTE: reproduce with: ant test  -Dtestcase=TestLatLonShapeQueries -Dtests.method=testRandomMedium -Dtests.seed=B1406AEE368F6B32 -Dtests.multiplier=3 -Dtests.slow=true -Dtests.badapples=true -Dtests.locale=ru-RU -Dtests.timezone=America/Puerto_Rico -Dtests.asserts=true -Dtests.file.encoding=ISO-8859-1
   [junit4] FAILURE 42.2s J1 | TestLatLonShapeQueries.testRandomMedium <<<
   [junit4]    > Throwable #1: java.lang.AssertionError: wrong hit (first of possibly more):
   [junit4]    > FAIL: id=6472 should match but did not
   [junit4]    >   query=LatLonShapeBoundingBoxQuery: field=shape:Rectangle(lat=-62.921879715286195 TO 0.0 lon=8.381903171539307E-8 TO 0.9999999403953552) docID=15772
   [junit4]    >   polygon=[-4.190951585769653E-8, 0.0] [89.99999995809048, 0.0] [89.99999995809048, 179.99999991618097] [-4.190951585769653E-8, 0.0] 
   [junit4]    >   deleted?=false  rect=Rectangle(-62.921879715286195 TO 0.0 lon=8.381903171539307E-8 TO 0.9999999403953552)
   [junit4]    > 	at __randomizedtesting.SeedInfo.seed([B1406AEE368F6B32:C9E5D4677EA0854]:0)
   [junit4]    > 	at org.apache.lucene.document.TestLatLonShapeQueries.verifyRandomBBoxes(TestLatLonShapeQueries.java:262)
   [junit4]    > 	at org.apache.lucene.document.TestLatLonShapeQueries.verify(TestLatLonShapeQueries.java:133)
   [junit4]    > 	at org.apache.lucene.document.TestLatLonShapeQueries.doTestRandom(TestLatLonShapeQueries.java:129)
   [junit4]    > 	at org.apache.lucene.document.TestLatLonShapeQueries.testRandomMedium(TestLatLonShapeQueries.java:101)
   [junit4]    > 	at java.lang.Thread.run(Thread.java:748)
   [junit4] IGNOR/A 0.00s J1 | TestLatLonShapeQueries.testRandomBig
   [junit4]    > Assumption #1: 'nightly' test group is disabled (@Nightly())
   [junit4] OK      0.11s J1 | TestLatLonShapeQueries.testRandomTiny
   [junit4]   2> NOTE: leaving temporary files on disk at: /home/jenkins/workspace/Lucene-Solr-7.x-Linux/lucene/build/sandbox/test/J1/temp/lucene.document.TestLatLonShapeQueries_B1406AEE368F6B32-001
   [junit4]   2> NOTE: test params are: codec=Asserting(Lucene70): {id=PostingsFormat(name=Asserting)}, docValues:{shape=DocValuesFormat(name=Memory), id=DocValuesFormat(name=Lucene70)}, maxPointsInLeafNode=422, maxMBSortInHeap=7.662765201926527, sim=RandomSimilarity(queryNorm=true): {}, locale=ru-RU, timezone=America/Puerto_Rico
   [junit4]   2> NOTE: Linux 4.15.0-24-generic amd64/Oracle Corporation 1.8.0_172 (64-bit)/cpus=8,threads=1,free=288407208,total=480247808
   [junit4]   2> NOTE: All tests run in this JVM: [TestLatLonShapeQueries]
   [junit4] Completed [3/5 (3!)] on J1 in 42.60s, 3 tests, 1 failure, 1 skipped <<< FAILURES!
   [junit4] 
   [junit4] Suite: org.apache.lucene.document.TestLatLonShapeQueries
   [junit4]   2> NOTE: reproduce with: ant test  -Dtestcase=TestLatLonShapeQueries -Dtests.method=testRandomMedium -Dtests.seed=B1406AEE368F6B32 -Dtests.multiplier=3 -Dtests.slow=true -Dtests.badapples=true -Dtests.locale=ru-RU -Dtests.timezone=America/Puerto_Rico -Dtests.asserts=true -Dtests.file.encoding=ISO-8859-1
   [junit4] FAILURE 32.3s J2 | TestLatLonShapeQueries.testRandomMedium <<<
   [junit4]    > Throwable #1: java.lang.AssertionError: wrong hit (first of possibly more):
   [junit4]    > FAIL: id=6472 should match but did not
   [junit4]    >   query=LatLonShapeBoundingBoxQuery: field=shape:Rectangle(lat=-62.921879715286195 TO 0.0 lon=8.381903171539307E-8 TO 0.9999999403953552) docID=15772
   [junit4]    >   polygon=[-4.190951585769653E-8, 0.0] [89.99999995809048, 0.0] [89.99999995809048, 179.99999991618097] [-4.190951585769653E-8, 0.0] 
   [junit4]    >   deleted?=false  rect=Rectangle(-62.921879715286195 TO 0.0 lon=8.381903171539307E-8 TO 0.9999999403953552)
   [junit4]    > 	at __randomizedtesting.SeedInfo.seed([B1406AEE368F6B32:C9E5D4677EA0854]:0)
   [junit4]    > 	at org.apache.lucene.document.TestLatLonShapeQueries.verifyRandomBBoxes(TestLatLonShapeQueries.java:262)
   [junit4]    > 	at org.apache.lucene.document.TestLatLonShapeQueries.verify(TestLatLonShapeQueries.java:133)
   [junit4]    > 	at org.apache.lucene.document.TestLatLonShapeQueries.doTestRandom(TestLatLonShapeQueries.java:129)
   [junit4]    > 	at org.apache.lucene.document.TestLatLonShapeQueries.testRandomMedium(TestLatLonShapeQueries.java:101)
   [junit4]    > 	at java.lang.Thread.run(Thread.java:748)
   [junit4] IGNOR/A 0.00s J2 | TestLatLonShapeQueries.testRandomBig
   [junit4]    > Assumption #1: 'nightly' test group is disabled (@Nightly())
   [junit4] OK      0.04s J2 | TestLatLonShapeQueries.testRandomTiny
   [junit4]   2> NOTE: leaving temporary files on disk at: /home/jenkins/workspace/Lucene-Solr-7.x-Linux/lucene/build/sandbox/test/J2/temp/lucene.document.TestLatLonShapeQueries_B1406AEE368F6B32-002
   [junit4]   2> NOTE: test params are: codec=Asserting(Lucene70): {id=PostingsFormat(name=Asserting)}, docValues:{shape=DocValuesFormat(name=Memory), id=DocValuesFormat(name=Lucene70)}, maxPointsInLeafNode=422, maxMBSortInHeap=7.662765201926527, sim=RandomSimilarity(queryNorm=true): {}, locale=ru-RU, timezone=America/Puerto_Rico
   [junit4]   2> NOTE: Linux 4.15.0-24-generic amd64/Oracle Corporation 1.8.0_172 (64-bit)/cpus=8,threads=1,free=167785376,total=523763712
   [junit4]   2> NOTE: All tests run in this JVM: [TestLatLonShapeQueries, TestLatLonShapeQueries]
   [junit4] Completed [4/5 (4!)] on J2 in 32.34s, 3 tests, 1 failure, 1 skipped <<< FAILURES!
   [junit4] 
   [junit4] Suite: org.apache.lucene.document.TestLatLonShapeQueries
   [junit4]   2> NOTE: reproduce with: ant test  -Dtestcase=TestLatLonShapeQueries -Dtests.method=testRandomMedium -Dtests.seed=B1406AEE368F6B32 -Dtests.multiplier=3 -Dtests.slow=true -Dtests.badapples=true -Dtests.locale=ru-RU -Dtests.timezone=America/Puerto_Rico -Dtests.asserts=true -Dtests.file.encoding=ISO-8859-1
   [junit4] FAILURE 32.6s J0 | TestLatLonShapeQueries.testRandomMedium <<<
   [junit4]    > Throwable #1: java.lang.AssertionError: wrong hit (first of possibly more):
   [junit4]    > FAIL: id=6472 should match but did not
   [junit4]    >   query=LatLonShapeBoundingBoxQuery: field=shape:Rectangle(lat=-62.921879715286195 TO 0.0 lon=8.381903171539307E-8 TO 0.9999999403953552) docID=15772
   [junit4]    >   polygon=[-4.190951585769653E-8, 0.0] [89.99999995809048, 0.0] [89.99999995809048, 179.99999991618097] [-4.190951585769653E-8, 0.0] 
   [junit4]    >   deleted?=false  rect=Rectangle(-62.921879715286195 TO 0.0 lon=8.381903171539307E-8 TO 0.9999999403953552)
   [junit4]    > 	at __randomizedtesting.SeedInfo.seed([B1406AEE368F6B32:C9E5D4677EA0854]:0)
   [junit4]    > 	at org.apache.lucene.document.TestLatLonShapeQueries.verifyRandomBBoxes(TestLatLonShapeQueries.java:262)
   [junit4]    > 	at org.apache.lucene.document.TestLatLonShapeQueries.verify(TestLatLonShapeQueries.java:133)
   [junit4]    > 	at org.apache.lucene.document.TestLatLonShapeQueries.doTestRandom(TestLatLonShapeQueries.java:129)
   [junit4]    > 	at org.apache.lucene.document.TestLatLonShapeQueries.testRandomMedium(TestLatLonShapeQueries.java:101)
   [junit4]    > 	at java.lang.Thread.run(Thread.java:748)
   [junit4] IGNOR/A 0.00s J0 | TestLatLonShapeQueries.testRandomBig
   [junit4]    > Assumption #1: 'nightly' test group is disabled (@Nightly())
   [junit4] OK      0.03s J0 | TestLatLonShapeQueries.testRandomTiny
   [junit4]   2> NOTE: leaving temporary files on disk at: /home/jenkins/workspace/Lucene-Solr-7.x-Linux/lucene/build/sandbox/test/J0/temp/lucene.document.TestLatLonShapeQueries_B1406AEE368F6B32-002
   [junit4]   2> NOTE: test params are: codec=Asserting(Lucene70): {id=PostingsFormat(name=Asserting)}, docValues:{shape=DocValuesFormat(name=Memory), id=DocValuesFormat(name=Lucene70)}, maxPointsInLeafNode=422, maxMBSortInHeap=7.662765201926527, sim=RandomSimilarity(queryNorm=true): {}, locale=ru-RU, timezone=America/Puerto_Rico
   [junit4]   2> NOTE: Linux 4.15.0-24-generic amd64/Oracle Corporation 1.8.0_172 (64-bit)/cpus=8,threads=1,free=246238432,total=521666560
   [junit4]   2> NOTE: All tests run in this JVM: [TestLatLonShapeQueries, TestLatLonShapeQueries]
   [junit4] Completed [5/5 (5!)] on J0 in 32.72s, 3 tests, 1 failure, 1 skipped <<< FAILURES!
   [junit4] 
   [junit4] 
   [junit4] Tests with failures [seed: B1406AEE368F6B32]:
   [junit4]   - org.apache.lucene.document.TestLatLonShapeQueries.testRandomMedium
   [junit4]   - org.apache.lucene.document.TestLatLonShapeQueries.testRandomMedium
   [junit4]   - org.apache.lucene.document.TestLatLonShapeQueries.testRandomMedium
   [junit4]   - org.apache.lucene.document.TestLatLonShapeQueries.testRandomMedium
   [junit4]   - org.apache.lucene.document.TestLatLonShapeQueries.testRandomMedium
   [junit4] 
   [junit4] 
   [junit4] JVM J0:     0.37 ..    75.74 =    75.37s
   [junit4] JVM J1:     0.37 ..    43.67 =    43.30s
   [junit4] JVM J2:     0.35 ..    75.02 =    74.67s
   [junit4] Execution time total: 1 minute 15 seconds
   [junit4] Tests summary: 5 suites, 15 tests, 5 failures, 5 ignored (5 assumptions)

BUILD FAILED
/home/jenkins/workspace/Lucene-Solr-7.x-Linux/lucene/common-build.xml:1568: The following error occurred while executing this line:
/home/jenkins/workspace/Lucene-Solr-7.x-Linux/lucene/common-build.xml:1092: There were test failures: 5 suites, 15 tests, 5 failures, 5 ignored (5 assumptions) [seed: B1406AEE368F6B32]

Total time: 1 minute 17 seconds

[repro] Setting last failure code to 256

[repro] Failures:
[repro]   5/5 failed: org.apache.lucene.document.TestLatLonShapeQueries
[repro] Exiting with code 256
+ mv lucene/build lucene/build.repro
+ mv solr/build solr/build.repro
mv: cannot stat 'solr/build': No such file or directory
+ true
+ mv lucene/build.orig lucene/build
+ mv solr/build.orig solr/build
Archiving artifacts
Setting ANT_1_8_2_HOME=/var/lib/jenkins/tools/hudson.tasks.Ant_AntInstallation/ANT_1.8.2
[WARNINGS] Parsing warnings in console log with parser Java Compiler (javac)
Setting ANT_1_8_2_HOME=/var/lib/jenkins/tools/hudson.tasks.Ant_AntInstallation/ANT_1.8.2
Setting ANT_1_8_2_HOME=/var/lib/jenkins/tools/hudson.tasks.Ant_AntInstallation/ANT_1.8.2
<Git Blamer> Using GitBlamer to create author and commit information for all warnings.
<Git Blamer> GIT_COMMIT=1284688a6d6a3e36e7af4ac159ff9d557f0bdc34, workspace=/var/lib/jenkins/workspace/Lucene-Solr-7.x-Linux
[WARNINGS] Computing warning deltas based on reference build #2327
Recording test results
Setting ANT_1_8_2_HOME=/var/lib/jenkins/tools/hudson.tasks.Ant_AntInstallation/ANT_1.8.2
Build step 'Publish JUnit test result report' changed build result to UNSTABLE
Email was triggered for: Unstable (Test Failures)
Sending email for trigger: Unstable (Test Failures)
Setting ANT_1_8_2_HOME=/var/lib/jenkins/tools/hudson.tasks.Ant_AntInstallation/ANT_1.8.2
Setting ANT_1_8_2_HOME=/var/lib/jenkins/tools/hudson.tasks.Ant_AntInstallation/ANT_1.8.2
Setting ANT_1_8_2_HOME=/var/lib/jenkins/tools/hudson.tasks.Ant_AntInstallation/ANT_1.8.2
Setting ANT_1_8_2_HOME=/var/lib/jenkins/tools/hudson.tasks.Ant_AntInstallation/ANT_1.8.2

Mime
View raw message