lucene-dev mailing list archives

Site index · List index
Message view « Date » · « Thread »
Top « Date » · « Thread »
From Policeman Jenkins Server <jenk...@thetaphi.de>
Subject [JENKINS] Lucene-Solr-master-Solaris (64bit/jdk1.8.0) - Build # 1967 - Still Unstable!
Date Fri, 13 Jul 2018 11:13:05 GMT
Build: https://jenkins.thetaphi.de/job/Lucene-Solr-master-Solaris/1967/
Java: 64bit/jdk1.8.0 -XX:-UseCompressedOops -XX:+UseSerialGC

5 tests failed.
FAILED:  org.apache.solr.cloud.LeaderTragicEventTest.test

Error Message:
Timeout waiting for new replica become leader null Live Nodes: [127.0.0.1:32981_solr, 127.0.0.1:63828_solr] Last available state: DocCollection(collection1//collections/collection1/state.json/5)={   "pullReplicas":"0",   "replicationFactor":"2",   "shards":{"shard1":{       "range":"80000000-7fffffff",       "state":"active",       "replicas":{         "core_node3":{           "core":"collection1_shard1_replica_n1",           "base_url":"http://127.0.0.1:32981/solr",           "node_name":"127.0.0.1:32981_solr",           "state":"active",           "type":"NRT",           "force_set_state":"false"},         "core_node4":{           "core":"collection1_shard1_replica_n2",           "base_url":"http://127.0.0.1:63828/solr",           "node_name":"127.0.0.1:63828_solr",           "state":"active",           "type":"NRT",           "force_set_state":"false",           "leader":"true"}}}},   "router":{"name":"compositeId"},   "maxShardsPerNode":"1",   "autoAddReplicas":"false",   "nrtReplicas":"2",   "tlogReplicas":"0"}

Stack Trace:
java.lang.AssertionError: Timeout waiting for new replica become leader
null
Live Nodes: [127.0.0.1:32981_solr, 127.0.0.1:63828_solr]
Last available state: DocCollection(collection1//collections/collection1/state.json/5)={
  "pullReplicas":"0",
  "replicationFactor":"2",
  "shards":{"shard1":{
      "range":"80000000-7fffffff",
      "state":"active",
      "replicas":{
        "core_node3":{
          "core":"collection1_shard1_replica_n1",
          "base_url":"http://127.0.0.1:32981/solr",
          "node_name":"127.0.0.1:32981_solr",
          "state":"active",
          "type":"NRT",
          "force_set_state":"false"},
        "core_node4":{
          "core":"collection1_shard1_replica_n2",
          "base_url":"http://127.0.0.1:63828/solr",
          "node_name":"127.0.0.1:63828_solr",
          "state":"active",
          "type":"NRT",
          "force_set_state":"false",
          "leader":"true"}}}},
  "router":{"name":"compositeId"},
  "maxShardsPerNode":"1",
  "autoAddReplicas":"false",
  "nrtReplicas":"2",
  "tlogReplicas":"0"}
	at __randomizedtesting.SeedInfo.seed([353ADAD86D49C7EC:BD6EE502C3B5AA14]:0)
	at org.junit.Assert.fail(Assert.java:93)
	at org.apache.solr.cloud.SolrCloudTestCase.waitForState(SolrCloudTestCase.java:278)
	at org.apache.solr.cloud.LeaderTragicEventTest.test(LeaderTragicEventTest.java:76)
	at sun.reflect.NativeMethodAccessorImpl.invoke0(Native Method)
	at sun.reflect.NativeMethodAccessorImpl.invoke(NativeMethodAccessorImpl.java:62)
	at sun.reflect.DelegatingMethodAccessorImpl.invoke(DelegatingMethodAccessorImpl.java:43)
	at java.lang.reflect.Method.invoke(Method.java:498)
	at com.carrotsearch.randomizedtesting.RandomizedRunner.invoke(RandomizedRunner.java:1737)
	at com.carrotsearch.randomizedtesting.RandomizedRunner$8.evaluate(RandomizedRunner.java:934)
	at com.carrotsearch.randomizedtesting.RandomizedRunner$9.evaluate(RandomizedRunner.java:970)
	at com.carrotsearch.randomizedtesting.RandomizedRunner$10.evaluate(RandomizedRunner.java:984)
	at com.carrotsearch.randomizedtesting.rules.SystemPropertiesRestoreRule$1.evaluate(SystemPropertiesRestoreRule.java:57)
	at org.apache.lucene.util.TestRuleSetupTeardownChained$1.evaluate(TestRuleSetupTeardownChained.java:49)
	at org.apache.lucene.util.AbstractBeforeAfterRule$1.evaluate(AbstractBeforeAfterRule.java:45)
	at org.apache.lucene.util.TestRuleThreadAndTestName$1.evaluate(TestRuleThreadAndTestName.java:48)
	at org.apache.lucene.util.TestRuleIgnoreAfterMaxFailures$1.evaluate(TestRuleIgnoreAfterMaxFailures.java:64)
	at org.apache.lucene.util.TestRuleMarkFailure$1.evaluate(TestRuleMarkFailure.java:47)
	at com.carrotsearch.randomizedtesting.rules.StatementAdapter.evaluate(StatementAdapter.java:36)
	at com.carrotsearch.randomizedtesting.ThreadLeakControl$StatementRunner.run(ThreadLeakControl.java:368)
	at com.carrotsearch.randomizedtesting.ThreadLeakControl.forkTimeoutingTask(ThreadLeakControl.java:817)
	at com.carrotsearch.randomizedtesting.ThreadLeakControl$3.evaluate(ThreadLeakControl.java:468)
	at com.carrotsearch.randomizedtesting.RandomizedRunner.runSingleTest(RandomizedRunner.java:943)
	at com.carrotsearch.randomizedtesting.RandomizedRunner$5.evaluate(RandomizedRunner.java:829)
	at com.carrotsearch.randomizedtesting.RandomizedRunner$6.evaluate(RandomizedRunner.java:879)
	at com.carrotsearch.randomizedtesting.RandomizedRunner$7.evaluate(RandomizedRunner.java:890)
	at com.carrotsearch.randomizedtesting.rules.StatementAdapter.evaluate(StatementAdapter.java:36)
	at com.carrotsearch.randomizedtesting.rules.SystemPropertiesRestoreRule$1.evaluate(SystemPropertiesRestoreRule.java:57)
	at org.apache.lucene.util.AbstractBeforeAfterRule$1.evaluate(AbstractBeforeAfterRule.java:45)
	at com.carrotsearch.randomizedtesting.rules.StatementAdapter.evaluate(StatementAdapter.java:36)
	at org.apache.lucene.util.TestRuleStoreClassName$1.evaluate(TestRuleStoreClassName.java:41)
	at com.carrotsearch.randomizedtesting.rules.NoShadowingOrOverridesOnMethodsRule$1.evaluate(NoShadowingOrOverridesOnMethodsRule.java:40)
	at com.carrotsearch.randomizedtesting.rules.NoShadowingOrOverridesOnMethodsRule$1.evaluate(NoShadowingOrOverridesOnMethodsRule.java:40)
	at com.carrotsearch.randomizedtesting.rules.StatementAdapter.evaluate(StatementAdapter.java:36)
	at com.carrotsearch.randomizedtesting.rules.StatementAdapter.evaluate(StatementAdapter.java:36)
	at com.carrotsearch.randomizedtesting.rules.StatementAdapter.evaluate(StatementAdapter.java:36)
	at org.apache.lucene.util.TestRuleAssertionsRequired$1.evaluate(TestRuleAssertionsRequired.java:53)
	at org.apache.lucene.util.TestRuleMarkFailure$1.evaluate(TestRuleMarkFailure.java:47)
	at org.apache.lucene.util.TestRuleIgnoreAfterMaxFailures$1.evaluate(TestRuleIgnoreAfterMaxFailures.java:64)
	at org.apache.lucene.util.TestRuleIgnoreTestSuites$1.evaluate(TestRuleIgnoreTestSuites.java:54)
	at com.carrotsearch.randomizedtesting.rules.StatementAdapter.evaluate(StatementAdapter.java:36)
	at com.carrotsearch.randomizedtesting.ThreadLeakControl$StatementRunner.run(ThreadLeakControl.java:368)
	at java.lang.Thread.run(Thread.java:748)


FAILED:  org.apache.solr.cloud.LeaderTragicEventTest.testOtherReplicasAreNotActive

Error Message:
Jetty Connector is not open: -2

Stack Trace:
java.lang.IllegalStateException: Jetty Connector is not open: -2
	at __randomizedtesting.SeedInfo.seed([353ADAD86D49C7EC:B08EF6AF51B67E74]:0)
	at org.apache.solr.client.solrj.embedded.JettySolrRunner.getBaseUrl(JettySolrRunner.java:499)
	at org.apache.solr.cloud.MiniSolrCloudCluster.getReplicaJetty(MiniSolrCloudCluster.java:539)
	at org.apache.solr.cloud.LeaderTragicEventTest.corruptLeader(LeaderTragicEventTest.java:100)
	at org.apache.solr.cloud.LeaderTragicEventTest.testOtherReplicasAreNotActive(LeaderTragicEventTest.java:150)
	at sun.reflect.NativeMethodAccessorImpl.invoke0(Native Method)
	at sun.reflect.NativeMethodAccessorImpl.invoke(NativeMethodAccessorImpl.java:62)
	at sun.reflect.DelegatingMethodAccessorImpl.invoke(DelegatingMethodAccessorImpl.java:43)
	at java.lang.reflect.Method.invoke(Method.java:498)
	at com.carrotsearch.randomizedtesting.RandomizedRunner.invoke(RandomizedRunner.java:1737)
	at com.carrotsearch.randomizedtesting.RandomizedRunner$8.evaluate(RandomizedRunner.java:934)
	at com.carrotsearch.randomizedtesting.RandomizedRunner$9.evaluate(RandomizedRunner.java:970)
	at com.carrotsearch.randomizedtesting.RandomizedRunner$10.evaluate(RandomizedRunner.java:984)
	at com.carrotsearch.randomizedtesting.rules.SystemPropertiesRestoreRule$1.evaluate(SystemPropertiesRestoreRule.java:57)
	at org.apache.lucene.util.TestRuleSetupTeardownChained$1.evaluate(TestRuleSetupTeardownChained.java:49)
	at org.apache.lucene.util.AbstractBeforeAfterRule$1.evaluate(AbstractBeforeAfterRule.java:45)
	at org.apache.lucene.util.TestRuleThreadAndTestName$1.evaluate(TestRuleThreadAndTestName.java:48)
	at org.apache.lucene.util.TestRuleIgnoreAfterMaxFailures$1.evaluate(TestRuleIgnoreAfterMaxFailures.java:64)
	at org.apache.lucene.util.TestRuleMarkFailure$1.evaluate(TestRuleMarkFailure.java:47)
	at com.carrotsearch.randomizedtesting.rules.StatementAdapter.evaluate(StatementAdapter.java:36)
	at com.carrotsearch.randomizedtesting.ThreadLeakControl$StatementRunner.run(ThreadLeakControl.java:368)
	at com.carrotsearch.randomizedtesting.ThreadLeakControl.forkTimeoutingTask(ThreadLeakControl.java:817)
	at com.carrotsearch.randomizedtesting.ThreadLeakControl$3.evaluate(ThreadLeakControl.java:468)
	at com.carrotsearch.randomizedtesting.RandomizedRunner.runSingleTest(RandomizedRunner.java:943)
	at com.carrotsearch.randomizedtesting.RandomizedRunner$5.evaluate(RandomizedRunner.java:829)
	at com.carrotsearch.randomizedtesting.RandomizedRunner$6.evaluate(RandomizedRunner.java:879)
	at com.carrotsearch.randomizedtesting.RandomizedRunner$7.evaluate(RandomizedRunner.java:890)
	at com.carrotsearch.randomizedtesting.rules.StatementAdapter.evaluate(StatementAdapter.java:36)
	at com.carrotsearch.randomizedtesting.rules.SystemPropertiesRestoreRule$1.evaluate(SystemPropertiesRestoreRule.java:57)
	at org.apache.lucene.util.AbstractBeforeAfterRule$1.evaluate(AbstractBeforeAfterRule.java:45)
	at com.carrotsearch.randomizedtesting.rules.StatementAdapter.evaluate(StatementAdapter.java:36)
	at org.apache.lucene.util.TestRuleStoreClassName$1.evaluate(TestRuleStoreClassName.java:41)
	at com.carrotsearch.randomizedtesting.rules.NoShadowingOrOverridesOnMethodsRule$1.evaluate(NoShadowingOrOverridesOnMethodsRule.java:40)
	at com.carrotsearch.randomizedtesting.rules.NoShadowingOrOverridesOnMethodsRule$1.evaluate(NoShadowingOrOverridesOnMethodsRule.java:40)
	at com.carrotsearch.randomizedtesting.rules.StatementAdapter.evaluate(StatementAdapter.java:36)
	at com.carrotsearch.randomizedtesting.rules.StatementAdapter.evaluate(StatementAdapter.java:36)
	at com.carrotsearch.randomizedtesting.rules.StatementAdapter.evaluate(StatementAdapter.java:36)
	at org.apache.lucene.util.TestRuleAssertionsRequired$1.evaluate(TestRuleAssertionsRequired.java:53)
	at org.apache.lucene.util.TestRuleMarkFailure$1.evaluate(TestRuleMarkFailure.java:47)
	at org.apache.lucene.util.TestRuleIgnoreAfterMaxFailures$1.evaluate(TestRuleIgnoreAfterMaxFailures.java:64)
	at org.apache.lucene.util.TestRuleIgnoreTestSuites$1.evaluate(TestRuleIgnoreTestSuites.java:54)
	at com.carrotsearch.randomizedtesting.rules.StatementAdapter.evaluate(StatementAdapter.java:36)
	at com.carrotsearch.randomizedtesting.ThreadLeakControl$StatementRunner.run(ThreadLeakControl.java:368)
	at java.lang.Thread.run(Thread.java:748)


FAILED:  org.apache.solr.cloud.LeaderTragicEventTest.testOtherReplicasAreNotActive

Error Message:
Jetty Connector is not open: -2

Stack Trace:
java.lang.IllegalStateException: Jetty Connector is not open: -2
	at __randomizedtesting.SeedInfo.seed([353ADAD86D49C7EC:B08EF6AF51B67E74]:0)
	at org.apache.solr.client.solrj.embedded.JettySolrRunner.getBaseUrl(JettySolrRunner.java:499)
	at org.apache.solr.cloud.MiniSolrCloudCluster.getReplicaJetty(MiniSolrCloudCluster.java:539)
	at org.apache.solr.cloud.LeaderTragicEventTest.corruptLeader(LeaderTragicEventTest.java:100)
	at org.apache.solr.cloud.LeaderTragicEventTest.testOtherReplicasAreNotActive(LeaderTragicEventTest.java:150)
	at sun.reflect.NativeMethodAccessorImpl.invoke0(Native Method)
	at sun.reflect.NativeMethodAccessorImpl.invoke(NativeMethodAccessorImpl.java:62)
	at sun.reflect.DelegatingMethodAccessorImpl.invoke(DelegatingMethodAccessorImpl.java:43)
	at java.lang.reflect.Method.invoke(Method.java:498)
	at com.carrotsearch.randomizedtesting.RandomizedRunner.invoke(RandomizedRunner.java:1737)
	at com.carrotsearch.randomizedtesting.RandomizedRunner$8.evaluate(RandomizedRunner.java:934)
	at com.carrotsearch.randomizedtesting.RandomizedRunner$9.evaluate(RandomizedRunner.java:970)
	at com.carrotsearch.randomizedtesting.RandomizedRunner$10.evaluate(RandomizedRunner.java:984)
	at com.carrotsearch.randomizedtesting.rules.SystemPropertiesRestoreRule$1.evaluate(SystemPropertiesRestoreRule.java:57)
	at org.apache.lucene.util.TestRuleSetupTeardownChained$1.evaluate(TestRuleSetupTeardownChained.java:49)
	at org.apache.lucene.util.AbstractBeforeAfterRule$1.evaluate(AbstractBeforeAfterRule.java:45)
	at org.apache.lucene.util.TestRuleThreadAndTestName$1.evaluate(TestRuleThreadAndTestName.java:48)
	at org.apache.lucene.util.TestRuleIgnoreAfterMaxFailures$1.evaluate(TestRuleIgnoreAfterMaxFailures.java:64)
	at org.apache.lucene.util.TestRuleMarkFailure$1.evaluate(TestRuleMarkFailure.java:47)
	at com.carrotsearch.randomizedtesting.rules.StatementAdapter.evaluate(StatementAdapter.java:36)
	at com.carrotsearch.randomizedtesting.ThreadLeakControl$StatementRunner.run(ThreadLeakControl.java:368)
	at com.carrotsearch.randomizedtesting.ThreadLeakControl.forkTimeoutingTask(ThreadLeakControl.java:817)
	at com.carrotsearch.randomizedtesting.ThreadLeakControl$3.evaluate(ThreadLeakControl.java:468)
	at com.carrotsearch.randomizedtesting.RandomizedRunner.runSingleTest(RandomizedRunner.java:943)
	at com.carrotsearch.randomizedtesting.RandomizedRunner$5.evaluate(RandomizedRunner.java:829)
	at com.carrotsearch.randomizedtesting.RandomizedRunner$6.evaluate(RandomizedRunner.java:879)
	at com.carrotsearch.randomizedtesting.RandomizedRunner$7.evaluate(RandomizedRunner.java:890)
	at com.carrotsearch.randomizedtesting.rules.StatementAdapter.evaluate(StatementAdapter.java:36)
	at com.carrotsearch.randomizedtesting.rules.SystemPropertiesRestoreRule$1.evaluate(SystemPropertiesRestoreRule.java:57)
	at org.apache.lucene.util.AbstractBeforeAfterRule$1.evaluate(AbstractBeforeAfterRule.java:45)
	at com.carrotsearch.randomizedtesting.rules.StatementAdapter.evaluate(StatementAdapter.java:36)
	at org.apache.lucene.util.TestRuleStoreClassName$1.evaluate(TestRuleStoreClassName.java:41)
	at com.carrotsearch.randomizedtesting.rules.NoShadowingOrOverridesOnMethodsRule$1.evaluate(NoShadowingOrOverridesOnMethodsRule.java:40)
	at com.carrotsearch.randomizedtesting.rules.NoShadowingOrOverridesOnMethodsRule$1.evaluate(NoShadowingOrOverridesOnMethodsRule.java:40)
	at com.carrotsearch.randomizedtesting.rules.StatementAdapter.evaluate(StatementAdapter.java:36)
	at com.carrotsearch.randomizedtesting.rules.StatementAdapter.evaluate(StatementAdapter.java:36)
	at com.carrotsearch.randomizedtesting.rules.StatementAdapter.evaluate(StatementAdapter.java:36)
	at org.apache.lucene.util.TestRuleAssertionsRequired$1.evaluate(TestRuleAssertionsRequired.java:53)
	at org.apache.lucene.util.TestRuleMarkFailure$1.evaluate(TestRuleMarkFailure.java:47)
	at org.apache.lucene.util.TestRuleIgnoreAfterMaxFailures$1.evaluate(TestRuleIgnoreAfterMaxFailures.java:64)
	at org.apache.lucene.util.TestRuleIgnoreTestSuites$1.evaluate(TestRuleIgnoreTestSuites.java:54)
	at com.carrotsearch.randomizedtesting.rules.StatementAdapter.evaluate(StatementAdapter.java:36)
	at com.carrotsearch.randomizedtesting.ThreadLeakControl$StatementRunner.run(ThreadLeakControl.java:368)
	at java.lang.Thread.run(Thread.java:748)


FAILED:  org.apache.solr.cloud.LeaderTragicEventTest.testOtherReplicasAreNotActive

Error Message:
Error from server at http://127.0.0.1:63828/solr: collection already exists: collection1

Stack Trace:
org.apache.solr.client.solrj.impl.HttpSolrClient$RemoteSolrException: Error from server at http://127.0.0.1:63828/solr: collection already exists: collection1
	at __randomizedtesting.SeedInfo.seed([353ADAD86D49C7EC:B08EF6AF51B67E74]:0)
	at org.apache.solr.client.solrj.impl.HttpSolrClient.executeMethod(HttpSolrClient.java:643)
	at org.apache.solr.client.solrj.impl.HttpSolrClient.request(HttpSolrClient.java:255)
	at org.apache.solr.client.solrj.impl.HttpSolrClient.request(HttpSolrClient.java:244)
	at org.apache.solr.client.solrj.impl.LBHttpSolrClient.doRequest(LBHttpSolrClient.java:483)
	at org.apache.solr.client.solrj.impl.LBHttpSolrClient.request(LBHttpSolrClient.java:413)
	at org.apache.solr.client.solrj.impl.CloudSolrClient.sendRequest(CloudSolrClient.java:1106)
	at org.apache.solr.client.solrj.impl.CloudSolrClient.requestWithRetryOnStaleState(CloudSolrClient.java:886)
	at org.apache.solr.client.solrj.impl.CloudSolrClient.request(CloudSolrClient.java:819)
	at org.apache.solr.client.solrj.SolrRequest.process(SolrRequest.java:194)
	at org.apache.solr.client.solrj.SolrRequest.process(SolrRequest.java:211)
	at org.apache.solr.cloud.LeaderTragicEventTest.testOtherReplicasAreNotActive(LeaderTragicEventTest.java:139)
	at sun.reflect.NativeMethodAccessorImpl.invoke0(Native Method)
	at sun.reflect.NativeMethodAccessorImpl.invoke(NativeMethodAccessorImpl.java:62)
	at sun.reflect.DelegatingMethodAccessorImpl.invoke(DelegatingMethodAccessorImpl.java:43)
	at java.lang.reflect.Method.invoke(Method.java:498)
	at com.carrotsearch.randomizedtesting.RandomizedRunner.invoke(RandomizedRunner.java:1737)
	at com.carrotsearch.randomizedtesting.RandomizedRunner$8.evaluate(RandomizedRunner.java:934)
	at com.carrotsearch.randomizedtesting.RandomizedRunner$9.evaluate(RandomizedRunner.java:970)
	at com.carrotsearch.randomizedtesting.RandomizedRunner$10.evaluate(RandomizedRunner.java:984)
	at com.carrotsearch.randomizedtesting.rules.SystemPropertiesRestoreRule$1.evaluate(SystemPropertiesRestoreRule.java:57)
	at org.apache.lucene.util.TestRuleSetupTeardownChained$1.evaluate(TestRuleSetupTeardownChained.java:49)
	at org.apache.lucene.util.AbstractBeforeAfterRule$1.evaluate(AbstractBeforeAfterRule.java:45)
	at org.apache.lucene.util.TestRuleThreadAndTestName$1.evaluate(TestRuleThreadAndTestName.java:48)
	at org.apache.lucene.util.TestRuleIgnoreAfterMaxFailures$1.evaluate(TestRuleIgnoreAfterMaxFailures.java:64)
	at org.apache.lucene.util.TestRuleMarkFailure$1.evaluate(TestRuleMarkFailure.java:47)
	at com.carrotsearch.randomizedtesting.rules.StatementAdapter.evaluate(StatementAdapter.java:36)
	at com.carrotsearch.randomizedtesting.ThreadLeakControl$StatementRunner.run(ThreadLeakControl.java:368)
	at com.carrotsearch.randomizedtesting.ThreadLeakControl.forkTimeoutingTask(ThreadLeakControl.java:817)
	at com.carrotsearch.randomizedtesting.ThreadLeakControl$3.evaluate(ThreadLeakControl.java:468)
	at com.carrotsearch.randomizedtesting.RandomizedRunner.runSingleTest(RandomizedRunner.java:943)
	at com.carrotsearch.randomizedtesting.RandomizedRunner$5.evaluate(RandomizedRunner.java:829)
	at com.carrotsearch.randomizedtesting.RandomizedRunner$6.evaluate(RandomizedRunner.java:879)
	at com.carrotsearch.randomizedtesting.RandomizedRunner$7.evaluate(RandomizedRunner.java:890)
	at com.carrotsearch.randomizedtesting.rules.StatementAdapter.evaluate(StatementAdapter.java:36)
	at com.carrotsearch.randomizedtesting.rules.SystemPropertiesRestoreRule$1.evaluate(SystemPropertiesRestoreRule.java:57)
	at org.apache.lucene.util.AbstractBeforeAfterRule$1.evaluate(AbstractBeforeAfterRule.java:45)
	at com.carrotsearch.randomizedtesting.rules.StatementAdapter.evaluate(StatementAdapter.java:36)
	at org.apache.lucene.util.TestRuleStoreClassName$1.evaluate(TestRuleStoreClassName.java:41)
	at com.carrotsearch.randomizedtesting.rules.NoShadowingOrOverridesOnMethodsRule$1.evaluate(NoShadowingOrOverridesOnMethodsRule.java:40)
	at com.carrotsearch.randomizedtesting.rules.NoShadowingOrOverridesOnMethodsRule$1.evaluate(NoShadowingOrOverridesOnMethodsRule.java:40)
	at com.carrotsearch.randomizedtesting.rules.StatementAdapter.evaluate(StatementAdapter.java:36)
	at com.carrotsearch.randomizedtesting.rules.StatementAdapter.evaluate(StatementAdapter.java:36)
	at com.carrotsearch.randomizedtesting.rules.StatementAdapter.evaluate(StatementAdapter.java:36)
	at org.apache.lucene.util.TestRuleAssertionsRequired$1.evaluate(TestRuleAssertionsRequired.java:53)
	at org.apache.lucene.util.TestRuleMarkFailure$1.evaluate(TestRuleMarkFailure.java:47)
	at org.apache.lucene.util.TestRuleIgnoreAfterMaxFailures$1.evaluate(TestRuleIgnoreAfterMaxFailures.java:64)
	at org.apache.lucene.util.TestRuleIgnoreTestSuites$1.evaluate(TestRuleIgnoreTestSuites.java:54)
	at com.carrotsearch.randomizedtesting.rules.StatementAdapter.evaluate(StatementAdapter.java:36)
	at com.carrotsearch.randomizedtesting.ThreadLeakControl$StatementRunner.run(ThreadLeakControl.java:368)
	at java.lang.Thread.run(Thread.java:748)


FAILED:  org.apache.solr.cloud.LeaderTragicEventTest.testOtherReplicasAreNotActive

Error Message:
Jetty Connector is not open: -2

Stack Trace:
java.lang.IllegalStateException: Jetty Connector is not open: -2
	at __randomizedtesting.SeedInfo.seed([353ADAD86D49C7EC:B08EF6AF51B67E74]:0)
	at org.apache.solr.client.solrj.embedded.JettySolrRunner.getBaseUrl(JettySolrRunner.java:499)
	at org.apache.solr.cloud.MiniSolrCloudCluster.getReplicaJetty(MiniSolrCloudCluster.java:539)
	at org.apache.solr.cloud.LeaderTragicEventTest.corruptLeader(LeaderTragicEventTest.java:100)
	at org.apache.solr.cloud.LeaderTragicEventTest.testOtherReplicasAreNotActive(LeaderTragicEventTest.java:150)
	at sun.reflect.NativeMethodAccessorImpl.invoke0(Native Method)
	at sun.reflect.NativeMethodAccessorImpl.invoke(NativeMethodAccessorImpl.java:62)
	at sun.reflect.DelegatingMethodAccessorImpl.invoke(DelegatingMethodAccessorImpl.java:43)
	at java.lang.reflect.Method.invoke(Method.java:498)
	at com.carrotsearch.randomizedtesting.RandomizedRunner.invoke(RandomizedRunner.java:1737)
	at com.carrotsearch.randomizedtesting.RandomizedRunner$8.evaluate(RandomizedRunner.java:934)
	at com.carrotsearch.randomizedtesting.RandomizedRunner$9.evaluate(RandomizedRunner.java:970)
	at com.carrotsearch.randomizedtesting.RandomizedRunner$10.evaluate(RandomizedRunner.java:984)
	at com.carrotsearch.randomizedtesting.rules.SystemPropertiesRestoreRule$1.evaluate(SystemPropertiesRestoreRule.java:57)
	at org.apache.lucene.util.TestRuleSetupTeardownChained$1.evaluate(TestRuleSetupTeardownChained.java:49)
	at org.apache.lucene.util.AbstractBeforeAfterRule$1.evaluate(AbstractBeforeAfterRule.java:45)
	at org.apache.lucene.util.TestRuleThreadAndTestName$1.evaluate(TestRuleThreadAndTestName.java:48)
	at org.apache.lucene.util.TestRuleIgnoreAfterMaxFailures$1.evaluate(TestRuleIgnoreAfterMaxFailures.java:64)
	at org.apache.lucene.util.TestRuleMarkFailure$1.evaluate(TestRuleMarkFailure.java:47)
	at com.carrotsearch.randomizedtesting.rules.StatementAdapter.evaluate(StatementAdapter.java:36)
	at com.carrotsearch.randomizedtesting.ThreadLeakControl$StatementRunner.run(ThreadLeakControl.java:368)
	at com.carrotsearch.randomizedtesting.ThreadLeakControl.forkTimeoutingTask(ThreadLeakControl.java:817)
	at com.carrotsearch.randomizedtesting.ThreadLeakControl$3.evaluate(ThreadLeakControl.java:468)
	at com.carrotsearch.randomizedtesting.RandomizedRunner.runSingleTest(RandomizedRunner.java:943)
	at com.carrotsearch.randomizedtesting.RandomizedRunner$5.evaluate(RandomizedRunner.java:829)
	at com.carrotsearch.randomizedtesting.RandomizedRunner$6.evaluate(RandomizedRunner.java:879)
	at com.carrotsearch.randomizedtesting.RandomizedRunner$7.evaluate(RandomizedRunner.java:890)
	at com.carrotsearch.randomizedtesting.rules.StatementAdapter.evaluate(StatementAdapter.java:36)
	at com.carrotsearch.randomizedtesting.rules.SystemPropertiesRestoreRule$1.evaluate(SystemPropertiesRestoreRule.java:57)
	at org.apache.lucene.util.AbstractBeforeAfterRule$1.evaluate(AbstractBeforeAfterRule.java:45)
	at com.carrotsearch.randomizedtesting.rules.StatementAdapter.evaluate(StatementAdapter.java:36)
	at org.apache.lucene.util.TestRuleStoreClassName$1.evaluate(TestRuleStoreClassName.java:41)
	at com.carrotsearch.randomizedtesting.rules.NoShadowingOrOverridesOnMethodsRule$1.evaluate(NoShadowingOrOverridesOnMethodsRule.java:40)
	at com.carrotsearch.randomizedtesting.rules.NoShadowingOrOverridesOnMethodsRule$1.evaluate(NoShadowingOrOverridesOnMethodsRule.java:40)
	at com.carrotsearch.randomizedtesting.rules.StatementAdapter.evaluate(StatementAdapter.java:36)
	at com.carrotsearch.randomizedtesting.rules.StatementAdapter.evaluate(StatementAdapter.java:36)
	at com.carrotsearch.randomizedtesting.rules.StatementAdapter.evaluate(StatementAdapter.java:36)
	at org.apache.lucene.util.TestRuleAssertionsRequired$1.evaluate(TestRuleAssertionsRequired.java:53)
	at org.apache.lucene.util.TestRuleMarkFailure$1.evaluate(TestRuleMarkFailure.java:47)
	at org.apache.lucene.util.TestRuleIgnoreAfterMaxFailures$1.evaluate(TestRuleIgnoreAfterMaxFailures.java:64)
	at org.apache.lucene.util.TestRuleIgnoreTestSuites$1.evaluate(TestRuleIgnoreTestSuites.java:54)
	at com.carrotsearch.randomizedtesting.rules.StatementAdapter.evaluate(StatementAdapter.java:36)
	at com.carrotsearch.randomizedtesting.ThreadLeakControl$StatementRunner.run(ThreadLeakControl.java:368)
	at java.lang.Thread.run(Thread.java:748)




Build Log:
[...truncated 13292 lines...]
   [junit4] Suite: org.apache.solr.cloud.LeaderTragicEventTest
   [junit4]   2> Creating dataDir: /export/home/jenkins/workspace/Lucene-Solr-master-Solaris/solr/build/solr-core/test/J1/temp/solr.cloud.LeaderTragicEventTest_353ADAD86D49C7EC-001/init-core-data-001
   [junit4]   2> 1789056 INFO  (SUITE-LeaderTragicEventTest-seed#[353ADAD86D49C7EC]-worker) [    ] o.a.s.c.MiniSolrCloudCluster Starting cluster of 2 servers in /export/home/jenkins/workspace/Lucene-Solr-master-Solaris/solr/build/solr-core/test/J1/temp/solr.cloud.LeaderTragicEventTest_353ADAD86D49C7EC-001/tempDir-001
   [junit4]   2> 1789056 INFO  (SUITE-LeaderTragicEventTest-seed#[353ADAD86D49C7EC]-worker) [    ] o.a.s.c.ZkTestServer STARTING ZK TEST SERVER
   [junit4]   2> 1789056 INFO  (Thread-3222) [    ] o.a.s.c.ZkTestServer client port:0.0.0.0/0.0.0.0:0
   [junit4]   2> 1789056 INFO  (Thread-3222) [    ] o.a.s.c.ZkTestServer Starting server
   [junit4]   2> 1789059 ERROR (Thread-3222) [    ] o.a.z.s.ZooKeeperServer ZKShutdownHandler is not registered, so ZooKeeper server won't take any action on ERROR or SHUTDOWN server state changes
   [junit4]   2> 1789157 INFO  (SUITE-LeaderTragicEventTest-seed#[353ADAD86D49C7EC]-worker) [    ] o.a.s.c.ZkTestServer start zk server on port:39221
   [junit4]   2> 1789159 INFO  (zkConnectionManagerCallback-5430-thread-1) [    ] o.a.s.c.c.ConnectionManager zkClient has connected
   [junit4]   2> 1789165 INFO  (jetty-launcher-5427-thread-2) [    ] o.e.j.s.Server jetty-9.4.11.v20180605; built: 2018-06-05T18:24:03.829Z; git: d5fc0523cfa96bfebfbda19606cad384d772f04c; jvm 1.8.0_172-b11
   [junit4]   2> 1789165 INFO  (jetty-launcher-5427-thread-1) [    ] o.e.j.s.Server jetty-9.4.11.v20180605; built: 2018-06-05T18:24:03.829Z; git: d5fc0523cfa96bfebfbda19606cad384d772f04c; jvm 1.8.0_172-b11
   [junit4]   2> 1789183 INFO  (jetty-launcher-5427-thread-1) [    ] o.e.j.s.session DefaultSessionIdManager workerName=node0
   [junit4]   2> 1789183 INFO  (jetty-launcher-5427-thread-1) [    ] o.e.j.s.session No SessionScavenger set, using defaults
   [junit4]   2> 1789183 INFO  (jetty-launcher-5427-thread-1) [    ] o.e.j.s.session node0 Scavenging every 600000ms
   [junit4]   2> 1789183 INFO  (jetty-launcher-5427-thread-2) [    ] o.e.j.s.session DefaultSessionIdManager workerName=node0
   [junit4]   2> 1789183 INFO  (jetty-launcher-5427-thread-2) [    ] o.e.j.s.session No SessionScavenger set, using defaults
   [junit4]   2> 1789183 INFO  (jetty-launcher-5427-thread-2) [    ] o.e.j.s.session node0 Scavenging every 600000ms
   [junit4]   2> 1789183 INFO  (jetty-launcher-5427-thread-1) [    ] o.e.j.s.h.ContextHandler Started o.e.j.s.ServletContextHandler@3dc07562{/solr,null,AVAILABLE}
   [junit4]   2> 1789183 INFO  (jetty-launcher-5427-thread-2) [    ] o.e.j.s.h.ContextHandler Started o.e.j.s.ServletContextHandler@7c1987bb{/solr,null,AVAILABLE}
   [junit4]   2> 1789184 INFO  (jetty-launcher-5427-thread-1) [    ] o.e.j.s.AbstractConnector Started ServerConnector@4b4efc49{HTTP/1.1,[http/1.1]}{127.0.0.1:38776}
   [junit4]   2> 1789184 INFO  (jetty-launcher-5427-thread-2) [    ] o.e.j.s.AbstractConnector Started ServerConnector@327b40f6{HTTP/1.1,[http/1.1]}{127.0.0.1:42958}
   [junit4]   2> 1789184 INFO  (jetty-launcher-5427-thread-1) [    ] o.e.j.s.Server Started @1790170ms
   [junit4]   2> 1789184 INFO  (jetty-launcher-5427-thread-2) [    ] o.e.j.s.Server Started @1790170ms
   [junit4]   2> 1789184 INFO  (jetty-launcher-5427-thread-2) [    ] o.a.s.c.s.e.JettySolrRunner Jetty properties: {hostContext=/solr, hostPort=42958}
   [junit4]   2> 1789184 INFO  (jetty-launcher-5427-thread-1) [    ] o.a.s.c.s.e.JettySolrRunner Jetty properties: {hostContext=/solr, hostPort=38776}
   [junit4]   2> 1789184 ERROR (jetty-launcher-5427-thread-1) [    ] o.a.s.u.StartupLoggingUtils Missing Java Option solr.log.dir. Logging may be missing or incomplete.
   [junit4]   2> 1789184 ERROR (jetty-launcher-5427-thread-2) [    ] o.a.s.u.StartupLoggingUtils Missing Java Option solr.log.dir. Logging may be missing or incomplete.
   [junit4]   2> 1789184 INFO  (jetty-launcher-5427-thread-1) [    ] o.a.s.s.SolrDispatchFilter Using logger factory org.apache.logging.slf4j.Log4jLoggerFactory
   [junit4]   2> 1789184 INFO  (jetty-launcher-5427-thread-2) [    ] o.a.s.s.SolrDispatchFilter Using logger factory org.apache.logging.slf4j.Log4jLoggerFactory
   [junit4]   2> 1789184 INFO  (jetty-launcher-5427-thread-2) [    ] o.a.s.s.SolrDispatchFilter  ___      _       Welcome to Apache Solr™ version 8.0.0
   [junit4]   2> 1789184 INFO  (jetty-launcher-5427-thread-1) [    ] o.a.s.s.SolrDispatchFilter  ___      _       Welcome to Apache Solr™ version 8.0.0
   [junit4]   2> 1789184 INFO  (jetty-launcher-5427-thread-2) [    ] o.a.s.s.SolrDispatchFilter / __| ___| |_ _   Starting in cloud mode on port null
   [junit4]   2> 1789184 INFO  (jetty-launcher-5427-thread-1) [    ] o.a.s.s.SolrDispatchFilter / __| ___| |_ _   Starting in cloud mode on port null
   [junit4]   2> 1789184 INFO  (jetty-launcher-5427-thread-2) [    ] o.a.s.s.SolrDispatchFilter \__ \/ _ \ | '_|  Install dir: null
   [junit4]   2> 1789184 INFO  (jetty-launcher-5427-thread-1) [    ] o.a.s.s.SolrDispatchFilter \__ \/ _ \ | '_|  Install dir: null
   [junit4]   2> 1789184 INFO  (jetty-launcher-5427-thread-1) [    ] o.a.s.s.SolrDispatchFilter |___/\___/_|_|    Start time: 2018-07-13T10:08:00.724Z
   [junit4]   2> 1789184 INFO  (jetty-launcher-5427-thread-2) [    ] o.a.s.s.SolrDispatchFilter |___/\___/_|_|    Start time: 2018-07-13T10:08:00.724Z
   [junit4]   2> 1789190 INFO  (zkConnectionManagerCallback-5434-thread-1) [    ] o.a.s.c.c.ConnectionManager zkClient has connected
   [junit4]   2> 1789190 INFO  (zkConnectionManagerCallback-5432-thread-1) [    ] o.a.s.c.c.ConnectionManager zkClient has connected
   [junit4]   2> 1789191 INFO  (jetty-launcher-5427-thread-2) [    ] o.a.s.s.SolrDispatchFilter solr.xml found in ZooKeeper. Loading...
   [junit4]   2> 1789191 INFO  (jetty-launcher-5427-thread-1) [    ] o.a.s.s.SolrDispatchFilter solr.xml found in ZooKeeper. Loading...
   [junit4]   2> 1789197 WARN  (NIOServerCxn.Factory:0.0.0.0/0.0.0.0:0) [    ] o.a.z.s.NIOServerCnxn Unable to read additional data from client sessionid 0x101920c3e2b0001, likely client has closed socket
   [junit4]   2> 1789982 INFO  (jetty-launcher-5427-thread-2) [    ] o.a.s.c.ZkContainer Zookeeper client=127.0.0.1:39221/solr
   [junit4]   2> 1789983 INFO  (zkConnectionManagerCallback-5438-thread-1) [    ] o.a.s.c.c.ConnectionManager zkClient has connected
   [junit4]   2> 1789986 INFO  (zkConnectionManagerCallback-5440-thread-1) [    ] o.a.s.c.c.ConnectionManager zkClient has connected
   [junit4]   2> 1790157 INFO  (jetty-launcher-5427-thread-1) [    ] o.a.s.c.ZkContainer Zookeeper client=127.0.0.1:39221/solr
   [junit4]   2> 1790157 INFO  (jetty-launcher-5427-thread-2) [n:127.0.0.1:42958_solr    ] o.a.s.c.Overseer Overseer (id=null) closing
   [junit4]   2> 1790158 INFO  (jetty-launcher-5427-thread-2) [n:127.0.0.1:42958_solr    ] o.a.s.c.OverseerElectionContext I am going to be the leader 127.0.0.1:42958_solr
   [junit4]   2> 1790160 INFO  (jetty-launcher-5427-thread-2) [n:127.0.0.1:42958_solr    ] o.a.s.c.Overseer Overseer (id=72499650294906884-127.0.0.1:42958_solr-n_0000000000) starting
   [junit4]   2> 1790160 INFO  (zkConnectionManagerCallback-5446-thread-1) [    ] o.a.s.c.c.ConnectionManager zkClient has connected
   [junit4]   2> 1790169 INFO  (zkConnectionManagerCallback-5448-thread-1) [    ] o.a.s.c.c.ConnectionManager zkClient has connected
   [junit4]   2> 1790178 INFO  (zkConnectionManagerCallback-5453-thread-1) [    ] o.a.s.c.c.ConnectionManager zkClient has connected
   [junit4]   2> 1790188 INFO  (jetty-launcher-5427-thread-2) [n:127.0.0.1:42958_solr    ] o.a.s.c.s.i.ZkClientClusterStateProvider Cluster at 127.0.0.1:39221/solr ready
   [junit4]   2> 1790190 INFO  (jetty-launcher-5427-thread-2) [n:127.0.0.1:42958_solr    ] o.a.s.c.ZkController Register node as live in ZooKeeper:/live_nodes/127.0.0.1:42958_solr
   [junit4]   2> 1790197 INFO  (zkCallback-5452-thread-1) [    ] o.a.s.c.c.ZkStateReader Updated live nodes from ZooKeeper... (0) -> (1)
   [junit4]   2> 1790197 INFO  (OverseerStateUpdate-72499650294906884-127.0.0.1:42958_solr-n_0000000000) [    ] o.a.s.c.c.ZkStateReader Updated live nodes from ZooKeeper... (0) -> (1)
   [junit4]   2> 1790204 INFO  (zkCallback-5447-thread-1) [    ] o.a.s.c.c.ZkStateReader Updated live nodes from ZooKeeper... (0) -> (1)
   [junit4]   2> 1790206 INFO  (jetty-launcher-5427-thread-1) [n:127.0.0.1:38776_solr    ] o.a.s.c.Overseer Overseer (id=null) closing
   [junit4]   2> 1790211 INFO  (jetty-launcher-5427-thread-1) [n:127.0.0.1:38776_solr    ] o.a.s.c.TransientSolrCoreCacheDefault Allocating transient cache for 2147483647 transient cores
   [junit4]   2> 1790211 INFO  (jetty-launcher-5427-thread-1) [n:127.0.0.1:38776_solr    ] o.a.s.c.ZkController Register node as live in ZooKeeper:/live_nodes/127.0.0.1:38776_solr
   [junit4]   2> 1790215 INFO  (zkCallback-5452-thread-1) [    ] o.a.s.c.c.ZkStateReader Updated live nodes from ZooKeeper... (1) -> (2)
   [junit4]   2> 1790216 INFO  (zkCallback-5447-thread-1) [    ] o.a.s.c.c.ZkStateReader Updated live nodes from ZooKeeper... (1) -> (2)
   [junit4]   2> 1790216 INFO  (zkCallback-5439-thread-2) [    ] o.a.s.c.c.ZkStateReader Updated live nodes from ZooKeeper... (1) -> (2)
   [junit4]   2> 1790220 INFO  (jetty-launcher-5427-thread-2) [n:127.0.0.1:42958_solr    ] o.a.s.h.a.MetricsHistoryHandler No .system collection, keeping metrics history in memory.
   [junit4]   2> 1790238 INFO  (zkConnectionManagerCallback-5461-thread-1) [    ] o.a.s.c.c.ConnectionManager zkClient has connected
   [junit4]   2> 1790240 INFO  (jetty-launcher-5427-thread-1) [n:127.0.0.1:38776_solr    ] o.a.s.c.c.ZkStateReader Updated live nodes from ZooKeeper... (0) -> (2)
   [junit4]   2> 1790242 INFO  (jetty-launcher-5427-thread-1) [n:127.0.0.1:38776_solr    ] o.a.s.c.s.i.ZkClientClusterStateProvider Cluster at 127.0.0.1:39221/solr ready
   [junit4]   2> 1790242 INFO  (jetty-launcher-5427-thread-1) [n:127.0.0.1:38776_solr    ] o.a.s.h.a.MetricsHistoryHandler No .system collection, keeping metrics history in memory.
   [junit4]   2> 1790254 INFO  (jetty-launcher-5427-thread-2) [n:127.0.0.1:42958_solr    ] o.a.s.m.r.SolrJmxReporter JMX monitoring for 'solr_42958.solr.node' (registry 'solr.node') enabled at server: com.sun.jmx.mbeanserver.JmxMBeanServer@67f8fd28
   [junit4]   2> 1790263 INFO  (jetty-launcher-5427-thread-2) [n:127.0.0.1:42958_solr    ] o.a.s.m.r.SolrJmxReporter JMX monitoring for 'solr_42958.solr.jvm' (registry 'solr.jvm') enabled at server: com.sun.jmx.mbeanserver.JmxMBeanServer@67f8fd28
   [junit4]   2> 1790263 INFO  (jetty-launcher-5427-thread-1) [n:127.0.0.1:38776_solr    ] o.a.s.m.r.SolrJmxReporter JMX monitoring for 'solr_38776.solr.node' (registry 'solr.node') enabled at server: com.sun.jmx.mbeanserver.JmxMBeanServer@67f8fd28
   [junit4]   2> 1790264 INFO  (jetty-launcher-5427-thread-2) [n:127.0.0.1:42958_solr    ] o.a.s.m.r.SolrJmxReporter JMX monitoring for 'solr_42958.solr.jetty' (registry 'solr.jetty') enabled at server: com.sun.jmx.mbeanserver.JmxMBeanServer@67f8fd28
   [junit4]   2> 1790265 INFO  (jetty-launcher-5427-thread-2) [n:127.0.0.1:42958_solr    ] o.a.s.c.CorePropertiesLocator Found 0 core definitions underneath /export/home/jenkins/workspace/Lucene-Solr-master-Solaris/solr/build/solr-core/test/J1/temp/solr.cloud.LeaderTragicEventTest_353ADAD86D49C7EC-001/tempDir-001/node1/.
   [junit4]   2> 1790272 INFO  (jetty-launcher-5427-thread-1) [n:127.0.0.1:38776_solr    ] o.a.s.m.r.SolrJmxReporter JMX monitoring for 'solr_38776.solr.jvm' (registry 'solr.jvm') enabled at server: com.sun.jmx.mbeanserver.JmxMBeanServer@67f8fd28
   [junit4]   2> 1790272 INFO  (jetty-launcher-5427-thread-1) [n:127.0.0.1:38776_solr    ] o.a.s.m.r.SolrJmxReporter JMX monitoring for 'solr_38776.solr.jetty' (registry 'solr.jetty') enabled at server: com.sun.jmx.mbeanserver.JmxMBeanServer@67f8fd28
   [junit4]   2> 1790274 INFO  (jetty-launcher-5427-thread-1) [n:127.0.0.1:38776_solr    ] o.a.s.c.CorePropertiesLocator Found 0 core definitions underneath /export/home/jenkins/workspace/Lucene-Solr-master-Solaris/solr/build/solr-core/test/J1/temp/solr.cloud.LeaderTragicEventTest_353ADAD86D49C7EC-001/tempDir-001/node2/.
   [junit4]   2> 1790305 INFO  (zkConnectionManagerCallback-5464-thread-1) [    ] o.a.s.c.c.ConnectionManager zkClient has connected
   [junit4]   2> 1790310 INFO  (zkConnectionManagerCallback-5469-thread-1) [    ] o.a.s.c.c.ConnectionManager zkClient has connected
   [junit4]   2> 1790313 INFO  (SUITE-LeaderTragicEventTest-seed#[353ADAD86D49C7EC]-worker) [    ] o.a.s.c.c.ZkStateReader Updated live nodes from ZooKeeper... (0) -> (2)
   [junit4]   2> 1790314 INFO  (SUITE-LeaderTragicEventTest-seed#[353ADAD86D49C7EC]-worker) [    ] o.a.s.c.s.i.ZkClientClusterStateProvider Cluster at 127.0.0.1:39221/solr ready
   [junit4]   2> 1790358 INFO  (qtp256804224-17563) [n:127.0.0.1:42958_solr    ] o.a.s.h.a.CollectionsHandler Invoked Collection Action :create with params collection.configName=config&name=collection1&nrtReplicas=2&action=CREATE&numShards=1&wt=javabin&version=2 and sendToOCPQueue=true
   [junit4]   2> 1790366 INFO  (OverseerThreadFactory-6104-thread-1) [    ] o.a.s.c.a.c.CreateCollectionCmd Create collection collection1
   [junit4]   2> 1790482 INFO  (OverseerStateUpdate-72499650294906884-127.0.0.1:42958_solr-n_0000000000) [    ] o.a.s.c.o.SliceMutator createReplica() {
   [junit4]   2>   "operation":"ADDREPLICA",
   [junit4]   2>   "collection":"collection1",
   [junit4]   2>   "shard":"shard1",
   [junit4]   2>   "core":"collection1_shard1_replica_n1",
   [junit4]   2>   "state":"down",
   [junit4]   2>   "base_url":"http://127.0.0.1:42958/solr",
   [junit4]   2>   "type":"NRT",
   [junit4]   2>   "waitForFinalState":"false"} 
   [junit4]   2> 1790486 INFO  (OverseerStateUpdate-72499650294906884-127.0.0.1:42958_solr-n_0000000000) [    ] o.a.s.c.o.SliceMutator createReplica() {
   [junit4]   2>   "operation":"ADDREPLICA",
   [junit4]   2>   "collection":"collection1",
   [junit4]   2>   "shard":"shard1",
   [junit4]   2>   "core":"collection1_shard1_replica_n2",
   [junit4]   2>   "state":"down",
   [junit4]   2>   "base_url":"http://127.0.0.1:38776/solr",
   [junit4]   2>   "type":"NRT",
   [junit4]   2>   "waitForFinalState":"false"} 
   [junit4]   2> 1790692 INFO  (qtp256804224-17553) [n:127.0.0.1:42958_solr    x:collection1_shard1_replica_n1] o.a.s.h.a.CoreAdminOperation core create command qt=/admin/cores&coreNodeName=core_node3&collection.configName=config&newCollection=true&name=collection1_shard1_replica_n1&action=CREATE&numShards=1&collection=collection1&shard=shard1&wt=javabin&version=2&replicaType=NRT
   [junit4]   2> 1790692 INFO  (qtp256804224-17553) [n:127.0.0.1:42958_solr    x:collection1_shard1_replica_n1] o.a.s.c.TransientSolrCoreCacheDefault Allocating transient cache for 2147483647 transient cores
   [junit4]   2> 1790693 INFO  (qtp1016615454-17558) [n:127.0.0.1:38776_solr    x:collection1_shard1_replica_n2] o.a.s.h.a.CoreAdminOperation core create command qt=/admin/cores&coreNodeName=core_node4&collection.configName=config&newCollection=true&name=collection1_shard1_replica_n2&action=CREATE&numShards=1&collection=collection1&shard=shard1&wt=javabin&version=2&replicaType=NRT
   [junit4]   2> 1791747 INFO  (qtp256804224-17553) [n:127.0.0.1:42958_solr c:collection1 s:shard1 r:core_node3 x:collection1_shard1_replica_n1] o.a.s.c.SolrConfig Using Lucene MatchVersion: 8.0.0
   [junit4]   2> 1791747 INFO  (qtp1016615454-17558) [n:127.0.0.1:38776_solr c:collection1 s:shard1 r:core_node4 x:collection1_shard1_replica_n2] o.a.s.c.SolrConfig Using Lucene MatchVersion: 8.0.0
   [junit4]   2> 1791756 INFO  (qtp1016615454-17558) [n:127.0.0.1:38776_solr c:collection1 s:shard1 r:core_node4 x:collection1_shard1_replica_n2] o.a.s.s.IndexSchema [collection1_shard1_replica_n2] Schema name=minimal
   [junit4]   2> 1791756 INFO  (qtp256804224-17553) [n:127.0.0.1:42958_solr c:collection1 s:shard1 r:core_node3 x:collection1_shard1_replica_n1] o.a.s.s.IndexSchema [collection1_shard1_replica_n1] Schema name=minimal
   [junit4]   2> 1791759 INFO  (qtp1016615454-17558) [n:127.0.0.1:38776_solr c:collection1 s:shard1 r:core_node4 x:collection1_shard1_replica_n2] o.a.s.s.IndexSchema Loaded schema minimal/1.1 with uniqueid field id
   [junit4]   2> 1791759 INFO  (qtp1016615454-17558) [n:127.0.0.1:38776_solr c:collection1 s:shard1 r:core_node4 x:collection1_shard1_replica_n2] o.a.s.c.CoreContainer Creating SolrCore 'collection1_shard1_replica_n2' using configuration from collection collection1, trusted=true
   [junit4]   2> 1791759 INFO  (qtp256804224-17553) [n:127.0.0.1:42958_solr c:collection1 s:shard1 r:core_node3 x:collection1_shard1_replica_n1] o.a.s.s.IndexSchema Loaded schema minimal/1.1 with uniqueid field id
   [junit4]   2> 1791759 INFO  (qtp256804224-17553) [n:127.0.0.1:42958_solr c:collection1 s:shard1 r:core_node3 x:collection1_shard1_replica_n1] o.a.s.c.CoreContainer Creating SolrCore 'collection1_shard1_replica_n1' using configuration from collection collection1, trusted=true
   [junit4]   2> 1791759 INFO  (qtp1016615454-17558) [n:127.0.0.1:38776_solr c:collection1 s:shard1 r:core_node4 x:collection1_shard1_replica_n2] o.a.s.m.r.SolrJmxReporter JMX monitoring for 'solr_38776.solr.core.collection1.shard1.replica_n2' (registry 'solr.core.collection1.shard1.replica_n2') enabled at server: com.sun.jmx.mbeanserver.JmxMBeanServer@67f8fd28
   [junit4]   2> 1791759 INFO  (qtp1016615454-17558) [n:127.0.0.1:38776_solr c:collection1 s:shard1 r:core_node4 x:collection1_shard1_replica_n2] o.a.s.c.SolrCore solr.RecoveryStrategy.Builder
   [junit4]   2> 1791759 INFO  (qtp256804224-17553) [n:127.0.0.1:42958_solr c:collection1 s:shard1 r:core_node3 x:collection1_shard1_replica_n1] o.a.s.m.r.SolrJmxReporter JMX monitoring for 'solr_42958.solr.core.collection1.shard1.replica_n1' (registry 'solr.core.collection1.shard1.replica_n1') enabled at server: com.sun.jmx.mbeanserver.JmxMBeanServer@67f8fd28
   [junit4]   2> 1791759 INFO  (qtp1016615454-17558) [n:127.0.0.1:38776_solr c:collection1 s:shard1 r:core_node4 x:collection1_shard1_replica_n2] o.a.s.c.SolrCore [[collection1_shard1_replica_n2] ] Opening new SolrCore at [/export/home/jenkins/workspace/Lucene-Solr-master-Solaris/solr/build/solr-core/test/J1/temp/solr.cloud.LeaderTragicEventTest_353ADAD86D49C7EC-001/tempDir-001/node2/collection1_shard1_replica_n2], dataDir=[/export/home/jenkins/workspace/Lucene-Solr-master-Solaris/solr/build/solr-core/test/J1/temp/solr.cloud.LeaderTragicEventTest_353ADAD86D49C7EC-001/tempDir-001/node2/./collection1_shard1_replica_n2/data/]
   [junit4]   2> 1791759 INFO  (qtp256804224-17553) [n:127.0.0.1:42958_solr c:collection1 s:shard1 r:core_node3 x:collection1_shard1_replica_n1] o.a.s.c.SolrCore solr.RecoveryStrategy.Builder
   [junit4]   2> 1791760 INFO  (qtp256804224-17553) [n:127.0.0.1:42958_solr c:collection1 s:shard1 r:core_node3 x:collection1_shard1_replica_n1] o.a.s.c.SolrCore [[collection1_shard1_replica_n1] ] Opening new SolrCore at [/export/home/jenkins/workspace/Lucene-Solr-master-Solaris/solr/build/solr-core/test/J1/temp/solr.cloud.LeaderTragicEventTest_353ADAD86D49C7EC-001/tempDir-001/node1/collection1_shard1_replica_n1], dataDir=[/export/home/jenkins/workspace/Lucene-Solr-master-Solaris/solr/build/solr-core/test/J1/temp/solr.cloud.LeaderTragicEventTest_353ADAD86D49C7EC-001/tempDir-001/node1/./collection1_shard1_replica_n1/data/]
   [junit4]   2> 1791828 INFO  (qtp1016615454-17558) [n:127.0.0.1:38776_solr c:collection1 s:shard1 r:core_node4 x:collection1_shard1_replica_n2] o.a.s.u.UpdateHandler Using UpdateLog implementation: org.apache.solr.update.UpdateLog
   [junit4]   2> 1791828 INFO  (qtp1016615454-17558) [n:127.0.0.1:38776_solr c:collection1 s:shard1 r:core_node4 x:collection1_shard1_replica_n2] o.a.s.u.UpdateLog Initializing UpdateLog: dataDir=null defaultSyncLevel=FLUSH numRecordsToKeep=100 maxNumLogsToKeep=10 numVersionBuckets=65536
   [junit4]   2> 1791830 INFO  (qtp1016615454-17558) [n:127.0.0.1:38776_solr c:collection1 s:shard1 r:core_node4 x:collection1_shard1_replica_n2] o.a.s.u.CommitTracker Hard AutoCommit: disabled
   [junit4]   2> 1791830 INFO  (qtp1016615454-17558) [n:127.0.0.1:38776_solr c:collection1 s:shard1 r:core_node4 x:collection1_shard1_replica_n2] o.a.s.u.CommitTracker Soft AutoCommit: disabled
   [junit4]   2> 1791831 INFO  (qtp1016615454-17558) [n:127.0.0.1:38776_solr c:collection1 s:shard1 r:core_node4 x:collection1_shard1_replica_n2] o.a.s.s.SolrIndexSearcher Opening [Searcher@1cb6a225[collection1_shard1_replica_n2] main]
   [junit4]   2> 1791835 INFO  (qtp256804224-17553) [n:127.0.0.1:42958_solr c:collection1 s:shard1 r:core_node3 x:collection1_shard1_replica_n1] o.a.s.u.UpdateHandler Using UpdateLog implementation: org.apache.solr.update.UpdateLog
   [junit4]   2> 1791835 INFO  (qtp256804224-17553) [n:127.0.0.1:42958_solr c:collection1 s:shard1 r:core_node3 x:collection1_shard1_replica_n1] o.a.s.u.UpdateLog Initializing UpdateLog: dataDir=null defaultSyncLevel=FLUSH numRecordsToKeep=100 maxNumLogsToKeep=10 numVersionBuckets=65536
   [junit4]   2> 1791836 INFO  (qtp256804224-17553) [n:127.0.0.1:42958_solr c:collection1 s:shard1 r:core_node3 x:collection1_shard1_replica_n1] o.a.s.u.CommitTracker Hard AutoCommit: disabled
   [junit4]   2> 1791836 INFO  (qtp256804224-17553) [n:127.0.0.1:42958_solr c:collection1 s:shard1 r:core_node3 x:collection1_shard1_replica_n1] o.a.s.u.CommitTracker Soft AutoCommit: disabled
   [junit4]   2> 1791837 INFO  (qtp1016615454-17558) [n:127.0.0.1:38776_solr c:collection1 s:shard1 r:core_node4 x:collection1_shard1_replica_n2] o.a.s.r.ManagedResourceStorage Configured ZooKeeperStorageIO with znodeBase: /configs/config
   [junit4]   2> 1791837 INFO  (qtp256804224-17553) [n:127.0.0.1:42958_solr c:collection1 s:shard1 r:core_node3 x:collection1_shard1_replica_n1] o.a.s.s.SolrIndexSearcher Opening [Searcher@261acac[collection1_shard1_replica_n1] main]
   [junit4]   2> 1791842 INFO  (qtp1016615454-17558) [n:127.0.0.1:38776_solr c:collection1 s:shard1 r:core_node4 x:collection1_shard1_replica_n2] o.a.s.r.ManagedResourceStorage Loaded null at path _rest_managed.json using ZooKeeperStorageIO:path=/configs/config
   [junit4]   2> 1791843 INFO  (qtp1016615454-17558) [n:127.0.0.1:38776_solr c:collection1 s:shard1 r:core_node4 x:collection1_shard1_replica_n2] o.a.s.h.ReplicationHandler Commits will be reserved for 10000ms.
   [junit4]   2> 1791843 INFO  (qtp1016615454-17558) [n:127.0.0.1:38776_solr c:collection1 s:shard1 r:core_node4 x:collection1_shard1_replica_n2] o.a.s.u.UpdateLog Could not find max version in index or recent updates, using new clock 1605869485039812608
   [junit4]   2> 1791844 INFO  (qtp256804224-17553) [n:127.0.0.1:42958_solr c:collection1 s:shard1 r:core_node3 x:collection1_shard1_replica_n1] o.a.s.r.ManagedResourceStorage Configured ZooKeeperStorageIO with znodeBase: /configs/config
   [junit4]   2> 1791844 INFO  (searcherExecutor-6113-thread-1-processing-n:127.0.0.1:38776_solr x:collection1_shard1_replica_n2 c:collection1 s:shard1 r:core_node4) [n:127.0.0.1:38776_solr c:collection1 s:shard1 r:core_node4 x:collection1_shard1_replica_n2] o.a.s.c.SolrCore [collection1_shard1_replica_n2] Registered new searcher Searcher@1cb6a225[collection1_shard1_replica_n2] main{ExitableDirectoryReader(UninvertingDirectoryReader())}
   [junit4]   2> 1791846 INFO  (qtp256804224-17553) [n:127.0.0.1:42958_solr c:collection1 s:shard1 r:core_node3 x:collection1_shard1_replica_n1] o.a.s.r.ManagedResourceStorage Loaded null at path _rest_managed.json using ZooKeeperStorageIO:path=/configs/config
   [junit4]   2> 1791846 INFO  (qtp256804224-17553) [n:127.0.0.1:42958_solr c:collection1 s:shard1 r:core_node3 x:collection1_shard1_replica_n1] o.a.s.h.ReplicationHandler Commits will be reserved for 10000ms.
   [junit4]   2> 1791847 INFO  (qtp256804224-17553) [n:127.0.0.1:42958_solr c:collection1 s:shard1 r:core_node3 x:collection1_shard1_replica_n1] o.a.s.u.UpdateLog Could not find max version in index or recent updates, using new clock 1605869485044006912
   [junit4]   2> 1791869 INFO  (searcherExecutor-6114-thread-1-processing-n:127.0.0.1:42958_solr x:collection1_shard1_replica_n1 c:collection1 s:shard1 r:core_node3) [n:127.0.0.1:42958_solr c:collection1 s:shard1 r:core_node3 x:collection1_shard1_replica_n1] o.a.s.c.SolrCore [collection1_shard1_replica_n1] Registered new searcher Searcher@261acac[collection1_shard1_replica_n1] main{ExitableDirectoryReader(UninvertingDirectoryReader())}
   [junit4]   2> 1791877 INFO  (qtp1016615454-17558) [n:127.0.0.1:38776_solr c:collection1 s:shard1 r:core_node4 x:collection1_shard1_replica_n2] o.a.s.c.ZkShardTerms Successful update of terms at /collections/collection1/terms/shard1 to Terms{values={core_node4=0}, version=0}
   [junit4]   2> 1791877 INFO  (qtp256804224-17553) [n:127.0.0.1:42958_solr c:collection1 s:shard1 r:core_node3 x:collection1_shard1_replica_n1] o.a.s.c.ZkShardTerms Failed to save terms, version is not a match, retrying
   [junit4]   2> 1791878 INFO  (qtp256804224-17553) [n:127.0.0.1:42958_solr c:collection1 s:shard1 r:core_node3 x:collection1_shard1_replica_n1] o.a.s.c.ZkShardTerms Successful update of terms at /collections/collection1/terms/shard1 to Terms{values={core_node3=0, core_node4=0}, version=1}
   [junit4]   2> 1791885 INFO  (qtp1016615454-17558) [n:127.0.0.1:38776_solr c:collection1 s:shard1 r:core_node4 x:collection1_shard1_replica_n2] o.a.s.c.ShardLeaderElectionContext Enough replicas found to continue.
   [junit4]   2> 1791885 INFO  (qtp1016615454-17558) [n:127.0.0.1:38776_solr c:collection1 s:shard1 r:core_node4 x:collection1_shard1_replica_n2] o.a.s.c.ShardLeaderElectionContext I may be the new leader - try and sync
   [junit4]   2> 1791885 INFO  (qtp1016615454-17558) [n:127.0.0.1:38776_solr c:collection1 s:shard1 r:core_node4 x:collection1_shard1_replica_n2] o.a.s.c.SyncStrategy Sync replicas to http://127.0.0.1:38776/solr/collection1_shard1_replica_n2/
   [junit4]   2> 1791886 INFO  (qtp1016615454-17558) [n:127.0.0.1:38776_solr c:collection1 s:shard1 r:core_node4 x:collection1_shard1_replica_n2] o.a.s.u.PeerSync PeerSync: core=collection1_shard1_replica_n2 url=http://127.0.0.1:38776/solr START replicas=[http://127.0.0.1:42958/solr/collection1_shard1_replica_n1/] nUpdates=100
   [junit4]   2> 1791886 INFO  (qtp1016615454-17558) [n:127.0.0.1:38776_solr c:collection1 s:shard1 r:core_node4 x:collection1_shard1_replica_n2] o.a.s.u.PeerSync PeerSync: core=collection1_shard1_replica_n2 url=http://127.0.0.1:38776/solr DONE.  We have no versions.  sync failed.
   [junit4]   2> 1791889 INFO  (qtp256804224-17562) [n:127.0.0.1:42958_solr c:collection1 s:shard1 r:core_node3 x:collection1_shard1_replica_n1] o.a.s.c.S.Request [collection1_shard1_replica_n1]  webapp=/solr path=/get params={distrib=false&qt=/get&fingerprint=false&getVersions=100&wt=javabin&version=2} status=0 QTime=0
   [junit4]   2> 1791889 INFO  (qtp1016615454-17558) [n:127.0.0.1:38776_solr c:collection1 s:shard1 r:core_node4 x:collection1_shard1_replica_n2] o.a.s.c.SyncStrategy Leader's attempt to sync with shard failed, moving to the next candidate
   [junit4]   2> 1791890 INFO  (qtp1016615454-17558) [n:127.0.0.1:38776_solr c:collection1 s:shard1 r:core_node4 x:collection1_shard1_replica_n2] o.a.s.c.ShardLeaderElectionContext We failed sync, but we have no versions - we can't sync in that case - we were active before, so become leader anyway
   [junit4]   2> 1791890 INFO  (qtp1016615454-17558) [n:127.0.0.1:38776_solr c:collection1 s:shard1 r:core_node4 x:collection1_shard1_replica_n2] o.a.s.c.ShardLeaderElectionContext Found all replicas participating in election, clear LIR
   [junit4]   2> 1791898 INFO  (qtp1016615454-17558) [n:127.0.0.1:38776_solr c:collection1 s:shard1 r:core_node4 x:collection1_shard1_replica_n2] o.a.s.c.ShardLeaderElectionContext I am the new leader: http://127.0.0.1:38776/solr/collection1_shard1_replica_n2/ shard1
   [junit4]   2> 1792003 INFO  (qtp1016615454-17558) [n:127.0.0.1:38776_solr c:collection1 s:shard1 r:core_node4 x:collection1_shard1_replica_n2] o.a.s.c.ZkController I am the leader, no recovery necessary
   [junit4]   2> 1792007 INFO  (qtp1016615454-17558) [n:127.0.0.1:38776_solr c:collection1 s:shard1 r:core_node4 x:collection1_shard1_replica_n2] o.a.s.s.HttpSolrCall [admin] webapp=null path=/admin/cores params={qt=/admin/cores&coreNodeName=core_node4&collection.configName=config&newCollection=true&name=collection1_shard1_replica_n2&action=CREATE&numShards=1&collection=collection1&shard=shard1&wt=javabin&version=2&replicaType=NRT} status=0 QTime=1315
   [junit4]   2> 1792109 INFO  (zkCallback-5447-thread-1) [    ] o.a.s.c.c.ZkStateReader A cluster state change: [WatchedEvent state:SyncConnected type:NodeDataChanged path:/collections/collection1/state.json] for collection [collection1] has occurred - updating... (live nodes size: [2])
   [junit4]   2> 1792893 INFO  (qtp256804224-17553) [n:127.0.0.1:42958_solr c:collection1 s:shard1 r:core_node3 x:collection1_shard1_replica_n1] o.a.s.s.HttpSolrCall [admin] webapp=null path=/admin/cores params={qt=/admin/cores&coreNodeName=core_node3&collection.configName=config&newCollection=true&name=collection1_shard1_replica_n1&action=CREATE&numShards=1&collection=collection1&shard=shard1&wt=javabin&version=2&replicaType=NRT} status=0 QTime=2204
   [junit4]   2> 1792899 INFO  (qtp256804224-17563) [n:127.0.0.1:42958_solr    ] o.a.s.h.a.CollectionsHandler Wait for new collection to be active for at most 30 seconds. Check all shard replicas
   [junit4]   2> 1792993 INFO  (zkCallback-5447-thread-1) [    ] o.a.s.c.c.ZkStateReader A cluster state change: [WatchedEvent state:SyncConnected type:NodeDataChanged path:/collections/collection1/state.json] for collection [collection1] has occurred - updating... (live nodes size: [2])
   [junit4]   2> 1792993 INFO  (zkCallback-5439-thread-2) [    ] o.a.s.c.c.ZkStateReader A cluster state change: [WatchedEvent state:SyncConnected type:NodeDataChanged path:/collections/collection1/state.json] for collection [collection1] has occurred - updating... (live nodes size: [2])
   [junit4]   2> 1793906 INFO  (qtp256804224-17563) [n:127.0.0.1:42958_solr    ] o.a.s.s.HttpSolrCall [admin] webapp=null path=/admin/collections params={collection.configName=config&name=collection1&nrtReplicas=2&action=CREATE&numShards=1&wt=javabin&version=2} status=0 QTime=3550
   [junit4]   2> 1793917 INFO  (qtp1016615454-17552) [n:127.0.0.1:38776_solr c:collection1 s:shard1 r:core_node4 x:collection1_shard1_replica_n2] o.a.s.c.ZkShardTerms Successful update of terms at /collections/collection1/terms/shard1 to Terms{values={core_node3=1, core_node4=1}, version=2}
   [junit4]   2> 1793918 INFO  (qtp256804224-17555) [n:127.0.0.1:42958_solr c:collection1 s:shard1 r:core_node3 x:collection1_shard1_replica_n1] o.a.s.u.p.LogUpdateProcessorFactory [collection1_shard1_replica_n1]  webapp=/solr path=/update params={update.distrib=FROMLEADER&distrib.from=http://127.0.0.1:38776/solr/collection1_shard1_replica_n2/&wt=javabin&version=2}{add=[0 (1605869487210364928)]} 0 1
   [junit4]   2> 1793918 INFO  (qtp1016615454-17552) [n:127.0.0.1:38776_solr c:collection1 s:shard1 r:core_node4 x:collection1_shard1_replica_n2] o.a.s.u.p.LogUpdateProcessorFactory [collection1_shard1_replica_n2]  webapp=/solr path=/update params={wt=javabin&version=2}{add=[0 (1605869487210364928)]} 0 7
   [junit4]   2> 1793920 INFO  (qtp256804224-17562) [n:127.0.0.1:42958_solr c:collection1 s:shard1 r:core_node3 x:collection1_shard1_replica_n1] o.a.s.u.DirectUpdateHandler2 start commit{_version_=1605869487217704960,optimize=false,openSearcher=true,waitSearcher=true,expungeDeletes=false,softCommit=false,prepareCommit=false}
   [junit4]   2> 1793920 INFO  (qtp256804224-17562) [n:127.0.0.1:42958_solr c:collection1 s:shard1 r:core_node3 x:collection1_shard1_replica_n1] o.a.s.u.SolrIndexWriter Calling setCommitData with IW:org.apache.solr.update.SolrIndexWriter@5277a29f commitCommandVersion:1605869487217704960
   [junit4]   2> 1793924 INFO  (qtp1016615454-17567) [n:127.0.0.1:38776_solr c:collection1 s:shard1 r:core_node4 x:collection1_shard1_replica_n2] o.a.s.u.DirectUpdateHandler2 start commit{_version_=1605869487221899264,optimize=false,openSearcher=true,waitSearcher=true,expungeDeletes=false,softCommit=false,prepareCommit=false}
   [junit4]   2> 1793924 INFO  (qtp1016615454-17567) [n:127.0.0.1:38776_solr c:collection1 s:shard1 r:core_node4 x:collection1_shard1_replica_n2] o.a.s.u.SolrIndexWriter Calling setCommitData with IW:org.apache.solr.update.SolrIndexWriter@5e31b01 commitCommandVersion:1605869487221899264
   [junit4]   2> 1793924 INFO  (qtp256804224-17562) [n:127.0.0.1:42958_solr c:collection1 s:shard1 r:core_node3 x:collection1_shard1_replica_n1] o.a.s.s.SolrIndexSearcher Opening [Searcher@fd6cf94[collection1_shard1_replica_n1] main]
   [junit4]   2> 1793924 INFO  (qtp256804224-17562) [n:127.0.0.1:42958_solr c:collection1 s:shard1 r:core_node3 x:collection1_shard1_replica_n1] o.a.s.u.DirectUpdateHandler2 end_commit_flush
   [junit4]   2> 1793927 INFO  (searcherExecutor-6114-thread-1-processing-n:127.0.0.1:42958_solr x:collection1_shard1_replica_n1 c:collection1 s:shard1 r:core_node3) [n:127.0.0.1:42958_solr c:collection1 s:shard1 r:core_node3 x:collection1_shard1_replica_n1] o.a.s.c.SolrCore [collection1_shard1_replica_n1] Registered new searcher Searcher@fd6cf94[collection1_shard1_replica_n1] main{ExitableDirectoryReader(UninvertingDirectoryReader(Uninverting(_0(8.0.0):C1)))}
   [junit4]   2> 1793927 INFO  (qtp256804224-17562) [n:127.0.0.1:42958_solr c:collection1 s:shard1 r:core_node3 x:collection1_shard1_replica_n1] o.a.s.u.p.LogUpdateProcessorFactory [collection1_shard1_replica_n1]  webapp=/solr path=/update params={update.distrib=FROMLEADER&waitSearcher=true&openSearcher=true&commit=true&softCommit=false&distrib.from=http://127.0.0.1:38776/solr/collection1_shard1_replica_n2/&commit_end_point=true&wt=javabin&version=2&expungeDeletes=false}{commit=} 0 7
   [junit4]   2> 1793928 INFO  (qtp1016615454-17567) [n:127.0.0.1:38776_solr c:collection1 s:shard1 r:core_node4 x:collection1_shard1_replica_n2] o.a.s.s.SolrIndexSearcher Opening [Searcher@3a73de1[collection1_shard1_replica_n2] main]
   [junit4]   2> 1793928 INFO  (qtp1016615454-17567) [n:127.0.0.1:38776_solr c:collection1 s:shard1 r:core_node4 x:collection1_shard1_replica_n2] o.a.s.u.DirectUpdateHandler2 end_commit_flush
   [junit4]   2> 1793929 INFO  (searcherExecutor-6113-thread-1-processing-n:127.0.0.1:38776_solr x:collection1_shard1_replica_n2 c:collection1 s:shard1 r:core_node4) [n:127.0.0.1:38776_solr c:collection1 s:shard1 r:core_node4 x:collection1_shard1_replica_n2] o.a.s.c.SolrCore [collection1_shard1_replica_n2] Registered new searcher Searcher@3a73de1[collection1_shard1_replica_n2] main{ExitableDirectoryReader(UninvertingDirectoryReader(Uninverting(_0(8.0.0):C1)))}
   [junit4]   2> 1793929 INFO  (qtp1016615454-17567) [n:127.0.0.1:38776_solr c:collection1 s:shard1 r:core_node4 x:collection1_shard1_replica_n2] o.a.s.u.p.LogUpdateProcessorFactory [collection1_shard1_replica_n2]  webapp=/solr path=/update params={update.distrib=FROMLEADER&waitSearcher=true&openSearcher=true&commit=true&softCommit=false&distrib.from=http://127.0.0.1:38776/solr/collection1_shard1_replica_n2/&commit_end_point=true&wt=javabin&version=2&expungeDeletes=false}{commit=} 0 5
   [junit4]   2> 1793929 INFO  (qtp1016615454-17557) [n:127.0.0.1:38776_solr c:collection1 s:shard1 r:core_node4 x:collection1_shard1_replica_n2] o.a.s.u.p.LogUpdateProcessorFactory [collection1_shard1_replica_n2]  webapp=/solr path=/update params={waitSearcher=true&commit=true&softCommit=false&wt=javabin&version=2}{commit=} 0 10
   [junit4]   2> 1793934 INFO  (qtp256804224-17555) [n:127.0.0.1:42958_solr c:collection1 s:shard1 r:core_node3 x:collection1_shard1_replica_n1] o.a.s.u.p.LogUpdateProcessorFactory [collection1_shard1_replica_n1]  webapp=/solr path=/update params={update.distrib=FROMLEADER&distrib.from=http://127.0.0.1:38776/solr/collection1_shard1_replica_n2/&wt=javabin&version=2}{add=[1 (1605869487229239296)]} 0 0
   [junit4]   2> 1793934 INFO  (qtp1016615454-17566) [n:127.0.0.1:38776_solr c:collection1 s:shard1 r:core_node4 x:collection1_shard1_replica_n2] o.a.s.u.p.LogUpdateProcessorFactory [collection1_shard1_replica_n2]  webapp=/solr path=/update params={wt=javabin&version=2}{add=[1 (1605869487229239296)]} 0 3
   [junit4]   2> 1793936 INFO  (qtp1016615454-17566) [n:127.0.0.1:38776_solr c:collection1 s:shard1 r:core_node4 x:collection1_shard1_replica_n2] o.a.s.u.DirectUpdateHandler2 start commit{_version_=1605869487234482176,optimize=false,openSearcher=true,waitSearcher=true,expungeDeletes=false,softCommit=false,prepareCommit=false}
   [junit4]   2> 1793936 INFO  (qtp256804224-17562) [n:127.0.0.1:42958_solr c:collection1 s:shard1 r:core_node3 x:collection1_shard1_replica_n1] o.a.s.u.DirectUpdateHandler2 start commit{_version_=1605869487234482176,optimize=false,openSearcher=true,waitSearcher=true,expungeDeletes=false,softCommit=false,prepareCommit=false}
   [junit4]   2> 1793936 INFO  (qtp256804224-17562) [n:127.0.0.1:42958_solr c:collection1 s:shard1 r:core_node3 x:collection1_shard1_replica_n1] o.a.s.u.SolrIndexWriter Calling setCommitData with IW:org.apache.solr.update.SolrIndexWriter@5277a29f commitCommandVersion:1605869487234482176
   [junit4]   2> 1793937 INFO  (qtp1016615454-17566) [n:127.0.0.1:38776_solr c:collection1 s:shard1 r:core_node4 x:collection1_shard1_replica_n2] o.a.s.u.SolrIndexWriter Calling setCommitData with IW:org.apache.solr.update.SolrIndexWriter@5e31b01 commitCommandVersion:1605869487234482176
   [junit4]   2> 1793938 INFO  (qtp1016615454-17566) [n:127.0.0.1:38776_solr c:collection1 s:shard1 r:core_node4 x:collection1_shard1_replica_n2] o.a.s.s.SolrIndexSearcher Opening [Searcher@43db83bc[collection1_shard1_replica_n2] main]
   [junit4]   2> 1793938 INFO  (qtp256804224-17562) [n:127.0.0.1:42958_solr c:collection1 s:shard1 r:core_node3 x:collection1_shard1_replica_n1] o.a.s.s.SolrIndexSearcher Opening [Searcher@101a4083[collection1_shard1_replica_n1] main]
   [junit4]   2> 1793939 INFO  (qtp1016615454-17566) [n:127.0.0.1:38776_solr c:collection1 s:shard1 r:core_node4 x:collection1_shard1_replica_n2] o.a.s.u.DirectUpdateHandler2 end_commit_flush
   [junit4]   2> 1793939 INFO  (qtp256804224-17562) [n:127.0.0.1:42958_solr c:collection1 s:shard1 r:core_node3 x:collection1_shard1_replica_n1] o.a.s.u.DirectUpdateHandler2 end_commit_flush
   [junit4]   2> 1793940 INFO  (searcherExecutor-6113-thread-1-processing-n:127.0.0.1:38776_solr x:collection1_shard1_replica_n2 c:collection1 s:shard1 r:core_node4) [n:127.0.0.1:38776_solr c:collection1 s:shard1 r:core_node4 x:collection1_shard1_replica_n2] o.a.s.c.SolrCore [collection1_shard1_replica_n2] Registered new searcher Searcher@43db83bc[collection1_shard1_replica_n2] main{ExitableDirectoryReader(UninvertingDirectoryReader(Uninverting(_0(8.0.0):C1) Uninverting(_1(8.0.0):C1)))}
   [junit4]   2> 1793940 INFO  (qtp1016615454-17566) [n:127.0.0.1:38776_solr c:collection1 s:shard1 r:core_node4 x:collection1_shard1_replica_n2] o.a.s.u.p.LogUpdateProcessorFactory [collection1_shard1_replica_n2]  webapp=/solr path=/update params={update.distrib=FROMLEADER&waitSearcher=true&openSearcher=true&commit=true&softCommit=false&distrib.from=http://127.0.0.1:38776/solr/collection1_shard1_replica_n2/&commit_end_point=true&wt=javabin&version=2&expungeDeletes=false}{commit=} 0 4
   [junit4]   2> 1793940 INFO  (searcherExecutor-6114-thread-1-processing-n:127.0.0.1:42958_solr x:collection1_shard1_replica_n1 c:collection1 s:shard1 r:core_node3) [n:127.0.0.1:42958_solr c:collection1 s:shard1 r:core_node3 x:collection1_shard1_replica_n1] o.a.s.c.SolrCore [collection1_shard1_replica_n1] Registered new searcher Searcher@101a4083[collection1_shard1_replica_n1] main{ExitableDirectoryReader(UninvertingDirectoryReader(Uninverting(_0(8.0.0):C1) Uninverting(_1(8.0.0):C1)))}
   [junit4]   2> 1793940 INFO  (qtp256804224-17562) [n:127.0.0.1:42958_solr c:collection1 s:shard1 r:core_node3 x:collection1_shard1_replica_n1] o.a.s.u.p.LogUpdateProcessorFactory [collection1_shard1_replica_n1]  webapp=/solr path=/update params={update.distrib=FROMLEADER&waitSearcher=true&openSearcher=true&commit=true&softCommit=false&distrib.from=http://127.0.0.1:38776/solr/collection1_shard1_replica_n2/&commit_end_point=true&wt=javabin&version=2&expungeDeletes=false}{commit=} 0 4
   [junit4]   2> 1793941 INFO  (qtp1016615454-17557) [n:127.0.0.1:38776_solr c:collection1 s:shard1 r:core_node4 x:collection1_shard1_replica_n2] o.a.s.u.p.LogUpdateProcessorFactory [collection1_shard1_replica_n2]  webapp=/solr path=/update params={waitSearcher=true&commit=true&softCommit=false&wt=javabin&version=2}{commit=} 0 5
   [junit4]   2> 1793944 INFO  (qtp256804224-17555) [n:127.0.0.1:42958_solr c:collection1 s:shard1 r:core_node3 x:collection1_shard1_replica_n1] o.a.s.u.p.LogUpdateProcessorFactory [collection1_shard1_replica_n1]  webapp=/solr path=/update params={update.distrib=FROMLEADER&distrib.from=http://127.0.0.1:38776/solr/collection1_shard1_replica_n2/&wt=javabin&version=2}{add=[2 (1605869487239725056)]} 0 0
   [junit4]   2> 1793945 INFO  (qtp1016615454-17567) [n:127.0.0.1:38776_solr c:collection1 s:shard1 r:core_node4 x:collection1_shard1_replica_n2] o.a.s.u.p.LogUpdateProcessorFactory [collection1_shard1_replica_n2]  webapp=/solr path=/update params={wt=javabin&version=2}{add=[2 (1605869487239725056)]} 0 3
   [junit4]   2> 1793946 INFO  (qtp1016615454-17567) [n:127.0.0.1:38776_solr c:collection1 s:shard1 r:core_node4 x:collection1_shard1_replica_n2] o.a.s.u.DirectUpdateHandler2 start commit{_version_=1605869487244967936,optimize=false,openSearcher=true,waitSearcher=true,expungeDeletes=false,softCommit=false,prepareCommit=false}
   [junit4]   2> 1793946 INFO  (qtp256804224-17562) [n:127.0.0.1:42958_solr c:collection1 s:shard1 r:core_node3 x:collection1_shard1_replica_n1] o.a.s.u.DirectUpdateHandler2 start commit{_version_=1605869487244967936,optimize=false,openSearcher=true,waitSearcher=true,expungeDeletes=false,softCommit=false,prepareCommit=false}
   [junit4]   2> 1793946 INFO  (qtp1016615454-17567) [n:127.0.0.1:38776_solr c:collection1 s:shard1 r:core_node4 x:collection1_shard1_replica_n2] o.a.s.u.SolrIndexWriter Calling setCommitData with IW:org.apache.solr.update.SolrIndexWriter@5e31b01 commitCommandVersion:1605869487244967936
   [junit4]   2> 1793946 INFO  (qtp256804224-17562) [n:127.0.0.1:42958_solr c:collection1 s:shard1 r:core_node3 x:collection1_shard1_replica_n1] o.a.s.u.SolrIndexWriter Calling setCommitData with IW:org.apache.solr.update.SolrIndexWriter@5277a29f commitCommandVersion:1605869487244967936
   [junit4]   2> 1793948 INFO  (qtp1016615454-17567) [n:127.0.0.1:38776_solr c:collection1 s:shard1 r:core_node4 x:collection1_shard1_replica_n2] o.a.s.s.SolrIndexSearcher Opening [Searcher@4c0547c0[collection1_shard1_replica_n2] main]
   [junit4]   2> 1793948 INFO  (qtp256804224-17562) [n:127.0.0.1:42958_solr c:collection1 s:shard1 r:core_node3 x:collection1_shard1_replica_n1] o.a.s.s.SolrIndexSearcher Opening [Searcher@4b4c428d[collection1_shard1_replica_n1] main]
   [junit4]   2> 1793948 INFO  (qtp1016615454-17567) [n:127.0.0.1:38776_solr c:collection1 s:shard1 r:core_node4 x:collection1_shard1_replica_n2] o.a.s.u.DirectUpdateHandler2 end_commit_flush
   [junit4]   2> 1793948 INFO  (qtp256804224-17562) [n:127.0.0.1:42958_solr c:collection1 s:shard1 r:core_node3 x:collection1_shard1_replica_n1] o.a.s.u.DirectUpdateHandler2 end_commit_flush
   [junit4]   2> 1793949 INFO  (searcherExecutor-6114-thread-1-processing-n:127.0.0.1:42958_solr x:collection1_shard1_replica_n1 c:collection1 s:shard1 r:core_node3) [n:127.0.0.1:42958_solr c:collection1 s:shard1 r:core_node3 x:collection1_shard1_replica_n1] o.a.s.c.SolrCore [collection1_shard1_replica_n1] Registered new searcher Searcher@4b4c428d[collection1_shard1_replica_n1] main{ExitableDirectoryReader(UninvertingDirectoryReader(Uninverting(_0(8.0.0):C1) Uninverting(_1(8.0.0):C1) Uninverting(_2(8.0.0):C1)))}
   [junit4]   2> 1793950 INFO  (qtp256804224-17562) [n:127.0.0.1:42958_solr c:collection1 s:shard1 r:core_node3 x:collection1_shard1_replica_n1] o.a.s.u.p.LogUpdateProcessorFactory [collection1_shard1_replica_n1]  webapp=/solr path=/update params={update.distrib=FROMLEADER&waitSearcher=true&openSearcher=true&commit=true&softCommit=false&distrib.from=http://127.0.0.1:38776/solr/collection1_shard1_replica_n2/&commit_end_point=true&wt=javabin&version=2&expungeDeletes=false}{commit=} 0 4
   [junit4]   2> 1793950 INFO  (searcherExecutor-6113-thread-1-processing-n:127.0.0.1:38776_solr x:collection1_shard1_replica_n2 c:collection1 s:shard1 r:core_node4) [n:127.0.0.1:38776_solr c:collection1 s:shard1 r:core_node4 x:collection1_shard1_replica_n2] o.a.s.c.SolrCore [collection1_shard1_replica_n2] Registered new searcher Searcher@4c0547c0[collection1_shard1_replica_n2] main{ExitableDirectoryReader(UninvertingDirectoryReader(Uninverting(_0(8.0.0):C1) Uninverting(_1(8.0.0):C1) Uninverting(_2(8.0.0):C1)))}
   [junit4]   2> 1793950 INFO  (qtp1016615454-17567) [n:127.0.0.1:38776_solr c:collection1 s:shard1 r:core_node4 x:collection1_shard1_replica_n2] o.a.s.u.p.LogUpdateProcessorFactory [collection1_shard1_replica_n2]  webapp=/solr path=/update params={update.distrib=FROMLEADER&waitSearcher=true&openSearcher=true&commit=true&softCommit=false&distrib.from=http://127.0.0.1:38776/solr/collection1_shard1_replica_n2/&commit_end_point=true&wt=javabin&version=2&expungeDeletes=false}{commit=} 0 4
   [junit4]   2> 1793950 INFO  (qtp1016615454-17557) [n:127.0.0.1:38776_solr c:collection1 s:shard1 r:core_node4 x:collection1_shard1_replica_n2] o.a.s.u.p.LogUpdateProcessorFactory [collection1_shard1_replica_n2]  webapp=/solr path=/update params={waitSearcher=true&commit=true&softCommit=false&wt=javabin&version=2}{commit=} 0 5
   [junit4]   2> 1793953 INFO  (qtp256804224-17555) [n:127.0.0.1:42958_solr c:collection1 s:shard1 r:core_node3 x:collection1_shard1_replica_n1] o.a.s.u.p.LogUpdateProcessorFactory [collection1_shard1_replica_n1]  webapp=/solr path=/update params={update.distrib=FROMLEADER&distrib.from=http://127.0.0.1:38776/solr/collection1_shard1_replica_n2/&wt=javabin&version=2}{add=[3 (1605869487250210816)]} 0 0
   [junit4]   2> 1793953 INFO  (qtp1016615454-17566) [n:127.0.0.1:38776_solr c:collection1 s:shard1 r:core_node4 x:collection1_shard1_replica_n2] o.a.s.u.p.LogUpdateProcessorFactory [collection1_shard1_replica_n2]  webapp=/solr path=/update params={wt=javabin&version=2}{add=[3 (1605869487250210816)]} 0 2
   [junit4]   2> 1793954 INFO  (qtp256804224-17562) [n:127.0.0.1:42958_solr c:collection1 s:shard1 r:core_node3 x:collection1_shard1_replica_n1] o.a.s.u.DirectUpdateHandler2 start commit{_version_=1605869487253356544,optimize=false,openSearcher=true,waitSearcher=true,expungeDeletes=false,softCommit=false,prepareCommit=false}
   [junit4]   2> 1793954 INFO  (qtp256804224-17562) [n:127.0.0.1:42958_solr c:collection1 s:shard1 r:core_node3 x:collection1_shard1_replica_n1] o.a.s.u.SolrIndexWriter Calling setCommitData with IW:org.apache.solr.update.SolrIndexWriter@5277a29f commitCommandVersion:1605869487253356544
   [junit4]   2> 1793954 INFO  (qtp1016615454-17566) [n:127.0.0.1:38776_solr c:collection1 s:shard1 r:core_node4 x:collection1_shard1_replica_n2] o.a.s.u.DirectUpdateHandler2 start commit{_version_=1605869487253356544,optimize=false,openSearcher=true,waitSearcher=true,expungeDeletes=false,softCommit=false,prepareCommit=false}
   [junit4]   2> 1793954 INFO  (qtp1016615454-17566) [n:127.0.0.1:38776_solr c:collection1 s:shard1 r:core_node4 x:collection1_shard1_replica_n2] o.a.s.u.SolrIndexWriter Calling setCommitData with IW:org.apache.solr.update.SolrIndexWriter@5e31b01 commitCommandVersion:1605869487253356544
   [junit4]   2> 1793956 INFO  (qtp1016615454-17566) [n:127.0.0.1:38776_solr c:collection1 s:shard1 r:core_node4 x:collection1_shard1_replica_n2] o.a.s.s.SolrIndexSearcher Opening [Searcher@7f5d20d4[collection1_shard1_replica_n2] main]
   [junit4]   2> 1793956 INFO  (qtp1016615454-17566) [n:127.0.0.1:38776_solr c:collection1 s:shard1 r:core_node4 x:collection1_shard1_replica_n2] o.a.s.u.DirectUpdateHandler2 end_commit_flush
   [junit4]   2> 1793958 INFO  (searcherExecutor-6113-thread-1-processing-n:127.0.0.1:38776_solr x:collection1_shard1_replica_n2 c:collection1 s:shard1 r:core_node4) [n:127.0.0.1:38776_solr c:collection1 s:shard1 r:core_node4 x:collection1_shard1_replica_n2] o.a.s.c.SolrCore [collection1_shard1_replica_n2] Registered new searcher Searcher@7f5d20d4[collection1_shard1_replica_n2] main{ExitableDirectoryReader(UninvertingDirectoryReader(Uninverting(_0(8.0.0):C1) Uninverting(_1(8.0.0):C1) Uninverting(_2(8.0.0):C1) Uninverting(_3(8.0.0):C1)))}
   [junit4]   2> 1793958 INFO  (qtp1016615454-17566) [n:127.0.0.1:38776_solr c:collection1 s:shard1 r:core_node4 x:collection1_shard1_replica_n2] o.a.s.u.p.LogUpdateProcessorFactory [collection1_shard1_replica_n2]  webapp=/solr path=/update params={update.distrib=FROMLEADER&waitSearcher=true&openSearcher=true&commit=true&softCommit=false&distrib.from=http://127.0.0.1:38776/solr/collection1_shard1_replica_n2/&commit_end_point=true&wt=javabin&version=2&expungeDeletes=false}{commit=} 0 3
   [junit4]   2> 1793958 INFO  (qtp256804224-17562) [n:127.0.0.1:42958_solr c:collection1 s:shard1 r:core_node3 x:collection1_shard1_replica_n1] o.a.s.s.SolrIndexSearcher Opening [Searcher@142021e1[collection1_shard1_replica_n1] main]
   [junit4]   2> 1793959 INFO  (qtp256804224-17562) [n:127.0.0.1:42958_solr c:collection1 s:shard1 r:core_node3 x:collection1_shard1_replica_n1] o.a.s.u.DirectUpdateHandler2 end_commit_flush
   [junit4]   2> 1793959 INFO  (searcherExecutor-6114-thread-1-processing-n:127.0.0.1:42958_solr x:collection1_shard1_replica_n1 c:collection1 s:shard1 r:core_node3) [n:127.0.0.1:42958_solr c:collection1 s:shard1 r:core_node3 x:collection1_shard1_replica_n1] o.a.s.c.SolrCore [collection1_shard1_replica_n1] Registered new searcher Searcher@142021e1[collection1_shard1_replica_n1] main{ExitableDirectoryReader(UninvertingDirectoryReader(Uninverting(_0(8.0.0):C1) Uninverting(_1(8.0.0):C1) Uninverting(_2(8.0.0):C1) Uninverting(_3(8.0.0):C1)))}
   [junit4]   2> 1793960 INFO  (qtp256804224-17562) [n:127.0.0.1:42958_solr c:collection1 s:shard1 r:core_node3 x:collection1_shard1_replica_n1] o.a.s.u.p.LogUpdateProcessorFactory [collection1_shard1_replica_n1]  webapp=/solr path=/update params={update.distrib=FROMLEADER&waitSearcher=true&openSearcher=true&commit=true&softCommit=false&distrib.from=http://127.0.0.1:38776/solr/collection1_shard1_replica_n2/&commit_end_point=true&wt=javabin&version=2&expungeDeletes=false}{commit=} 0 5
   [junit4]   2> 1793960 INFO  (qtp1016615454-17557) [n:127.0.0.1:38776_solr c:collection1 s:shard1 r:core_node4 x:collection1_shard1_replica_n2] o.a.s.u.p.LogUpdateProcessorFactory [collection1_shard1_replica_n2]  webapp=/solr path=/update params={waitSearcher=true&commit=true&softCommit=false&wt=javabin&version=2}{commit=} 0 6
   [junit4]   2> 1793962 INFO  (qtp256804224-17555) [n:127.0.0.1:42958_solr c:collection1 s:shard1 r:core_node3 x:collection1_shard1_replica_n1] o.a.s.u.p.LogUpdateProcessorFactory [collection1_shard1_replica_n1]  webapp=/solr path=/update params={update.distrib=FROMLEADER&distrib.from=http://127.0.0.1:38776/solr/collection1_shard1_replica_n2/&wt=javabin&version=2}{add=[4 (1605869487260696576)]} 0 0
   [junit4]   2> 1793963 INFO  (qtp1016615454-17567) [n:127.0.0.1:38776_solr c:collection1 s:shard1 r:core_node4 x:collection1_shard1_replica_n2] o.a.s.u.p.LogUpdateProcessorFactory [collection1_shard1_replica_n2]  webapp=/solr path=/update params={wt=javabin&version=2}{add=[4 (1605869487260696576)]} 0 1
   [junit4]   2> 1793963 INFO  (qtp256804224-17555) [n:127.0.0.1:42958_solr c:collection1 s:shard1 r:core_node3 x:collection1_shard1_replica_n1] o.a.s.u.DirectUpdateHandler2 start commit{_version_=1605869487262793728,optimize=false,openSearcher=true,waitSearcher=true,expungeDeletes=false,softCommit=false,prepareCommit=false}
   [junit4]   2> 1793964 INFO  (qtp256804224-17555) [n:127.0.0.1:42958_solr c:collection1 s:shard1 r:core_node3 x:collection1_shard1_replica_n1] o.a.s.u.SolrIndexWriter Calling setCommitData with IW:org.apache.solr.update.SolrIndexWriter@5277a29f commitCommandVersion:1605869487262793728
   [junit4]   2> 1793965 INFO  (qtp1016615454-17557) [n:127.0.0.1:38776_solr c:collection1 s:shard1 r:core_node4 x:collection1_shard1_replica_n2] o.a.s.u.DirectUpdateHandler2 start commit{_version_=1605869487264890880,optimize=false,openSearcher=true,waitSearcher=true,expungeDeletes=false,softCommit=false,prepareCommit=false}
   [junit4]   2> 1793965 INFO  (qtp1016615454-17557) [n:127.0.0.1:38776_solr c:collection1 s:shard1 r:core_node4 x:collection1_shard1_replica_n2] o.a.s.u.SolrIndexWriter Calling setCommitData with IW:org.apache.solr.update.SolrIndexWriter@5e31b01 commitCommandVersion:1605869487264890880
   [junit4]   2> 1793966 INFO  (qtp256804224-17555) [n:127.0.0.1:42958_solr c:collection1 s:shard1 r:core_node3 x:collection1_shard1_replica_n1] o.a.s.s.SolrIndexSearcher Opening [Searcher@6849b99c[collection1_shard1_replica_n1] main]
   [junit4]   2> 1793967 INFO  (searcherExecutor-6114-thread-1-processing-n:127.0.0.1:42958_solr x:collection1_shard1_replica_n1 c:collection1 s:shard1 r:core_node3) [n:127.0.0.1:42958_solr c:collection1 s:shard1 r:core_node3 x:collection1_shard1_replica_n1] o.a.s.c.SolrCore [collection1_shard1_replica_n1] Registered new searcher Searcher@6849b99c[collection1_shard1_replica_n1] main{ExitableDirectoryReader(UninvertingDirectoryReader(Uninverting(_0(8.0.0):C1) Uninverting(_1(8.0.0):C1) Uninverting(_2(8.0.0):C1) Uninverting(_3(8.0.0):C1) Uninverting(_4(8.0.0):C1)))}
   [junit4]   2> 1793967 INFO  (qtp256804224-17555) [n:127.0.0.1:42958_solr c:collection1 s:shard1 r:core_node3 x:collection1_shard1_replica_n1] o.a.s.u.DirectUpdateHandler2 end_commit_flush
   [junit4]   2> 1793967 INFO  (qtp256804224-17555) [n:127.0.0.1:42958_solr c:collection1 s:shard1 r:core_node3 x:collection1_shard1_replica_n1] o.a.s.u.p.LogUpdateProcessorFactory [collection1_shard1_replica_n1]  webapp=/solr path=/update params={update.distrib=FROMLEADER&waitSearcher=true&openSearcher=true&commit=true&softCommit=false&distrib.from=http://127.0.0.1:38776/solr/collection1_shard1_replica_n2/&commit_end_point=true&wt=javabin&version=2&expungeDeletes=false}{commit=} 0 4
   [junit4]   2> 1793968 INFO  (qtp1016615454-17557) [n:127.0.0.1:38776_solr c:collection1 s:shard1 r:core_node4 x:collection1_shard1_replica_n2] o.a.s.s.SolrIndexSearcher Opening [Searcher@5aa672f5[collection1_shard1_replica_n2] main]
   [junit4]   2> 1793969 INFO  (qtp1016615454-17557) [n:127.0.0.1:38776_solr c:collection1 s:shard1 r:core_node4 x:collection1_shard1_replica_n2] o.a.s.u.DirectUpdateHandler2 end_commit_flush
   [junit4]   2> 1793969 INFO  (searcherExecutor-6113-thread-1-processing-n:127.0.0.1:38776_solr x:collection1_shard1_replica_n2 c:collection1 s:shard1 r:core_node4) [n:127.0.0.1:38776_solr c:collection1 s:shard1 r:core_node4 x:collection1_shard1_replica_n2] o.a.s.c.SolrCore [collection1_shard1_replica_n2] Registered new searcher Searcher@5aa672f5[collection1_shard1_replica_n2] main{ExitableDirectoryReader(UninvertingDirectoryReader(Uninverting(_0(8.0.0):C1) Uninverting(_1(8.0.0):C1) Uninverting(_2(8.0.0):C1) Uninverting(_3(8.0.0):C1) Uninverting(_4(8.0.0):C1)))}
   [junit4]   2> 1793970 INFO  (qtp1016615454-17557) [n:127.0.0.1:38776_solr c:collection1 s:shard1 r:core_node4 x:collection1_shard1_replica_n2] o.a.s.u.p.LogUpdateProcessorFactory [collection1_shard1_replica_n2]  webapp=/solr path=/update params={update.distrib=FROMLEADER&waitSearcher=true&openSearcher=true&commit=true&softCommit=false&distrib.from=http://127.0.0.1:38776/solr/collection1_shard1_replica_n2/&commit_end_point=true&wt=javabin&version=2&expungeDeletes=false}{commit=} 0 6
   [junit4]   2> 1793970 INFO  (qtp1016615454-17567) [n:127.0.0.1:38776_solr c:collection1 s:shard1 r:core_node4 x:collection1_shard1_replica_n2] o.a.s.u.p.LogUpdateProcessorFactory [collection1_shard1_replica_n2]  webapp=/solr path=/update params={waitSearcher=true&commit=true&softCommit=false&wt=javabin&version=2}{commit=} 0 7
   [junit4]   2> 1793973 INFO  (qtp256804224-17555) [n:127.0.0.1:42958_solr c:collection1 s:shard1 r:core_node3 x:collection1_shard1_replica_n1] o.a.s.u.p.LogUpdateProcessorFactory [collection1_shard1_replica_n1]  webapp=/solr path=/update params={update.distrib=FROMLEADER&distrib.from=http://127.0.0.1:38776/solr/collection1_shard1_replica_n2/&wt=javabin&version=2}{add=[5 (1605869487271182336)]} 0 0
   [junit4]   2> 1793973 INFO  (qtp1016615454-17566) [n:127.0.0.1:38776_solr c:collection1 s:shard1 r:core_node4 x:collection1_shard1_replica_n2] o.a.s.u.p.LogUpdateProcessorFactory [collection1_shard1_replica_n2]  webapp=/solr path=/update params={wt=javabin&version=2}{add=[5 (1605869487271182336)]} 0 2
   [junit4]   2> 1793974 INFO  (qtp256804224-17562) [n:127.0.0.1:42958_solr c:collection1 s:shard1 r:core_node3 x:collection1_shard1_replica_n1] o.a.s.u.DirectUpdateHandler2 start commit{_version_=1605869487274328064,optimize=false,openSearcher=true,waitSearcher=true,expungeDeletes=false,softCommit=false,prepareCommit=false}
   [junit4]   2> 1793974 INFO  (qtp1016615454-17566) [n:127.0.0.1:38776_solr c:collection1 s:shard1 r:core_node4 x:collection1_shard1_replica_n2] o.a.s.u.DirectUpdateHandler2 start commit{_version_=1605869487274328064,optimize=false,openSearcher=true,waitSearcher=true,expungeDeletes=false,softCommit=false,prepareCommit=false}
   [junit4]   2> 1793974 INFO  (qtp256804224-17562) [n:127.0.0.1:42958_solr c:collection1 s:shard1 r:core_node3 x:collection1_shard1_replica_n1] o.a.s.u.SolrIndexWriter Calling setCommitData with IW:org.apache.solr.update.SolrIndexWriter@5277a29f commitCommandVersion:1605869487274328064
   [junit4]   2> 1793974 INFO  (qtp1016615454-17566) [n:127.0.0.1:38776_solr c:collection1 s:shard1 r:core_node4 x:collection1_shard1_replica_n2] o.a.s.u.SolrIndexWriter Calling setCommitData with IW:org.apache.solr.update.SolrIndexWriter@5e31b01 commitCommandVersion:1605869487274328064
   [junit4]   2> 1793976 INFO  (qtp1016615454-17566) [n:127.0.0.1:38776_solr c:collection1 s:shard1 r:core_node4 x:collection1_shard1_replica_n2] o.a.s.s.SolrIndexSearcher Opening [Searcher@507f341b[collection1_shard1_replica_n2] main]
   [junit4]   2> 1793976 INFO  (qtp1016615454-17566) [n:127.0.0.1:38776_solr c:collection1 s:shard1 r:core_node4 x:collection1_shard1_replica_n2] o.a.s.u.DirectUpdateHandler2 end_commit_flush
   [junit4]   2> 1793977 INFO  (searcherExecutor-6113-thread-1-processing-n:127.0.0.1:38776_solr x:collection1_shard1_replica_n2 c:collection1 s:shard1 r:core_node4) [n:127.0.0.1:38776_solr c:collection1 s:shard1 r:core_node4 x:collection1_shard1_replica_n2] o.a.s.c.SolrCore [collection1_shard1_replica_n2] Registered new searcher Searcher@507f341b[collection1_shard1_replica_n2] main{ExitableDirectoryReader(UninvertingDirectoryReader(Uninverting(_0(8.0.0):C1) Uninverting(_1(8.0.0):C1) Uninverting(_2(8.0.0):C1) Uninverting(_3(8.0.0):C1) Uninverting(_4(8.0.0):C1) Uninverting(_5(8.0.0):C1)))}
   [junit4]   2> 1793977 INFO  (qtp1016615454-17566) [n:127.0.0.1:38776_solr c:collection1 s:shard1 r:core_node4 x:collection1_shard1_replica_n2] o.a.s.u.p.LogUpdateProcessorFactory [collection1_shard1_replica_n2]  webapp=/solr path=/update params={update.distrib=FROMLEADER&waitSearcher=true&openSearcher=true&commit=true&softCommit=false&distrib.from=http://127.0.0.1:38776/solr/collection1_shard1_replica_n2/&commit_end_point=true&wt=javabin&version=2&expungeDeletes=false}{commit=} 0 3
   [junit4]   2> 1793978 INFO  (qtp256804224-17562) [n:127.0.0.1:42958_solr c:collection1 s:shard1 r:core_node3 x:collection1_shard1_replica_n1] o.a.s.s.SolrIndexSearcher Opening [Searcher@3aca7d1e[collection1_shard1_replica_n1] main]
   [junit4]   2> 1793978 INFO  (qtp256804224-17562) [n:127.0.0.1:42958_solr c:collection1 s:shard1 r:core_node3 x:collection1_shard1_replica_n1] o.a.s.u.DirectUpdateHandler2 end_commit_flush
   [junit4]   2> 1793979 INFO  (searcherExecutor-6114-thread-1-processing-n:127.0.0.1:42958_solr x:collection1_shard1_replica_n1 c:collection1 s:shard1 r:core_node3) [n:127.0.0.1:42958_solr c:collection1 s:shard1 r:core_node3 x:collection1_shard1_replica_n1] o.a.s.c.SolrCore [collection1_shard1_replica_n1] Registered new searcher Searcher@3aca7d1e[collection1_shard1_replica_n1] main{ExitableDirectoryReader(UninvertingDirectoryReader(Uninverting(_0(8.0.0):C1) Uninverting(_1(8.0.0):C1) Uninverting(_2(8.0.0):C1) Uninverting(_3(8.0.0):C1) Uninverting(_4(8.0.0):C1) Uninverting(_5(8.0.0):C1)))}
   [junit4]   2> 1793979 INFO  (qtp256804224-17562) [n:127.0.0.1:42958_solr c:collection1 s:shard1 r:core_node3 x:collection1_shard1_replica_n1] o.a.s.u.p.LogUpdateProcessorFactory [collection1_shard1_replica_n1]  webapp=/solr path=/update params={update.distrib=FROMLEADER&waitSearcher=true&openSearcher=true&commit=true&softCommit=false&distrib.from=http://127.0.0.1:38776/solr/collection1_shard1_replica_n2/&commit_end_point=true&wt=javabin&version=2&expungeDeletes=false}{commit=} 0 5
   [junit4]   2> 1793979 INFO  (qtp1016615454-17567) [n:127.0.0.1:38776_solr c:collection1 s:shard1 r:core_node4 x:collection1_shard1_replica_n2] o.a.s.u.p.LogUpdateProcessorFactory [collection1_shard1_replica_n2]  webapp=/solr path=/update params={waitSearcher=true&commit=true&softCommit=false&wt=javabin&version=2}{commit=} 0 6
   [junit4]   2> 1793982 INFO  (qtp256804224-17555) [n:127.0.0.1:42958_solr c:collection1 s:shard1 r:core_node3 x:collection1_shard1_replica_n1] o.a.s.u.p.LogUpdateProcessorFactory [collection1_shard1_replica_n1]  webapp=/solr path=/update params={update.distrib=FROMLEADER&distrib.from=http://127.0.0.1:38776/solr/collection1_shard1_replica_n2/&wt=javabin&version=2}{add=[6 (1605869487280619520)]} 0 0
   [junit4]   2> 1793982 INFO  (qtp1016615454-17557) [n:127.0.0.1:38776_solr c:collection1 s:shard1 r:core_node4 x:collection1_shard1_replica_n2] o.a.s.u.p.LogUpdateProcessorFactory [collection1_shard1_replica_n2]  webapp=/solr path=/update params={wt=javabin&version=2}{add=[6 (1605869487280619520)]} 0 1
   [junit4]   2> 1793983 INFO  (qtp1016615454-17557) [n:127.0.0.1:38776_solr c:collection1 s:shard1 r:core_node4 x:collection1_shard1_replica_n2] o.a.s.u.DirectUpdateHandler2 start commit{_version_=1605869487283765248,optimize=false,openSearcher=true,waitSearcher=true,expungeDeletes=false,softCommit=false,prepareCommit=false}
   [junit4]   2> 1793983 INFO  (qtp1016615454-17557) [n:127.0.0.1:38776_solr c:collection1 s:shard1 r:core_node4 x:collection1_shard1_replica_n2] o.a.s.u.SolrIndexWriter Calling setCommitData with IW:org.apache.solr.update.SolrIndexWriter@5e31b01 commitCommandVersion:1605869487283765248
   [junit4]   2> 1793983 INFO  (qtp256804224-17562) [n:127.0.0.1:42958_solr c:collection1 s:shard1 r:core_node3 x:collection1_shard1_replica_n1] o.a.s.u.DirectUpdateHandler2 start commit{_version_=1605869487283765248,optimize=false,openSearcher=true,waitSearcher=true,expungeDeletes=false,softCommit=false,prepareCommit=false}
   [junit4]   2> 1793983 INFO  (qtp256804224-17562) [n:127.0.0.1:42958_solr c:collection1 s:shard1 r:core_node3 x:collection1_shard1_replica_n1] o.a.s.u.SolrIndexWriter Calling setCommitData with IW:org.apache.solr.update.SolrIndexWriter@5277a29f commitCommandVersion:1605869487283765248
   [junit4]   2> 1793984 INFO  (qtp1016615454-17557) [n:127.0.0.1:38776_solr c:collection1 s:shard1 r:core_node4 x:collection1_shard1_replica_n2] o.a.s.s.SolrIndexSearcher Opening [Searcher@6e6af019[collection1_shard1_replica_n2] main]
   [junit4]   2> 1793984 INFO  (qtp256804224-17562) [n:127.0.0.1:42958_solr c:collection1 s:shard1 r:core_node3 x:collection1_shard1_replica_n1] o.a.s.s.SolrIndexSearcher Opening [Searcher@47fd3a34[collection1_shard1_replica_n1] main]
   [junit4]   2> 1793985 INFO  (qtp1016615454-17557) [n:127.0.0.1:38776_solr c:collection1 s:shard1 r:core_node4 x:collection1_shard1_replica_n2] o.a.s.u.DirectUpdateHandler2 end_commit_flush
   [junit4]   2> 1793985 INFO  (searcherExecutor-6113-thread-1-processing-n:127.0.0.1:38776_solr x:collection1_shard1_replica_n2 c:collection1 s:shard1 r:core_node4) [n:127.0.0.1:38776_solr c:collection1 s:shard1 r:core_node4 x:collection1_shard1_replica_n2] o.a.s.c.SolrCore [collection1_shard1_replica_n2] Registered new searcher Searcher@6e6af019[collection1_shard1_replica_n2] main{ExitableDirectoryReader(UninvertingDirectoryReader(Uninverting(_0(8.0.0):C1) Uninverting(_1(8.0.0):C1) Uninverting(

[...truncated too long message...]

e4 x:collection1_shard1_replica_n2] o.a.s.c.SolrCore [collection1_shard1_replica_n2]  CLOSING SolrCore org.apache.solr.core.SolrCore@72573f10
   [junit4]   2> 158647 INFO  (coreCloseExecutor-145-thread-1) [n:127.0.0.1:63828_solr c:collection1 s:shard1 r:core_node4 x:collection1_shard1_replica_n2] o.a.s.m.SolrMetricManager Closing metric reporters for registry=solr.core.collection1.shard1.replica_n2, tag=72573f10
   [junit4]   2> 158647 INFO  (coreCloseExecutor-145-thread-1) [n:127.0.0.1:63828_solr c:collection1 s:shard1 r:core_node4 x:collection1_shard1_replica_n2] o.a.s.m.r.SolrJmxReporter Closing reporter [org.apache.solr.metrics.reporters.SolrJmxReporter@629a5b80: rootName = solr_63828, domain = solr.core.collection1.shard1.replica_n2, service url = null, agent id = null] for registry solr.core.collection1.shard1.replica_n2 / com.codahale.metrics.MetricRegistry@59de70bc
   [junit4]   2> 158647 INFO  (zkCallback-111-thread-2) [    ] o.a.s.c.c.ZkStateReader A cluster state change: [WatchedEvent state:SyncConnected type:NodeDataChanged path:/collections/collection1/state.json] for collection [collection1] has occurred - updating... (live nodes size: [2])
   [junit4]   2> 158648 INFO  (zkCallback-111-thread-3) [    ] o.a.s.c.c.ZkStateReader Updated live nodes from ZooKeeper... (2) -> (0)
   [junit4]   2> 158649 INFO  (zkCallback-118-thread-2) [    ] o.a.s.c.c.ZkStateReader Updated live nodes from ZooKeeper... (2) -> (0)
   [junit4]   2> 158650 INFO  (zkCallback-124-thread-2) [    ] o.a.s.c.c.ZkStateReader Updated live nodes from ZooKeeper... (2) -> (0)
   [junit4]   2> 158652 INFO  (coreCloseExecutor-146-thread-1) [n:127.0.0.1:32981_solr c:collection1 s:shard1 r:core_node3 x:collection1_shard1_replica_n1] o.a.s.c.SolrCore [collection1_shard1_replica_n1]  CLOSING SolrCore org.apache.solr.core.SolrCore@6f5fd41b
   [junit4]   2> 158652 INFO  (coreCloseExecutor-146-thread-1) [n:127.0.0.1:32981_solr c:collection1 s:shard1 r:core_node3 x:collection1_shard1_replica_n1] o.a.s.m.SolrMetricManager Closing metric reporters for registry=solr.core.collection1.shard1.replica_n1, tag=6f5fd41b
   [junit4]   2> 158652 INFO  (coreCloseExecutor-146-thread-1) [n:127.0.0.1:32981_solr c:collection1 s:shard1 r:core_node3 x:collection1_shard1_replica_n1] o.a.s.m.r.SolrJmxReporter Closing reporter [org.apache.solr.metrics.reporters.SolrJmxReporter@1e1edb80: rootName = solr_32981, domain = solr.core.collection1.shard1.replica_n1, service url = null, agent id = null] for registry solr.core.collection1.shard1.replica_n1 / com.codahale.metrics.MetricRegistry@31f116a2
   [junit4]   2> 158663 INFO  (coreCloseExecutor-145-thread-1) [n:127.0.0.1:63828_solr c:collection1 s:shard1 r:core_node4 x:collection1_shard1_replica_n2] o.a.s.m.SolrMetricManager Closing metric reporters for registry=solr.collection.collection1.shard1.leader, tag=72573f10
   [junit4]   2> 158674 INFO  (jetty-closer-92-thread-1) [    ] o.a.s.c.Overseer Overseer (id=72499890576031748-127.0.0.1:63828_solr-n_0000000000) closing
   [junit4]   2> 158674 INFO  (OverseerStateUpdate-72499890576031748-127.0.0.1:63828_solr-n_0000000000) [    ] o.a.s.c.Overseer Overseer Loop exiting : 127.0.0.1:63828_solr
   [junit4]   2> 158676 WARN  (OverseerAutoScalingTriggerThread-72499890576031748-127.0.0.1:63828_solr-n_0000000000) [    ] o.a.s.c.a.OverseerTriggerThread OverseerTriggerThread woken up but we are closed, exiting.
   [junit4]   2> 158684 INFO  (coreCloseExecutor-146-thread-1) [n:127.0.0.1:32981_solr c:collection1 s:shard1 r:core_node3 x:collection1_shard1_replica_n1] o.a.s.m.SolrMetricManager Closing metric reporters for registry=solr.collection.collection1.shard1.leader, tag=6f5fd41b
   [junit4]   2> 158687 INFO  (zkCallback-111-thread-2) [    ] o.a.s.c.OverseerElectionContext I am going to be the leader 127.0.0.1:32981_solr
   [junit4]   2> 158689 INFO  (jetty-closer-92-thread-1) [    ] o.e.j.s.h.ContextHandler Stopped o.e.j.s.ServletContextHandler@3fa64219{/solr,null,UNAVAILABLE}
   [junit4]   2> 158690 INFO  (jetty-closer-92-thread-1) [    ] o.e.j.s.session node0 Stopped scavenging
   [junit4]   2> 158709 INFO  (jetty-closer-92-thread-2) [    ] o.e.j.s.h.ContextHandler Stopped o.e.j.s.ServletContextHandler@3fe81f88{/solr,null,UNAVAILABLE}
   [junit4]   2> 158709 INFO  (jetty-closer-92-thread-2) [    ] o.e.j.s.session node0 Stopped scavenging
   [junit4]   2> 158712 ERROR (SUITE-LeaderTragicEventTest-seed#[353ADAD86D49C7EC]-worker) [    ] o.a.z.s.ZooKeeperServer ZKShutdownHandler is not registered, so ZooKeeper server won't take any action on ERROR or SHUTDOWN server state changes
   [junit4]   2> 158712 INFO  (SUITE-LeaderTragicEventTest-seed#[353ADAD86D49C7EC]-worker) [    ] o.a.s.c.ZkTestServer connecting to 127.0.0.1:32771 32771
   [junit4]   2> 158830 WARN  (NIOServerCxn.Factory:0.0.0.0/0.0.0.0:0) [    ] o.a.z.s.NIOServerCnxnFactory Ignoring unexpected runtime exception
   [junit4]   2> java.nio.channels.CancelledKeyException: null
   [junit4]   2> 	at sun.nio.ch.SelectionKeyImpl.ensureValid(SelectionKeyImpl.java:73) ~[?:1.8.0_172]
   [junit4]   2> 	at sun.nio.ch.SelectionKeyImpl.readyOps(SelectionKeyImpl.java:87) ~[?:1.8.0_172]
   [junit4]   2> 	at org.apache.zookeeper.server.NIOServerCnxnFactory.run(NIOServerCnxnFactory.java:205) [zookeeper-3.4.11.jar:3.4.11-37e277162d567b55a07d1755f0b31c32e93c01a0]
   [junit4]   2> 	at java.lang.Thread.run(Thread.java:748) [?:1.8.0_172]
   [junit4]   2> 158831 INFO  (Thread-50) [    ] o.a.s.c.ZkTestServer connecting to 127.0.0.1:32771 32771
   [junit4]   2> 158832 WARN  (Thread-50) [    ] o.a.s.c.ZkTestServer Watch limit violations: 
   [junit4]   2> Maximum concurrent create/delete watches above limit:
   [junit4]   2> 
   [junit4]   2> 	8	/solr/collections/collection1/terms/shard1
   [junit4]   2> 	5	/solr/aliases.json
   [junit4]   2> 	5	/solr/clusterprops.json
   [junit4]   2> 	2	/solr/security.json
   [junit4]   2> 	2	/solr/configs/config
   [junit4]   2> 
   [junit4]   2> Maximum concurrent data watches above limit:
   [junit4]   2> 
   [junit4]   2> 	5	/solr/clusterstate.json
   [junit4]   2> 	3	/solr/collections/collection1/state.json
   [junit4]   2> 
   [junit4]   2> Maximum concurrent children watches above limit:
   [junit4]   2> 
   [junit4]   2> 	5	/solr/live_nodes
   [junit4]   2> 	5	/solr/collections
   [junit4]   2> 
   [junit4]   2> NOTE: leaving temporary files on disk at: /export/home/jenkins/workspace/Lucene-Solr-master-Solaris/solr/build/solr-core/test/J0/temp/solr.cloud.LeaderTragicEventTest_353ADAD86D49C7EC-003
   [junit4]   2> Jul 13, 2018 11:10:40 AM com.carrotsearch.randomizedtesting.ThreadLeakControl checkThreadLeaks
   [junit4]   2> WARNING: Will linger awaiting termination of 1 leaked thread(s).
   [junit4]   2> NOTE: test params are: codec=Asserting(Lucene70), sim=Asserting(org.apache.lucene.search.similarities.AssertingSimilarity@4e7e50eb), locale=fr-LU, timezone=Egypt
   [junit4]   2> NOTE: SunOS 5.11 amd64/Oracle Corporation 1.8.0_172 (64-bit)/cpus=3,threads=1,free=29651680,total=137662464
   [junit4]   2> NOTE: All tests run in this JVM: [LeaderTragicEventTest, LeaderTragicEventTest, LeaderTragicEventTest]
   [junit4] Completed [5/5 (4!)] on J0 in 95.61s, 2 tests, 1 failure, 1 error <<< FAILURES!
   [junit4] 
   [junit4] 
   [junit4] Tests with failures [seed: 353ADAD86D49C7EC]:
   [junit4]   - org.apache.solr.cloud.LeaderTragicEventTest.testOtherReplicasAreNotActive
   [junit4]   - org.apache.solr.cloud.LeaderTragicEventTest.testOtherReplicasAreNotActive
   [junit4]   - org.apache.solr.cloud.LeaderTragicEventTest.testOtherReplicasAreNotActive
   [junit4]   - org.apache.solr.cloud.LeaderTragicEventTest.test
   [junit4]   - org.apache.solr.cloud.LeaderTragicEventTest.testOtherReplicasAreNotActive
   [junit4] 
   [junit4] 
   [junit4] JVM J0:     1.56 ..   159.94 =   158.39s
   [junit4] JVM J1:     1.30 ..    78.73 =    77.44s
   [junit4] Execution time total: 2 minutes 40 seconds
   [junit4] Tests summary: 5 suites, 10 tests, 4 errors, 1 failure

BUILD FAILED
/export/home/jenkins/workspace/Lucene-Solr-master-Solaris/lucene/common-build.xml:1568: The following error occurred while executing this line:
/export/home/jenkins/workspace/Lucene-Solr-master-Solaris/lucene/common-build.xml:1092: There were test failures: 5 suites, 10 tests, 4 errors, 1 failure [seed: 353ADAD86D49C7EC]

Total time: 2 minutes 43 seconds

[repro] Setting last failure code to 256

[repro] Failures:
[repro]   4/5 failed: org.apache.solr.cloud.LeaderTragicEventTest
[repro] Exiting with code 256
+ mv lucene/build lucene/build.repro
+ mv solr/build solr/build.repro
+ mv lucene/build.orig lucene/build
+ mv solr/build.orig solr/build
Archiving artifacts
Setting ANT_1_8_2_HOME=/export/home/jenkins/tools/hudson.tasks.Ant_AntInstallation/ANT_1.8.2
[WARNINGS] Parsing warnings in console log with parser Java Compiler (javac)
Setting ANT_1_8_2_HOME=/export/home/jenkins/tools/hudson.tasks.Ant_AntInstallation/ANT_1.8.2
Setting ANT_1_8_2_HOME=/export/home/jenkins/tools/hudson.tasks.Ant_AntInstallation/ANT_1.8.2
<Git Blamer> Using GitBlamer to create author and commit information for all warnings.
<Git Blamer> GIT_COMMIT=0545901c24f4d146f4251ba52defa4eb23fc10b9, workspace=/export/home/jenkins/workspace/Lucene-Solr-master-Solaris
[WARNINGS] Computing warning deltas based on reference build #1966
Recording test results
Setting ANT_1_8_2_HOME=/export/home/jenkins/tools/hudson.tasks.Ant_AntInstallation/ANT_1.8.2
Build step 'Publish JUnit test result report' changed build result to UNSTABLE
Email was triggered for: Unstable (Test Failures)
Sending email for trigger: Unstable (Test Failures)
Setting ANT_1_8_2_HOME=/export/home/jenkins/tools/hudson.tasks.Ant_AntInstallation/ANT_1.8.2
Setting ANT_1_8_2_HOME=/export/home/jenkins/tools/hudson.tasks.Ant_AntInstallation/ANT_1.8.2
Setting ANT_1_8_2_HOME=/export/home/jenkins/tools/hudson.tasks.Ant_AntInstallation/ANT_1.8.2
Setting ANT_1_8_2_HOME=/export/home/jenkins/tools/hudson.tasks.Ant_AntInstallation/ANT_1.8.2

Mime
View raw message