lucene-dev mailing list archives

Site index · List index
Message view « Date » · « Thread »
Top « Date » · « Thread »
From Apache Jenkins Server <jenk...@builds.apache.org>
Subject [JENKINS] Lucene-Solr-BadApples-Tests-master - Build # 88 - Still Unstable
Date Sun, 01 Jul 2018 22:24:30 GMT
Build: https://builds.apache.org/job/Lucene-Solr-BadApples-Tests-master/88/

6 tests failed.
FAILED:  org.apache.solr.cloud.api.collections.ShardSplitTest.testSplitMixedReplicaTypes

Error Message:
unexpected shard state expected:<inactive> but was:<active>

Stack Trace:
java.lang.AssertionError: unexpected shard state expected:<inactive> but was:<active>
	at __randomizedtesting.SeedInfo.seed([B49AFC4C00ADAE1B:C59A8ECFC767B6E]:0)
	at org.junit.Assert.fail(Assert.java:93)
	at org.junit.Assert.failNotEquals(Assert.java:647)
	at org.junit.Assert.assertEquals(Assert.java:128)
	at org.apache.solr.cloud.api.collections.ShardSplitTest.verifyShard(ShardSplitTest.java:380)
	at org.apache.solr.cloud.api.collections.ShardSplitTest.testSplitMixedReplicaTypes(ShardSplitTest.java:372)
	at sun.reflect.NativeMethodAccessorImpl.invoke0(Native Method)
	at sun.reflect.NativeMethodAccessorImpl.invoke(NativeMethodAccessorImpl.java:62)
	at sun.reflect.DelegatingMethodAccessorImpl.invoke(DelegatingMethodAccessorImpl.java:43)
	at java.lang.reflect.Method.invoke(Method.java:498)
	at com.carrotsearch.randomizedtesting.RandomizedRunner.invoke(RandomizedRunner.java:1737)
	at com.carrotsearch.randomizedtesting.RandomizedRunner$8.evaluate(RandomizedRunner.java:934)
	at com.carrotsearch.randomizedtesting.RandomizedRunner$9.evaluate(RandomizedRunner.java:970)
	at com.carrotsearch.randomizedtesting.RandomizedRunner$10.evaluate(RandomizedRunner.java:984)
	at org.apache.solr.BaseDistributedSearchTestCase$ShardsRepeatRule$ShardsFixedStatement.callStatement(BaseDistributedSearchTestCase.java:1008)
	at org.apache.solr.BaseDistributedSearchTestCase$ShardsRepeatRule$ShardsStatement.evaluate(BaseDistributedSearchTestCase.java:983)
	at com.carrotsearch.randomizedtesting.rules.SystemPropertiesRestoreRule$1.evaluate(SystemPropertiesRestoreRule.java:57)
	at org.apache.lucene.util.TestRuleSetupTeardownChained$1.evaluate(TestRuleSetupTeardownChained.java:49)
	at org.apache.lucene.util.AbstractBeforeAfterRule$1.evaluate(AbstractBeforeAfterRule.java:45)
	at org.apache.lucene.util.TestRuleThreadAndTestName$1.evaluate(TestRuleThreadAndTestName.java:48)
	at org.apache.lucene.util.TestRuleIgnoreAfterMaxFailures$1.evaluate(TestRuleIgnoreAfterMaxFailures.java:64)
	at org.apache.lucene.util.TestRuleMarkFailure$1.evaluate(TestRuleMarkFailure.java:47)
	at com.carrotsearch.randomizedtesting.rules.StatementAdapter.evaluate(StatementAdapter.java:36)
	at com.carrotsearch.randomizedtesting.ThreadLeakControl$StatementRunner.run(ThreadLeakControl.java:368)
	at com.carrotsearch.randomizedtesting.ThreadLeakControl.forkTimeoutingTask(ThreadLeakControl.java:817)
	at com.carrotsearch.randomizedtesting.ThreadLeakControl$3.evaluate(ThreadLeakControl.java:468)
	at com.carrotsearch.randomizedtesting.RandomizedRunner.runSingleTest(RandomizedRunner.java:943)
	at com.carrotsearch.randomizedtesting.RandomizedRunner$5.evaluate(RandomizedRunner.java:829)
	at com.carrotsearch.randomizedtesting.RandomizedRunner$6.evaluate(RandomizedRunner.java:879)
	at com.carrotsearch.randomizedtesting.RandomizedRunner$7.evaluate(RandomizedRunner.java:890)
	at com.carrotsearch.randomizedtesting.rules.StatementAdapter.evaluate(StatementAdapter.java:36)
	at com.carrotsearch.randomizedtesting.rules.SystemPropertiesRestoreRule$1.evaluate(SystemPropertiesRestoreRule.java:57)
	at org.apache.lucene.util.AbstractBeforeAfterRule$1.evaluate(AbstractBeforeAfterRule.java:45)
	at com.carrotsearch.randomizedtesting.rules.StatementAdapter.evaluate(StatementAdapter.java:36)
	at org.apache.lucene.util.TestRuleStoreClassName$1.evaluate(TestRuleStoreClassName.java:41)
	at com.carrotsearch.randomizedtesting.rules.NoShadowingOrOverridesOnMethodsRule$1.evaluate(NoShadowingOrOverridesOnMethodsRule.java:40)
	at com.carrotsearch.randomizedtesting.rules.NoShadowingOrOverridesOnMethodsRule$1.evaluate(NoShadowingOrOverridesOnMethodsRule.java:40)
	at com.carrotsearch.randomizedtesting.rules.StatementAdapter.evaluate(StatementAdapter.java:36)
	at com.carrotsearch.randomizedtesting.rules.StatementAdapter.evaluate(StatementAdapter.java:36)
	at com.carrotsearch.randomizedtesting.rules.StatementAdapter.evaluate(StatementAdapter.java:36)
	at org.apache.lucene.util.TestRuleAssertionsRequired$1.evaluate(TestRuleAssertionsRequired.java:53)
	at org.apache.lucene.util.TestRuleMarkFailure$1.evaluate(TestRuleMarkFailure.java:47)
	at org.apache.lucene.util.TestRuleIgnoreAfterMaxFailures$1.evaluate(TestRuleIgnoreAfterMaxFailures.java:64)
	at org.apache.lucene.util.TestRuleIgnoreTestSuites$1.evaluate(TestRuleIgnoreTestSuites.java:54)
	at com.carrotsearch.randomizedtesting.rules.StatementAdapter.evaluate(StatementAdapter.java:36)
	at com.carrotsearch.randomizedtesting.ThreadLeakControl$StatementRunner.run(ThreadLeakControl.java:368)
	at java.lang.Thread.run(Thread.java:748)


FAILED:  org.apache.solr.cloud.autoscaling.IndexSizeTriggerTest.testSplitIntegration

Error Message:
last state: DocCollection(testSplitIntegration_collection//clusterstate.json/169)={   "replicationFactor":"1",   "pullReplicas":"0",   "router":{"name":"compositeId"},   "maxShardsPerNode":"2",   "autoAddReplicas":"false",   "nrtReplicas":"2",   "tlogReplicas":"0",   "autoCreated":"true",   "shards":{     "shard1_1_0":{       "state":"active",       "replicas":{         "core_node14":{           "core":"testSplitIntegration_collection_shard1_1_0_replica1",           "SEARCHER.searcher.maxDoc":6,           "SEARCHER.searcher.deletedDocs":0,           "INDEX.sizeInBytes":23480,           "node_name":"127.0.0.1:10129_solr",           "base_url":"http://127.0.0.1:10129/solr",           "state":"active",           "type":"NRT",           "INDEX.sizeInGB":2.1867454051971436E-5,           "SEARCHER.searcher.numDocs":6},         "core_node13":{           "core":"testSplitIntegration_collection_shard1_1_0_replica0",           "SEARCHER.searcher.maxDoc":6,           "SEARCHER.searcher.deletedDocs":0,           "INDEX.sizeInBytes":23480,           "node_name":"127.0.0.1:10130_solr",           "base_url":"http://127.0.0.1:10130/solr",           "state":"active",           "type":"NRT",           "INDEX.sizeInGB":2.1867454051971436E-5,           "SEARCHER.searcher.numDocs":6}}},     "shard2":{       "replicas":{         "core_node3":{           "core":"testSplitIntegration_collection_shard2_replica_n3",           "SEARCHER.searcher.maxDoc":0,           "SEARCHER.searcher.deletedDocs":0,           "INDEX.sizeInBytes":10240,           "node_name":"127.0.0.1:10129_solr",           "state":"active",           "type":"NRT",           "INDEX.sizeInGB":9.5367431640625E-6,           "SEARCHER.searcher.numDocs":0},         "core_node4":{           "core":"testSplitIntegration_collection_shard2_replica_n4",           "SEARCHER.searcher.maxDoc":0,           "SEARCHER.searcher.deletedDocs":0,           "INDEX.sizeInBytes":10240,           "node_name":"127.0.0.1:10130_solr",           "state":"active",           "type":"NRT",           "INDEX.sizeInGB":9.5367431640625E-6,           "SEARCHER.searcher.numDocs":0}},       "range":"0-7fffffff",       "state":"active"},     "shard1_1_1":{       "state":"active",       "replicas":{"core_node15":{           "core":"testSplitIntegration_collection_shard1_1_1_replica0",           "SEARCHER.searcher.maxDoc":6,           "SEARCHER.searcher.deletedDocs":0,           "INDEX.sizeInBytes":13240,           "node_name":"127.0.0.1:10130_solr",           "base_url":"http://127.0.0.1:10130/solr",           "state":"active",           "type":"NRT",           "INDEX.sizeInGB":1.2330710887908936E-5,           "SEARCHER.searcher.numDocs":6}}},     "shard1":{       "stateTimestamp":"1530591564065884800",       "replicas":{         "core_node1":{           "core":"testSplitIntegration_collection_shard1_replica_n1",           "leader":"true",           "SEARCHER.searcher.maxDoc":25,           "SEARCHER.searcher.deletedDocs":0,           "INDEX.sizeInBytes":22740,           "node_name":"127.0.0.1:10129_solr",           "state":"active",           "type":"NRT",           "INDEX.sizeInGB":2.117827534675598E-5,           "SEARCHER.searcher.numDocs":25},         "core_node2":{           "core":"testSplitIntegration_collection_shard1_replica_n2",           "SEARCHER.searcher.maxDoc":25,           "SEARCHER.searcher.deletedDocs":0,           "INDEX.sizeInBytes":22740,           "node_name":"127.0.0.1:10130_solr",           "state":"active",           "type":"NRT",           "INDEX.sizeInGB":2.117827534675598E-5,           "SEARCHER.searcher.numDocs":25}},       "range":"80000000-ffffffff",       "state":"inactive"},     "shard1_1":{       "parent":"shard1",       "stateTimestamp":"1530591564066455800",       "range":"c0000000-ffffffff",       "state":"active",       "replicas":{         "core_node10":{           "leader":"true",           "core":"testSplitIntegration_collection_shard1_1_replica1",           "SEARCHER.searcher.maxDoc":12,           "SEARCHER.searcher.deletedDocs":0,           "INDEX.sizeInBytes":16240,           "node_name":"127.0.0.1:10129_solr",           "base_url":"http://127.0.0.1:10129/solr",           "state":"active",           "type":"NRT",           "INDEX.sizeInGB":1.5124678611755371E-5,           "SEARCHER.searcher.numDocs":12},         "core_node9":{           "core":"testSplitIntegration_collection_shard1_1_replica0",           "SEARCHER.searcher.maxDoc":12,           "SEARCHER.searcher.deletedDocs":0,           "INDEX.sizeInBytes":16240,           "node_name":"127.0.0.1:10130_solr",           "base_url":"http://127.0.0.1:10130/solr",           "state":"active",           "type":"NRT",           "INDEX.sizeInGB":1.5124678611755371E-5,           "SEARCHER.searcher.numDocs":12}}},     "shard1_0":{       "parent":"shard1",       "stateTimestamp":"1530591564066328550",       "range":"80000000-bfffffff",       "state":"active",       "replicas":{         "core_node7":{           "leader":"true",           "core":"testSplitIntegration_collection_shard1_0_replica0",           "SEARCHER.searcher.maxDoc":13,           "SEARCHER.searcher.deletedDocs":0,           "INDEX.sizeInBytes":26980,           "node_name":"127.0.0.1:10130_solr",           "base_url":"http://127.0.0.1:10130/solr",           "state":"active",           "type":"NRT",           "INDEX.sizeInGB":2.512708306312561E-5,           "SEARCHER.searcher.numDocs":13},         "core_node8":{           "core":"testSplitIntegration_collection_shard1_0_replica1",           "SEARCHER.searcher.maxDoc":13,           "SEARCHER.searcher.deletedDocs":0,           "INDEX.sizeInBytes":26980,           "node_name":"127.0.0.1:10129_solr",           "base_url":"http://127.0.0.1:10129/solr",           "state":"active",           "type":"NRT",           "INDEX.sizeInGB":2.512708306312561E-5,           "SEARCHER.searcher.numDocs":13}}}}}

Stack Trace:
java.util.concurrent.TimeoutException: last state: DocCollection(testSplitIntegration_collection//clusterstate.json/169)={
  "replicationFactor":"1",
  "pullReplicas":"0",
  "router":{"name":"compositeId"},
  "maxShardsPerNode":"2",
  "autoAddReplicas":"false",
  "nrtReplicas":"2",
  "tlogReplicas":"0",
  "autoCreated":"true",
  "shards":{
    "shard1_1_0":{
      "state":"active",
      "replicas":{
        "core_node14":{
          "core":"testSplitIntegration_collection_shard1_1_0_replica1",
          "SEARCHER.searcher.maxDoc":6,
          "SEARCHER.searcher.deletedDocs":0,
          "INDEX.sizeInBytes":23480,
          "node_name":"127.0.0.1:10129_solr",
          "base_url":"http://127.0.0.1:10129/solr",
          "state":"active",
          "type":"NRT",
          "INDEX.sizeInGB":2.1867454051971436E-5,
          "SEARCHER.searcher.numDocs":6},
        "core_node13":{
          "core":"testSplitIntegration_collection_shard1_1_0_replica0",
          "SEARCHER.searcher.maxDoc":6,
          "SEARCHER.searcher.deletedDocs":0,
          "INDEX.sizeInBytes":23480,
          "node_name":"127.0.0.1:10130_solr",
          "base_url":"http://127.0.0.1:10130/solr",
          "state":"active",
          "type":"NRT",
          "INDEX.sizeInGB":2.1867454051971436E-5,
          "SEARCHER.searcher.numDocs":6}}},
    "shard2":{
      "replicas":{
        "core_node3":{
          "core":"testSplitIntegration_collection_shard2_replica_n3",
          "SEARCHER.searcher.maxDoc":0,
          "SEARCHER.searcher.deletedDocs":0,
          "INDEX.sizeInBytes":10240,
          "node_name":"127.0.0.1:10129_solr",
          "state":"active",
          "type":"NRT",
          "INDEX.sizeInGB":9.5367431640625E-6,
          "SEARCHER.searcher.numDocs":0},
        "core_node4":{
          "core":"testSplitIntegration_collection_shard2_replica_n4",
          "SEARCHER.searcher.maxDoc":0,
          "SEARCHER.searcher.deletedDocs":0,
          "INDEX.sizeInBytes":10240,
          "node_name":"127.0.0.1:10130_solr",
          "state":"active",
          "type":"NRT",
          "INDEX.sizeInGB":9.5367431640625E-6,
          "SEARCHER.searcher.numDocs":0}},
      "range":"0-7fffffff",
      "state":"active"},
    "shard1_1_1":{
      "state":"active",
      "replicas":{"core_node15":{
          "core":"testSplitIntegration_collection_shard1_1_1_replica0",
          "SEARCHER.searcher.maxDoc":6,
          "SEARCHER.searcher.deletedDocs":0,
          "INDEX.sizeInBytes":13240,
          "node_name":"127.0.0.1:10130_solr",
          "base_url":"http://127.0.0.1:10130/solr",
          "state":"active",
          "type":"NRT",
          "INDEX.sizeInGB":1.2330710887908936E-5,
          "SEARCHER.searcher.numDocs":6}}},
    "shard1":{
      "stateTimestamp":"1530591564065884800",
      "replicas":{
        "core_node1":{
          "core":"testSplitIntegration_collection_shard1_replica_n1",
          "leader":"true",
          "SEARCHER.searcher.maxDoc":25,
          "SEARCHER.searcher.deletedDocs":0,
          "INDEX.sizeInBytes":22740,
          "node_name":"127.0.0.1:10129_solr",
          "state":"active",
          "type":"NRT",
          "INDEX.sizeInGB":2.117827534675598E-5,
          "SEARCHER.searcher.numDocs":25},
        "core_node2":{
          "core":"testSplitIntegration_collection_shard1_replica_n2",
          "SEARCHER.searcher.maxDoc":25,
          "SEARCHER.searcher.deletedDocs":0,
          "INDEX.sizeInBytes":22740,
          "node_name":"127.0.0.1:10130_solr",
          "state":"active",
          "type":"NRT",
          "INDEX.sizeInGB":2.117827534675598E-5,
          "SEARCHER.searcher.numDocs":25}},
      "range":"80000000-ffffffff",
      "state":"inactive"},
    "shard1_1":{
      "parent":"shard1",
      "stateTimestamp":"1530591564066455800",
      "range":"c0000000-ffffffff",
      "state":"active",
      "replicas":{
        "core_node10":{
          "leader":"true",
          "core":"testSplitIntegration_collection_shard1_1_replica1",
          "SEARCHER.searcher.maxDoc":12,
          "SEARCHER.searcher.deletedDocs":0,
          "INDEX.sizeInBytes":16240,
          "node_name":"127.0.0.1:10129_solr",
          "base_url":"http://127.0.0.1:10129/solr",
          "state":"active",
          "type":"NRT",
          "INDEX.sizeInGB":1.5124678611755371E-5,
          "SEARCHER.searcher.numDocs":12},
        "core_node9":{
          "core":"testSplitIntegration_collection_shard1_1_replica0",
          "SEARCHER.searcher.maxDoc":12,
          "SEARCHER.searcher.deletedDocs":0,
          "INDEX.sizeInBytes":16240,
          "node_name":"127.0.0.1:10130_solr",
          "base_url":"http://127.0.0.1:10130/solr",
          "state":"active",
          "type":"NRT",
          "INDEX.sizeInGB":1.5124678611755371E-5,
          "SEARCHER.searcher.numDocs":12}}},
    "shard1_0":{
      "parent":"shard1",
      "stateTimestamp":"1530591564066328550",
      "range":"80000000-bfffffff",
      "state":"active",
      "replicas":{
        "core_node7":{
          "leader":"true",
          "core":"testSplitIntegration_collection_shard1_0_replica0",
          "SEARCHER.searcher.maxDoc":13,
          "SEARCHER.searcher.deletedDocs":0,
          "INDEX.sizeInBytes":26980,
          "node_name":"127.0.0.1:10130_solr",
          "base_url":"http://127.0.0.1:10130/solr",
          "state":"active",
          "type":"NRT",
          "INDEX.sizeInGB":2.512708306312561E-5,
          "SEARCHER.searcher.numDocs":13},
        "core_node8":{
          "core":"testSplitIntegration_collection_shard1_0_replica1",
          "SEARCHER.searcher.maxDoc":13,
          "SEARCHER.searcher.deletedDocs":0,
          "INDEX.sizeInBytes":26980,
          "node_name":"127.0.0.1:10129_solr",
          "base_url":"http://127.0.0.1:10129/solr",
          "state":"active",
          "type":"NRT",
          "INDEX.sizeInGB":2.512708306312561E-5,
          "SEARCHER.searcher.numDocs":13}}}}}
	at __randomizedtesting.SeedInfo.seed([B49AFC4C00ADAE1B:8D14450C2F5267E5]:0)
	at org.apache.solr.cloud.CloudTestUtils.waitForState(CloudTestUtils.java:111)
	at org.apache.solr.cloud.autoscaling.IndexSizeTriggerTest.testSplitIntegration(IndexSizeTriggerTest.java:312)
	at sun.reflect.NativeMethodAccessorImpl.invoke0(Native Method)
	at sun.reflect.NativeMethodAccessorImpl.invoke(NativeMethodAccessorImpl.java:62)
	at sun.reflect.DelegatingMethodAccessorImpl.invoke(DelegatingMethodAccessorImpl.java:43)
	at java.lang.reflect.Method.invoke(Method.java:498)
	at com.carrotsearch.randomizedtesting.RandomizedRunner.invoke(RandomizedRunner.java:1737)
	at com.carrotsearch.randomizedtesting.RandomizedRunner$8.evaluate(RandomizedRunner.java:934)
	at com.carrotsearch.randomizedtesting.RandomizedRunner$9.evaluate(RandomizedRunner.java:970)
	at com.carrotsearch.randomizedtesting.RandomizedRunner$10.evaluate(RandomizedRunner.java:984)
	at com.carrotsearch.randomizedtesting.rules.SystemPropertiesRestoreRule$1.evaluate(SystemPropertiesRestoreRule.java:57)
	at org.apache.lucene.util.TestRuleSetupTeardownChained$1.evaluate(TestRuleSetupTeardownChained.java:49)
	at org.apache.lucene.util.AbstractBeforeAfterRule$1.evaluate(AbstractBeforeAfterRule.java:45)
	at org.apache.lucene.util.TestRuleThreadAndTestName$1.evaluate(TestRuleThreadAndTestName.java:48)
	at org.apache.lucene.util.TestRuleIgnoreAfterMaxFailures$1.evaluate(TestRuleIgnoreAfterMaxFailures.java:64)
	at org.apache.lucene.util.TestRuleMarkFailure$1.evaluate(TestRuleMarkFailure.java:47)
	at com.carrotsearch.randomizedtesting.rules.StatementAdapter.evaluate(StatementAdapter.java:36)
	at com.carrotsearch.randomizedtesting.ThreadLeakControl$StatementRunner.run(ThreadLeakControl.java:368)
	at com.carrotsearch.randomizedtesting.ThreadLeakControl.forkTimeoutingTask(ThreadLeakControl.java:817)
	at com.carrotsearch.randomizedtesting.ThreadLeakControl$3.evaluate(ThreadLeakControl.java:468)
	at com.carrotsearch.randomizedtesting.RandomizedRunner.runSingleTest(RandomizedRunner.java:943)
	at com.carrotsearch.randomizedtesting.RandomizedRunner$5.evaluate(RandomizedRunner.java:829)
	at com.carrotsearch.randomizedtesting.RandomizedRunner$6.evaluate(RandomizedRunner.java:879)
	at com.carrotsearch.randomizedtesting.RandomizedRunner$7.evaluate(RandomizedRunner.java:890)
	at com.carrotsearch.randomizedtesting.rules.StatementAdapter.evaluate(StatementAdapter.java:36)
	at com.carrotsearch.randomizedtesting.rules.SystemPropertiesRestoreRule$1.evaluate(SystemPropertiesRestoreRule.java:57)
	at org.apache.lucene.util.AbstractBeforeAfterRule$1.evaluate(AbstractBeforeAfterRule.java:45)
	at com.carrotsearch.randomizedtesting.rules.StatementAdapter.evaluate(StatementAdapter.java:36)
	at org.apache.lucene.util.TestRuleStoreClassName$1.evaluate(TestRuleStoreClassName.java:41)
	at com.carrotsearch.randomizedtesting.rules.NoShadowingOrOverridesOnMethodsRule$1.evaluate(NoShadowingOrOverridesOnMethodsRule.java:40)
	at com.carrotsearch.randomizedtesting.rules.NoShadowingOrOverridesOnMethodsRule$1.evaluate(NoShadowingOrOverridesOnMethodsRule.java:40)
	at com.carrotsearch.randomizedtesting.rules.StatementAdapter.evaluate(StatementAdapter.java:36)
	at com.carrotsearch.randomizedtesting.rules.StatementAdapter.evaluate(StatementAdapter.java:36)
	at com.carrotsearch.randomizedtesting.rules.StatementAdapter.evaluate(StatementAdapter.java:36)
	at org.apache.lucene.util.TestRuleAssertionsRequired$1.evaluate(TestRuleAssertionsRequired.java:53)
	at org.apache.lucene.util.TestRuleMarkFailure$1.evaluate(TestRuleMarkFailure.java:47)
	at org.apache.lucene.util.TestRuleIgnoreAfterMaxFailures$1.evaluate(TestRuleIgnoreAfterMaxFailures.java:64)
	at org.apache.lucene.util.TestRuleIgnoreTestSuites$1.evaluate(TestRuleIgnoreTestSuites.java:54)
	at com.carrotsearch.randomizedtesting.rules.StatementAdapter.evaluate(StatementAdapter.java:36)
	at com.carrotsearch.randomizedtesting.ThreadLeakControl$StatementRunner.run(ThreadLeakControl.java:368)
	at java.lang.Thread.run(Thread.java:748)


FAILED:  org.apache.solr.cloud.autoscaling.sim.TestTriggerIntegration.testNodeAddedTriggerRestoreState

Error Message:
The trigger did not fire at all

Stack Trace:
java.lang.AssertionError: The trigger did not fire at all
	at __randomizedtesting.SeedInfo.seed([B49AFC4C00ADAE1B:3CA775333A6D4FB6]:0)
	at org.junit.Assert.fail(Assert.java:93)
	at org.junit.Assert.assertTrue(Assert.java:43)
	at org.apache.solr.cloud.autoscaling.sim.TestTriggerIntegration.testNodeAddedTriggerRestoreState(TestTriggerIntegration.java:383)
	at sun.reflect.NativeMethodAccessorImpl.invoke0(Native Method)
	at sun.reflect.NativeMethodAccessorImpl.invoke(NativeMethodAccessorImpl.java:62)
	at sun.reflect.DelegatingMethodAccessorImpl.invoke(DelegatingMethodAccessorImpl.java:43)
	at java.lang.reflect.Method.invoke(Method.java:498)
	at com.carrotsearch.randomizedtesting.RandomizedRunner.invoke(RandomizedRunner.java:1737)
	at com.carrotsearch.randomizedtesting.RandomizedRunner$8.evaluate(RandomizedRunner.java:934)
	at com.carrotsearch.randomizedtesting.RandomizedRunner$9.evaluate(RandomizedRunner.java:970)
	at com.carrotsearch.randomizedtesting.RandomizedRunner$10.evaluate(RandomizedRunner.java:984)
	at com.carrotsearch.randomizedtesting.rules.SystemPropertiesRestoreRule$1.evaluate(SystemPropertiesRestoreRule.java:57)
	at org.apache.lucene.util.TestRuleSetupTeardownChained$1.evaluate(TestRuleSetupTeardownChained.java:49)
	at org.apache.lucene.util.AbstractBeforeAfterRule$1.evaluate(AbstractBeforeAfterRule.java:45)
	at org.apache.lucene.util.TestRuleThreadAndTestName$1.evaluate(TestRuleThreadAndTestName.java:48)
	at org.apache.lucene.util.TestRuleIgnoreAfterMaxFailures$1.evaluate(TestRuleIgnoreAfterMaxFailures.java:64)
	at org.apache.lucene.util.TestRuleMarkFailure$1.evaluate(TestRuleMarkFailure.java:47)
	at com.carrotsearch.randomizedtesting.rules.StatementAdapter.evaluate(StatementAdapter.java:36)
	at com.carrotsearch.randomizedtesting.ThreadLeakControl$StatementRunner.run(ThreadLeakControl.java:368)
	at com.carrotsearch.randomizedtesting.ThreadLeakControl.forkTimeoutingTask(ThreadLeakControl.java:817)
	at com.carrotsearch.randomizedtesting.ThreadLeakControl$3.evaluate(ThreadLeakControl.java:468)
	at com.carrotsearch.randomizedtesting.RandomizedRunner.runSingleTest(RandomizedRunner.java:943)
	at com.carrotsearch.randomizedtesting.RandomizedRunner$5.evaluate(RandomizedRunner.java:829)
	at com.carrotsearch.randomizedtesting.RandomizedRunner$6.evaluate(RandomizedRunner.java:879)
	at com.carrotsearch.randomizedtesting.RandomizedRunner$7.evaluate(RandomizedRunner.java:890)
	at com.carrotsearch.randomizedtesting.rules.StatementAdapter.evaluate(StatementAdapter.java:36)
	at com.carrotsearch.randomizedtesting.rules.SystemPropertiesRestoreRule$1.evaluate(SystemPropertiesRestoreRule.java:57)
	at org.apache.lucene.util.AbstractBeforeAfterRule$1.evaluate(AbstractBeforeAfterRule.java:45)
	at com.carrotsearch.randomizedtesting.rules.StatementAdapter.evaluate(StatementAdapter.java:36)
	at org.apache.lucene.util.TestRuleStoreClassName$1.evaluate(TestRuleStoreClassName.java:41)
	at com.carrotsearch.randomizedtesting.rules.NoShadowingOrOverridesOnMethodsRule$1.evaluate(NoShadowingOrOverridesOnMethodsRule.java:40)
	at com.carrotsearch.randomizedtesting.rules.NoShadowingOrOverridesOnMethodsRule$1.evaluate(NoShadowingOrOverridesOnMethodsRule.java:40)
	at com.carrotsearch.randomizedtesting.rules.StatementAdapter.evaluate(StatementAdapter.java:36)
	at com.carrotsearch.randomizedtesting.rules.StatementAdapter.evaluate(StatementAdapter.java:36)
	at com.carrotsearch.randomizedtesting.rules.StatementAdapter.evaluate(StatementAdapter.java:36)
	at org.apache.lucene.util.TestRuleAssertionsRequired$1.evaluate(TestRuleAssertionsRequired.java:53)
	at org.apache.lucene.util.TestRuleMarkFailure$1.evaluate(TestRuleMarkFailure.java:47)
	at org.apache.lucene.util.TestRuleIgnoreAfterMaxFailures$1.evaluate(TestRuleIgnoreAfterMaxFailures.java:64)
	at org.apache.lucene.util.TestRuleIgnoreTestSuites$1.evaluate(TestRuleIgnoreTestSuites.java:54)
	at com.carrotsearch.randomizedtesting.rules.StatementAdapter.evaluate(StatementAdapter.java:36)
	at com.carrotsearch.randomizedtesting.ThreadLeakControl$StatementRunner.run(ThreadLeakControl.java:368)
	at java.lang.Thread.run(Thread.java:748)


FAILED:  org.apache.solr.cloud.autoscaling.sim.TestTriggerIntegration.testSearchRate

Error Message:
The trigger did not fire at all

Stack Trace:
java.lang.AssertionError: The trigger did not fire at all
	at __randomizedtesting.SeedInfo.seed([B49AFC4C00ADAE1B:E9D2E2C5CF6B0854]:0)
	at org.junit.Assert.fail(Assert.java:93)
	at org.junit.Assert.assertTrue(Assert.java:43)
	at org.apache.solr.cloud.autoscaling.sim.TestTriggerIntegration.testSearchRate(TestTriggerIntegration.java:1204)
	at sun.reflect.NativeMethodAccessorImpl.invoke0(Native Method)
	at sun.reflect.NativeMethodAccessorImpl.invoke(NativeMethodAccessorImpl.java:62)
	at sun.reflect.DelegatingMethodAccessorImpl.invoke(DelegatingMethodAccessorImpl.java:43)
	at java.lang.reflect.Method.invoke(Method.java:498)
	at com.carrotsearch.randomizedtesting.RandomizedRunner.invoke(RandomizedRunner.java:1737)
	at com.carrotsearch.randomizedtesting.RandomizedRunner$8.evaluate(RandomizedRunner.java:934)
	at com.carrotsearch.randomizedtesting.RandomizedRunner$9.evaluate(RandomizedRunner.java:970)
	at com.carrotsearch.randomizedtesting.RandomizedRunner$10.evaluate(RandomizedRunner.java:984)
	at com.carrotsearch.randomizedtesting.rules.SystemPropertiesRestoreRule$1.evaluate(SystemPropertiesRestoreRule.java:57)
	at org.apache.lucene.util.TestRuleSetupTeardownChained$1.evaluate(TestRuleSetupTeardownChained.java:49)
	at org.apache.lucene.util.AbstractBeforeAfterRule$1.evaluate(AbstractBeforeAfterRule.java:45)
	at org.apache.lucene.util.TestRuleThreadAndTestName$1.evaluate(TestRuleThreadAndTestName.java:48)
	at org.apache.lucene.util.TestRuleIgnoreAfterMaxFailures$1.evaluate(TestRuleIgnoreAfterMaxFailures.java:64)
	at org.apache.lucene.util.TestRuleMarkFailure$1.evaluate(TestRuleMarkFailure.java:47)
	at com.carrotsearch.randomizedtesting.rules.StatementAdapter.evaluate(StatementAdapter.java:36)
	at com.carrotsearch.randomizedtesting.ThreadLeakControl$StatementRunner.run(ThreadLeakControl.java:368)
	at com.carrotsearch.randomizedtesting.ThreadLeakControl.forkTimeoutingTask(ThreadLeakControl.java:817)
	at com.carrotsearch.randomizedtesting.ThreadLeakControl$3.evaluate(ThreadLeakControl.java:468)
	at com.carrotsearch.randomizedtesting.RandomizedRunner.runSingleTest(RandomizedRunner.java:943)
	at com.carrotsearch.randomizedtesting.RandomizedRunner$5.evaluate(RandomizedRunner.java:829)
	at com.carrotsearch.randomizedtesting.RandomizedRunner$6.evaluate(RandomizedRunner.java:879)
	at com.carrotsearch.randomizedtesting.RandomizedRunner$7.evaluate(RandomizedRunner.java:890)
	at com.carrotsearch.randomizedtesting.rules.StatementAdapter.evaluate(StatementAdapter.java:36)
	at com.carrotsearch.randomizedtesting.rules.SystemPropertiesRestoreRule$1.evaluate(SystemPropertiesRestoreRule.java:57)
	at org.apache.lucene.util.AbstractBeforeAfterRule$1.evaluate(AbstractBeforeAfterRule.java:45)
	at com.carrotsearch.randomizedtesting.rules.StatementAdapter.evaluate(StatementAdapter.java:36)
	at org.apache.lucene.util.TestRuleStoreClassName$1.evaluate(TestRuleStoreClassName.java:41)
	at com.carrotsearch.randomizedtesting.rules.NoShadowingOrOverridesOnMethodsRule$1.evaluate(NoShadowingOrOverridesOnMethodsRule.java:40)
	at com.carrotsearch.randomizedtesting.rules.NoShadowingOrOverridesOnMethodsRule$1.evaluate(NoShadowingOrOverridesOnMethodsRule.java:40)
	at com.carrotsearch.randomizedtesting.rules.StatementAdapter.evaluate(StatementAdapter.java:36)
	at com.carrotsearch.randomizedtesting.rules.StatementAdapter.evaluate(StatementAdapter.java:36)
	at com.carrotsearch.randomizedtesting.rules.StatementAdapter.evaluate(StatementAdapter.java:36)
	at org.apache.lucene.util.TestRuleAssertionsRequired$1.evaluate(TestRuleAssertionsRequired.java:53)
	at org.apache.lucene.util.TestRuleMarkFailure$1.evaluate(TestRuleMarkFailure.java:47)
	at org.apache.lucene.util.TestRuleIgnoreAfterMaxFailures$1.evaluate(TestRuleIgnoreAfterMaxFailures.java:64)
	at org.apache.lucene.util.TestRuleIgnoreTestSuites$1.evaluate(TestRuleIgnoreTestSuites.java:54)
	at com.carrotsearch.randomizedtesting.rules.StatementAdapter.evaluate(StatementAdapter.java:36)
	at com.carrotsearch.randomizedtesting.ThreadLeakControl$StatementRunner.run(ThreadLeakControl.java:368)
	at java.lang.Thread.run(Thread.java:748)


FAILED:  org.apache.solr.cloud.cdcr.CdcrBidirectionalTest.testBiDir

Error Message:
Captured an uncaught exception in thread: Thread[id=13211, name=cdcr-replicator-4674-thread-1, state=RUNNABLE, group=TGRP-CdcrBidirectionalTest]

Stack Trace:
com.carrotsearch.randomizedtesting.UncaughtExceptionError: Captured an uncaught exception in thread: Thread[id=13211, name=cdcr-replicator-4674-thread-1, state=RUNNABLE, group=TGRP-CdcrBidirectionalTest]
Caused by: java.lang.AssertionError: 1604822256668639232 != 1604822256237674496
	at __randomizedtesting.SeedInfo.seed([B49AFC4C00ADAE1B]:0)
	at org.apache.solr.update.CdcrUpdateLog$CdcrLogReader.forwardSeek(CdcrUpdateLog.java:611)
	at org.apache.solr.handler.CdcrReplicator.run(CdcrReplicator.java:125)
	at org.apache.solr.handler.CdcrReplicatorScheduler.lambda$null$0(CdcrReplicatorScheduler.java:81)
	at org.apache.solr.common.util.ExecutorUtil$MDCAwareThreadPoolExecutor.lambda$execute$0(ExecutorUtil.java:209)
	at java.util.concurrent.ThreadPoolExecutor.runWorker(ThreadPoolExecutor.java:1149)
	at java.util.concurrent.ThreadPoolExecutor$Worker.run(ThreadPoolExecutor.java:624)
	at java.lang.Thread.run(Thread.java:748)


FAILED:  org.apache.solr.cloud.api.collections.ShardSplitTest.testSplitWithChaosMonkey

Error Message:
We think that split was successful but sub-shard states were not updated even after 2 minutes.

Stack Trace:
java.lang.AssertionError: We think that split was successful but sub-shard states were not updated even after 2 minutes.
	at __randomizedtesting.SeedInfo.seed([B49AFC4C00ADAE1B:3FBD2F9D41AB059F]:0)
	at org.junit.Assert.fail(Assert.java:93)
	at org.apache.solr.cloud.api.collections.ShardSplitTest.testSplitWithChaosMonkey(ShardSplitTest.java:555)
	at sun.reflect.NativeMethodAccessorImpl.invoke0(Native Method)
	at sun.reflect.NativeMethodAccessorImpl.invoke(NativeMethodAccessorImpl.java:62)
	at sun.reflect.DelegatingMethodAccessorImpl.invoke(DelegatingMethodAccessorImpl.java:43)
	at java.lang.reflect.Method.invoke(Method.java:498)
	at com.carrotsearch.randomizedtesting.RandomizedRunner.invoke(RandomizedRunner.java:1737)
	at com.carrotsearch.randomizedtesting.RandomizedRunner$8.evaluate(RandomizedRunner.java:934)
	at com.carrotsearch.randomizedtesting.RandomizedRunner$9.evaluate(RandomizedRunner.java:970)
	at com.carrotsearch.randomizedtesting.RandomizedRunner$10.evaluate(RandomizedRunner.java:984)
	at org.apache.solr.BaseDistributedSearchTestCase$ShardsRepeatRule$ShardsFixedStatement.callStatement(BaseDistributedSearchTestCase.java:1008)
	at org.apache.solr.BaseDistributedSearchTestCase$ShardsRepeatRule$ShardsStatement.evaluate(BaseDistributedSearchTestCase.java:983)
	at com.carrotsearch.randomizedtesting.rules.SystemPropertiesRestoreRule$1.evaluate(SystemPropertiesRestoreRule.java:57)
	at org.apache.lucene.util.TestRuleSetupTeardownChained$1.evaluate(TestRuleSetupTeardownChained.java:49)
	at org.apache.lucene.util.AbstractBeforeAfterRule$1.evaluate(AbstractBeforeAfterRule.java:45)
	at org.apache.lucene.util.TestRuleThreadAndTestName$1.evaluate(TestRuleThreadAndTestName.java:48)
	at org.apache.lucene.util.TestRuleIgnoreAfterMaxFailures$1.evaluate(TestRuleIgnoreAfterMaxFailures.java:64)
	at org.apache.lucene.util.TestRuleMarkFailure$1.evaluate(TestRuleMarkFailure.java:47)
	at com.carrotsearch.randomizedtesting.rules.StatementAdapter.evaluate(StatementAdapter.java:36)
	at com.carrotsearch.randomizedtesting.ThreadLeakControl$StatementRunner.run(ThreadLeakControl.java:368)
	at com.carrotsearch.randomizedtesting.ThreadLeakControl.forkTimeoutingTask(ThreadLeakControl.java:817)
	at com.carrotsearch.randomizedtesting.ThreadLeakControl$3.evaluate(ThreadLeakControl.java:468)
	at com.carrotsearch.randomizedtesting.RandomizedRunner.runSingleTest(RandomizedRunner.java:943)
	at com.carrotsearch.randomizedtesting.RandomizedRunner$5.evaluate(RandomizedRunner.java:829)
	at com.carrotsearch.randomizedtesting.RandomizedRunner$6.evaluate(RandomizedRunner.java:879)
	at com.carrotsearch.randomizedtesting.RandomizedRunner$7.evaluate(RandomizedRunner.java:890)
	at com.carrotsearch.randomizedtesting.rules.StatementAdapter.evaluate(StatementAdapter.java:36)
	at com.carrotsearch.randomizedtesting.rules.SystemPropertiesRestoreRule$1.evaluate(SystemPropertiesRestoreRule.java:57)
	at org.apache.lucene.util.AbstractBeforeAfterRule$1.evaluate(AbstractBeforeAfterRule.java:45)
	at com.carrotsearch.randomizedtesting.rules.StatementAdapter.evaluate(StatementAdapter.java:36)
	at org.apache.lucene.util.TestRuleStoreClassName$1.evaluate(TestRuleStoreClassName.java:41)
	at com.carrotsearch.randomizedtesting.rules.NoShadowingOrOverridesOnMethodsRule$1.evaluate(NoShadowingOrOverridesOnMethodsRule.java:40)
	at com.carrotsearch.randomizedtesting.rules.NoShadowingOrOverridesOnMethodsRule$1.evaluate(NoShadowingOrOverridesOnMethodsRule.java:40)
	at com.carrotsearch.randomizedtesting.rules.StatementAdapter.evaluate(StatementAdapter.java:36)
	at com.carrotsearch.randomizedtesting.rules.StatementAdapter.evaluate(StatementAdapter.java:36)
	at com.carrotsearch.randomizedtesting.rules.StatementAdapter.evaluate(StatementAdapter.java:36)
	at org.apache.lucene.util.TestRuleAssertionsRequired$1.evaluate(TestRuleAssertionsRequired.java:53)
	at org.apache.lucene.util.TestRuleMarkFailure$1.evaluate(TestRuleMarkFailure.java:47)
	at org.apache.lucene.util.TestRuleIgnoreAfterMaxFailures$1.evaluate(TestRuleIgnoreAfterMaxFailures.java:64)
	at org.apache.lucene.util.TestRuleIgnoreTestSuites$1.evaluate(TestRuleIgnoreTestSuites.java:54)
	at com.carrotsearch.randomizedtesting.rules.StatementAdapter.evaluate(StatementAdapter.java:36)
	at com.carrotsearch.randomizedtesting.ThreadLeakControl$StatementRunner.run(ThreadLeakControl.java:368)
	at java.lang.Thread.run(Thread.java:748)




Build Log:
[...truncated 12336 lines...]
   [junit4] Suite: org.apache.solr.cloud.autoscaling.sim.TestTriggerIntegration
   [junit4]   2> Creating dataDir: /home/jenkins/jenkins-slave/workspace/Lucene-Solr-BadApples-Tests-master/solr/build/solr-core/test/J2/temp/solr.cloud.autoscaling.sim.TestTriggerIntegration_B49AFC4C00ADAE1B-001/init-core-data-001
   [junit4]   2> 4013 INFO  (SUITE-TestTriggerIntegration-seed#[B49AFC4C00ADAE1B]-worker) [    ] o.a.s.SolrTestCaseJ4 Using PointFields (NUMERIC_POINTS_SYSPROP=true) w/NUMERIC_DOCVALUES_SYSPROP=false
   [junit4]   2> 4090 INFO  (SUITE-TestTriggerIntegration-seed#[B49AFC4C00ADAE1B]-worker) [    ] o.e.j.u.log Logging initialized @4138ms to org.eclipse.jetty.util.log.Slf4jLog
   [junit4]   2> 4120 INFO  (SUITE-TestTriggerIntegration-seed#[B49AFC4C00ADAE1B]-worker) [    ] o.a.s.SolrTestCaseJ4 Randomized ssl (true) and clientAuth (true) via: @org.apache.solr.util.RandomizeSSL(reason=, value=NaN, ssl=NaN, clientAuth=NaN)
   [junit4]   2> 4533 INFO  (SUITE-TestTriggerIntegration-seed#[B49AFC4C00ADAE1B]-worker) [    ] o.a.s.SolrTestCaseJ4 SecureRandom sanity checks: test.solr.allowed.securerandom=null & java.security.egd=file:/dev/./urandom
   [junit4]   2> 4621 INFO  (SUITE-TestTriggerIntegration-seed#[B49AFC4C00ADAE1B]-worker) [    ] o.a.s.c.SolrResourceLoader solr home defaulted to 'solr/' (could not find system property or JNDI)
   [junit4]   2> 4799 DEBUG (SUITE-TestTriggerIntegration-seed#[B49AFC4C00ADAE1B]-worker) [    ] o.a.s.c.a.s.SimClusterStateProvider --- new Overseer leader: 127.0.0.1:10000_solr
   [junit4]   2> 4856 INFO  (SUITE-TestTriggerIntegration-seed#[B49AFC4C00ADAE1B]-worker) [    ] o.a.s.h.a.MetricsHistoryHandler No .system collection, keeping metrics history in memory.
   [junit4]   2> 4901 INFO  (TEST-TestTriggerIntegration.testNodeAddedTriggerRestoreState-seed#[B49AFC4C00ADAE1B]) [    ] o.a.s.SolrTestCaseJ4 ###Starting testNodeAddedTriggerRestoreState
   [junit4]   2> 4905 INFO  (TEST-TestTriggerIntegration.testNodeAddedTriggerRestoreState-seed#[B49AFC4C00ADAE1B]) [    ] o.a.s.c.a.s.SimCloudManager === Restarting OverseerTriggerThread and clearing object cache...
   [junit4]   2> 4908 DEBUG (TEST-TestTriggerIntegration.testNodeAddedTriggerRestoreState-seed#[B49AFC4C00ADAE1B]) [    ] o.a.s.c.a.ScheduledTriggers Shutting down scheduled thread pool executor now
   [junit4]   2> 4908 DEBUG (TEST-TestTriggerIntegration.testNodeAddedTriggerRestoreState-seed#[B49AFC4C00ADAE1B]) [    ] o.a.s.c.a.ScheduledTriggers Shutting down action executor now
   [junit4]   2> 4909 DEBUG (TEST-TestTriggerIntegration.testNodeAddedTriggerRestoreState-seed#[B49AFC4C00ADAE1B]) [    ] o.a.s.c.a.ScheduledTriggers Awaiting termination for action executor
   [junit4]   2> 4909 DEBUG (TEST-TestTriggerIntegration.testNodeAddedTriggerRestoreState-seed#[B49AFC4C00ADAE1B]) [    ] o.a.s.c.a.ScheduledTriggers Awaiting termination for scheduled thread pool executor
   [junit4]   2> 4909 DEBUG (TEST-TestTriggerIntegration.testNodeAddedTriggerRestoreState-seed#[B49AFC4C00ADAE1B]) [    ] o.a.s.c.a.ScheduledTriggers ScheduledTriggers closed completely
   [junit4]   2> 4909 DEBUG (TEST-TestTriggerIntegration.testNodeAddedTriggerRestoreState-seed#[B49AFC4C00ADAE1B]) [    ] o.a.s.c.a.OverseerTriggerThread OverseerTriggerThread has been closed explicitly
   [junit4]   2> 4910 DEBUG (Simulated OverseerAutoScalingTriggerThread) [    ] o.a.s.c.a.OverseerTriggerThread Adding .auto_add_replicas and .scheduled_maintenance triggers
   [junit4]   2> 4923 DEBUG (Simulated OverseerAutoScalingTriggerThread) [    ] o.a.s.c.a.OverseerTriggerThread Refreshing /autoscaling.json with znode version 1
   [junit4]   2> 5070 DEBUG (Simulated OverseerAutoScalingTriggerThread) [    ] o.a.s.c.a.OverseerTriggerThread Current znodeVersion 1, lastZnodeVersion -1
   [junit4]   2> 5070 DEBUG (Simulated OverseerAutoScalingTriggerThread) [    ] o.a.s.c.a.OverseerTriggerThread Processed trigger updates upto znodeVersion 1
   [junit4]   2> 5095 DEBUG (Simulated OverseerAutoScalingTriggerThread) [    ] o.a.s.c.a.NodeLostTrigger NodeLostTrigger .auto_add_replicas - Initial livenodes: [127.0.0.1:10001_solr, 127.0.0.1:10000_solr]
   [junit4]   2> 5100 DEBUG (Simulated OverseerAutoScalingTriggerThread) [    ] o.a.s.c.a.OverseerTriggerThread -- clean old nodeAdded markers
   [junit4]   2> 5101 DEBUG (Simulated OverseerAutoScalingTriggerThread) [    ] o.a.s.c.a.OverseerTriggerThread Current znodeVersion 1, lastZnodeVersion 1
   [junit4]   2> 5101 DEBUG (ScheduledTrigger-8-thread-2) [    ] o.a.s.c.a.NodeLostTrigger Running NodeLostTrigger: .auto_add_replicas with currently live nodes: 2
   [junit4]   2> 5123 DEBUG (ScheduledTrigger-8-thread-3) [    ] o.a.s.c.a.NodeLostTrigger Running NodeLostTrigger: .auto_add_replicas with currently live nodes: 2
   [junit4]   2> 5143 DEBUG (simCloudManagerPool-7-thread-1) [    ] o.a.s.c.a.AutoScalingHandler Verified autoscaling configuration
   [junit4]   2> 5150 DEBUG (simCloudManagerPool-7-thread-1) [    ] o.a.s.c.a.OverseerTriggerThread Refreshing /autoscaling.json with znode version 2
   [junit4]   2> 5151 DEBUG (ScheduledTrigger-8-thread-4) [    ] o.a.s.c.a.NodeLostTrigger Running NodeLostTrigger: .auto_add_replicas with currently live nodes: 2
   [junit4]   2> 5152 DEBUG (Simulated OverseerAutoScalingTriggerThread) [    ] o.a.s.c.a.OverseerTriggerThread Processed trigger updates upto znodeVersion 2
   [junit4]   2> 5153 DEBUG (Simulated OverseerAutoScalingTriggerThread) [    ] o.a.s.c.a.OverseerTriggerThread -- clean old nodeAdded markers
   [junit4]   2> 5153 DEBUG (Simulated OverseerAutoScalingTriggerThread) [    ] o.a.s.c.a.OverseerTriggerThread Current znodeVersion 2, lastZnodeVersion 2
   [junit4]   2> 5162 DEBUG (simCloudManagerPool-7-thread-2) [    ] o.a.s.c.a.AutoScalingHandler Verified autoscaling configuration
   [junit4]   2> 5164 DEBUG (simCloudManagerPool-7-thread-2) [    ] o.a.s.c.a.OverseerTriggerThread Refreshing /autoscaling.json with znode version 3
   [junit4]   2> 5166 DEBUG (Simulated OverseerAutoScalingTriggerThread) [    ] o.a.s.c.a.OverseerTriggerThread Processed trigger updates upto znodeVersion 3
   [junit4]   2> 5166 INFO  (Simulated OverseerAutoScalingTriggerThread) [    ] o.a.s.c.a.s.TestTriggerIntegration TestTriggerAction init
   [junit4]   2> 5166 DEBUG (Simulated OverseerAutoScalingTriggerThread) [    ] o.a.s.c.a.NodeAddedTrigger NodeAddedTrigger node_added_restore_trigger - Initial livenodes: [127.0.0.1:10001_solr, 127.0.0.1:10000_solr]
   [junit4]   2> 5166 DEBUG (Simulated OverseerAutoScalingTriggerThread) [    ] o.a.s.c.a.NodeAddedTrigger NodeAddedTrigger node_added_restore_trigger instantiated with properties: {event=nodeAdded, waitFor=5, actions=[{name=test, class=org.apache.solr.cloud.autoscaling.sim.TestTriggerIntegration$TestTriggerAction}], enabled=true}
   [junit4]   2> 5167 DEBUG (Simulated OverseerAutoScalingTriggerThread) [    ] o.a.s.c.a.OverseerTriggerThread Current znodeVersion 3, lastZnodeVersion 3
   [junit4]   2> 5167 DEBUG (ScheduledTrigger-8-thread-1) [    ] o.a.s.c.a.NodeAddedTrigger Running NodeAddedTrigger node_added_restore_trigger
   [junit4]   2> 5168 DEBUG (ScheduledTrigger-8-thread-1) [    ] o.a.s.c.a.NodeAddedTrigger Found livenodes: 2
   [junit4]   2> 5171 DEBUG (ScheduledTrigger-8-thread-2) [    ] o.a.s.c.a.NodeLostTrigger Running NodeLostTrigger: .auto_add_replicas with currently live nodes: 2
   [junit4]   2> 5189 DEBUG (ScheduledTrigger-8-thread-3) [    ] o.a.s.c.a.NodeAddedTrigger Running NodeAddedTrigger node_added_restore_trigger
   [junit4]   2> 5189 DEBUG (ScheduledTrigger-8-thread-3) [    ] o.a.s.c.a.NodeAddedTrigger Found livenodes: 3
   [junit4]   2> 5189 DEBUG (ScheduledTrigger-8-thread-3) [    ] o.a.s.c.a.NodeAddedTrigger Tracking new node: 127.0.0.1:10002_solr at time 12812948231221762
   [junit4]   2> 5191 DEBUG (ScheduledTrigger-8-thread-4) [    ] o.a.s.c.a.NodeLostTrigger Running NodeLostTrigger: .auto_add_replicas with currently live nodes: 3
   [junit4]   2> 5210 DEBUG (ScheduledTrigger-8-thread-1) [    ] o.a.s.c.a.NodeAddedTrigger Running NodeAddedTrigger node_added_restore_trigger
   [junit4]   2> 5210 DEBUG (ScheduledTrigger-8-thread-1) [    ] o.a.s.c.a.NodeAddedTrigger Found livenodes: 3
   [junit4]   2> 5211 DEBUG (simCloudManagerPool-7-thread-3) [    ] o.a.s.c.a.AutoScalingHandler Verified autoscaling configuration
   [junit4]   2> 5212 DEBUG (ScheduledTrigger-8-thread-2) [    ] o.a.s.c.a.NodeLostTrigger Running NodeLostTrigger: .auto_add_replicas with currently live nodes: 3
   [junit4]   2> 5212 DEBUG (simCloudManagerPool-7-thread-3) [    ] o.a.s.c.a.OverseerTriggerThread Refreshing /autoscaling.json with znode version 4
   [junit4]   2> 5213 DEBUG (Simulated OverseerAutoScalingTriggerThread) [    ] o.a.s.c.a.OverseerTriggerThread Processed trigger updates upto znodeVersion 4
   [junit4]   2> 5214 INFO  (Simulated OverseerAutoScalingTriggerThread) [    ] o.a.s.c.a.s.TestTriggerIntegration TestTriggerAction init
   [junit4]   2> 5214 DEBUG (Simulated OverseerAutoScalingTriggerThread) [    ] o.a.s.c.a.NodeAddedTrigger NodeAddedTrigger node_added_restore_trigger - Initial livenodes: [127.0.0.1:10001_solr, 127.0.0.1:10000_solr, 127.0.0.1:10002_solr]
   [junit4]   2> 5214 DEBUG (Simulated OverseerAutoScalingTriggerThread) [    ] o.a.s.c.a.NodeAddedTrigger NodeAddedTrigger node_added_restore_trigger instantiated with properties: {event=nodeAdded, waitFor=0, actions=[{name=test, class=org.apache.solr.cloud.autoscaling.sim.TestTriggerIntegration$TestTriggerAction}], enabled=true}
   [junit4]   2> 5214 DEBUG (Simulated OverseerAutoScalingTriggerThread) [    ] o.a.s.c.a.NodeAddedTrigger Adding node from marker path: 127.0.0.1:10002_solr
   [junit4]   2> 5214 DEBUG (Simulated OverseerAutoScalingTriggerThread) [    ] o.a.s.c.a.NodeAddedTrigger NodeAddedTrigger node_added_restore_trigger - removing marker path: /autoscaling/nodeAdded/127.0.0.1:10002_solr
   [junit4]   2> 5214 DEBUG (Simulated OverseerAutoScalingTriggerThread) [    ] o.a.s.c.a.OverseerTriggerThread Current znodeVersion 4, lastZnodeVersion 4
   [junit4]   2> 5215 DEBUG (ScheduledTrigger-8-thread-4) [    ] o.a.s.c.a.NodeAddedTrigger Running NodeAddedTrigger node_added_restore_trigger
   [junit4]   2> 5215 DEBUG (ScheduledTrigger-8-thread-4) [    ] o.a.s.c.a.NodeAddedTrigger Found livenodes: 3
   [junit4]   2> 5215 DEBUG (ScheduledTrigger-8-thread-4) [    ] o.a.s.c.a.NodeAddedTrigger NodeAddedTrigger node_added_restore_trigger firing registered processor for nodes: [127.0.0.1:10002_solr] added at times [12812949486472662], now=12812949527657912
   [junit4]   2> 5217 DEBUG (ScheduledTrigger-8-thread-4) [    ] o.a.s.c.a.ScheduledTriggers ++++++++ Cooldown inactive - processing event: {
   [junit4]   2>   "id":"2d854f46aa8dd6T4nkqq99srzs294hz7t4p9ei9v",
   [junit4]   2>   "source":"node_added_restore_trigger",
   [junit4]   2>   "eventTime":12812949486472662,
   [junit4]   2>   "eventType":"NODEADDED",
   [junit4]   2>   "properties":{
   [junit4]   2>     "eventTimes":[12812949486472662],
   [junit4]   2>     "nodeNames":["127.0.0.1:10002_solr"]}}
   [junit4]   2> 5218 DEBUG (ScheduledTrigger-8-thread-4) [    ] o.a.s.c.a.ScheduledTriggers Pausing all triggers: [.auto_add_replicas, node_added_restore_trigger]
   [junit4]   2> 5316 DEBUG (simCloudManagerPool-7-thread-4) [    ] o.a.s.c.a.s.SimClusterStateProvider -- no leader in shard1:{
   [junit4]   2>   "replicas":{"core_node1":{
   [junit4]   2>       "core":".system_shard1_replica_n1",
   [junit4]   2>       "SEARCHER.searcher.maxDoc":0,
   [junit4]   2>       "SEARCHER.searcher.deletedDocs":0,
   [junit4]   2>       "INDEX.sizeInBytes":10240,
   [junit4]   2>       "node_name":"127.0.0.1:10002_solr",
   [junit4]   2>       "state":"active",
   [junit4]   2>       "type":"NRT",
   [junit4]   2>       "INDEX.sizeInGB":9.5367431640625E-6,
   [junit4]   2>       "SEARCHER.searcher.numDocs":0}},
   [junit4]   2>   "range":"80000000-7fffffff",
   [junit4]   2>   "state":"active"}
   [junit4]   2> 5322 INFO  (TEST-TestTriggerIntegration.testNodeAddedTriggerRestoreState-seed#[B49AFC4C00ADAE1B]) [    ] o.a.s.SolrTestCaseJ4 ###Ending testNodeAddedTriggerRestoreState
   [junit4]   2> 5327 DEBUG (ScheduledTrigger-8-thread-4) [    ] o.a.s.c.a.NodeAddedTrigger NodeAddedTrigger node_added_restore_trigger - removing marker path: /autoscaling/nodeAdded/127.0.0.1:10002_solr
   [junit4]   2> 5328 DEBUG (AutoscalingActionExecutor-9-thread-1) [    ] o.a.s.c.a.ScheduledTriggers -- processing actions for {
   [junit4]   2>   "id":"2d854f46aa8dd6T4nkqq99srzs294hz7t4p9ei9v",
   [junit4]   2>   "source":"node_added_restore_trigger",
   [junit4]   2>   "eventTime":12812949486472662,
   [junit4]   2>   "eventType":"NODEADDED",
   [junit4]   2>   "properties":{
   [junit4]   2>     "eventTimes":[12812949486472662],
   [junit4]   2>     "_enqueue_time_":12812949685332612,
   [junit4]   2>     "nodeNames":["127.0.0.1:10002_solr"]}}
   [junit4]   2> 5349 DEBUG (simCloudManagerPool-7-thread-7) [    ] o.a.s.c.a.s.SimClusterStateProvider -- no leader in shard1:{
   [junit4]   2>   "replicas":{"core_node1":{
   [junit4]   2>       "core":".system_shard1_replica_n1",
   [junit4]   2>       "SEARCHER.searcher.maxDoc":0,
   [junit4]   2>       "SEARCHER.searcher.deletedDocs":0,
   [junit4]   2>       "INDEX.sizeInBytes":10240,
   [junit4]   2>       "node_name":"127.0.0.1:10002_solr",
   [junit4]   2>       "state":"active",
   [junit4]   2>       "type":"NRT",
   [junit4]   2>       "INDEX.sizeInGB":9.5367431640625E-6,
   [junit4]   2>       "SEARCHER.searcher.numDocs":0}},
   [junit4]   2>   "range":"80000000-7fffffff",
   [junit4]   2>   "state":"active"}
   [junit4]   2> 5353 DEBUG (AutoscalingActionExecutor-9-thread-1) [    ] o.a.s.c.a.ScheduledTriggers Resuming trigger: .auto_add_replicas after 100ms
   [junit4]   2> 5353 DEBUG (AutoscalingActionExecutor-9-thread-1) [    ] o.a.s.c.a.ScheduledTriggers Resuming trigger: node_added_restore_trigger after 100ms
   [junit4]   2> 5353 DEBUG (AutoscalingActionExecutor-9-thread-1) [    ] o.a.s.c.a.ScheduledTriggers -- processing took 1291 ms for event id=2d854f46aa8dd6T4nkqq99srzs294hz7t4p9ei9v
   [junit4]   2> 5383 INFO  (TEST-TestTriggerIntegration.testNodeAddedTriggerRestoreState-seed#[B49AFC4C00ADAE1B]) [    ] o.a.s.c.a.s.SimSolrCloudTestCase #######################################
   [junit4]   2> ############ CLUSTER STATE ############
   [junit4]   2> #######################################
   [junit4]   2> ## Live nodes:		3
   [junit4]   2> ## Empty nodes:	2
   [junit4]   2> ## Dead nodes:		0
   [junit4]   2> ## Collections:	[.system]
   [junit4]   2> ## Max replicas per node:	1
   [junit4]   2> ## Min replicas per node:	0
   [junit4]   2> ## Total replicas:		1
   [junit4]   2> ## * .system		1
   [junit4]   2> ##		- active           1
   [junit4]   2> ######### Solr op counts ##########
   [junit4]   2> ##		- autoscaling        3
   [junit4]   2> ##		- update             2
   [junit4]   2> ######### Autoscaling event counts ###########
   [junit4]   2> ## * Trigger: node_added_restore_trigger
   [junit4]   2> ##		- STARTED         1
   [junit4]   2> ##		- SUCCEEDED       1
   [junit4]   2> 
   [junit4]   2> NOTE: reproduce with: ant test  -Dtestcase=TestTriggerIntegration -Dtests.method=testNodeAddedTriggerRestoreState -Dtests.seed=B49AFC4C00ADAE1B -Dtests.multiplier=2 -Dtests.slow=true -Dtests.badapples=true -Dtests.locale=ga-IE -Dtests.timezone=Australia/Brisbane -Dtests.asserts=true -Dtests.file.encoding=UTF-8
   [junit4] FAILURE 0.52s J2 | TestTriggerIntegration.testNodeAddedTriggerRestoreState <<<
   [junit4]    > Throwable #1: java.lang.AssertionError: The trigger did not fire at all
   [junit4]    > 	at __randomizedtesting.SeedInfo.seed([B49AFC4C00ADAE1B:3CA775333A6D4FB6]:0)
   [junit4]    > 	at org.apache.solr.cloud.autoscaling.sim.TestTriggerIntegration.testNodeAddedTriggerRestoreState(TestTriggerIntegration.java:383)
   [junit4]    > 	at java.lang.Thread.run(Thread.java:748)
   [junit4]   2> 5394 INFO  (TEST-TestTriggerIntegration.testSearchRate-seed#[B49AFC4C00ADAE1B]) [    ] o.a.s.SolrTestCaseJ4 ###Starting testSearchRate
   [junit4]   2> 5394 DEBUG (TEST-TestTriggerIntegration.testSearchRate-seed#[B49AFC4C00ADAE1B]) [    ] o.a.s.c.a.OverseerTriggerThread Refreshing /autoscaling.json with znode version 5
   [junit4]   2> 5396 DEBUG (Simulated OverseerAutoScalingTriggerThread) [    ] o.a.s.c.a.OverseerTriggerThread Processed trigger updates upto znodeVersion 5
   [junit4]   2> 5398 DEBUG (Simulated OverseerAutoScalingTriggerThread) [    ] o.a.s.c.a.OverseerTriggerThread -- clean old nodeLost markers
   [junit4]   2> 5399 DEBUG (Simulated OverseerAutoScalingTriggerThread) [    ] o.a.s.c.a.OverseerTriggerThread -- clean old nodeAdded markers
   [junit4]   2> 5399 DEBUG (Simulated OverseerAutoScalingTriggerThread) [    ] o.a.s.c.a.OverseerTriggerThread Current znodeVersion 5, lastZnodeVersion 5
   [junit4]   2> 5400 DEBUG (TEST-TestTriggerIntegration.testSearchRate-seed#[B49AFC4C00ADAE1B]) [    ] o.a.s.c.a.s.SimNodeStateProvider --removing value for 127.0.0.1:10002_solr
   [junit4]   2> 5404 INFO  (TEST-TestTriggerIntegration.testSearchRate-seed#[B49AFC4C00ADAE1B]) [    ] o.a.s.c.a.s.SimCloudManager === Restarting OverseerTriggerThread and clearing object cache...
   [junit4]   2> 5406 WARN  (Simulated OverseerAutoScalingTriggerThread) [    ] o.a.s.c.a.OverseerTriggerThread Interrupted
   [junit4]   2> java.lang.InterruptedException: null
   [junit4]   2> 	at java.util.concurrent.locks.AbstractQueuedSynchronizer$ConditionObject.reportInterruptAfterWait(AbstractQueuedSynchronizer.java:2014) ~[?:1.8.0_172]
   [junit4]   2> 	at java.util.concurrent.locks.AbstractQueuedSynchronizer$ConditionObject.await(AbstractQueuedSynchronizer.java:2048) ~[?:1.8.0_172]
   [junit4]   2> 	at org.apache.solr.cloud.autoscaling.OverseerTriggerThread.run(OverseerTriggerThread.java:189) [java/:?]
   [junit4]   2> 	at java.lang.Thread.run(Thread.java:748) [?:1.8.0_172]
   [junit4]   2> 5413 DEBUG (TEST-TestTriggerIntegration.testSearchRate-seed#[B49AFC4C00ADAE1B]) [    ] o.a.s.c.a.ScheduledTriggers Shutting down scheduled thread pool executor now
   [junit4]   2> 5413 DEBUG (TEST-TestTriggerIntegration.testSearchRate-seed#[B49AFC4C00ADAE1B]) [    ] o.a.s.c.a.ScheduledTriggers Shutting down action executor now
   [junit4]   2> 5414 DEBUG (TEST-TestTriggerIntegration.testSearchRate-seed#[B49AFC4C00ADAE1B]) [    ] o.a.s.c.a.ScheduledTriggers Awaiting termination for action executor
   [junit4]   2> 5414 DEBUG (TEST-TestTriggerIntegration.testSearchRate-seed#[B49AFC4C00ADAE1B]) [    ] o.a.s.c.a.ScheduledTriggers Awaiting termination for scheduled thread pool executor
   [junit4]   2> 5414 DEBUG (TEST-TestTriggerIntegration.testSearchRate-seed#[B49AFC4C00ADAE1B]) [    ] o.a.s.c.a.ScheduledTriggers ScheduledTriggers closed completely
   [junit4]   2> 5414 DEBUG (TEST-TestTriggerIntegration.testSearchRate-seed#[B49AFC4C00ADAE1B]) [    ] o.a.s.c.a.OverseerTriggerThread OverseerTriggerThread has been closed explicitly
   [junit4]   2> 5427 DEBUG (Simulated OverseerAutoScalingTriggerThread) [    ] o.a.s.c.a.OverseerTriggerThread Adding .auto_add_replicas and .scheduled_maintenance triggers
   [junit4]   2> 5428 DEBUG (Simulated OverseerAutoScalingTriggerThread) [    ] o.a.s.c.a.OverseerTriggerThread Refreshing /autoscaling.json with znode version 6
   [junit4]   2> 5429 DEBUG (Simulated OverseerAutoScalingTriggerThread) [    ] o.a.s.c.a.OverseerTriggerThread Current znodeVersion 6, lastZnodeVersion -1
   [junit4]   2> 5429 DEBUG (Simulated OverseerAutoScalingTriggerThread) [    ] o.a.s.c.a.OverseerTriggerThread Processed trigger updates upto znodeVersion 6
   [junit4]   2> 5439 DEBUG (Simulated OverseerAutoScalingTriggerThread) [    ] o.a.s.c.a.NodeLostTrigger NodeLostTrigger .auto_add_replicas - Initial livenodes: [127.0.0.1:10001_solr, 127.0.0.1:10000_solr]
   [junit4]   2> 5441 DEBUG (Simulated OverseerAutoScalingTriggerThread) [    ] o.a.s.c.a.OverseerTriggerThread -- clean old nodeAdded markers
   [junit4]   2> 5441 DEBUG (Simulated OverseerAutoScalingTriggerThread) [    ] o.a.s.c.a.OverseerTriggerThread Current znodeVersion 6, lastZnodeVersion 6
   [junit4]   2> 5442 DEBUG (ScheduledTrigger-11-thread-1) [    ] o.a.s.c.a.NodeLostTrigger Running NodeLostTrigger: .auto_add_replicas with currently live nodes: 2
   [junit4]   2> 5462 DEBUG (ScheduledTrigger-11-thread-2) [    ] o.a.s.c.a.NodeLostTrigger Running NodeLostTrigger: .auto_add_replicas with currently live nodes: 2
   [junit4]   2> 5483 DEBUG (ScheduledTrigger-11-thread-4) [    ] o.a.s.c.a.NodeLostTrigger Running NodeLostTrigger: .auto_add_replicas with currently live nodes: 2
   [junit4]   2> 5504 DEBUG (ScheduledTrigger-11-thread-2) [    ] o.a.s.c.a.NodeLostTrigger Running NodeLostTrigger: .auto_add_replicas with currently live nodes: 2
   [junit4]   2> 5528 DEBUG (ScheduledTrigger-11-thread-4) [    ] o.a.s.c.a.NodeLostTrigger Running NodeLostTrigger: .auto_add_replicas with currently live nodes: 2
   [junit4]   2> 5529 DEBUG (simCloudManagerPool-10-thread-1) [    ] o.a.s.c.a.AutoScalingHandler Verified autoscaling configuration
   [junit4]   2> 5530 DEBUG (simCloudManagerPool-10-thread-1) [    ] o.a.s.c.a.OverseerTriggerThread Refreshing /autoscaling.json with znode version 7
   [junit4]   2> 5531 DEBUG (Simulated OverseerAutoScalingTriggerThread) [    ] o.a.s.c.a.OverseerTriggerThread Processed trigger updates upto znodeVersion 7
   [junit4]   2> 5531 DEBUG (Simulated OverseerAutoScalingTriggerThread) [    ] o.a.s.c.a.OverseerTriggerThread -- clean old nodeAdded markers
   [junit4]   2> 5531 DEBUG (Simulated OverseerAutoScalingTriggerThread) [    ] o.a.s.c.a.OverseerTriggerThread Current znodeVersion 7, lastZnodeVersion 7
   [junit4]   2> 5549 DEBUG (ScheduledTrigger-11-thread-3) [    ] o.a.s.c.a.NodeLostTrigger Running NodeLostTrigger: .auto_add_replicas with currently live nodes: 2
   [junit4]   2> 5570 DEBUG (ScheduledTrigger-11-thread-3) [    ] o.a.s.c.a.NodeLostTrigger Running NodeLostTrigger: .auto_add_replicas with currently live nodes: 2
   [junit4]   2> 5595 DEBUG (ScheduledTrigger-11-thread-3) [    ] o.a.s.c.a.NodeLostTrigger Running NodeLostTrigger: .auto_add_replicas with currently live nodes: 2
   [junit4]   2> 5603 DEBUG (simCloudManagerPool-10-thread-6) [    ] o.a.s.c.a.AutoScalingHandler Verified autoscaling configuration
   [junit4]   2> 5606 DEBUG (simCloudManagerPool-10-thread-6) [    ] o.a.s.c.a.OverseerTriggerThread Refreshing /autoscaling.json with znode version 8
   [junit4]   2> 5607 DEBUG (simCloudManagerPool-10-thread-5) [    ] o.a.s.c.a.s.SimClusterStateProvider -- elected new leader for collection1 / shard1: {"core_node1":{
   [junit4]   2>     "core":"collection1_shard1_replica_n1",
   [junit4]   2>     "leader":"true",
   [junit4]   2>     "SEARCHER.searcher.maxDoc":0,
   [junit4]   2>     "SEARCHER.searcher.deletedDocs":0,
   [junit4]   2>     "INDEX.sizeInBytes":10240,
   [junit4]   2>     "node_name":"127.0.0.1:10001_solr",
   [junit4]   2>     "state":"active",
   [junit4]   2>     "type":"NRT",
   [junit4]   2>     "INDEX.sizeInGB":9.5367431640625E-6,
   [junit4]   2>     "SEARCHER.searcher.numDocs":0,
   [junit4]   2>     "shard":"shard1",
   [junit4]   2>     "collection":"collection1"}}
   [junit4]   2> 5613 DEBUG (Simulated OverseerAutoScalingTriggerThread) [    ] o.a.s.c.a.OverseerTriggerThread Processed trigger updates upto znodeVersion 8
   [junit4]   2> 5613 DEBUG (Simulated OverseerAutoScalingTriggerThread) [    ] o.a.s.c.a.OverseerTriggerThread -- clean old nodeAdded markers
   [junit4]   2> 5613 DEBUG (Simulated OverseerAutoScalingTriggerThread) [    ] o.a.s.c.a.OverseerTriggerThread Current znodeVersion 8, lastZnodeVersion 8
   [junit4]   2> 5620 DEBUG (ScheduledTrigger-11-thread-3) [    ] o.a.s.c.a.NodeLostTrigger Running NodeLostTrigger: .auto_add_replicas with currently live nodes: 2
   [junit4]   2> 5628 DEBUG (simCloudManagerPool-10-thread-7) [    ] o.a.s.c.a.AutoScalingHandler Verified autoscaling configuration
   [junit4]   2> 5629 DEBUG (simCloudManagerPool-10-thread-7) [    ] o.a.s.c.a.OverseerTriggerThread Refreshing /autoscaling.json with znode version 9
   [junit4]   2> 5630 DEBUG (Simulated OverseerAutoScalingTriggerThread) [    ] o.a.s.c.a.OverseerTriggerThread Processed trigger updates upto znodeVersion 9
   [junit4]   2> 5630 DEBUG (Simulated OverseerAutoScalingTriggerThread) [    ] o.a.s.c.a.OverseerTriggerThread -- clean old nodeAdded markers
   [junit4]   2> 5630 DEBUG (Simulated OverseerAutoScalingTriggerThread) [    ] o.a.s.c.a.OverseerTriggerThread Current znodeVersion 9, lastZnodeVersion 9
   [junit4]   2> 5640 DEBUG (ScheduledTrigger-11-thread-3) [    ] o.a.s.c.a.NodeLostTrigger Running NodeLostTrigger: .auto_add_replicas with currently live nodes: 2
   [junit4]   2> 5661 DEBUG (ScheduledTrigger-11-thread-4) [    ] o.a.s.c.a.NodeLostTrigger Running NodeLostTrigger: .auto_add_replicas with currently live nodes: 2
   [junit4]   2> 5681 DEBUG (ScheduledTrigger-11-thread-3) [    ] o.a.s.c.a.NodeLostTrigger Running NodeLostTrigger: .auto_add_replicas with currently live nodes: 2
   [junit4]   2> 5701 DEBUG (ScheduledTrigger-11-thread-3) [    ] o.a.s.c.a.NodeLostTrigger Running NodeLostTrigger: .auto_add_replicas with currently live nodes: 2
   [junit4]   2> 5722 DEBUG (ScheduledTrigger-11-thread-2) [    ] o.a.s.c.a.NodeLostTrigger Running NodeLostTrigger: .auto_add_replicas with currently live nodes: 2
   [junit4]   2> 5738 DEBUG (ScheduledTrigger-11-thread-3) [    ] o.a.s.c.a.ScheduledTriggers ++++++++ Cooldown inactive - processing event: {
   [junit4]   2>   "id":"2d855458431450T4nkqq99srzs294hz7t4p9ei9y",
   [junit4]   2>   "source":"search_rate_trigger",
   [junit4]   2>   "eventTime":12812971256517712,
   [junit4]   2>   "eventType":"SEARCHRATE",
   [junit4]   2>   "properties":{
   [junit4]   2>     "hotReplicas":[
   [junit4]   2>       "{\"core_node1\":{\n    \"core\":\"collection1_shard1_replica_n1\",\n    \"leader\":\"true\",\n    \"SEARCHER.searcher.maxDoc\":0,\n    \"SEARCHER.searcher.deletedDocs\":0,\n    \"INDEX.sizeInBytes\":10240,\n    \"rate\":250.0,\n    \"node_name\":\"127.0.0.1:10001_solr\",\n    \"state\":\"active\",\n    \"type\":\"NRT\",\n    \"QUERY./select.requestTimes:1minRate\":250,\n    \"INDEX.sizeInGB\":9.5367431640625E-6,\n    \"SEARCHER.searcher.numDocs\":0,\n    \"shard\":\"shard1\",\n    \"collection\":\"collection1\"}}",
   [junit4]   2>       "{\"core_node2\":{\n    \"core\":\"collection1_shard1_replica_n2\",\n    \"SEARCHER.searcher.maxDoc\":0,\n    \"SEARCHER.searcher.deletedDocs\":0,\n    \"INDEX.sizeInBytes\":10240,\n    \"rate\":250.0,\n    \"node_name\":\"127.0.0.1:10000_solr\",\n    \"state\":\"active\",\n    \"type\":\"NRT\",\n    \"QUERY./select.requestTimes:1minRate\":250,\n    \"INDEX.sizeInGB\":9.5367431640625E-6,\n    \"SEARCHER.searcher.numDocs\":0,\n    \"shard\":\"shard1\",\n    \"collection\":\"collection1\"}}"],
   [junit4]   2>     "coldNodes":{},
   [junit4]   2>     "coldShards":{},
   [junit4]   2>     "coldReplicas":[],
   [junit4]   2>     "coldCollections":{},
   [junit4]   2>     "hotShards":{"collection1":{"shard1":500.0}},
   [junit4]   2>     "hotCollections":{"collection1":500.0},
   [junit4]   2>     "hotNodes":{
   [junit4]   2>       "127.0.0.1:10001_solr":250.0,
   [junit4]   2>       "127.0.0.1:10000_solr":250.0},
   [junit4]   2>     "requestedOps":[
   [junit4]   2>       "Op{action=ADDREPLICA, hints={COLL_SHARD=[{\n  \"first\":\"collection1\",\n  \"second\":\"shard1\"}]}}",
   [junit4]   2>       "Op{action=ADDREPLICA, hints={COLL_SHARD=[{\n  \"first\":\"collection1\",\n  \"second\":\"shard1\"}]}}",
   [junit4]   2>       "Op{action=ADDREPLICA, hints={COLL_SHARD=[{\n  \"first\":\"collection1\",\n  \"second\":\"shard1\"}]}}"]}}
   [junit4]   2> 5738 DEBUG (ScheduledTrigger-11-thread-3) [    ] o.a.s.c.a.ScheduledTriggers Pausing all triggers: [.auto_add_replicas, search_rate_trigger]
   [junit4]   2> 5768 DEBUG (simCloudManagerPool-10-thread-8) [    ] o.a.s.c.a.s.SimClusterStateProvider -- no leader in shard1:{
   [junit4]   2>   "replicas":{"core_node2":{
   [junit4]   2>       "core":".system_shard1_replica_n1",
   [junit4]   2>       "SEARCHER.searcher.maxDoc":0,
   [junit4]   2>       "SEARCHER.searcher.deletedDocs":0,
   [junit4]   2>       "INDEX.sizeInBytes":10240,
   [junit4]   2>       "node_name":"127.0.0.1:10000_solr",
   [junit4]   2>       "state":"active",
   [junit4]   2>       "type":"NRT",
   [junit4]   2>       "INDEX.sizeInGB":9.5367431640625E-6,
   [junit4]   2>       "SEARCHER.searcher.numDocs":0}},
   [junit4]   2>   "range":"80000000-7fffffff",
   [junit4]   2>   "state":"active"}
   [junit4]   2> 5811 DEBUG (AutoscalingActionExecutor-12-thread-1) [    ] o.a.s.c.a.ScheduledTriggers -- processing actions for {
   [junit4]   2>   "id":"2d855458431450T4nkqq99srzs294hz7t4p9ei9y",
   [junit4]   2>   "source":"search_rate_trigger",
   [junit4]   2>   "eventTime":12812971256517712,
   [junit4]   2>   "eventType":"SEARCHRATE",
   [junit4]   2>   "properties":{
   [junit4]   2>     "hotReplicas":[
   [junit4]   2>       "{\"core_node1\":{\n    \"core\":\"collection1_shard1_replica_n1\",\n    \"leader\":\"true\",\n    \"SEARCHER.searcher.maxDoc\":0,\n    \"SEARCHER.searcher.deletedDocs\":0,\n    \"INDEX.sizeInBytes\":10240,\n    \"rate\":250.0,\n    \"node_name\":\"127.0.0.1:10001_solr\",\n    \"state\":\"active\",\n    \"type\":\"NRT\",\n    \"QUERY./select.requestTimes:1minRate\":250,\n    \"INDEX.sizeInGB\":9.5367431640625E-6,\n    \"SEARCHER.searcher.numDocs\":0,\n    \"shard\":\"shard1\",\n    \"collection\":\"collection1\"}}",
   [junit4]   2>       "{\"core_node2\":{\n    \"core\":\"collection1_shard1_replica_n2\",\n    \"SEARCHER.searcher.maxDoc\":0,\n    \"SEARCHER.searcher.deletedDocs\":0,\n    \"INDEX.sizeInBytes\":10240,\n    \"rate\":250.0,\n    \"node_name\":\"127.0.0.1:10000_solr\",\n    \"state\":\"active\",\n    \"type\":\"NRT\",\n    \"QUERY./select.requestTimes:1minRate\":250,\n    \"INDEX.sizeInGB\":9.5367431640625E-6,\n    \"SEARCHER.searcher.numDocs\":0,\n    \"shard\":\"shard1\",\n    \"collection\":\"collection1\"}}"],
   [junit4]   2>     "coldNodes":{},
   [junit4]   2>     "coldShards":{},
   [junit4]   2>     "coldReplicas":[],
   [junit4]   2>     "coldCollections":{},
   [junit4]   2>     "hotShards":{"collection1":{"shard1":500.0}},
   [junit4]   2>     "hotCollections":{"collection1":500.0},
   [junit4]   2>     "hotNodes":{
   [junit4]   2>       "127.0.0.1:10001_solr":250.0,
   [junit4]   2>       "127.0.0.1:10000_solr":250.0},
   [junit4]   2>     "_enqueue_time_":12812975710560062,
   [junit4]   2>     "requestedOps":[
   [junit4]   2>       "Op{action=ADDREPLICA, hints={COLL_SHARD=[{\n  \"first\":\"collection1\",\n  \"second\":\"shard1\"}]}}",
   [junit4]   2>       "Op{action=ADDREPLICA, hints={COLL_SHARD=[{\n  \"first\":\"collection1\",\n  \"second\":\"shard1\"}]}}",
   [junit4]   2>       "Op{action=ADDREPLICA, hints={COLL_SHARD=[{\n  \"first\":\"collection1\",\n  \"second\":\"shard1\"}]}}"]}}
   [junit4]   2> 5811 DEBUG (AutoscalingActionExecutor-12-thread-1) [    ] o.a.s.c.a.ComputePlanAction -- processing event: {
   [junit4]   2>   "id":"2d855458431450T4nkqq99srzs294hz7t4p9ei9y",
   [junit4]   2>   "source":"search_rate_trigger",
   [junit4]   2>   "eventTime":12812971256517712,
   [junit4]   2>   "eventType":"SEARCHRATE",
   [junit4]   2>   "properties":{
   [junit4]   2>     "hotReplicas":[
   [junit4]   2>       "{\"core_node1\":{\n    \"core\":\"collection1_shard1_replica_n1\",\n    \"leader\":\"true\",\n    \"SEARCHER.searcher.maxDoc\":0,\n    \"SEARCHER.searcher.deletedDocs\":0,\n    \"INDEX.sizeInBytes\":10240,\n    \"rate\":250.0,\n    \"node_name\":\"127.0.0.1:10001_solr\",\n    \"state\":\"active\",\n    \"type\":\"NRT\",\n    \"QUERY./select.requestTimes:1minRate\":250,\n    \"INDEX.sizeInGB\":9.5367431640625E-6,\n    \"SEARCHER.searcher.numDocs\":0,\n    \"shard\":\"shard1\",\n    \"collection\":\"collection1\"}}",
   [junit4]   2>       "{\"core_node2\":{\n    \"core\":\"collection1_shard1_replica_n2\",\n    \"SEARCHER.searcher.maxDoc\":0,\n    \"SEARCHER.searcher.deletedDocs\":0,\n    \"INDEX.sizeInBytes\":10240,\n    \"rate\":250.0,\n    \"node_name\":\"127.0.0.1:10000_solr\",\n    \"state\":\"active\",\n    \"type\":\"NRT\",\n    \"QUERY./select.requestTimes:1minRate\":250,\n    \"INDEX.sizeInGB\":9.5367431640625E-6,\n    \"SEARCHER.searcher.numDocs\":0,\n    \"shard\":\"shard1\",\n    \"collection\":\"collection1\"}}"],
   [junit4]   2>     "coldNodes":{},
   [junit4]   2>     "coldShards":{},
   [junit4]   2>     "coldReplicas":[],
   [junit4]   2>     "coldCollections":{},
   [junit4]   2>     "hotShards":{"collection1":{"shard1":500.0}},
   [junit4]   2>     "hotCollections":{"collection1":500.0},
   [junit4]   2>     "hotNodes":{
   [junit4]   2>       "127.0.0.1:10001_solr":250.0,
   [junit4]   2>       "127.0.0.1:10000_solr":250.0},
   [junit4]   2>     "_enqueue_time_":12812975710560062,
   [junit4]   2>     "requestedOps":[
   [junit4]   2>       "Op{action=ADDREPLICA, hints={COLL_SHARD=[{\n  \"first\":\"collection1\",\n  \"second\":\"shard1\"}]}}",
   [junit4]   2>       "Op{action=ADDREPLICA, hints={COLL_SHARD=[{\n  \"first\":\"collection1\",\n  \"second\":\"shard1\"}]}}",
   [junit4]   2>       "Op{action=ADDREPLICA, hints={COLL_SHARD=[{\n  \"first\":\"collection1\",\n  \"second\":\"shard1\"}]}}"]}} with context properties: {BEFORE_ACTION=[compute]}
   [junit4]   2> 5832 INFO  (AutoscalingActionExecutor-12-thread-1) [    ] o.a.s.c.a.ComputePlanAction Computed Plan: action=ADDREPLICA&collection=collection1&shard=shard1&node=127.0.0.1:10001_solr&type=NRT
   [junit4]   2> 5833 INFO  (AutoscalingActionExecutor-12-thread-1) [    ] o.a.s.c.a.ComputePlanAction Computed Plan: action=ADDREPLICA&collection=collection1&shard=shard1&node=127.0.0.1:10001_solr&type=NRT
   [junit4]   2> 5834 INFO  (AutoscalingActionExecutor-12-thread-1) [    ] o.a.s.c.a.ComputePlanAction Computed Plan: action=ADDREPLICA&collection=collection1&shard=shard1&node=127.0.0.1:10000_solr&type=NRT
   [junit4]   2> 5834 INFO  (AutoscalingActionExecutor-12-thread-1) [    ] o.a.s.c.s.c.a.PolicyHelper returnSession, curr-time 12812980491 sessionWrapper.createTime 12812979608309812, this.sessionWrapper.createTime 12812979608309812 
   [junit4]   2> 5835 DEBUG (AutoscalingActionExecutor-12-thread-1) [    ] o.a.s.c.a.ExecutePlanAction -- processing event: {
   [junit4]   2>   "id":"2d855458431450T4nkqq99srzs294hz7t4p9ei9y",
   [junit4]   2>   "source":"search_rate_trigger",
   [junit4]   2>   "eventTime":12812971256517712,
   [junit4]   2>   "eventType":"SEARCHRATE",
   [junit4]   2>   "properties":{
   [junit4]   2>     "hotReplicas":[
   [junit4]   2>       "{\"core_node1\":{\n    \"core\":\"collection1_shard1_replica_n1\",\n    \"leader\":\"true\",\n    \"SEARCHER.searcher.maxDoc\":0,\n    \"SEARCHER.searcher.deletedDocs\":0,\n    \"INDEX.sizeInBytes\":10240,\n    \"rate\":250.0,\n    \"node_name\":\"127.0.0.1:10001_solr\",\n    \"state\":\"active\",\n    \"type\":\"NRT\",\n    \"QUERY./select.requestTimes:1minRate\":250,\n    \"INDEX.sizeInGB\":9.5367431640625E-6,\n    \"SEARCHER.searcher.numDocs\":0,\n    \"shard\":\"shard1\",\n    \"collection\":\"collection1\"}}",
   [junit4]   2>       "{\"core_node2\":{\n    \"core\":\"collection1_shard1_replica_n2\",\n    \"SEARCHER.searcher.maxDoc\":0,\n    \"SEARCHER.searcher.deletedDocs\":0,\n    \"INDEX.sizeInBytes\":10240,\n    \"rate\":250.0,\n    \"node_name\":\"127.0.0.1:10000_solr\",\n    \"state\":\"active\",\n    \"type\":\"NRT\",\n    \"QUERY./select.requestTimes:1minRate\":250,\n    \"INDEX.sizeInGB\":9.5367431640625E-6,\n    \"SEARCHER.searcher.numDocs\":0,\n    \"shard\":\"shard1\",\n    \"collection\":\"collection1\"}}"],
   [junit4]   2>     "__start__":3,
   [junit4]   2>     "coldNodes":{},
   [junit4]   2>     "coldShards":{},
   [junit4]   2>     "coldReplicas":[],
   [junit4]   2>     "coldCollections":{},
   [junit4]   2>     "hotShards":{"collection1":{"shard1":500.0}},
   [junit4]   2>     "hotCollections":{"collection1":500.0},
   [junit4]   2>     "hotNodes":{
   [junit4]   2>       "127.0.0.1:10001_solr":250.0,
   [junit4]   2>       "127.0.0.1:10000_solr":250.0},
   [junit4]   2>     "_enqueue_time_":12812975710560062,
   [junit4]   2>     "requestedOps":[
   [junit4]   2>       "Op{action=ADDREPLICA, hints={COLL_SHARD=[{\n  \"first\":\"collection1\",\n  \"second\":\"shard1\"}]}}",
   [junit4]   2>       "Op{action=ADDREPLICA, hints={COLL_SHARD=[{\n  \"first\":\"collection1\",\n  \"second\":\"shard1\"}]}}",
   [junit4]   2>       "Op{action=ADDREPLICA, hints={COLL_SHARD=[{\n  \"first\":\"collection1\",\n  \"second\":\"shard1\"}]}}"]}} with context properties: {operations=[org.apache.solr.client.solrj.request.CollectionAdminRequest$AddReplica@6b56e833, org.apache.solr.client.solrj.request.CollectionAdminRequest$AddReplica@7a27b140, org.apache.solr.client.solrj.request.CollectionAdminRequest$AddReplica@2a1c5894], AFTER_ACTION=[compute], BEFORE_ACTION=[compute, execute]}
   [junit4]   2> 5836 DEBUG (AutoscalingActionExecutor-12-thread-1) [    ] o.a.s.c.a.ExecutePlanAction Executing operation: action=ADDREPLICA&collection=collection1&shard=shard1&node=127.0.0.1:10001_solr&type=NRT
   [junit4]   2> 5861 INFO  (simCloudManagerPool-10-thread-11) [    ] o.a.s.c.a.c.AddReplicaCmd Node Identified 127.0.0.1:10001_solr for creating new replica
   [junit4]   2> 5921 DEBUG (AutoscalingActionExecutor-12-thread-1) [    ] o.a.s.c.a.ExecutePlanAction Executing operation: action=ADDREPLICA&collection=collection1&shard=shard1&node=127.0.0.1:10001_solr&type=NRT
   [junit4]   2> 5934 INFO  (simCloudManagerPool-10-thread-15) [    ] o.a.s.c.a.c.AddReplicaCmd Node Identified 127.0.0.1:10001_solr for creating new replica
   [junit4]   2> 5983 DEBUG (AutoscalingActionExecutor-12-thread-1) [    ] o.a.s.c.a.ExecutePlanAction Executing operation: action=ADDREPLICA&collection=collection1&shard=shard1&node=127.0.0.1:10000_solr&type=NRT
   [junit4]   2> 5992 INFO  (simCloudManagerPool-10-thread-19) [    ] o.a.s.c.a.c.AddReplicaCmd Node Identified 127.0.0.1:10000_solr for creating new replica
   [junit4]   2> 6032 INFO  (TEST-TestTriggerIntegration.testSearchRate-seed#[B49AFC4C00ADAE1B]) [    ] o.a.s.SolrTestCaseJ4 ###Ending testSearchRate
   [junit4]   2> 6032 INFO  (TEST-TestTriggerIntegration.testSearchRate-seed#[B49AFC4C00ADAE1B]) [    ] o.a.s.c.a.s.SimSolrCloudTestCase #######################################
   [junit4]   2> ############ CLUSTER STATE ############
   [junit4]   2> #######################################
   [junit4]   2> ## Live nodes:		2
   [junit4]   2> ## Empty nodes:	0
   [junit4]   2> ## Dead nodes:		0
   [junit4]   2> ## Collections:	[collection1, .system]
   [junit4]   2> ## Max replicas per node:	3
   [junit4]   2> ## Min replicas per node:	3
   [junit4]   2> ## Total replicas:		6
   [junit4]   2> ## * .system		1
   [junit4]   2> ##		- active           1
   [junit4]   2> ## * collection1		5
   [junit4]   2> ##		- active           5
   [junit4]   2> ######### Solr op counts ##########
   [junit4]   2> ##		- ADDREPLICA         3
   [junit4]   2> ##		- CREATE             1
   [junit4]   2> ##		- DELETESTATUS       2
   [junit4]   2> ##		- REQUESTSTATUS      2
   [junit4]   2> ##		- autoscaling        3
   [junit4]   2> ##		- update             1
   [junit4]   2> ######### Autoscaling event counts ###########
   [junit4]   2> ## * Trigger: search_rate_trigger
   [junit4]   2> ##		- STARTED         1
   [junit4]   2> 
   [junit4]   2> NOTE: reproduce with: ant test  -Dtestcase=TestTriggerIntegration -Dtests.method=testSearchRate -Dtests.seed=B49AFC4C00ADAE1B -Dtests.multiplier=2 -Dtests.slow=true -Dtests.badapples=true -Dtests.locale=ga-IE -Dtests.timezone=Australia/Brisbane -Dtests.asserts=true -Dtests.file.encoding=UTF-8
   [junit4] FAILURE 0.64s J2 | TestTriggerIntegration.testSearchRate <<<
   [junit4]    > Throwable #1: java.lang.AssertionError: The trigger did not fire at all
   [junit4]    > 	at __randomizedtesting.SeedInfo.seed([B49AFC4C00ADAE1B:E9D2E2C5CF6B0854]:0)
   [junit4]    > 	at org.apache.solr.cloud.autoscaling.sim.TestTriggerIntegration.testSearchRate(TestTriggerIntegration.java:1204)
   [junit4]    > 	at java.lang.Thread.run(Thread.java:748)
   [junit4]   2> 6063 INFO  (TEST-TestTriggerIntegration.testCooldown-seed#[B49AFC4C00ADAE1B]) [    ] o.a.s.SolrTestCaseJ4 ###Starting testCooldown
   [junit4]   2> 6063 DEBUG (simCloudManagerPool-10-thread-23) [    ] o.a.s.c.a.s.SimClusterStateProvider -- no leader in shard1:{
   [junit4]   2>   "replicas":{"core_node2":{
   [junit4]   2>       "core":".system_shard1_replica_n1",
   [junit4]   2>       "SEARCHER.searcher.maxDoc":0,
   [junit4]   2>       "SEARCHER.searcher.deletedDocs":0,
   [junit4]   2>       "INDEX.sizeInBytes":10240,
   [junit4]   2>       "node_name":"127.0.0.1:10000_solr",
   [junit4]   2>       "state":"active",
   [junit4]   2>       "type":"NRT",
   [junit4]   2>       "INDEX.sizeInGB":9.5367431640625E-6,
   [junit4]   2>       "SEARCHER.searcher.numDocs":0}},
   [junit4]   2>   "range":"80000000-7fffffff",
   [junit4]   2>   "state":"active"}
   [junit4]   2> 6064 DEBUG (TEST-TestTriggerIntegration.testCooldown-seed#[B49AFC4C00ADAE1B]) [    ] o.a.s.c.a.OverseerTriggerThread Refreshing /autoscaling.json with znode version 10
   [junit4]   2> 6064 DEBUG (Simulated OverseerAutoScalingTriggerThread) [    ] o.a.s.c.a.OverseerTriggerThread Processed trigger updates upto znodeVersion 10
   [junit4]   2> 6065 DEBUG (Simulated OverseerAutoScalingTriggerThread) [    ] o.a.s.c.a.OverseerTriggerThread -- clean old nodeLost markers
   [junit4]   2> 6065 DEBUG (Simulated OverseerAutoScalingTriggerThread) [    ] o.a.s.c.a.OverseerTriggerThread -- clean old nodeAdded markers
   [junit4]   2> 6065 DEBUG (Simulated OverseerAutoScalingTriggerThread) [    ] o.a.s.c.a.OverseerTriggerThread Current znodeVersion 10, lastZnodeVersion 10
   [junit4]   2> 6065 INFO  (TEST-TestTriggerIntegration.testCooldown-seed#[B49AFC4C00ADAE1B]) [    ] o.a.s.c.a.s.SimCloudManager === Restarting OverseerTriggerThread and clearing object cache...
   [junit4]   2> 6065 DEBUG (TEST-TestTriggerIntegration.testCooldown-seed#[B49AFC4C00ADAE1B]) [    ] o.a.s.c.a.ScheduledTriggers Shutting down scheduled thread pool executor now
   [junit4]   2> 6065 DEBUG (TEST-TestTriggerIntegration.testCooldown-seed#[B49AFC4C00ADAE1B]) [    ] o.a.s.c.a.ScheduledTriggers Shutting down action executor now
   [junit4]   2> 6075 DEBUG (TEST-TestTriggerIntegration.testCooldown-seed#[B49AFC4C00ADAE1B]) [    ] o.a.s.c.a.ScheduledTriggers Awaiting termination for action executor
   [junit4]   2> 6075 WARN  (Simulated OverseerAutoScalingTriggerThread) [    ] o.a.s.c.a.OverseerTriggerThread OverseerTriggerThread woken up but we are closed, exiting.
   [junit4]   2> 6075 WARN  (AutoscalingActionExecutor-12-thread-1) [    ] o.a.s.c.a.SystemLogListener Exception sending event to collection .system
   [junit4]   2> java.io.IOException: java.lang.InterruptedException
   [junit4]   2> 	at org.apache.solr.cloud.autoscaling.sim.SimCloudManager.request(SimCloudManager.java:632) ~[test/:?]
   [junit4]   2> 	at org.apache.solr.cloud.autoscaling.SystemLogListener.onEvent(SystemLogListener.java:118) ~[java/:?]
   [junit4]   2> 	at org.apache.solr.cloud.autoscaling.ScheduledTriggers$TriggerListeners.fireListeners(ScheduledTriggers.java:789) ~[java/:?]
   [junit4]   2> 	at org.apache.solr.cloud.autoscaling.ScheduledTriggers$TriggerListeners.fireListeners(ScheduledTriggers.java:756) ~[java/:?]
   [junit4]   2> 	at org.apache.solr.cloud.autoscaling.ScheduledTriggers.lambda$null$3(ScheduledTriggers.java:321) ~[java/:?]
   [junit4]   2> 	at java.util.concurrent.Executors$RunnableAdapter.call(Executors.java:511) ~[?:1.8.0_172]
   [junit4]   2> 	at java.util.concurrent.FutureTask.run(FutureTask.java:266) ~[?:1.8.0_172]
   [junit4]   2> 	at org.apache.solr.common.util.ExecutorUtil$MDCAwareThreadPoolExecutor.lambda$execute$0(ExecutorUtil.java:209) ~[java/:?]
   [junit4]   2> 	at java.util.concurrent.ThreadPoolExecutor.runWorker(ThreadPoolExecutor.java:1149) [?:1.8.0_172]
   [junit4]   2> 	at java.util.concurrent.ThreadPoolExecutor$Worker.run(ThreadPoolExecutor.java:624) [?:1.8.0_172]
   [junit4]   2> 	at java.lang.Thread.run(Thread.java:748) [?:1.8.0_172]
   [junit4]   2> Caused by: java.lang.InterruptedException
   [junit4]   2> 	at java.util.concurrent.FutureTask.awaitDone(FutureTask.java:404) ~[?:1.8.0_172]
   [junit4]   2> 	at java.util.concurrent.FutureTask.get(FutureTask.java:191) ~[?:1.8.0_172]
   [junit4]   2> 	at org.apache.solr.cloud.autoscaling.sim.SimCloudManager.request(SimCloudManager.java:630) ~[test/:?]
   [junit4]   2> 	... 10 more
   [junit4]   2> 6077 DEBUG (AutoscalingActionExecutor-12-thread-1) [    ] o.a.s.c.a.ScheduledTriggers -- processing took 14628 ms for event id=2d855458431450T4nkqq99srzs294hz7t4p9ei9y
   [junit4]   2> 6077 DEBUG (TEST-TestTriggerIntegration.testCooldown-seed#[B49AFC4C00ADAE1B]) [    ] o.a.s.c.a.ScheduledTriggers Awaiting termination for scheduled thread pool executor
   [junit4]   2> 6077 DEBUG (TEST-TestTriggerIntegration.testCooldown-seed#[B49AFC4C00ADAE1B]) [    ] o.a.s.c.a.ScheduledTriggers ScheduledTriggers closed completely
   [junit4]   2> 6077 DEBUG (TEST-TestTriggerIntegration.testCooldown-seed#[B49AFC4C00ADAE1B]) [    ] o.a.s.c.a.OverseerTriggerThread OverseerTriggerThread has been closed explicitly
   [junit4]   2> 6091 DEBUG (Simulated OverseerAutoScalingTriggerThread) [    ] o.a.s.c.a.OverseerTriggerThread Adding .auto_add_replicas and .scheduled_maintenance triggers
   [junit4]   2> 6092 DEBUG (Simulated OverseerAutoScalingTriggerThread) [    ] o.a.s.c.a.OverseerTriggerThread Refreshing /autoscaling.json with znode version 11
   [junit4]   2> 6093 DEBUG (Simulated OverseerAutoScalingTriggerThread) [    ] o.a.s.c.a.OverseerTriggerThread Current znodeVersion 11, lastZnodeVersion -1
   [junit4]   2> 6093 DEBUG (Simulated OverseerAutoScalingTriggerThread) [    ] o.a.s.c.a.OverseerTriggerThread Processed trigger updates upto znodeVersion 11
   [junit4]   2> 6107 DEBUG (Simulated OverseerAutoScalingTriggerThread) [    ] o.a.s.c.a.NodeLostTrigger NodeLostTrigger .auto_add_replicas - Initial livenodes: [127.0.0.1:10001_solr, 127.0.0.1:10000_solr]
   [junit4]   2> 6107 DEBUG (Simulated OverseerAutoScalingTriggerThread) [    ] o.a.s.c.a.OverseerTriggerThread -- clean old nodeAdded markers
   [junit4]   2> 6108 DEBUG (Simulated OverseerAutoScalingTriggerThread) [    ] o.a.s.c.a.OverseerTriggerThread Current znodeVersion 11, lastZnodeVersion 11
   [junit4]   2> 6108 DEBUG (ScheduledTrigger-14-thread-1) [    ] o.a.s.c.a.NodeLostTrigger Running NodeLostTrigger: .auto_add_replicas with currently live nodes: 2
   [junit4]   2> 6129 DEBUG (ScheduledTrigger-14-thread-3) [    ] o.a.s.c.a.NodeLostTrigger Running NodeLostTrigger: .auto_add_replicas with currently live nodes: 2
   [junit4]   2> 6152 DEBUG (ScheduledTrigger-14-thread-1) [    ] o.a.s.c.a.NodeLostTrigger Running NodeLostTrigger: .auto_add_replicas with currently live nodes: 2
   [junit4]   2> 6172 DEBUG (ScheduledTrigger-14-thread-1) [    ] o.a.s.c.a.NodeLostTrigger Running NodeLostTrigger: .auto_add_replicas with currently live nodes: 2
   [junit4]   2> 6193 DEBUG (ScheduledTrigger-14-thread-1) [    ] o.a.s.c.a.NodeLostTrigger Running NodeLostTrigger: .auto_add_replicas with currently live nodes: 2
   [junit4]   2> 6194 DEBUG (simCloudManagerPool-13-thread-1) [    ] o.a.s.c.a.AutoScalingHandler Verified autoscaling configuration
   [junit4]   2> 6194 DEBUG (simCloudManagerPool-13-thread-1) [    ] o.a.s.c.a.OverseerTriggerThread Refreshing /autoscaling.json with znode version 12
   [junit4]   2> 6212 DEBUG (Simulated OverseerAutoScalingTriggerThread) [    ] o.a.s.c.a.OverseerTriggerThread Processed trigger updates upto znodeVersion 12
   [junit4]   2> 6212 DEBUG (Simulated OverseerAutoScalingTriggerThread) [    ] o.a.s.c.a.OverseerTriggerThread -- clean old nodeAdded markers
   [junit4]   2> 6212 DEBUG (Simulated OverseerAutoScalingTriggerThread) [    ] o.a.s.c.a.OverseerTriggerThread Current znodeVersion 12, lastZnodeVersion 12
   [junit4]   2> 6213 DEBUG (ScheduledTrigger-14-thread-2) [    ] o.a.s.c.a.NodeLostTrigger Running NodeLostTrigger: .auto_add_replicas with currently live nodes: 2
   [junit4]   2> 6225 DEBUG (simCloudManagerPool-13-thread-2) [    ] o.a.s.c.a.AutoScalingHandler Verified autoscaling configuration
   [junit4]   2> 6225 DEBUG (simCloudManagerPool-13-thread-2) [    ] o.a.s.c.a.OverseerTriggerThread Refreshing /autoscaling.json with znode version 13
   [junit4]   2> 6226 DEBUG (Simulated OverseerAutoScalingTriggerThread) [    ] o.a.s.c.a.OverseerTriggerThread Processed trigger updates upto znodeVersion 13
   [junit4]   2> 6226 INFO  (Simulated OverseerAutoScalingTriggerThread) [    ] o.a.s.c.a.s.TestTriggerIntegration TestTriggerAction init
   [junit4]   2> 6226 DEBUG (Simulated OverseerAutoScalingTriggerThread) [    ] o.a.s.c.a.NodeAddedTrigger NodeAddedTrigger node_added_cooldown_trigger - Initial livenodes: [127.0.0.1:10001_solr, 127.0.0.1:10000_solr]
   [junit4]   2> 6226 DEBUG (Simulated OverseerAutoScalingTriggerThread) [    ] o.a.s.c.a.NodeAddedTrigger NodeAddedTrigger node_added_cooldown_trigger instantiated with properties: {event=nodeAdded, waitFor=1, actions=[{name=test, class=org.apache.solr.cloud.autoscaling.sim.TestTriggerIntegration$TestTriggerAction}], enabled=true}
   [junit4]   2> 6228 DEBUG (Simulated OverseerAutoScalingTriggerThread) [    ] o.a.s.c.a.OverseerTriggerThread Current znodeVersion 13, lastZnodeVersion 13
   [junit4]   2> 6228 DEBUG (ScheduledTrigger-14-thread-1) [    ] o.a.s.c.a.NodeAddedTrigger Running NodeAddedTrigger node_added_cooldown_trigger
   [junit4]   2> 6228 DEBUG (ScheduledTrigger-14-thread-1) [    ] o.a.s.c.a.NodeAddedTrigger Found livenodes: 2
   [junit4]   2> 6233 DEBUG (ScheduledTrigger-14-thread-1) [    ] o.a.s.c.a.NodeLostTrigger Running NodeLostTrigger: .auto_add_replicas with currently live nodes: 2
   [junit4]   2> 6236 DEBUG (simCloudManagerPool-13-thread-3) [    ] o.a.s.c.a.AutoScalingHandler Verified autoscaling configuration
   [junit4]   2> 6237 DEBUG (simCloudManagerPool-13-thread-3) [    ] o.a.s.c.a.OverseerTriggerThread Refreshing /autoscaling.json with znode version 14
   [junit4]   2> 6239 DEBUG (Simulated OverseerAutoScalingTriggerThread) [    ] o.a.s.c.a.OverseerTriggerThread Processed trigger updates upto znodeVersion 14
   [junit4]   2> 6239 DEBUG (Simulated OverseerAutoScalingTriggerThread) [    ] o.a.s.c.a.OverseerTriggerThread Current znodeVersion 14, lastZnodeVersion 14
   [junit4]   2> 6248 DEBUG (ScheduledTrigger-14-thread-2) [    ] o.a.s.c.a.NodeAddedTrigger Running NodeAddedTrigger node_added_cooldown_trigger
   [junit4]   2> 6249 DEBUG (ScheduledTrigger-14-thread-2) [    ] o.a.s.c.a.NodeAddedTrigger Found livenodes: 3
   [junit4]   2> 6249 DEBUG (ScheduledTrigger-14-thread-2) [    ] o.a.s.c.a.NodeAddedTrigger Tracking new node: 127.0.0.1:10003_solr at time 12813001212162762
   [junit4]   2> 6254 DEBUG (ScheduledTrigger-14-thread-4) [    ] o.a.s.c.a.NodeLostTrigger Running NodeLostTrigger: .auto_add_replicas with currently live nodes: 3
   [junit4]   2> 6271 DEBUG (ScheduledTrigger-14-thread-4) [    ] o.a.s.c.a.NodeAddedTrigger Running NodeAddedTrigger node_added_cooldown_trigger
   [junit4]   2> 6271 DEBUG (ScheduledTrigger-14-thread-4) [    ] o.a.s.c.a.NodeAddedTrigger Found livenodes: 3
   [junit4]   2> 6271 DEBUG (ScheduledTrigger-14-thread-4) [    ] o.a.s.c.a.NodeAddedTrigger NodeAddedTrigger node_added_cooldown_trigger firing registered processor for nodes: [127.0.0.1:10003_solr] added at times [12813001212162762], now=12813002320013812
   [junit4]   2> 6271 DEBUG (ScheduledTrigger-14-thread-4) [    ] o.a.s.c.a.ScheduledTriggers ++++++++ Cooldown inactive - processing event: {
   [junit4]   2>   "id":"2d855b51c1f2caT4nkqq99srzs294hz7t4p9eia1",
   [junit4]   2>   "source":"node_added_cooldown_trigger",
   [junit4]   2>   "eventTime":12813001212162762,
   [junit4]   2>   "eventType":"NODEADDED",
   [junit4]   2>   "properties":{
   [junit4]   2>     "eventTimes":[12813001212162762],
   [junit4]   2>     "nodeNames":["127.0.0.1:10003_solr"]}}
   [junit4]   2> 6272 DEBUG (ScheduledTrigger-14-thread-4) [    ] o.a.s.c.a.ScheduledTriggers Pausing all triggers: [.auto_add_replicas, node_added_cooldown_trigger]
   [junit4]   2> 6310 DEBUG (simCloudManagerPool-13-thread-4) [    ] o.a.s.c.a.s.SimClusterStateProvider -- no leader in shard1:{
   [junit4]   2>   "replicas":{"core_node3":{
   [junit4]   2>       "core":".system_shard1_replica_n1",
   [junit4]   2>       "SEARCHER.searcher.maxDoc":0,
   [junit4]   2>       "SEARCHER.searcher.deletedDocs":0,
   [junit4]   2>       "INDEX.sizeInBytes":10240,
   [junit4]   2>       "node_name":"127.0.0.1:10000_solr",
   [junit4]   2>       "state":"active",
   [junit4]   2>       "type":"NRT",
   [junit4]   2>       "INDEX.sizeInGB":9.5367431640625E-6,
   [junit4]   2>       "SEARCHER.searcher.numDocs":0}},
   [junit4]   2>   "range":"80000000-7fffffff",
   [junit4]   2>   "state":"active"}
   [junit4]   2> 6310 DEBUG (ScheduledTrigger-14-thread-4) [    ] o.a.s.c.a.NodeAddedTrigger NodeAddedTrigger node_added_cooldown_trigger - removing marker path: /autoscaling/nodeAdded/127.0.0.1:10003_solr
   [junit4]   2> 6311 DEBUG (AutoscalingActionExecutor-15-thread-1) [    ] o.a.s.c.a.ScheduledTriggers -- processing actions for {
   [junit4]   2>   "id":"2d855b51c1f2caT4nkqq99srzs294hz7t4p9eia1",
   [junit4]   2>   "source":"node_added_cooldown_trigger",
   [junit4]   2>   "eventTime":12813001212162762,
   [junit4]   2>   "eventType":"NODEADDED",
   [junit4]   2>   "properties":{
   [junit4]   2>     "eventTimes":[12813001212162762],
   [junit4]   2>     "_enqueue_time_":12813002383986962,
   [junit4]   2>     "nodeNames":["127.0.0.1:10003_solr"]}}
   [junit4]   2> 6314 DEBUG (simCloudManagerPool-13-thread-7) [    ] o.a.s.c.a.s.SimClusterStateProvider -- no leader in shard1:{
   [junit4]   2>   "replicas":{"core_node3":{
   [junit4]   2>       "core":".system_shard1_replica_n1",
   [junit4]   2>       "SEARCHER.searcher.maxDoc":0,
   [junit4]   2>       "SEARCHER.searcher.deletedDocs":0,
   [junit4]   2>       "INDEX.sizeInBytes":10240,
   [junit4]   2>       "node_name":"127.0.0.1:10000_solr",
   [junit4]   2>       "state":"active",
   [junit4]   2>       "type":"NRT",
   [junit4]   2>       "INDEX.sizeInGB":9.5367431640625E-6,
   [junit4]   2>       "SEARCHER.searcher.numDocs":0}},
   [junit4]   2>   "range":"80000000-7fffffff",
   [junit4]   2>   "state":"active"}
   [junit4

[...truncated too long message...]

sts-master/lucene/top-level-ivy-settings.xml

resolve:

ivy-availability-check:
[loadresource] Do not set property disallowed.ivy.jars.list as its length is 0.

-ivy-fail-disallowed-ivy-version:

ivy-fail:

ivy-fail:

ivy-configure:
[ivy:configure] :: loading settings :: file = /home/jenkins/jenkins-slave/workspace/Lucene-Solr-BadApples-Tests-master/lucene/top-level-ivy-settings.xml

resolve:

ivy-availability-check:
[loadresource] Do not set property disallowed.ivy.jars.list as its length is 0.

-ivy-fail-disallowed-ivy-version:

ivy-fail:

ivy-configure:
[ivy:configure] :: loading settings :: file = /home/jenkins/jenkins-slave/workspace/Lucene-Solr-BadApples-Tests-master/lucene/top-level-ivy-settings.xml

resolve:

ivy-availability-check:
[loadresource] Do not set property disallowed.ivy.jars.list as its length is 0.

-ivy-fail-disallowed-ivy-version:

ivy-fail:

ivy-fail:

ivy-configure:
[ivy:configure] :: loading settings :: file = /home/jenkins/jenkins-slave/workspace/Lucene-Solr-BadApples-Tests-master/lucene/top-level-ivy-settings.xml

resolve:

ivy-availability-check:
[loadresource] Do not set property disallowed.ivy.jars.list as its length is 0.

-ivy-fail-disallowed-ivy-version:

ivy-fail:

ivy-fail:

ivy-configure:
[ivy:configure] :: loading settings :: file = /home/jenkins/jenkins-slave/workspace/Lucene-Solr-BadApples-Tests-master/lucene/top-level-ivy-settings.xml

resolve:

ivy-availability-check:
[loadresource] Do not set property disallowed.ivy.jars.list as its length is 0.

-ivy-fail-disallowed-ivy-version:

ivy-fail:

ivy-fail:

ivy-configure:
[ivy:configure] :: loading settings :: file = /home/jenkins/jenkins-slave/workspace/Lucene-Solr-BadApples-Tests-master/lucene/top-level-ivy-settings.xml

resolve:

ivy-availability-check:
[loadresource] Do not set property disallowed.ivy.jars.list as its length is 0.

-ivy-fail-disallowed-ivy-version:

ivy-fail:

ivy-fail:

ivy-configure:
[ivy:configure] :: loading settings :: file = /home/jenkins/jenkins-slave/workspace/Lucene-Solr-BadApples-Tests-master/lucene/top-level-ivy-settings.xml

resolve:

ivy-availability-check:
[loadresource] Do not set property disallowed.ivy.jars.list as its length is 0.

-ivy-fail-disallowed-ivy-version:

ivy-fail:

ivy-fail:

ivy-configure:
[ivy:configure] :: loading settings :: file = /home/jenkins/jenkins-slave/workspace/Lucene-Solr-BadApples-Tests-master/lucene/top-level-ivy-settings.xml

resolve:

ivy-availability-check:
[loadresource] Do not set property disallowed.ivy.jars.list as its length is 0.

-ivy-fail-disallowed-ivy-version:

ivy-fail:

ivy-fail:

ivy-configure:
[ivy:configure] :: loading settings :: file = /home/jenkins/jenkins-slave/workspace/Lucene-Solr-BadApples-Tests-master/lucene/top-level-ivy-settings.xml

resolve:

ivy-availability-check:
[loadresource] Do not set property disallowed.ivy.jars.list as its length is 0.

-ivy-fail-disallowed-ivy-version:

ivy-fail:

ivy-fail:

ivy-configure:
[ivy:configure] :: loading settings :: file = /home/jenkins/jenkins-slave/workspace/Lucene-Solr-BadApples-Tests-master/lucene/top-level-ivy-settings.xml

resolve:

ivy-availability-check:
[loadresource] Do not set property disallowed.ivy.jars.list as its length is 0.

-ivy-fail-disallowed-ivy-version:

ivy-fail:

ivy-fail:

ivy-configure:
[ivy:configure] :: loading settings :: file = /home/jenkins/jenkins-slave/workspace/Lucene-Solr-BadApples-Tests-master/lucene/top-level-ivy-settings.xml

resolve:

ivy-availability-check:
[loadresource] Do not set property disallowed.ivy.jars.list as its length is 0.

-ivy-fail-disallowed-ivy-version:

ivy-fail:

ivy-fail:

ivy-configure:
[ivy:configure] :: loading settings :: file = /home/jenkins/jenkins-slave/workspace/Lucene-Solr-BadApples-Tests-master/lucene/top-level-ivy-settings.xml

resolve:

ivy-availability-check:
[loadresource] Do not set property disallowed.ivy.jars.list as its length is 0.

-ivy-fail-disallowed-ivy-version:

ivy-fail:

ivy-fail:

ivy-configure:
[ivy:configure] :: loading settings :: file = /home/jenkins/jenkins-slave/workspace/Lucene-Solr-BadApples-Tests-master/lucene/top-level-ivy-settings.xml

resolve:

ivy-availability-check:
[loadresource] Do not set property disallowed.ivy.jars.list as its length is 0.

-ivy-fail-disallowed-ivy-version:

ivy-fail:

ivy-fail:

ivy-configure:
[ivy:configure] :: loading settings :: file = /home/jenkins/jenkins-slave/workspace/Lucene-Solr-BadApples-Tests-master/lucene/top-level-ivy-settings.xml

resolve:

jar-checksums:
    [mkdir] Created dir: /home/jenkins/jenkins-slave/workspace/Lucene-Solr-BadApples-Tests-master/solr/null277163377
     [copy] Copying 247 files to /home/jenkins/jenkins-slave/workspace/Lucene-Solr-BadApples-Tests-master/solr/null277163377
   [delete] Deleting directory /home/jenkins/jenkins-slave/workspace/Lucene-Solr-BadApples-Tests-master/solr/null277163377

check-working-copy:
[ivy:cachepath] :: resolving dependencies :: org.eclipse.jgit#org.eclipse.jgit-caller;working
[ivy:cachepath] 	confs: [default]
[ivy:cachepath] 	found org.eclipse.jgit#org.eclipse.jgit;4.6.0.201612231935-r in public
[ivy:cachepath] 	found com.jcraft#jsch;0.1.53 in public
[ivy:cachepath] 	found com.googlecode.javaewah#JavaEWAH;1.1.6 in public
[ivy:cachepath] 	found org.apache.httpcomponents#httpclient;4.3.6 in public
[ivy:cachepath] 	found org.apache.httpcomponents#httpcore;4.3.3 in public
[ivy:cachepath] 	found commons-logging#commons-logging;1.1.3 in public
[ivy:cachepath] 	found commons-codec#commons-codec;1.6 in public
[ivy:cachepath] 	found org.slf4j#slf4j-api;1.7.2 in public
[ivy:cachepath] :: resolution report :: resolve 71ms :: artifacts dl 18ms
	---------------------------------------------------------------------
	|                  |            modules            ||   artifacts   |
	|       conf       | number| search|dwnlded|evicted|| number|dwnlded|
	---------------------------------------------------------------------
	|      default     |   8   |   0   |   0   |   0   ||   8   |   0   |
	---------------------------------------------------------------------
[wc-checker] Initializing working copy...
[wc-checker] SLF4J: Failed to load class "org.slf4j.impl.StaticLoggerBinder".
[wc-checker] SLF4J: Defaulting to no-operation (NOP) logger implementation
[wc-checker] SLF4J: See http://www.slf4j.org/codes.html#StaticLoggerBinder for further details.
[wc-checker] Checking working copy status...

-jenkins-base:

BUILD SUCCESSFUL
Total time: 216 minutes 20 seconds
Archiving artifacts
java.lang.InterruptedException: no matches found within 10000
	at hudson.FilePath$34.hasMatch(FilePath.java:2678)
	at hudson.FilePath$34.invoke(FilePath.java:2557)
	at hudson.FilePath$34.invoke(FilePath.java:2547)
	at hudson.FilePath$FileCallableWrapper.call(FilePath.java:2918)
Also:   hudson.remoting.Channel$CallSiteStackTrace: Remote call to lucene2
		at hudson.remoting.Channel.attachCallSiteStackTrace(Channel.java:1741)
		at hudson.remoting.UserRequest$ExceptionResponse.retrieve(UserRequest.java:357)
		at hudson.remoting.Channel.call(Channel.java:955)
		at hudson.FilePath.act(FilePath.java:1036)
		at hudson.FilePath.act(FilePath.java:1025)
		at hudson.FilePath.validateAntFileMask(FilePath.java:2547)
		at hudson.tasks.ArtifactArchiver.perform(ArtifactArchiver.java:243)
		at hudson.tasks.BuildStepCompatibilityLayer.perform(BuildStepCompatibilityLayer.java:81)
		at hudson.tasks.BuildStepMonitor$1.perform(BuildStepMonitor.java:20)
		at hudson.model.AbstractBuild$AbstractBuildExecution.perform(AbstractBuild.java:744)
		at hudson.model.AbstractBuild$AbstractBuildExecution.performAllBuildSteps(AbstractBuild.java:690)
		at hudson.model.Build$BuildExecution.post2(Build.java:186)
		at hudson.model.AbstractBuild$AbstractBuildExecution.post(AbstractBuild.java:635)
		at hudson.model.Run.execute(Run.java:1819)
		at hudson.model.FreeStyleBuild.run(FreeStyleBuild.java:43)
		at hudson.model.ResourceController.execute(ResourceController.java:97)
		at hudson.model.Executor.run(Executor.java:429)
Caused: hudson.FilePath$TunneledInterruptedException
	at hudson.FilePath$FileCallableWrapper.call(FilePath.java:2920)
	at hudson.remoting.UserRequest.perform(UserRequest.java:212)
	at hudson.remoting.UserRequest.perform(UserRequest.java:54)
	at hudson.remoting.Request$2.run(Request.java:369)
	at hudson.remoting.InterceptingExecutorService$1.call(InterceptingExecutorService.java:72)
	at java.util.concurrent.FutureTask.run(FutureTask.java:266)
	at java.util.concurrent.ThreadPoolExecutor.runWorker(ThreadPoolExecutor.java:1142)
	at java.util.concurrent.ThreadPoolExecutor$Worker.run(ThreadPoolExecutor.java:617)
	at java.lang.Thread.run(Thread.java:748)
Caused: java.lang.InterruptedException: java.lang.InterruptedException: no matches found within 10000
	at hudson.FilePath.act(FilePath.java:1038)
	at hudson.FilePath.act(FilePath.java:1025)
	at hudson.FilePath.validateAntFileMask(FilePath.java:2547)
	at hudson.tasks.ArtifactArchiver.perform(ArtifactArchiver.java:243)
	at hudson.tasks.BuildStepCompatibilityLayer.perform(BuildStepCompatibilityLayer.java:81)
	at hudson.tasks.BuildStepMonitor$1.perform(BuildStepMonitor.java:20)
	at hudson.model.AbstractBuild$AbstractBuildExecution.perform(AbstractBuild.java:744)
	at hudson.model.AbstractBuild$AbstractBuildExecution.performAllBuildSteps(AbstractBuild.java:690)
	at hudson.model.Build$BuildExecution.post2(Build.java:186)
	at hudson.model.AbstractBuild$AbstractBuildExecution.post(AbstractBuild.java:635)
	at hudson.model.Run.execute(Run.java:1819)
	at hudson.model.FreeStyleBuild.run(FreeStyleBuild.java:43)
	at hudson.model.ResourceController.execute(ResourceController.java:97)
	at hudson.model.Executor.run(Executor.java:429)
No artifacts found that match the file pattern "**/*.events,heapdumps/**,**/hs_err_pid*". Configuration error?
Recording test results
Build step 'Publish JUnit test result report' changed build result to UNSTABLE
Email was triggered for: Unstable (Test Failures)
Sending email for trigger: Unstable (Test Failures)

Mime
View raw message