lucene-dev mailing list archives

Site index · List index
Message view « Date » · « Thread »
Top « Date » · « Thread »
From Policeman Jenkins Server <jenk...@thetaphi.de>
Subject [JENKINS] Lucene-Solr-7.x-Linux (64bit/jdk-10.0.1) - Build # 2306 - Still Unstable!
Date Thu, 12 Jul 2018 18:59:08 GMT
Build: https://jenkins.thetaphi.de/job/Lucene-Solr-7.x-Linux/2306/
Java: 64bit/jdk-10.0.1 -XX:-UseCompressedOops -XX:+UseParallelGC

1 tests failed.
FAILED:  org.apache.solr.handler.component.InfixSuggestersTest.testShutdownDuringBuild

Error Message:
junit.framework.AssertionFailedError: Unexpected wrapped exception type, expected CoreIsClosedException

Stack Trace:
java.util.concurrent.ExecutionException: junit.framework.AssertionFailedError: Unexpected wrapped exception type, expected CoreIsClosedException
	at __randomizedtesting.SeedInfo.seed([73F5578926B30E68:AC78353618DA5B0A]:0)
	at java.base/java.util.concurrent.FutureTask.report(FutureTask.java:122)
	at java.base/java.util.concurrent.FutureTask.get(FutureTask.java:191)
	at org.apache.solr.handler.component.InfixSuggestersTest.testShutdownDuringBuild(InfixSuggestersTest.java:130)
	at java.base/jdk.internal.reflect.NativeMethodAccessorImpl.invoke0(Native Method)
	at java.base/jdk.internal.reflect.NativeMethodAccessorImpl.invoke(NativeMethodAccessorImpl.java:62)
	at java.base/jdk.internal.reflect.DelegatingMethodAccessorImpl.invoke(DelegatingMethodAccessorImpl.java:43)
	at java.base/java.lang.reflect.Method.invoke(Method.java:564)
	at com.carrotsearch.randomizedtesting.RandomizedRunner.invoke(RandomizedRunner.java:1737)
	at com.carrotsearch.randomizedtesting.RandomizedRunner$8.evaluate(RandomizedRunner.java:934)
	at com.carrotsearch.randomizedtesting.RandomizedRunner$9.evaluate(RandomizedRunner.java:970)
	at com.carrotsearch.randomizedtesting.RandomizedRunner$10.evaluate(RandomizedRunner.java:984)
	at com.carrotsearch.randomizedtesting.rules.SystemPropertiesRestoreRule$1.evaluate(SystemPropertiesRestoreRule.java:57)
	at org.apache.lucene.util.TestRuleSetupTeardownChained$1.evaluate(TestRuleSetupTeardownChained.java:49)
	at org.apache.lucene.util.AbstractBeforeAfterRule$1.evaluate(AbstractBeforeAfterRule.java:45)
	at org.apache.lucene.util.TestRuleThreadAndTestName$1.evaluate(TestRuleThreadAndTestName.java:48)
	at org.apache.lucene.util.TestRuleIgnoreAfterMaxFailures$1.evaluate(TestRuleIgnoreAfterMaxFailures.java:64)
	at org.apache.lucene.util.TestRuleMarkFailure$1.evaluate(TestRuleMarkFailure.java:47)
	at com.carrotsearch.randomizedtesting.rules.StatementAdapter.evaluate(StatementAdapter.java:36)
	at com.carrotsearch.randomizedtesting.ThreadLeakControl$StatementRunner.run(ThreadLeakControl.java:368)
	at com.carrotsearch.randomizedtesting.ThreadLeakControl.forkTimeoutingTask(ThreadLeakControl.java:817)
	at com.carrotsearch.randomizedtesting.ThreadLeakControl$3.evaluate(ThreadLeakControl.java:468)
	at com.carrotsearch.randomizedtesting.RandomizedRunner.runSingleTest(RandomizedRunner.java:943)
	at com.carrotsearch.randomizedtesting.RandomizedRunner$5.evaluate(RandomizedRunner.java:829)
	at com.carrotsearch.randomizedtesting.RandomizedRunner$6.evaluate(RandomizedRunner.java:879)
	at com.carrotsearch.randomizedtesting.RandomizedRunner$7.evaluate(RandomizedRunner.java:890)
	at com.carrotsearch.randomizedtesting.rules.StatementAdapter.evaluate(StatementAdapter.java:36)
	at com.carrotsearch.randomizedtesting.rules.SystemPropertiesRestoreRule$1.evaluate(SystemPropertiesRestoreRule.java:57)
	at org.apache.lucene.util.AbstractBeforeAfterRule$1.evaluate(AbstractBeforeAfterRule.java:45)
	at com.carrotsearch.randomizedtesting.rules.StatementAdapter.evaluate(StatementAdapter.java:36)
	at org.apache.lucene.util.TestRuleStoreClassName$1.evaluate(TestRuleStoreClassName.java:41)
	at com.carrotsearch.randomizedtesting.rules.NoShadowingOrOverridesOnMethodsRule$1.evaluate(NoShadowingOrOverridesOnMethodsRule.java:40)
	at com.carrotsearch.randomizedtesting.rules.NoShadowingOrOverridesOnMethodsRule$1.evaluate(NoShadowingOrOverridesOnMethodsRule.java:40)
	at com.carrotsearch.randomizedtesting.rules.StatementAdapter.evaluate(StatementAdapter.java:36)
	at com.carrotsearch.randomizedtesting.rules.StatementAdapter.evaluate(StatementAdapter.java:36)
	at org.apache.lucene.util.TestRuleAssertionsRequired$1.evaluate(TestRuleAssertionsRequired.java:53)
	at org.apache.lucene.util.TestRuleMarkFailure$1.evaluate(TestRuleMarkFailure.java:47)
	at org.apache.lucene.util.TestRuleIgnoreAfterMaxFailures$1.evaluate(TestRuleIgnoreAfterMaxFailures.java:64)
	at org.apache.lucene.util.TestRuleIgnoreTestSuites$1.evaluate(TestRuleIgnoreTestSuites.java:54)
	at com.carrotsearch.randomizedtesting.rules.StatementAdapter.evaluate(StatementAdapter.java:36)
	at com.carrotsearch.randomizedtesting.ThreadLeakControl$StatementRunner.run(ThreadLeakControl.java:368)
	at java.base/java.lang.Thread.run(Thread.java:844)
Caused by: junit.framework.AssertionFailedError: Unexpected wrapped exception type, expected CoreIsClosedException
	at org.apache.lucene.util.LuceneTestCase.expectThrows(LuceneTestCase.java:2704)
	at org.apache.solr.handler.component.InfixSuggestersTest.lambda$testShutdownDuringBuild$3(InfixSuggestersTest.java:121)
	at java.base/java.util.concurrent.FutureTask.run(FutureTask.java:264)
	at org.apache.solr.common.util.ExecutorUtil$MDCAwareThreadPoolExecutor.lambda$execute$0(ExecutorUtil.java:209)
	at java.base/java.util.concurrent.ThreadPoolExecutor.runWorker(ThreadPoolExecutor.java:1135)
	at java.base/java.util.concurrent.ThreadPoolExecutor$Worker.run(ThreadPoolExecutor.java:635)
	... 1 more
Caused by: java.lang.RuntimeException: Exception during query
	at org.apache.solr.SolrTestCaseJ4.assertQ(SolrTestCaseJ4.java:917)
	at org.apache.solr.SolrTestCaseJ4.assertQ(SolrTestCaseJ4.java:877)
	at org.apache.solr.handler.component.InfixSuggestersTest.lambda$testShutdownDuringBuild$2(InfixSuggestersTest.java:122)
	at org.apache.lucene.util.LuceneTestCase.expectThrows(LuceneTestCase.java:2696)
	... 6 more
Caused by: org.apache.solr.common.SolrException: SolrCoreState already closed.
	at org.apache.solr.update.DefaultSolrCoreState.lock(DefaultSolrCoreState.java:186)
	at org.apache.solr.update.DefaultSolrCoreState.getIndexWriter(DefaultSolrCoreState.java:121)
	at org.apache.solr.update.SolrCoreState.getTragicException(SolrCoreState.java:198)
	at org.apache.solr.core.CoreContainer.checkTragicException(CoreContainer.java:1805)
	at org.apache.solr.handler.RequestHandlerBase.handleRequest(RequestHandlerBase.java:212)
	at org.apache.solr.core.SolrCore.execute(SolrCore.java:2541)
	at org.apache.solr.util.TestHarness.query(TestHarness.java:337)
	at org.apache.solr.util.TestHarness.query(TestHarness.java:319)
	at org.apache.solr.SolrTestCaseJ4.assertQ(SolrTestCaseJ4.java:891)
	... 9 more




Build Log:
[...truncated 12590 lines...]
   [junit4] Suite: org.apache.solr.handler.component.InfixSuggestersTest
   [junit4]   2> Creating dataDir: /home/jenkins/workspace/Lucene-Solr-7.x-Linux/solr/build/solr-core/test/J0/temp/solr.handler.component.InfixSuggestersTest_73F5578926B30E68-001/init-core-data-001
   [junit4]   2> 288438 WARN  (SUITE-InfixSuggestersTest-seed#[73F5578926B30E68]-worker) [    ] o.a.s.SolrTestCaseJ4 startTrackingSearchers: numOpens=1 numCloses=1
   [junit4]   2> 288439 INFO  (SUITE-InfixSuggestersTest-seed#[73F5578926B30E68]-worker) [    ] o.a.s.SolrTestCaseJ4 Using PointFields (NUMERIC_POINTS_SYSPROP=true) w/NUMERIC_DOCVALUES_SYSPROP=true
   [junit4]   2> 288439 INFO  (SUITE-InfixSuggestersTest-seed#[73F5578926B30E68]-worker) [    ] o.a.s.SolrTestCaseJ4 Randomized ssl (true) and clientAuth (true) via: @org.apache.solr.util.RandomizeSSL(reason="", ssl=0.0/0.0, value=0.0/0.0, clientAuth=0.0/0.0)
   [junit4]   2> 288440 INFO  (SUITE-InfixSuggestersTest-seed#[73F5578926B30E68]-worker) [    ] o.a.s.SolrTestCaseJ4 SecureRandom sanity checks: test.solr.allowed.securerandom=null & java.security.egd=file:/dev/./urandom
   [junit4]   2> 288440 INFO  (SUITE-InfixSuggestersTest-seed#[73F5578926B30E68]-worker) [    ] o.a.s.SolrTestCaseJ4 ####initCore
   [junit4]   2> 288440 INFO  (SUITE-InfixSuggestersTest-seed#[73F5578926B30E68]-worker) [    ] o.a.s.c.SolrResourceLoader [null] Added 2 libs to classloader, from paths: [/home/jenkins/workspace/Lucene-Solr-7.x-Linux/solr/core/src/test-files/solr/collection1/lib, /home/jenkins/workspace/Lucene-Solr-7.x-Linux/solr/core/src/test-files/solr/collection1/lib/classes]
   [junit4]   2> 288463 INFO  (SUITE-InfixSuggestersTest-seed#[73F5578926B30E68]-worker) [    ] o.a.s.c.SolrConfig Using Lucene MatchVersion: 7.5.0
   [junit4]   2> 288469 INFO  (SUITE-InfixSuggestersTest-seed#[73F5578926B30E68]-worker) [    ] o.a.s.s.IndexSchema [null] Schema name=test
   [junit4]   2> 288519 INFO  (SUITE-InfixSuggestersTest-seed#[73F5578926B30E68]-worker) [    ] o.a.s.s.IndexSchema Loaded schema test/1.0 with uniqueid field id
   [junit4]   2> 288558 INFO  (SUITE-InfixSuggestersTest-seed#[73F5578926B30E68]-worker) [    ] o.a.s.c.TransientSolrCoreCacheDefault Allocating transient cache for 2147483647 transient cores
   [junit4]   2> 288558 INFO  (SUITE-InfixSuggestersTest-seed#[73F5578926B30E68]-worker) [    ] o.a.s.h.a.MetricsHistoryHandler No .system collection, keeping metrics history in memory.
   [junit4]   2> 288570 INFO  (SUITE-InfixSuggestersTest-seed#[73F5578926B30E68]-worker) [    ] o.a.s.m.r.SolrJmxReporter JMX monitoring for 'solr.node' (registry 'solr.node') enabled at server: com.sun.jmx.mbeanserver.JmxMBeanServer@3116f176
   [junit4]   2> 288577 INFO  (SUITE-InfixSuggestersTest-seed#[73F5578926B30E68]-worker) [    ] o.a.s.m.r.SolrJmxReporter JMX monitoring for 'solr.jvm' (registry 'solr.jvm') enabled at server: com.sun.jmx.mbeanserver.JmxMBeanServer@3116f176
   [junit4]   2> 288577 INFO  (SUITE-InfixSuggestersTest-seed#[73F5578926B30E68]-worker) [    ] o.a.s.m.r.SolrJmxReporter JMX monitoring for 'solr.jetty' (registry 'solr.jetty') enabled at server: com.sun.jmx.mbeanserver.JmxMBeanServer@3116f176
   [junit4]   2> 288579 INFO  (coreLoadExecutor-1044-thread-1) [    x:collection1] o.a.s.c.SolrResourceLoader [null] Added 2 libs to classloader, from paths: [/home/jenkins/workspace/Lucene-Solr-7.x-Linux/solr/core/src/test-files/solr/collection1/lib, /home/jenkins/workspace/Lucene-Solr-7.x-Linux/solr/core/src/test-files/solr/collection1/lib/classes]
   [junit4]   2> 288591 INFO  (coreLoadExecutor-1044-thread-1) [    x:collection1] o.a.s.c.SolrConfig Using Lucene MatchVersion: 7.5.0
   [junit4]   2> 288598 INFO  (coreLoadExecutor-1044-thread-1) [    x:collection1] o.a.s.s.IndexSchema [collection1] Schema name=test
   [junit4]   2> 288677 INFO  (coreLoadExecutor-1044-thread-1) [    x:collection1] o.a.s.s.IndexSchema Loaded schema test/1.0 with uniqueid field id
   [junit4]   2> 288685 INFO  (coreLoadExecutor-1044-thread-1) [    x:collection1] o.a.s.c.CoreContainer Creating SolrCore 'collection1' using configuration from instancedir /home/jenkins/workspace/Lucene-Solr-7.x-Linux/solr/core/src/test-files/solr/collection1, trusted=true
   [junit4]   2> 288686 INFO  (coreLoadExecutor-1044-thread-1) [    x:collection1] o.a.s.m.r.SolrJmxReporter JMX monitoring for 'solr.core.collection1' (registry 'solr.core.collection1') enabled at server: com.sun.jmx.mbeanserver.JmxMBeanServer@3116f176
   [junit4]   2> 288688 INFO  (coreLoadExecutor-1044-thread-1) [    x:collection1] o.a.s.c.SolrCore solr.RecoveryStrategy.Builder
   [junit4]   2> 288688 INFO  (coreLoadExecutor-1044-thread-1) [    x:collection1] o.a.s.c.SolrCore [[collection1] ] Opening new SolrCore at [/home/jenkins/workspace/Lucene-Solr-7.x-Linux/solr/core/src/test-files/solr/collection1], dataDir=[/home/jenkins/workspace/Lucene-Solr-7.x-Linux/solr/build/solr-core/test/J0/temp/solr.handler.component.InfixSuggestersTest_73F5578926B30E68-001/init-core-data-001/]
   [junit4]   2> 288690 INFO  (coreLoadExecutor-1044-thread-1) [    x:collection1] o.a.s.u.RandomMergePolicy RandomMergePolicy wrapping class org.apache.lucene.index.TieredMergePolicy: [TieredMergePolicy: maxMergeAtOnce=38, maxMergeAtOnceExplicit=46, maxMergedSegmentMB=36.61328125, floorSegmentMB=0.89453125, forceMergeDeletesPctAllowed=6.505926793390455, segmentsPerTier=19.0, maxCFSSegmentSizeMB=8.796093022207999E12, noCFSRatio=0.26835987281211826, reclaimDeletesWeight=0.5009067601179504
   [junit4]   2> 288760 INFO  (coreLoadExecutor-1044-thread-1) [    x:collection1] o.a.s.u.CommitTracker Hard AutoCommit: disabled
   [junit4]   2> 288760 INFO  (coreLoadExecutor-1044-thread-1) [    x:collection1] o.a.s.u.CommitTracker Soft AutoCommit: disabled
   [junit4]   2> 288761 INFO  (coreLoadExecutor-1044-thread-1) [    x:collection1] o.a.s.u.RandomMergePolicy RandomMergePolicy wrapping class org.apache.lucene.index.TieredMergePolicy: [TieredMergePolicy: maxMergeAtOnce=29, maxMergeAtOnceExplicit=29, maxMergedSegmentMB=7.607421875, floorSegmentMB=2.0380859375, forceMergeDeletesPctAllowed=1.9106971067361056, segmentsPerTier=15.0, maxCFSSegmentSizeMB=8.796093022207999E12, noCFSRatio=1.0, reclaimDeletesWeight=1.8741195146274272
   [junit4]   2> 288761 INFO  (coreLoadExecutor-1044-thread-1) [    x:collection1] o.a.s.s.SolrIndexSearcher Opening [Searcher@ed208ec[collection1] main]
   [junit4]   2> 288762 WARN  (coreLoadExecutor-1044-thread-1) [    x:collection1] o.a.s.r.ManagedResourceStorage Cannot write to config directory /home/jenkins/workspace/Lucene-Solr-7.x-Linux/solr/core/src/test-files/solr/collection1/conf; switching to use InMemory storage instead.
   [junit4]   2> 288762 INFO  (coreLoadExecutor-1044-thread-1) [    x:collection1] o.a.s.h.c.SuggestComponent Initializing SuggestComponent
   [junit4]   2> 288762 INFO  (coreLoadExecutor-1044-thread-1) [    x:collection1] o.a.s.s.s.SolrSuggester init: {name=shortRandomAnalyzingInfixSuggester,lookupImpl=AnalyzingInfixLookupFactory,dictionaryImpl=RandomTestDictionaryFactory,randDictMaxItems=100,indexPath=short_random_analyzing_infix_suggester,suggestAnalyzerFieldType=text,buildOnCommit=false,buildOnStartup=false}
   [junit4]   2> 288775 INFO  (coreLoadExecutor-1044-thread-1) [    x:collection1] o.a.s.s.s.SolrSuggester Dictionary loaded with params: {name=shortRandomAnalyzingInfixSuggester,lookupImpl=AnalyzingInfixLookupFactory,dictionaryImpl=RandomTestDictionaryFactory,randDictMaxItems=100,indexPath=short_random_analyzing_infix_suggester,suggestAnalyzerFieldType=text,buildOnCommit=false,buildOnStartup=false}
   [junit4]   2> 288775 INFO  (coreLoadExecutor-1044-thread-1) [    x:collection1] o.a.s.h.c.SuggestComponent Initializing SuggestComponent
   [junit4]   2> 288775 INFO  (coreLoadExecutor-1044-thread-1) [    x:collection1] o.a.s.s.s.SolrSuggester init: {name=longRandomAnalyzingInfixSuggester,lookupImpl=AnalyzingInfixLookupFactory,dictionaryImpl=RandomTestDictionaryFactory,randDictMaxItems=100000,indexPath=long_random_analyzing_infix_suggester,suggestAnalyzerFieldType=text,buildOnCommit=false,buildOnStartup=false}
   [junit4]   2> 288775 INFO  (coreLoadExecutor-1044-thread-1) [    x:collection1] o.a.s.s.s.SolrSuggester Dictionary loaded with params: {name=longRandomAnalyzingInfixSuggester,lookupImpl=AnalyzingInfixLookupFactory,dictionaryImpl=RandomTestDictionaryFactory,randDictMaxItems=100000,indexPath=long_random_analyzing_infix_suggester,suggestAnalyzerFieldType=text,buildOnCommit=false,buildOnStartup=false}
   [junit4]   2> 288775 INFO  (coreLoadExecutor-1044-thread-1) [    x:collection1] o.a.s.h.c.SuggestComponent Initializing SuggestComponent
   [junit4]   2> 288775 INFO  (coreLoadExecutor-1044-thread-1) [    x:collection1] o.a.s.s.s.SolrSuggester init: {name=shortRandomBlendedInfixSuggester,lookupImpl=BlendedInfixLookupFactory,dictionaryImpl=RandomTestDictionaryFactory,randDictMaxItems=100,blenderType=position_linear,suggestAnalyzerFieldType=text,indexPath=short_random_blended_infix_suggester,highlight=true,buildOnStartup=false,buildOnCommit=false}
   [junit4]   2> 288782 INFO  (coreLoadExecutor-1044-thread-1) [    x:collection1] o.a.s.s.s.SolrSuggester Dictionary loaded with params: {name=shortRandomBlendedInfixSuggester,lookupImpl=BlendedInfixLookupFactory,dictionaryImpl=RandomTestDictionaryFactory,randDictMaxItems=100,blenderType=position_linear,suggestAnalyzerFieldType=text,indexPath=short_random_blended_infix_suggester,highlight=true,buildOnStartup=false,buildOnCommit=false}
   [junit4]   2> 288782 INFO  (coreLoadExecutor-1044-thread-1) [    x:collection1] o.a.s.h.ReplicationHandler Commits will be reserved for 10000ms.
   [junit4]   2> 288783 INFO  (searcherExecutor-1045-thread-1-processing-x:collection1) [    x:collection1] o.a.s.c.SolrCore [collection1] Registered new searcher Searcher@ed208ec[collection1] main{ExitableDirectoryReader(UninvertingDirectoryReader())}
   [junit4]   2> 288783 INFO  (SUITE-InfixSuggestersTest-seed#[73F5578926B30E68]-worker) [    ] o.a.s.SolrTestCaseJ4 ####initCore end
   [junit4]   2> 288785 INFO  (TEST-InfixSuggestersTest.test2xBuildReload-seed#[73F5578926B30E68]) [    ] o.a.s.SolrTestCaseJ4 ###Starting test2xBuildReload
   [junit4]   2> 288785 INFO  (TEST-InfixSuggestersTest.test2xBuildReload-seed#[73F5578926B30E68]) [    ] o.a.s.h.c.SuggestComponent SuggestComponent prepare with : qt=/suggest_analyzing_infix_short_dictionary&suggest=true&suggest.buildAll=true&wt=xml&indent=off
   [junit4]   2> 288785 INFO  (TEST-InfixSuggestersTest.test2xBuildReload-seed#[73F5578926B30E68]) [    ] o.a.s.s.s.SolrSuggester SolrSuggester.build(shortRandomAnalyzingInfixSuggester)
   [junit4]   2> 288828 INFO  (TEST-InfixSuggestersTest.test2xBuildReload-seed#[73F5578926B30E68]) [    ] o.a.s.s.s.RandomTestDictionaryFactory org.apache.solr.spelling.suggest.RandomTestDictionaryFactory$RandomTestDictionary.enabled.shortRandomAnalyzingInfixSuggester disabled after emitting 100 items.
   [junit4]   2> 288886 INFO  (TEST-InfixSuggestersTest.test2xBuildReload-seed#[73F5578926B30E68]) [    ] o.a.s.h.c.SuggestComponent SuggestComponent process with : qt=/suggest_analyzing_infix_short_dictionary&suggest=true&suggest.buildAll=true&wt=xml&indent=off
   [junit4]   2> 288886 INFO  (TEST-InfixSuggestersTest.test2xBuildReload-seed#[73F5578926B30E68]) [    ] o.a.s.c.S.Request [collection1]  webapp=null path=null params={qt=/suggest_analyzing_infix_short_dictionary&suggest.buildAll=true&wt=xml} status=0 QTime=101
   [junit4]   2> 288887 ERROR (TEST-InfixSuggestersTest.test2xBuildReload-seed#[73F5578926B30E68]) [    ] o.a.s.c.CorePropertiesLocator Couldn't load core descriptor from /home/jenkins/workspace/Lucene-Solr-7.x-Linux/solr/core/src/test-files/solr/collection1/core.properties:java.nio.file.NoSuchFileException: /home/jenkins/workspace/Lucene-Solr-7.x-Linux/solr/core/src/test-files/solr/collection1/core.properties
   [junit4]   2> 288887 INFO  (TEST-InfixSuggestersTest.test2xBuildReload-seed#[73F5578926B30E68]) [    ] o.a.s.c.SolrResourceLoader [null] Added 2 libs to classloader, from paths: [/home/jenkins/workspace/Lucene-Solr-7.x-Linux/solr/core/src/test-files/solr/collection1/lib, /home/jenkins/workspace/Lucene-Solr-7.x-Linux/solr/core/src/test-files/solr/collection1/lib/classes]
   [junit4]   2> 288898 INFO  (TEST-InfixSuggestersTest.test2xBuildReload-seed#[73F5578926B30E68]) [    ] o.a.s.c.SolrConfig Using Lucene MatchVersion: 7.5.0
   [junit4]   2> 288904 INFO  (TEST-InfixSuggestersTest.test2xBuildReload-seed#[73F5578926B30E68]) [    ] o.a.s.s.IndexSchema [collection1] Schema name=test
   [junit4]   2> 288971 INFO  (TEST-InfixSuggestersTest.test2xBuildReload-seed#[73F5578926B30E68]) [    ] o.a.s.s.IndexSchema Loaded schema test/1.0 with uniqueid field id
   [junit4]   2> 288976 INFO  (TEST-InfixSuggestersTest.test2xBuildReload-seed#[73F5578926B30E68]) [    ] o.a.s.c.CoreContainer Reloading SolrCore 'collection1' using configuration from instancedir /home/jenkins/workspace/Lucene-Solr-7.x-Linux/solr/core/src/test-files/solr/collection1
   [junit4]   2> 289002 INFO  (TEST-InfixSuggestersTest.test2xBuildReload-seed#[73F5578926B30E68]) [    x:collection1] o.a.s.m.r.SolrJmxReporter JMX monitoring for 'solr.core.collection1' (registry 'solr.core.collection1') enabled at server: com.sun.jmx.mbeanserver.JmxMBeanServer@3116f176
   [junit4]   2> 289003 INFO  (TEST-InfixSuggestersTest.test2xBuildReload-seed#[73F5578926B30E68]) [    x:collection1] o.a.s.c.SolrCore [[collection1] ] Opening new SolrCore at [/home/jenkins/workspace/Lucene-Solr-7.x-Linux/solr/core/src/test-files/solr/collection1], dataDir=[/home/jenkins/workspace/Lucene-Solr-7.x-Linux/solr/build/solr-core/test/J0/temp/solr.handler.component.InfixSuggestersTest_73F5578926B30E68-001/init-core-data-001/]
   [junit4]   2> 289050 INFO  (TEST-InfixSuggestersTest.test2xBuildReload-seed#[73F5578926B30E68]) [    x:collection1] o.a.s.u.CommitTracker Hard AutoCommit: disabled
   [junit4]   2> 289050 INFO  (TEST-InfixSuggestersTest.test2xBuildReload-seed#[73F5578926B30E68]) [    x:collection1] o.a.s.u.CommitTracker Soft AutoCommit: disabled
   [junit4]   2> 289052 INFO  (TEST-InfixSuggestersTest.test2xBuildReload-seed#[73F5578926B30E68]) [    x:collection1] o.a.s.s.SolrIndexSearcher Opening [Searcher@173bb879[collection1] main]
   [junit4]   2> 289052 WARN  (TEST-InfixSuggestersTest.test2xBuildReload-seed#[73F5578926B30E68]) [    x:collection1] o.a.s.r.ManagedResourceStorage Cannot write to config directory /home/jenkins/workspace/Lucene-Solr-7.x-Linux/solr/core/src/test-files/solr/collection1/conf; switching to use InMemory storage instead.
   [junit4]   2> 289053 INFO  (TEST-InfixSuggestersTest.test2xBuildReload-seed#[73F5578926B30E68]) [    x:collection1] o.a.s.h.c.SuggestComponent Initializing SuggestComponent
   [junit4]   2> 289053 INFO  (TEST-InfixSuggestersTest.test2xBuildReload-seed#[73F5578926B30E68]) [    x:collection1] o.a.s.s.s.SolrSuggester init: {name=shortRandomAnalyzingInfixSuggester,lookupImpl=AnalyzingInfixLookupFactory,dictionaryImpl=RandomTestDictionaryFactory,randDictMaxItems=100,indexPath=short_random_analyzing_infix_suggester,suggestAnalyzerFieldType=text,buildOnCommit=false,buildOnStartup=false}
   [junit4]   2> 289055 INFO  (TEST-InfixSuggestersTest.test2xBuildReload-seed#[73F5578926B30E68]) [    x:collection1] o.a.s.s.s.SolrSuggester Dictionary loaded with params: {name=shortRandomAnalyzingInfixSuggester,lookupImpl=AnalyzingInfixLookupFactory,dictionaryImpl=RandomTestDictionaryFactory,randDictMaxItems=100,indexPath=short_random_analyzing_infix_suggester,suggestAnalyzerFieldType=text,buildOnCommit=false,buildOnStartup=false}
   [junit4]   2> 289055 INFO  (TEST-InfixSuggestersTest.test2xBuildReload-seed#[73F5578926B30E68]) [    x:collection1] o.a.s.h.c.SuggestComponent Initializing SuggestComponent
   [junit4]   2> 289055 INFO  (TEST-InfixSuggestersTest.test2xBuildReload-seed#[73F5578926B30E68]) [    x:collection1] o.a.s.s.s.SolrSuggester init: {name=longRandomAnalyzingInfixSuggester,lookupImpl=AnalyzingInfixLookupFactory,dictionaryImpl=RandomTestDictionaryFactory,randDictMaxItems=100000,indexPath=long_random_analyzing_infix_suggester,suggestAnalyzerFieldType=text,buildOnCommit=false,buildOnStartup=false}
   [junit4]   2> 289055 INFO  (TEST-InfixSuggestersTest.test2xBuildReload-seed#[73F5578926B30E68]) [    x:collection1] o.a.s.s.s.SolrSuggester Dictionary loaded with params: {name=longRandomAnalyzingInfixSuggester,lookupImpl=AnalyzingInfixLookupFactory,dictionaryImpl=RandomTestDictionaryFactory,randDictMaxItems=100000,indexPath=long_random_analyzing_infix_suggester,suggestAnalyzerFieldType=text,buildOnCommit=false,buildOnStartup=false}
   [junit4]   2> 289055 INFO  (TEST-InfixSuggestersTest.test2xBuildReload-seed#[73F5578926B30E68]) [    x:collection1] o.a.s.h.c.SuggestComponent Initializing SuggestComponent
   [junit4]   2> 289055 INFO  (TEST-InfixSuggestersTest.test2xBuildReload-seed#[73F5578926B30E68]) [    x:collection1] o.a.s.s.s.SolrSuggester init: {name=shortRandomBlendedInfixSuggester,lookupImpl=BlendedInfixLookupFactory,dictionaryImpl=RandomTestDictionaryFactory,randDictMaxItems=100,blenderType=position_linear,suggestAnalyzerFieldType=text,indexPath=short_random_blended_infix_suggester,highlight=true,buildOnStartup=false,buildOnCommit=false}
   [junit4]   2> 289055 INFO  (TEST-InfixSuggestersTest.test2xBuildReload-seed#[73F5578926B30E68]) [    x:collection1] o.a.s.s.s.SolrSuggester Dictionary loaded with params: {name=shortRandomBlendedInfixSuggester,lookupImpl=BlendedInfixLookupFactory,dictionaryImpl=RandomTestDictionaryFactory,randDictMaxItems=100,blenderType=position_linear,suggestAnalyzerFieldType=text,indexPath=short_random_blended_infix_suggester,highlight=true,buildOnStartup=false,buildOnCommit=false}
   [junit4]   2> 289056 INFO  (TEST-InfixSuggestersTest.test2xBuildReload-seed#[73F5578926B30E68]) [    x:collection1] o.a.s.h.ReplicationHandler Commits will be reserved for 10000ms.
   [junit4]   2> 289056 INFO  (TEST-InfixSuggestersTest.test2xBuildReload-seed#[73F5578926B30E68]) [    x:collection1] o.a.s.u.RandomMergePolicy RandomMergePolicy wrapping class org.apache.lucene.index.TieredMergePolicy: [TieredMergePolicy: maxMergeAtOnce=21, maxMergeAtOnceExplicit=33, maxMergedSegmentMB=2.76953125, floorSegmentMB=0.4111328125, forceMergeDeletesPctAllowed=27.25603737955083, segmentsPerTier=41.0, maxCFSSegmentSizeMB=8.796093022207999E12, noCFSRatio=1.0, reclaimDeletesWeight=2.422918094030772
   [junit4]   2> 289057 INFO  (searcherExecutor-1049-thread-1-processing-x:collection1) [    x:collection1] o.a.s.c.SolrCore [collection1] Registered new searcher Searcher@173bb879[collection1] main{ExitableDirectoryReader(UninvertingDirectoryReader())}
   [junit4]   2> 289057 INFO  (TEST-InfixSuggestersTest.test2xBuildReload-seed#[73F5578926B30E68]) [    x:collection1] o.a.s.u.DefaultSolrCoreState New IndexWriter is ready to be used.
   [junit4]   2> 289057 INFO  (TEST-InfixSuggestersTest.test2xBuildReload-seed#[73F5578926B30E68]) [    x:collection1] o.a.s.s.SolrIndexSearcher Opening [Searcher@2bf232bb[collection1] main]
   [junit4]   2> 289057 INFO  (TEST-InfixSuggestersTest.test2xBuildReload-seed#[73F5578926B30E68]) [    x:collection1] o.a.s.c.SolrCore [collection1]  CLOSING SolrCore org.apache.solr.core.SolrCore@17bc37f
   [junit4]   2> 289057 INFO  (TEST-InfixSuggestersTest.test2xBuildReload-seed#[73F5578926B30E68]) [    x:collection1] o.a.s.m.SolrMetricManager Closing metric reporters for registry=solr.core.collection1, tag=17bc37f
   [junit4]   2> 289058 INFO  (TEST-InfixSuggestersTest.test2xBuildReload-seed#[73F5578926B30E68]) [    x:collection1] o.a.s.m.r.SolrJmxReporter Closing reporter [org.apache.solr.metrics.reporters.SolrJmxReporter@85c3785: rootName = null, domain = solr.core.collection1, service url = null, agent id = null] for registry solr.core.collection1 / com.codahale.metrics.MetricRegistry@75e79ead
   [junit4]   2> 289058 INFO  (searcherExecutor-1049-thread-1-processing-x:collection1) [    x:collection1] o.a.s.c.SolrCore [collection1] Registered new searcher Searcher@2bf232bb[collection1] main{ExitableDirectoryReader(UninvertingDirectoryReader())}
   [junit4]   2> 289066 INFO  (TEST-InfixSuggestersTest.test2xBuildReload-seed#[73F5578926B30E68]) [    x:collection1] o.a.s.h.c.SuggestComponent SuggestComponent prepare with : qt=/suggest_analyzing_infix_short_dictionary&suggest=true&suggest.buildAll=true&wt=xml&indent=off
   [junit4]   2> 289066 INFO  (TEST-InfixSuggestersTest.test2xBuildReload-seed#[73F5578926B30E68]) [    x:collection1] o.a.s.s.s.SolrSuggester SolrSuggester.build(shortRandomAnalyzingInfixSuggester)
   [junit4]   2> 289081 INFO  (TEST-InfixSuggestersTest.test2xBuildReload-seed#[73F5578926B30E68]) [    x:collection1] o.a.s.s.s.RandomTestDictionaryFactory org.apache.solr.spelling.suggest.RandomTestDictionaryFactory$RandomTestDictionary.enabled.shortRandomAnalyzingInfixSuggester disabled after emitting 100 items.
   [junit4]   2> 289130 INFO  (TEST-InfixSuggestersTest.test2xBuildReload-seed#[73F5578926B30E68]) [    x:collection1] o.a.s.h.c.SuggestComponent SuggestComponent process with : qt=/suggest_analyzing_infix_short_dictionary&suggest=true&suggest.buildAll=true&wt=xml&indent=off
   [junit4]   2> 289130 INFO  (TEST-InfixSuggestersTest.test2xBuildReload-seed#[73F5578926B30E68]) [    x:collection1] o.a.s.c.S.Request [collection1]  webapp=null path=null params={qt=/suggest_analyzing_infix_short_dictionary&suggest.buildAll=true&wt=xml} status=0 QTime=63
   [junit4]   2> 289130 ERROR (TEST-InfixSuggestersTest.test2xBuildReload-seed#[73F5578926B30E68]) [    x:collection1] o.a.s.c.CorePropertiesLocator Couldn't load core descriptor from /home/jenkins/workspace/Lucene-Solr-7.x-Linux/solr/core/src/test-files/solr/collection1/core.properties:java.nio.file.NoSuchFileException: /home/jenkins/workspace/Lucene-Solr-7.x-Linux/solr/core/src/test-files/solr/collection1/core.properties
   [junit4]   2> 289131 INFO  (TEST-InfixSuggestersTest.test2xBuildReload-seed#[73F5578926B30E68]) [    x:collection1] o.a.s.c.SolrResourceLoader [null] Added 2 libs to classloader, from paths: [/home/jenkins/workspace/Lucene-Solr-7.x-Linux/solr/core/src/test-files/solr/collection1/lib, /home/jenkins/workspace/Lucene-Solr-7.x-Linux/solr/core/src/test-files/solr/collection1/lib/classes]
   [junit4]   2> 289141 INFO  (TEST-InfixSuggestersTest.test2xBuildReload-seed#[73F5578926B30E68]) [    x:collection1] o.a.s.c.SolrConfig Using Lucene MatchVersion: 7.5.0
   [junit4]   2> 289147 INFO  (TEST-InfixSuggestersTest.test2xBuildReload-seed#[73F5578926B30E68]) [    x:collection1] o.a.s.s.IndexSchema [collection1] Schema name=test
   [junit4]   2> 289199 INFO  (TEST-InfixSuggestersTest.test2xBuildReload-seed#[73F5578926B30E68]) [    x:collection1] o.a.s.s.IndexSchema Loaded schema test/1.0 with uniqueid field id
   [junit4]   2> 289207 INFO  (TEST-InfixSuggestersTest.test2xBuildReload-seed#[73F5578926B30E68]) [    x:collection1] o.a.s.c.CoreContainer Reloading SolrCore 'collection1' using configuration from instancedir /home/jenkins/workspace/Lucene-Solr-7.x-Linux/solr/core/src/test-files/solr/collection1
   [junit4]   2> 289223 INFO  (TEST-InfixSuggestersTest.test2xBuildReload-seed#[73F5578926B30E68]) [    x:collection1] o.a.s.m.r.SolrJmxReporter JMX monitoring for 'solr.core.collection1' (registry 'solr.core.collection1') enabled at server: com.sun.jmx.mbeanserver.JmxMBeanServer@3116f176
   [junit4]   2> 289223 INFO  (TEST-InfixSuggestersTest.test2xBuildReload-seed#[73F5578926B30E68]) [    x:collection1] o.a.s.c.SolrCore [[collection1] ] Opening new SolrCore at [/home/jenkins/workspace/Lucene-Solr-7.x-Linux/solr/core/src/test-files/solr/collection1], dataDir=[/home/jenkins/workspace/Lucene-Solr-7.x-Linux/solr/build/solr-core/test/J0/temp/solr.handler.component.InfixSuggestersTest_73F5578926B30E68-001/init-core-data-001/]
   [junit4]   2> 289250 INFO  (TEST-InfixSuggestersTest.test2xBuildReload-seed#[73F5578926B30E68]) [    x:collection1] o.a.s.u.CommitTracker Hard AutoCommit: disabled
   [junit4]   2> 289251 INFO  (TEST-InfixSuggestersTest.test2xBuildReload-seed#[73F5578926B30E68]) [    x:collection1] o.a.s.u.CommitTracker Soft AutoCommit: disabled
   [junit4]   2> 289251 INFO  (TEST-InfixSuggestersTest.test2xBuildReload-seed#[73F5578926B30E68]) [    x:collection1] o.a.s.s.SolrIndexSearcher Opening [Searcher@49f93a83[collection1] main]
   [junit4]   2> 289252 WARN  (TEST-InfixSuggestersTest.test2xBuildReload-seed#[73F5578926B30E68]) [    x:collection1] o.a.s.r.ManagedResourceStorage Cannot write to config directory /home/jenkins/workspace/Lucene-Solr-7.x-Linux/solr/core/src/test-files/solr/collection1/conf; switching to use InMemory storage instead.
   [junit4]   2> 289252 INFO  (TEST-InfixSuggestersTest.test2xBuildReload-seed#[73F5578926B30E68]) [    x:collection1] o.a.s.h.c.SuggestComponent Initializing SuggestComponent
   [junit4]   2> 289252 INFO  (TEST-InfixSuggestersTest.test2xBuildReload-seed#[73F5578926B30E68]) [    x:collection1] o.a.s.s.s.SolrSuggester init: {name=shortRandomAnalyzingInfixSuggester,lookupImpl=AnalyzingInfixLookupFactory,dictionaryImpl=RandomTestDictionaryFactory,randDictMaxItems=100,indexPath=short_random_analyzing_infix_suggester,suggestAnalyzerFieldType=text,buildOnCommit=false,buildOnStartup=false}
   [junit4]   2> 289253 INFO  (TEST-InfixSuggestersTest.test2xBuildReload-seed#[73F5578926B30E68]) [    x:collection1] o.a.s.s.s.SolrSuggester Dictionary loaded with params: {name=shortRandomAnalyzingInfixSuggester,lookupImpl=AnalyzingInfixLookupFactory,dictionaryImpl=RandomTestDictionaryFactory,randDictMaxItems=100,indexPath=short_random_analyzing_infix_suggester,suggestAnalyzerFieldType=text,buildOnCommit=false,buildOnStartup=false}
   [junit4]   2> 289253 INFO  (TEST-InfixSuggestersTest.test2xBuildReload-seed#[73F5578926B30E68]) [    x:collection1] o.a.s.h.c.SuggestComponent Initializing SuggestComponent
   [junit4]   2> 289253 INFO  (TEST-InfixSuggestersTest.test2xBuildReload-seed#[73F5578926B30E68]) [    x:collection1] o.a.s.s.s.SolrSuggester init: {name=longRandomAnalyzingInfixSuggester,lookupImpl=AnalyzingInfixLookupFactory,dictionaryImpl=RandomTestDictionaryFactory,randDictMaxItems=100000,indexPath=long_random_analyzing_infix_suggester,suggestAnalyzerFieldType=text,buildOnCommit=false,buildOnStartup=false}
   [junit4]   2> 289253 INFO  (TEST-InfixSuggestersTest.test2xBuildReload-seed#[73F5578926B30E68]) [    x:collection1] o.a.s.s.s.SolrSuggester Dictionary loaded with params: {name=longRandomAnalyzingInfixSuggester,lookupImpl=AnalyzingInfixLookupFactory,dictionaryImpl=RandomTestDictionaryFactory,randDictMaxItems=100000,indexPath=long_random_analyzing_infix_suggester,suggestAnalyzerFieldType=text,buildOnCommit=false,buildOnStartup=false}
   [junit4]   2> 289253 INFO  (TEST-InfixSuggestersTest.test2xBuildReload-seed#[73F5578926B30E68]) [    x:collection1] o.a.s.h.c.SuggestComponent Initializing SuggestComponent
   [junit4]   2> 289253 INFO  (TEST-InfixSuggestersTest.test2xBuildReload-seed#[73F5578926B30E68]) [    x:collection1] o.a.s.s.s.SolrSuggester init: {name=shortRandomBlendedInfixSuggester,lookupImpl=BlendedInfixLookupFactory,dictionaryImpl=RandomTestDictionaryFactory,randDictMaxItems=100,blenderType=position_linear,suggestAnalyzerFieldType=text,indexPath=short_random_blended_infix_suggester,highlight=true,buildOnStartup=false,buildOnCommit=false}
   [junit4]   2> 289253 INFO  (TEST-InfixSuggestersTest.test2xBuildReload-seed#[73F5578926B30E68]) [    x:collection1] o.a.s.s.s.SolrSuggester Dictionary loaded with params: {name=shortRandomBlendedInfixSuggester,lookupImpl=BlendedInfixLookupFactory,dictionaryImpl=RandomTestDictionaryFactory,randDictMaxItems=100,blenderType=position_linear,suggestAnalyzerFieldType=text,indexPath=short_random_blended_infix_suggester,highlight=true,buildOnStartup=false,buildOnCommit=false}
   [junit4]   2> 289254 INFO  (TEST-InfixSuggestersTest.test2xBuildReload-seed#[73F5578926B30E68]) [    x:collection1] o.a.s.h.ReplicationHandler Commits will be reserved for 10000ms.
   [junit4]   2> 289254 INFO  (TEST-InfixSuggestersTest.test2xBuildReload-seed#[73F5578926B30E68]) [    x:collection1] o.a.s.u.RandomMergePolicy RandomMergePolicy wrapping class org.apache.lucene.index.LogByteSizeMergePolicy: [LogByteSizeMergePolicy: minMergeSize=1677721, mergeFactor=47, maxMergeSize=2147483648, maxMergeSizeForForcedMerge=9223372036854775807, calibrateSizeByDeletes=true, maxMergeDocs=2147483647, maxCFSSegmentSizeMB=8.796093022207999E12, noCFSRatio=0.5693308784877747]
   [junit4]   2> 289255 INFO  (TEST-InfixSuggestersTest.test2xBuildReload-seed#[73F5578926B30E68]) [    x:collection1] o.a.s.u.DefaultSolrCoreState New IndexWriter is ready to be used.
   [junit4]   2> 289255 INFO  (searcherExecutor-1053-thread-1-processing-x:collection1) [    x:collection1] o.a.s.c.SolrCore [collection1] Registered new searcher Searcher@49f93a83[collection1] main{ExitableDirectoryReader(UninvertingDirectoryReader())}
   [junit4]   2> 289255 INFO  (TEST-InfixSuggestersTest.test2xBuildReload-seed#[73F5578926B30E68]) [    x:collection1] o.a.s.s.SolrIndexSearcher Opening [Searcher@ed3490c[collection1] main]
   [junit4]   2> 289255 INFO  (TEST-InfixSuggestersTest.test2xBuildReload-seed#[73F5578926B30E68]) [    x:collection1] o.a.s.c.SolrCore [collection1]  CLOSING SolrCore org.apache.solr.core.SolrCore@570ce81a
   [junit4]   2> 289255 INFO  (TEST-InfixSuggestersTest.test2xBuildReload-seed#[73F5578926B30E68]) [    x:collection1] o.a.s.m.SolrMetricManager Closing metric reporters for registry=solr.core.collection1, tag=570ce81a
   [junit4]   2> 289255 INFO  (TEST-InfixSuggestersTest.test2xBuildReload-seed#[73F5578926B30E68]) [    x:collection1] o.a.s.m.r.SolrJmxReporter Closing reporter [org.apache.solr.metrics.reporters.SolrJmxReporter@51473ecb: rootName = null, domain = solr.core.collection1, service url = null, agent id = null] for registry solr.core.collection1 / com.codahale.metrics.MetricRegistry@75e79ead
   [junit4]   2> 289256 INFO  (searcherExecutor-1053-thread-1-processing-x:collection1) [    x:collection1] o.a.s.c.SolrCore [collection1] Registered new searcher Searcher@ed3490c[collection1] main{ExitableDirectoryReader(UninvertingDirectoryReader())}
   [junit4]   2> 289261 INFO  (TEST-InfixSuggestersTest.test2xBuildReload-seed#[73F5578926B30E68]) [    x:collection1] o.a.s.SolrTestCaseJ4 ###Ending test2xBuildReload
   [junit4]   2> 289262 INFO  (TEST-InfixSuggestersTest.testShutdownDuringBuild-seed#[73F5578926B30E68]) [    x:collection1] o.a.s.SolrTestCaseJ4 ###Starting testShutdownDuringBuild
   [junit4]   2> 289263 INFO  (AnalyzingInfixSuggesterTest-545-thread-1-processing-x:collection1) [    x:collection1] o.a.s.h.c.SuggestComponent SuggestComponent prepare with : qt=/suggest_analyzing_infix_long_dictionary&suggest=true&suggest.buildAll=true&wt=xml&indent=off
   [junit4]   2> 289263 INFO  (AnalyzingInfixSuggesterTest-545-thread-1-processing-x:collection1) [    x:collection1] o.a.s.s.s.SolrSuggester SolrSuggester.build(longRandomAnalyzingInfixSuggester)
   [junit4]   2> 289337 INFO  (AnalyzingInfixSuggesterTest-545-thread-1-processing-x:collection1) [    x:collection1] o.a.s.s.s.RandomTestDictionaryFactory org.apache.solr.spelling.suggest.RandomTestDictionaryFactory$RandomTestDictionary.enabled.longRandomAnalyzingInfixSuggester emitted 1000 items.
   [junit4]   2> 289363 INFO  (TEST-InfixSuggestersTest.testShutdownDuringBuild-seed#[73F5578926B30E68]) [    x:collection1] o.a.s.c.CoreContainer Shutting down CoreContainer instance=822272240
   [junit4]   2> 289363 INFO  (TEST-InfixSuggestersTest.testShutdownDuringBuild-seed#[73F5578926B30E68]) [    x:collection1] o.a.s.m.SolrMetricManager Closing metric reporters for registry=solr.node, tag=null
   [junit4]   2> 289363 INFO  (TEST-InfixSuggestersTest.testShutdownDuringBuild-seed#[73F5578926B30E68]) [    x:collection1] o.a.s.m.r.SolrJmxReporter Closing reporter [org.apache.solr.metrics.reporters.SolrJmxReporter@567790ea: rootName = null, domain = solr.node, service url = null, agent id = null] for registry solr.node / com.codahale.metrics.MetricRegistry@5609bd9b
   [junit4]   2> 289367 INFO  (TEST-InfixSuggestersTest.testShutdownDuringBuild-seed#[73F5578926B30E68]) [    x:collection1] o.a.s.m.SolrMetricManager Closing metric reporters for registry=solr.jvm, tag=null
   [junit4]   2> 289367 INFO  (TEST-InfixSuggestersTest.testShutdownDuringBuild-seed#[73F5578926B30E68]) [    x:collection1] o.a.s.m.r.SolrJmxReporter Closing reporter [org.apache.solr.metrics.reporters.SolrJmxReporter@4e6c0a2e: rootName = null, domain = solr.jvm, service url = null, agent id = null] for registry solr.jvm / com.codahale.metrics.MetricRegistry@34afb6dc
   [junit4]   2> 289370 INFO  (TEST-InfixSuggestersTest.testShutdownDuringBuild-seed#[73F5578926B30E68]) [    x:collection1] o.a.s.m.SolrMetricManager Closing metric reporters for registry=solr.jetty, tag=null
   [junit4]   2> 289370 INFO  (TEST-InfixSuggestersTest.testShutdownDuringBuild-seed#[73F5578926B30E68]) [    x:collection1] o.a.s.m.r.SolrJmxReporter Closing reporter [org.apache.solr.metrics.reporters.SolrJmxReporter@734890f2: rootName = null, domain = solr.jetty, service url = null, agent id = null] for registry solr.jetty / com.codahale.metrics.MetricRegistry@499ad6e3
   [junit4]   2> 289371 INFO  (coreCloseExecutor-1057-thread-1-processing-x:collection1) [    x:collection1] o.a.s.c.SolrCore [collection1]  CLOSING SolrCore org.apache.solr.core.SolrCore@3a1e601b
   [junit4]   2> 289371 INFO  (coreCloseExecutor-1057-thread-1-processing-x:collection1) [    x:collection1] o.a.s.m.SolrMetricManager Closing metric reporters for registry=solr.core.collection1, tag=3a1e601b
   [junit4]   2> 289371 INFO  (coreCloseExecutor-1057-thread-1-processing-x:collection1) [    x:collection1] o.a.s.m.r.SolrJmxReporter Closing reporter [org.apache.solr.metrics.reporters.SolrJmxReporter@7fb20a77: rootName = null, domain = solr.core.collection1, service url = null, agent id = null] for registry solr.core.collection1 / com.codahale.metrics.MetricRegistry@75e79ead
   [junit4]   2> 289538 ERROR (AnalyzingInfixSuggesterTest-545-thread-1-processing-x:collection1) [    x:collection1] o.a.s.SolrTestCaseJ4 REQUEST FAILED: qt=/suggest_analyzing_infix_long_dictionary&suggest.buildAll=true&wt=xml:org.apache.solr.common.SolrException: SolrCoreState already closed.
   [junit4]   2> 	at org.apache.solr.update.DefaultSolrCoreState.lock(DefaultSolrCoreState.java:186)
   [junit4]   2> 	at org.apache.solr.update.DefaultSolrCoreState.getIndexWriter(DefaultSolrCoreState.java:121)
   [junit4]   2> 	at org.apache.solr.update.SolrCoreState.getTragicException(SolrCoreState.java:198)
   [junit4]   2> 	at org.apache.solr.core.CoreContainer.checkTragicException(CoreContainer.java:1805)
   [junit4]   2> 	at org.apache.solr.handler.RequestHandlerBase.handleRequest(RequestHandlerBase.java:212)
   [junit4]   2> 	at org.apache.solr.core.SolrCore.execute(SolrCore.java:2541)
   [junit4]   2> 	at org.apache.solr.util.TestHarness.query(TestHarness.java:337)
   [junit4]   2> 	at org.apache.solr.util.TestHarness.query(TestHarness.java:319)
   [junit4]   2> 	at org.apache.solr.SolrTestCaseJ4.assertQ(SolrTestCaseJ4.java:891)
   [junit4]   2> 	at org.apache.solr.SolrTestCaseJ4.assertQ(SolrTestCaseJ4.java:877)
   [junit4]   2> 	at org.apache.solr.handler.component.InfixSuggestersTest.lambda$testShutdownDuringBuild$2(InfixSuggestersTest.java:122)
   [junit4]   2> 	at org.apache.lucene.util.LuceneTestCase.expectThrows(LuceneTestCase.java:2696)
   [junit4]   2> 	at org.apache.solr.handler.component.InfixSuggestersTest.lambda$testShutdownDuringBuild$3(InfixSuggestersTest.java:121)
   [junit4]   2> 	at java.base/java.util.concurrent.FutureTask.run(FutureTask.java:264)
   [junit4]   2> 	at org.apache.solr.common.util.ExecutorUtil$MDCAwareThreadPoolExecutor.lambda$execute$0(ExecutorUtil.java:209)
   [junit4]   2> 	at java.base/java.util.concurrent.ThreadPoolExecutor.runWorker(ThreadPoolExecutor.java:1135)
   [junit4]   2> 	at java.base/java.util.concurrent.ThreadPoolExecutor$Worker.run(ThreadPoolExecutor.java:635)
   [junit4]   2> 	at java.base/java.lang.Thread.run(Thread.java:844)
   [junit4]   2> 
   [junit4]   2> 289539 INFO  (TEST-InfixSuggestersTest.testShutdownDuringBuild-seed#[73F5578926B30E68]) [    x:collection1] o.a.s.SolrTestCaseJ4 ####initCore
   [junit4]   2> 289539 INFO  (TEST-InfixSuggestersTest.testShutdownDuringBuild-seed#[73F5578926B30E68]) [    x:collection1] o.a.s.c.SolrResourceLoader [null] Added 2 libs to classloader, from paths: [/home/jenkins/workspace/Lucene-Solr-7.x-Linux/solr/core/src/test-files/solr/collection1/lib, /home/jenkins/workspace/Lucene-Solr-7.x-Linux/solr/core/src/test-files/solr/collection1/lib/classes]
   [junit4]   2> 289554 INFO  (TEST-InfixSuggestersTest.testShutdownDuringBuild-seed#[73F5578926B30E68]) [    x:collection1] o.a.s.c.SolrConfig Using Lucene MatchVersion: 7.5.0
   [junit4]   2> 289562 INFO  (TEST-InfixSuggestersTest.testShutdownDuringBuild-seed#[73F5578926B30E68]) [    x:collection1] o.a.s.s.IndexSchema [null] Schema name=test
   [junit4]   2> 289637 INFO  (TEST-InfixSuggestersTest.testShutdownDuringBuild-seed#[73F5578926B30E68]) [    x:collection1] o.a.s.s.IndexSchema Loaded schema test/1.0 with uniqueid field id
   [junit4]   2> 289748 INFO  (TEST-InfixSuggestersTest.testShutdownDuringBuild-seed#[73F5578926B30E68]) [    x:collection1] o.a.s.c.TransientSolrCoreCacheDefault Allocating transient cache for 2147483647 transient cores
   [junit4]   2> 289748 INFO  (TEST-InfixSuggestersTest.testShutdownDuringBuild-seed#[73F5578926B30E68]) [    x:collection1] o.a.s.h.a.MetricsHistoryHandler No .system collection, keeping metrics history in memory.
   [junit4]   2> 289755 INFO  (TEST-InfixSuggestersTest.testShutdownDuringBuild-seed#[73F5578926B30E68]) [    x:collection1] o.a.s.m.r.SolrJmxReporter JMX monitoring for 'solr.node' (registry 'solr.node') enabled at server: com.sun.jmx.mbeanserver.JmxMBeanServer@3116f176
   [junit4]   2> 289760 INFO  (TEST-InfixSuggestersTest.testShutdownDuringBuild-seed#[73F5578926B30E68]) [    x:collection1] o.a.s.m.r.SolrJmxReporter JMX monitoring for 'solr.jvm' (registry 'solr.jvm') enabled at server: com.sun.jmx.mbeanserver.JmxMBeanServer@3116f176
   [junit4]   2> 289760 INFO  (TEST-InfixSuggestersTest.testShutdownDuringBuild-seed#[73F5578926B30E68]) [    x:collection1] o.a.s.m.r.SolrJmxReporter JMX monitoring for 'solr.jetty' (registry 'solr.jetty') enabled at server: com.sun.jmx.mbeanserver.JmxMBeanServer@3116f176
   [junit4]   2> 289761 INFO  (coreLoadExecutor-1067-thread-1-processing-x:collection1) [    x:collection1] o.a.s.c.SolrResourceLoader [null] Added 2 libs to classloader, from paths: [/home/jenkins/workspace/Lucene-Solr-7.x-Linux/solr/core/src/test-files/solr/collection1/lib, /home/jenkins/workspace/Lucene-Solr-7.x-Linux/solr/core/src/test-files/solr/collection1/lib/classes]
   [junit4]   2> 289776 INFO  (coreLoadExecutor-1067-thread-1-processing-x:collection1) [    x:collection1] o.a.s.c.SolrConfig Using Lucene MatchVersion: 7.5.0
   [junit4]   2> 289784 INFO  (coreLoadExecutor-1067-thread-1-processing-x:collection1) [    x:collection1] o.a.s.s.IndexSchema [collection1] Schema name=test
   [junit4]   2> 289856 INFO  (coreLoadExecutor-1067-thread-1-processing-x:collection1) [    x:collection1] o.a.s.s.IndexSchema Loaded schema test/1.0 with uniqueid field id
   [junit4]   2> 289875 INFO  (coreLoadExecutor-1067-thread-1-processing-x:collection1) [    x:collection1] o.a.s.c.CoreContainer Creating SolrCore 'collection1' using configuration from instancedir /home/jenkins/workspace/Lucene-Solr-7.x-Linux/solr/core/src/test-files/solr/collection1, trusted=true
   [junit4]   2> 289875 INFO  (coreLoadExecutor-1067-thread-1-processing-x:collection1) [    x:collection1] o.a.s.m.r.SolrJmxReporter JMX monitoring for 'solr.core.collection1' (registry 'solr.core.collection1') enabled at server: com.sun.jmx.mbeanserver.JmxMBeanServer@3116f176
   [junit4]   2> 289875 INFO  (coreLoadExecutor-1067-thread-1-processing-x:collection1) [    x:collection1] o.a.s.c.SolrCore solr.RecoveryStrategy.Builder
   [junit4]   2> 289875 INFO  (coreLoadExecutor-1067-thread-1-processing-x:collection1) [    x:collection1] o.a.s.c.SolrCore [[collection1] ] Opening new SolrCore at [/home/jenkins/workspace/Lucene-Solr-7.x-Linux/solr/core/src/test-files/solr/collection1], dataDir=[/home/jenkins/workspace/Lucene-Solr-7.x-Linux/solr/build/solr-core/test/J0/temp/solr.handler.component.InfixSuggestersTest_73F5578926B30E68-001/init-core-data-001/]
   [junit4]   2> 289908 INFO  (coreLoadExecutor-1067-thread-1-processing-x:collection1) [    x:collection1] o.a.s.u.CommitTracker Hard AutoCommit: disabled
   [junit4]   2> 289908 INFO  (coreLoadExecutor-1067-thread-1-processing-x:collection1) [    x:collection1] o.a.s.u.CommitTracker Soft AutoCommit: disabled
   [junit4]   2> 289909 INFO  (coreLoadExecutor-1067-thread-1-processing-x:collection1) [    x:collection1] o.a.s.u.RandomMergePolicy RandomMergePolicy wrapping class org.apache.lucene.index.TieredMergePolicy: [TieredMergePolicy: maxMergeAtOnce=38, maxMergeAtOnceExplicit=46, maxMergedSegmentMB=36.61328125, floorSegmentMB=0.89453125, forceMergeDeletesPctAllowed=6.505926793390455, segmentsPerTier=19.0, maxCFSSegmentSizeMB=8.796093022207999E12, noCFSRatio=0.26835987281211826, reclaimDeletesWeight=0.5009067601179504
   [junit4]   2> 289910 INFO  (coreLoadExecutor-1067-thread-1-processing-x:collection1) [    x:collection1] o.a.s.s.SolrIndexSearcher Opening [Searcher@33387752[collection1] main]
   [junit4]   2> 289910 WARN  (coreLoadExecutor-1067-thread-1-processing-x:collection1) [    x:collection1] o.a.s.r.ManagedResourceStorage Cannot write to config directory /home/jenkins/workspace/Lucene-Solr-7.x-Linux/solr/core/src/test-files/solr/collection1/conf; switching to use InMemory storage instead.
   [junit4]   2> 289910 INFO  (coreLoadExecutor-1067-thread-1-processing-x:collection1) [    x:collection1] o.a.s.h.c.SuggestComponent Initializing SuggestComponent
   [junit4]   2> 289910 INFO  (coreLoadExecutor-1067-thread-1-processing-x:collection1) [    x:collection1] o.a.s.s.s.SolrSuggester init: {name=shortRandomAnalyzingInfixSuggester,lookupImpl=AnalyzingInfixLookupFactory,dictionaryImpl=RandomTestDictionaryFactory,randDictMaxItems=100,indexPath=short_random_analyzing_infix_suggester,suggestAnalyzerFieldType=text,buildOnCommit=false,buildOnStartup=false}
   [junit4]   2> 289912 INFO  (coreLoadExecutor-1067-thread-1-processing-x:collection1) [    x:collection1] o.a.s.s.s.SolrSuggester Dictionary loaded with params: {name=shortRandomAnalyzingInfixSuggester,lookupImpl=AnalyzingInfixLookupFactory,dictionaryImpl=RandomTestDictionaryFactory,randDictMaxItems=100,indexPath=short_random_analyzing_infix_suggester,suggestAnalyzerFieldType=text,buildOnCommit=false,buildOnStartup=false}
   [junit4]   2> 289912 INFO  (coreLoadExecutor-1067-thread-1-processing-x:collection1) [    x:collection1] o.a.s.h.c.SuggestComponent Initializing SuggestComponent
   [junit4]   2> 289912 INFO  (coreLoadExecutor-1067-thread-1-processing-x:collection1) [    x:collection1] o.a.s.s.s.SolrSuggester init: {name=longRandomAnalyzingInfixSuggester,lookupImpl=AnalyzingInfixLookupFactory,dictionaryImpl=RandomTestDictionaryFactory,randDictMaxItems=100000,indexPath=long_random_analyzing_infix_suggester,suggestAnalyzerFieldType=text,buildOnCommit=false,buildOnStartup=false}
   [junit4]   2> 289916 INFO  (coreLoadExecutor-1067-thread-1-processing-x:collection1) [    x:collection1] o.a.s.s.s.SolrSuggester Dictionary loaded with params: {name=longRandomAnalyzingInfixSuggester,lookupImpl=AnalyzingInfixLookupFactory,dictionaryImpl=RandomTestDictionaryFactory,randDictMaxItems=100000,indexPath=long_random_analyzing_infix_suggester,suggestAnalyzerFieldType=text,buildOnCommit=false,buildOnStartup=false}
   [junit4]   2> 289916 INFO  (coreLoadExecutor-1067-thread-1-processing-x:collection1) [    x:collection1] o.a.s.h.c.SuggestComponent Initializing SuggestComponent
   [junit4]   2> 289916 INFO  (coreLoadExecutor-1067-thread-1-processing-x:collection1) [    x:collection1] o.a.s.s.s.SolrSuggester init: {name=shortRandomBlendedInfixSuggester,lookupImpl=BlendedInfixLookupFactory,dictionaryImpl=RandomTestDictionaryFactory,randDictMaxItems=100,blenderType=position_linear,suggestAnalyzerFieldType=text,indexPath=short_random_blended_infix_suggester,highlight=true,buildOnStartup=false,buildOnCommit=false}
   [junit4]   2> 289916 INFO  (coreLoadExecutor-1067-thread-1-processing-x:collection1) [    x:collection1] o.a.s.s.s.SolrSuggester Dictionary loaded with params: {name=shortRandomBlendedInfixSuggester,lookupImpl=BlendedInfixLookupFactory,dictionaryImpl=RandomTestDictionaryFactory,randDictMaxItems=100,blenderType=position_linear,suggestAnalyzerFieldType=text,indexPath=short_random_blended_infix_suggester,highlight=true,buildOnStartup=false,buildOnCommit=false}
   [junit4]   2> 289916 INFO  (coreLoadExecutor-1067-thread-1-processing-x:collection1) [    x:collection1] o.a.s.h.ReplicationHandler Commits will be reserved for 10000ms.
   [junit4]   2> 289917 INFO  (TEST-InfixSuggestersTest.testShutdownDuringBuild-seed#[73F5578926B30E68]) [    x:collection1] o.a.s.SolrTestCaseJ4 ####initCore end
   [junit4]   2> 289917 INFO  (TEST-InfixSuggestersTest.testShutdownDuringBuild-seed#[73F5578926B30E68]) [    x:collection1] o.a.s.SolrTestCaseJ4 ###Ending testShutdownDuringBuild
   [junit4]   2> 289919 INFO  (searcherExecutor-1068-thread-1-processing-x:collection1) [    x:collection1] o.a.s.c.SolrCore [collection1] Registered new searcher Searcher@33387752[collection1] main{ExitableDirectoryReader(UninvertingDirectoryReader())}
   [junit4]   2> NOTE: reproduce with: ant test  -Dtestcase=InfixSuggestersTest -Dtests.method=testShutdownDuringBuild -Dtests.seed=73F5578926B30E68 -Dtests.multiplier=3 -Dtests.slow=true -Dtests.locale=en-ZM -Dtests.timezone=Europe/Dublin -Dtests.asserts=true -Dtests.file.encoding=UTF-8
   [junit4] ERROR   0.66s J0 | InfixSuggestersTest.testShutdownDuringBuild <<<
   [junit4]    > Throwable #1: java.util.concurrent.ExecutionException: junit.framework.AssertionFailedError: Unexpected wrapped exception type, expected CoreIsClosedException
   [junit4]    > 	at __randomizedtesting.SeedInfo.seed([73F5578926B30E68:AC78353618DA5B0A]:0)
   [junit4]    > 	at java.base/java.util.concurrent.FutureTask.report(FutureTask.java:122)
   [junit4]    > 	at java.base/java.util.concurrent.FutureTask.get(FutureTask.java:191)
   [junit4]    > 	at org.apache.solr.handler.component.InfixSuggestersTest.testShutdownDuringBuild(InfixSuggestersTest.java:130)
   [junit4]    > 	at java.base/jdk.internal.reflect.NativeMethodAccessorImpl.invoke0(Native Method)
   [junit4]    > 	at java.base/jdk.internal.reflect.NativeMethodAccessorImpl.invoke(NativeMethodAccessorImpl.java:62)
   [junit4]    > 	at java.base/jdk.internal.reflect.DelegatingMethodAccessorImpl.invoke(DelegatingMethodAccessorImpl.java:43)
   [junit4]    > 	at java.base/java.lang.reflect.Method.invoke(Method.java:564)
   [junit4]    > 	at java.base/java.lang.Thread.run(Thread.java:844)
   [junit4]    > Caused by: junit.framework.AssertionFailedError: Unexpected wrapped exception type, expected CoreIsClosedException
   [junit4]    > 	at org.apache.lucene.util.LuceneTestCase.expectThrows(LuceneTestCase.java:2704)
   [junit4]    > 	at org.apache.solr.handler.component.InfixSuggestersTest.lambda$testShutdownDuringBuild$3(InfixSuggestersTest.java:121)
   [junit4]    > 	at java.base/java.util.concurrent.FutureTask.run(FutureTask.java:264)
   [junit4]    > 	at org.apache.solr.common.util.ExecutorUtil$MDCAwareThreadPoolExecutor.lambda$execute$0(ExecutorUtil.java:209)
   [junit4]    > 	at java.base/java.util.concurrent.ThreadPoolExecutor.runWorker(ThreadPoolExecutor.java:1135)
   [junit4]    > 	at java.base/java.util.concurrent.ThreadPoolExecutor$Worker.run(ThreadPoolExecutor.java:635)
   [junit4]    > 	... 1 more
   [junit4]    > Caused by: java.lang.RuntimeException: Exception during query
   [junit4]    > 	at org.apache.solr.SolrTestCaseJ4.assertQ(SolrTestCaseJ4.java:917)
   [junit4]    > 	at org.apache.solr.SolrTestCaseJ4.assertQ(SolrTestCaseJ4.java:877)
   [junit4]    > 	at org.apache.solr.handler.component.InfixSuggestersTest.lambda$testShutdownDuringBuild$2(InfixSuggestersTest.java:122)
   [junit4]    > 	at org.apache.lucene.util.LuceneTestCase.expectThrows(LuceneTestCase.java:2696)
   [junit4]    > 	... 6 more
   [junit4]    > Caused by: org.apache.solr.common.SolrException: SolrCoreState already closed.
   [junit4]    > 	at org.apache.solr.update.DefaultSolrCoreState.lock(DefaultSolrCoreState.java:186)
   [junit4]    > 	at org.apache.solr.update.DefaultSolrCoreState.getIndexWriter(DefaultSolrCoreState.java:121)
   [junit4]    > 	at org.apache.solr.update.SolrCoreState.getTragicException(SolrCoreState.java:198)
   [junit4]    > 	at org.apache.solr.core.CoreContainer.checkTragicException(CoreContainer.java:1805)
   [junit4]    > 	at org.apache.solr.handler.RequestHandlerBase.handleRequest(RequestHandlerBase.java:212)
   [junit4]    > 	at org.apache.solr.core.SolrCore.execute(SolrCore.java:2541)
   [junit4]    > 	at org.apache.solr.util.TestHarness.query(TestHarness.java:337)
   [junit4]    > 	at org.apache.solr.util.TestHarness.query(TestHarness.java:319)
   [junit4]    > 	at org.apache.solr.SolrTestCaseJ4.assertQ(SolrTestCaseJ4.java:891)
   [junit4]    > 	... 9 more
   [junit4]   2> 289921 INFO  (TEST-InfixSuggestersTest.testBuildThen2xReload-seed#[73F5578926B30E68]) [    x:collection1] o.a.s.SolrTestCaseJ4 ###Starting testBuildThen2xReload
   [junit4]   2> 289921 INFO  (TEST-InfixSuggestersTest.testBuildThen2xReload-seed#[73F5578926B30E68]) [    x:collection1] o.a.s.h.c.SuggestComponent SuggestComponent prepare with : qt=/suggest_analyzing_infix_short_dictionary&suggest=true&suggest.buildAll=true&wt=xml&indent=off
   [junit4]   2> 289921 INFO  (TEST-InfixSuggestersTest.testBuildThen2xReload-seed#[73F5578926B30E68]) [    x:collection1] o.a.s.s.s.SolrSuggester SolrSuggester.build(shortRandomAnalyzingInfixSuggester)
   [junit4]   2> 289928 INFO  (TEST-InfixSuggestersTest.testBuildThen2xReload-seed#[73F5578926B30E68]) [    x:collection1] o.a.s.s.s.RandomTestDictionaryFactory org.apache.solr.spelling.suggest.RandomTestDictionaryFactory$RandomTestDictionary.enabled.shortRandomAnalyzingInfixSuggester disabled after emitting 100 items.
   [junit4]   2> 290000 INFO  (TEST-InfixSuggestersTest.testBuildThen2xReload-seed#[73F5578926B30E68]) [    x:collection1] o.a.s.h.c.SuggestComponent SuggestComponent process with : qt=/suggest_analyzing_infix_short_dictionary&suggest=true&suggest.buildAll=true&wt=xml&indent=off
   [junit4]   2> 290000 INFO  (TEST-InfixSuggestersTest.testBuildThen2xReload-seed#[73F5578926B30E68]) [    x:collection1] o.a.s.c.S.Request [collection1]  webapp=null path=null params={qt=/suggest_analyzing_infix_short_dictionary&suggest.buildAll=true&wt=xml} status=0 QTime=79
   [junit4]   2> 290001 ERROR (TEST-InfixSuggestersTest.testBuildThen2xReload-seed#[73F5578926B30E68]) [    x:collection1] o.a.s.c.CorePropertiesLocator Couldn't load core descriptor from /home/jenkins/workspace/Lucene-Solr-7.x-Linux/solr/core/src/test-files/solr/collection1/core.properties:java.nio.file.NoSuchFileException: /home/jenkins/workspace/Lucene-Solr-7.x-Linux/solr/core/src/test-files/solr/collection1/core.properties
   [junit4]   2> 290001 INFO  (TEST-InfixSuggestersTest.testBuildThen2xReload-seed#[73F5578926B30E68]) [    x:collection1] o.a.s.c.SolrResourceLoader [null] Added 2 libs to classloader, from paths: [/home/jenkins/workspace/Lucene-Solr-7.x-Linux/solr/core/src/test-files/solr/collection1/lib, /home/jenkins/workspace/Lucene-Solr-7.x-Linux/solr/core/src/test-files/solr/collection1/lib/classes]
   [junit4]   2> 290014 INFO  (TEST-InfixSuggestersTest.testBuildThen2xReload-seed#[73F5578926B30E68]) [    x:collection1] o.a.s.c.SolrConfig Using Lucene MatchVersion: 7.5.0
   [junit4]   2> 290023 INFO  (TEST-InfixSuggestersTest.testBuildThen2xReload-seed#[73F5578926B30E68]) [    x:collection1] o.a.s.s.IndexSchema [collection1] Schema name=test
   [junit4]   2> 290112 INFO  (TEST-InfixSuggestersTest.testBuildThen2xReload-seed#[73F5578926B30E68]) [    x:collection1] o.a.s.s.IndexSchema Loaded schema test/1.0 with uniqueid field id
   [junit4]   2> 290120 INFO  (TEST-InfixSuggestersTest.testBuildThen2xReload-seed#[73F5578926B30E68]) [    x:collection1] o.a.s.c.CoreContainer Reloading SolrCore 'collection1' using configuration from instancedir /home/jenkins/workspace/Lucene-Solr-7.x-Linux/solr/core/src/test-files/solr/collection1
   [junit4]   2> 290141 INFO  (TEST-InfixSuggestersTest.testBuildThen2xReload-seed#[73F5578926B30E68]) [    x:collection1] o.a.s.m.r.SolrJmxReporter JMX monitoring for 'solr.core.collection1' (registry 'solr.core.collection1') enabled at server: com.sun.jmx.mbeanserver.JmxMBeanServer@3116f176
   [junit4]   2> 290141 INFO  (TEST-InfixSuggestersTest.testBuildThen2xReload-seed#[73F5578926B30E68]) [    x:collection1] o.a.s.c.SolrCore [[collection1] ] Opening new SolrCore at [/home/jenkins/workspace/Lucene-Solr-7.x-Linux/solr/core/src/test-files/solr/collection1], dataDir=[/home/jenkins/workspace/Lucene-Solr-7.x-Linux/solr/build/solr-core/test/J0/temp/solr.handler.component.InfixSuggestersTest_73F5578926B30E68-001/init-core-data-001/]
   [junit4]   2> 290179 INFO  (TEST-InfixSuggestersTest.testBuildThen2xReload-seed#[73F5578926B30E68]) [    x:collection1] o.a.s.u.CommitTracker Hard AutoCommit: disabled
   [junit4]   2> 290179 INFO  (TEST-InfixSuggestersTest.testBuildThen2xReload-seed#[73F5578926B30E68]) [    x:collection1] o.a.s.u.CommitTracker Soft AutoCommit: disabled
   [junit4]   2> 290180 INFO  (TEST-InfixSuggestersTest.testBuildThen2xReload-seed#[73F5578926B30E68]) [    x:collection1] o.a.s.s.SolrIndexSearcher Opening [Searcher@5340ba80[collection1] main]
   [junit4]   2> 290181 WARN  (TEST-InfixSuggestersTest.testBuildThen2xReload-seed#[73F5578926B30E68]) [    x:collection1] o.a.s.r.ManagedResourceStorage Cannot write to config directory /home/jenkins/workspace/Lucene-Solr-7.x-Linux/solr/core/src/test-files/solr/collection1/conf; switching to use InMemory storage instead.
   [junit4]   2> 290181 INFO  (TEST-InfixSuggestersTest.testBuildThen2xReload-seed#[73F5578926B30E68]) [    x:collection1] o.a.s.h.c.SuggestComponent Initializing SuggestComponent
   [junit4]   2> 290181 INFO  (TEST-InfixSuggestersTest.testBuildThen2xReload-seed#[73F5578926B30E68]) [    x:collection1] o.a.s.s.s.SolrSuggester init: {name=shortRandomAnalyzingInfixSuggester,lookupImpl=AnalyzingInfixLookupFactory,dictionaryImpl=RandomTestDictionaryFactory,randDictMaxItems=100,indexPath=short_random_analyzing_infix_suggester,suggestAnalyzerFieldType=text,buildOnCommit=false,buildOnStartup=false}
   [junit4]   2> 290183 INFO  (TEST-InfixSuggestersTest.testBuildThen2xReload-seed#[73F5578926B30E68]) [    x:collection1] o.a.s.s.s.SolrSuggester Dictionary loaded with params: {name=shortRandomAnalyzingInfixSuggester,lookupImpl=AnalyzingInfixLookupFactory,dictionaryImpl=RandomTestDictionaryFactory,randDictMaxItems=100,indexPath=short_random_analyzing_infix_suggester,suggestAnalyzerFieldType=text,buildOnCommit=false,buildOnStartup=false}
   [junit4]   2> 290183 INFO  (TEST-InfixSuggestersTest.testBuildThen2xReload-seed#[73F5578926B30E68]) [    x:collection1] o.a.s.h.c.SuggestComponent Initializing SuggestComponent
   [junit4]   2> 290183 INFO  (TEST-InfixSuggestersTest.testBuildThen2xReload-seed#[73F5578926B30E68]) [    x:collection1] o.a.s.s.s.SolrSuggester init: {name=longRandomAnalyzingInfixSuggester,lookupImpl=AnalyzingInfixLookupFactory,dictionaryImpl=RandomTestDictionaryFactory,randDictMaxItems=100000,indexPath=long_random_analyzing_infix_suggester,suggestAnalyzerFieldType=text,buildOnCommit=false,buildOnStartup=false}
   [junit4]   2> 290185 INFO  (TEST-InfixSuggestersTest.testBuildThen2xReload-seed#[73F5578926B30E68]) [    x:collection1] o.a.s.s.s.SolrSuggester Dictionary loaded with params: {name=longRandomAnalyzingInfixSuggester,lookupImpl=AnalyzingInfixLookupFactory,dictionaryImpl=RandomTestDictionaryFactory,randDictMaxItems=100000,indexPath=long_random_analyzing_infix_suggester,suggestAnalyzerFieldType=text,buildOnCommit=false,buildOnStartup=false}
   [junit4]   2> 290185 INFO  (TEST-InfixSuggestersTest.testBuildThen2xReload-seed#[73F5578926B30E68]) [    x:collection1] o.a.s.h.c.SuggestComponent Initializing SuggestComponent
   [junit4]   2> 290185 INFO  (TEST-InfixSuggestersTest.testBuildThen2xReload-seed#[73F5578926B30E68]) [    x:collection1] o.a.s.s.s.SolrSuggester init: {name=shortRandomBlendedInfixSuggester,lookupImpl=BlendedInfixLookupFactory,dictionaryImpl=RandomTestDictionaryFactory,randDictMaxItems=100,blenderType=position_linear,suggestAnalyzerFieldType=text,indexPath=short_random_blended_infix_suggester,highlight=true,buildOnStartup=false,buildOnCommit=false}
   [junit4]   2> 290185 INFO  (TEST-InfixSuggestersTest.testBuildThen2xReload-seed#[73F5578926B30E68]) [    x:collection1] o.a.s.s.s.SolrSuggester Dictionary loaded with params: {name=shortRandomBlendedInfixSuggester,lookupImpl=BlendedInfixLookupFactory,dictionaryImpl=RandomTestDictionaryFactory,randDictMaxItems=100,blenderType=position_linear,suggestAnalyzerFieldType=text,indexPath=short_random_blended_infix_suggester,highlight=true,buildOnStartup=false,buildOnCommit=false}
   [junit4]   2> 290185 INFO  (TEST-InfixSuggestersTest.testBuildThen2xReload-seed#[73F5578926B30E68]) [    x:collection1] o.a.s.h.ReplicationHandler Commits will be reserved for 10000ms.
   [junit4]   2> 290186 INFO  (TEST-InfixSuggestersTest.testBuildThen2xReload-seed#[73F5578926B30E68]) [    x:collection1] o.a.s.u.RandomMergePolicy RandomMergePolicy wrapping class org.apache.lucene.index.LogByteSizeMergePolicy: [LogByteSizeMergePolicy: minMergeSize=1677721, mergeFactor=34, maxMergeSize=2147483648, maxMergeSizeForForcedMerge=9223372036854775807, calibrateSizeByDeletes=true, maxMergeDocs=2147483647, maxCFSSegmentSizeMB=8.796093022207999E12, noCFSRatio=0.0]
   [junit4]   2> 290186 INFO  (TEST-InfixSuggestersTest.testBuildThen2xReload-seed#[73F5578926B30E68]) [    x:collection1] o.a.s.u.DefaultSolrCoreState New IndexWriter is ready to be used.
   [junit4]   2> 290186 INFO  (searcherExecutor-1072-thread-1-processing-x:collection1) [    x:collection1] o.a.s.c.SolrCore [collection1] Registered new searcher Searcher@5340ba80[collection1] main{ExitableDirectoryReader(UninvertingDirectoryReader())}
   [junit4]   2> 290187 INFO  (TEST-InfixSuggestersTest.testBuildThen2xReload-seed#[73F5578926B30E68]) [    x:collection1] o.a.s.s.SolrIndexSearcher Opening [Searcher@7a502c1c[collection1] main]
   [junit4]   2> 290187 INFO  (TEST-InfixSuggestersTest.testBuildThen2xReload-seed#[73F5578926B30E68]) [    x:collection1] o.a.s.c.SolrCore [collection1]  CLOSING SolrCore org.apache.solr.core.SolrCore@5b5d9f17
   [junit4]   2> 290187 INFO  (TEST-InfixSuggestersTest.testBuildThen2xReload-seed#[73F5578926B30E68]) [    x:collection1] o.a.s.m.SolrMetricManager Closing metric reporters for registry=solr.core.collection1, tag=5b5d9f17
   [junit4]   2> 290187 INFO  (TEST-InfixSuggestersTest.testBuildThen2xReload-seed#[73F5578926B30E68]) [    x:collection1] o.a.s.m.r.SolrJmxReporter Closing reporter [org.apache.solr.metrics.reporters.SolrJmxReporter@4cb35e45: rootName = null, domain = solr.core.collection1, service url = null, agent id = null] for registry solr.core.collection1 / com.codahale.metrics.MetricRegistry@496f0e3a
   [junit4]   2> 290187 INFO  (searcherExecutor-1072-thread-1-processing-x:collection1) [    x:collection1] o.a.s.c.SolrCore [collection1] Registered new searcher Searcher@7a502c1c[collection1] main{ExitableDirectoryReader(UninvertingDirectoryReader())}
   [junit4]   2> 290193 ERROR (TEST-InfixSuggestersTest.testBuildThen2xReload-seed#[73F5578926B30E68]) [    x:collection1] o.a.s.c.CorePropertiesLocator Couldn't load core descriptor from /home/jenkins/workspace/Lucene-Solr-7.x-Linux/solr/core/src/test-files/solr/collection1/core.properties:java.nio.file.NoSuchFileException: /home/jenkins/workspace/Lucene-Solr-7.x-Linux/solr/core/src/test-files/solr/collection1/core.properties
   [junit4]   2> 290193 INFO  (TEST-InfixSuggestersTest.testBuildThen2xReload-seed#[73F5578926B30E68]) [    x:collection1] o.a.s.c.SolrResourceLoader [null] Added 2 libs to classloader, from paths: [/home/jenkins/workspace/Lucene-Solr-7.x-Linux/solr/core/src/test-files/solr/collection1/lib, /home/jenkins/workspace/Lucene-Solr-7.x-Linux/solr/core/src/test-files/solr/collection1/lib/classes]
   [junit4]   2> 290203 INFO  (TEST-InfixSuggestersTest.testBuildThen2xReload-seed#[73F5578926B30E68]) [    x:collection1] o.a.s.c.SolrConfig Using Lucene MatchVersion: 7.5.0
   [junit4]   2> 290212 INFO  (TEST-InfixSuggestersTest.testBuildThen2xReload-seed#[73F5578926B30E68]) [    x:collection1] o.a.s.s.IndexSchema [collection1] Schema name=test
   [junit4]   2> 290317 INFO  (TEST-InfixSuggestersTest.testBuildThen2xReload-seed#[73F5578926B30E68]) [    x:collection1] o.a.s.s.IndexSchema Loaded schema test/1.0 with uniqueid field id
   [junit4]   2> 290325 INFO  (TEST-InfixSuggestersTest.testBuildThen2xReload-seed#[73F5578926B30E68]) [    x:collection1] o.a.s.c.CoreContainer Reloading SolrCore 'collection1' using configuration from instancedir /home/jenkins/workspace/Lucene-Solr-7.x-Linux/solr/core/src/test-files/solr/collection1
   [junit4]   2> 290340 INFO  (TEST-InfixSuggestersTest.testBuildThen2xReload-seed#[73F5578926B30E68]) [    x:collection1] o.a.s.m.r.SolrJmxReporter JMX monitoring for 'solr.core.collection1' (registry 'solr.core.collection1') enabled at server: com.sun.jmx.mbeanserver.JmxMBeanServer@3116f176
   [junit4]   2> 290340 INFO  (TEST-InfixSuggestersTest.testBuildThen2xReload-seed#[73F5578926B30E68]) [    x:collection1] o.a.s.c.SolrCore [[collection1] ] Opening new SolrCore at [/home/jenkins/workspace/Lucene-Solr-7.x-Linux/solr/core/src/test-files/solr/collection1], dataDir=[/home/jenkins/workspace/Lucene-Solr-7.x-Linux/solr/build/solr-core/test/J0/temp/solr.handler.component.InfixSuggestersTest_73F5578926B30E68-001/init-core-data-001/]
   [junit4]   2> 290370 INFO  (TEST-InfixSuggestersTest.testBuildThen2xReload-seed#[73F5578926B30E68]) [    x:collection1] o.a.s.u.CommitTracker Hard AutoCommit: disabled
   [junit4]   2> 290370 INFO  (TEST-InfixSuggestersTest.testBuildThen2xReload-seed#[73F5578926B30E68]) [    x:collection1] o.a.s.u.CommitTracker Soft AutoCommit: disabled
   [junit4]   2> 290371 INFO  (TEST-InfixSuggestersTest.testBuildThen2xReload-seed#[73F5578926B30E68]) [    x:collection1] o.a.s.s.SolrIndexSearcher Opening [Searcher@6714a5cf[collection1] main]
   [junit4]   2> 290371 WARN  (TEST-InfixSuggestersTest.testBuildThen2xReload-seed#[73F5578926B30E68]) [    x:collection1] o.a.s.r.ManagedResourceStorage Cannot write to config directory /home/jenkins/workspace/Lucene-Solr-7.x-Linux/solr/core/src/test-files/solr/collection1/conf; switching to use InMemory storage instead.
   [junit4]   2> 290372 INFO  (TEST-InfixSuggestersTest.testBuildThen2xReload-seed#[73F5578926B30E68]) [    x:collection1] o.a.s.h.c.SuggestComponent Initializing SuggestComponent
   [junit4]   2> 290372 INFO  (TEST-InfixSuggestersTest.testBuildThen2xReload-seed#[73F5578926B30E68]) [    x:collection1] o.a.s.s.s.SolrSuggester init: {name=shortRandomAnalyzingInfixSuggester,lookupImpl=AnalyzingInfixLookupFactory,dictionaryImpl=RandomTestDictionaryFactory,randDictMaxItems=100,indexPath=short_random_analyzing_infix_suggester,suggestAnalyzerFieldType=text,buildOnCommit=false,buildOnStartup=false}
   [junit4]   2> 290373 INFO  (TEST-InfixSuggestersTest.testBuildThen2xReload-seed#[73F5578926B30E68]) [    x:collection1] o.a.s.s.s.SolrSuggester Dictionary loaded with params: {name=shortRandomAnalyzingInfixSuggester,lookupImpl=AnalyzingInfixLookupFactory,dictionaryImpl=RandomTestDictionaryFactory,randDictMaxItems=100,indexPath=short_random_analyzing_infix_suggester,suggestAnalyzerFieldType=text,buildOnCommit=false,buildOnStartup=false}
   [junit4]   2> 290373 INFO  (TEST-InfixSuggestersTest.testBuildThen2xReload-seed#[73F5578926B30E68]) [    x:collection1] o.a.s.h.c.SuggestComponent Initializing SuggestComponent
   [junit4]   2> 290373 INFO  (TEST-InfixSuggestersTest.testBuildThen2xReload-seed#[73F5578926B30E68]) [    x:collection1] o.a.s.s.s.SolrSuggester init: {name=longRandomAnalyzingInfixSuggester,lookupImpl=AnalyzingInfixLookupFactory,dictionaryImpl=RandomTestDictionaryFactory,randDictMaxItems=100000,indexPath=long_random_analyzing_infix_suggester,suggestAnalyzerFieldType=text,buildOnCommit=false,buildOnStartup=false}
   [junit4]   2> 290376 INFO  (TEST-InfixSuggestersTest.testBuildThen2xReload-seed#[73F5578926B30E68]) [    x:collection1] o.a.s.s.s.SolrSuggester Dictionary loaded with params: {name=longRandomAnalyzingInfixSuggester,lookupImpl=AnalyzingInfixLookupFactory,dictionaryImpl=RandomTestDictionaryFactory,randDictMaxItems=100000,indexPath=long_random_analyzing_infix_suggester,suggestAnalyzerFieldType=text,buildOnCommit=false,buildOnStartup=false}
   [junit4]   2> 290376 INFO  (TEST-InfixSuggestersTest.testBuildThen2xReload-seed#[73F5578926B30E68]) [    x:collection1] o.a.s.h.c.SuggestComponent Initializing SuggestComponent
   [junit4]   2> 290376 INFO  (TEST-InfixSuggestersTest.testBuildThen2xReload-seed#[73F5578926B30E68]) [    x:collection1] o.a.s.s.s.SolrSuggester init: {name=shortRandomBlendedInfixSuggester,lookupImpl=BlendedInfixLookupFactory,dictionaryImpl=RandomTestDictionaryFactory,randDictMaxItems=100,blenderType=position_linear,suggestAnalyzerFieldType=text,indexPath=short_random_blended_infix_suggester,highlight=true,buildOnStartup=false,buildOnCommit=false}
   [junit4]   2> 290376 INFO  (TEST-InfixSuggestersTest.testBuildThen2xReload-seed#[73F5578926B30E68]) [    x:collection1] o.a.s.s.s.SolrSuggester Dictionary loaded with params: {name=shortRandomBlendedInfixSuggester,lookupImpl=BlendedInfixLookupFactory,dictionaryImpl=RandomTestDictionaryFactory,randDictMaxItems=100,blenderType=position_linear,suggestAnalyzerFieldType=text,indexPath=short_random_blended_infix_suggester,highlight=true,buildOnStartup=false,buildOnCommit=false}
   [junit4]   2> 290376 INFO  (TEST-InfixSuggestersTest.testBuildThen2xReload-seed#[73F5578926B30E68]) [    x:collection1] o.a.s.h.ReplicationHandler Commits will be reserved for 10000ms.
   [junit4]   2> 290379 INFO  (TEST-InfixSuggestersTest.testBuildThen2xReload-seed#[73F5578926B30E68]) [    x:collection1] o.a.s.u.RandomMergePolicy RandomMergePolicy wrapping class org.apache.lucene.index.MockRandomMergePolicy: org.apache.lucene.index.MockRandomMergePolicy@5837ce39
   [junit4]   2> 290379 INFO  (searcherExecutor-1076-thread-1-processing-x:collection1) [    x:collection1] o.a.s.c.SolrCore [collection1] Registered new searcher Searcher@6714a5cf[collection1] main{ExitableDirectoryReader(UninvertingDirectoryReader())}
   [junit4]   2> 290379 INFO  (TEST-InfixSuggestersTest.testBuildThen2xReload-seed#[73F5578926B30E68]) [    x:collection1] o.a.s.u.DefaultSolrCoreState New IndexWriter is ready to be used.
   [junit4]   2> 290380 INFO  (TEST-InfixSuggestersTest.testBuildThen2xReload-seed#[73F5578926B30E68]) [    x:collection1] o.a.s.s.SolrIndexSearcher Opening [Searcher@756bc098[collection1] main]
   [junit4]   2> 290380 INFO  (TEST-InfixSuggestersTest.testBuildThen2xReload-seed#[73F5578926B30E68]) [    x:collection1] o.a.s.c.SolrCore [collection1]  CLOSING SolrCore org.apache.solr.core.SolrCore@2622812e
   [junit4]   2> 290380 INFO  (TEST-InfixSuggestersTest.testBuildThen2xReload-seed#[73F5578926B30E68]) [    x:collection1] o.a.s.m.SolrMetricManager Closing metric reporters for registry=solr.core.collection1, tag=2622812e
   [junit4]   2> 290380 INFO  (TEST-InfixSuggestersTest.testBuildThen2xReload-seed#[73F5578926B30E68]) [    x:collection1] o.a.s.m.r.SolrJmxReporter Closing reporter [org.apache.solr.metrics.reporters.SolrJmxReporter@711c5422: rootName = null, domain = solr.core.collection1, service url = null, agent id = null] for registry solr.core.collection1 / com.codahale.metrics.MetricRegistry@496f0e3a
   [junit4]   2> 290381 INFO  (searcherExecutor-1076-thread-1-processing-x:collection1) [    x:collection1] o.a.s.c.SolrCore [collection1] Registered new searcher Searcher@756bc098[collection1] main{ExitableDirectoryReader(UninvertingDirectoryReader())}
   [junit4]   2> 290386 INFO  (TEST-InfixSuggestersTest.testBuildThen2xReload-seed#[73F5578926B30E68]) [    x:collection1] o.a.s.SolrTestCaseJ4 ###Ending testBuildThen2xReload
   [junit4]   2> 290387 INFO  (TEST-InfixSuggestersTest.testBlendedInfixSuggesterBuildThenReload-seed#[73F5578926B30E68]) [    x:collection1] o.a.s.SolrTestCaseJ4 ###Starting testBlendedInfixSuggesterBuildThenReload
   [junit4]   2> 290387 INFO  (TEST-InfixSuggestersTest.testBlendedInfixSuggesterBuildThenReload-seed#[73F5578926B30E68]) [    x:collection1] o.a.s.h.c.SuggestComponent SuggestComponent prepare with : qt=/suggest_blended_infix_short_dictionary&suggest.onlyMorePopular=true&indent=off&suggest.count=10&suggest=true&suggest.collate=true&suggest.buildAll=true&suggest.dictionary=shortRandomBlendedInfixSuggester&wt=xml
   [junit4]   2> 290387 INFO  (TEST-InfixSuggestersTest.testBlendedInfixSuggesterBuildThenReload-seed#[73F5578926B30E68]) [    x:collection1] o.a.s.s.s.SolrSuggester SolrSuggester.build(shortRandomBlendedInfixSuggester)
   [junit4]   2> 290409 INFO  (TEST-InfixSuggestersTest.testBlendedInfixSuggesterBuildThenReload-seed#[73F5578926B30E68]) [    x:collection1] o.a.s.s.s.RandomTestDictionaryFactory org.apache.solr.spelling.suggest.RandomTestDictionaryFactory$RandomTestDictionary.enabled.shortRandomBlendedInfixSuggester disabled after emitting 100 items.
   [junit4]   2> 290969 INFO  (TEST-InfixSuggestersTest.testBlendedInfixSuggesterBuildThenReload-seed#[73F5578926B30E68]) [    x:collection1] o.a.s.h.c.SuggestComponent SuggestComponent process with : qt=/suggest_blended_infix_short_dictionary&suggest.onlyMorePopular=true&indent=off&suggest.count=10&suggest=true&suggest.collate=true&suggest.buildAll=true&suggest.dictionary=shortRandomBlendedInfixSuggester&wt=xml
   [junit4]   2> 290969 INFO  (TEST-InfixSuggestersTest.testBlendedInfixSuggesterBuildThenReload-seed#[73F5578926B30E68]) [    x:collection1] o.a.s.c.S.Request [collection1]  webapp=null path=null params={qt=/suggest_blended_infix_short_dictionary&suggest.buildAll=true&wt=xml} status=0 QTime=581
   [junit4]   2> 290970 ERROR (TEST-InfixSuggestersTest.testBlendedInfixSuggesterBuildThenReload-seed#[73F5578926B30E68]) [    x:collection1] o.a.s.c.CorePropertiesLocator Couldn't load core descriptor from /home/jenkins/workspace/Lucene-Solr-7.x-Linux/solr/core/src/test-files/solr/collection1/core.properties:java.nio.file.NoSuchFileException: /home/jenkins/workspace/Lucene-Solr-7.x-Linux/solr/core/src/test-files/solr/collection1/core.properties
   [junit4]   2> 290970 INFO  (TEST-InfixSuggestersTest.testBlendedInfixSuggesterBuildThenReload-seed#[73F5578926B30E68]) [    x:collection1] o.a.s.c.SolrResourceLoader [null] Added 2 libs to classloader, from paths: [/home/jenkins/workspace/Lucene-Solr-7.x-Linux/solr/core/src/test-files/solr/collection1/lib, /home/jenkins/workspace/Lucene-Solr-7.x-Linux/solr/core/src/test-files/solr/collection1/lib/classes]
   [junit4]   2> 290983 INFO  (TEST-InfixSuggestersTest.testBlendedInfixSuggesterBuildThenReload-seed#[73F5578926B30E68]) [    x:collection1] o.a.s.c.SolrConfig Using Lucene MatchVersion: 7.5.0
   [junit4]   2> 291004 INFO  (TEST-InfixSuggestersTest.testBlendedInfixSuggesterBuildThenReload-seed#[73F5578926B30E68]) [    x:collection1] o.a.s.s.IndexSchema [collection1] Schema name=test
   [junit4]   2> 291075 INFO  (TEST-InfixSuggestersTest.testBlendedInfixSuggesterBuildThenReload-seed#[73F5578926B30E68]) [    x:collection1] o.a.s.s.IndexSchema Loaded schema test/1.0 with uniqueid field id
   [junit4]   2> 291082 INFO  (TEST-InfixSuggestersTest.testBlendedInfixSuggesterBuildThenReload-seed#[73F5578926B30E68]) [    x:collection1] o.a.s.c.CoreContainer Reloading SolrCore 'collection1' using configuration from instancedir /home/jenkins/workspace/Lucene-Solr-7.x-Linux/solr/core/src/test-files/solr/collection1
   [junit4]   2> 291102 INFO  (TEST-InfixSuggestersTest.testBlendedInfixSuggesterBuildThenReload-seed#[73F5578926B30E68]) [    x:collection1] o.a.s.m.r.SolrJmxReporter JMX monitoring for 'solr.core.collection1' (registry 'solr.core.collection1') enabled at server: com.sun.jmx.mbeanserver.JmxMBeanServer@3116f176
   [junit4]   2> 291102 INFO  (TEST-InfixSuggestersTest.testBlendedInfixSuggesterBuildThenReload-seed#[73F5578926B30E68]) [    x:collection1] o.a.s.c.SolrCore [[collection1] ] Opening new SolrCore at [/home/jenkins/workspace/Lucene-Solr-7.x-Linux/solr/core/src/test-files/solr/collection1], dataDir=[/home/jenkins/workspace/Lucene-Solr-7.x-Linux/solr/build/solr-core/test/J0/temp/solr.handler.component.InfixSuggestersTest_73F5578926B30E68-001/init-core-data-001/]
   [junit4]   2> 291141 INFO  (TEST-InfixSuggestersTest.testBlendedInfixSuggesterBuildThenReload-seed#[73F5578926B30E68]) [    x:collection1] o.a.s.u.CommitTracker Hard AutoCommit: disabled
   [junit4]   2> 291141 INFO  (TEST-InfixSuggestersTest.testBlendedInfixSuggesterBuildThenReload-seed#[73F5578926B30E68]) [    x:collection1] o.a.s.u.CommitTracker Soft AutoCommit: disabled
   [junit4]   2> 291143 INFO  (TEST-InfixSuggestersTest.testBlendedInfixSuggesterBuildThenReload-seed#[73F5578926B30E68]) [    x:collection1] o.a.s.s.SolrIndexSearcher Opening [Searcher@681fd012[collection1] main]
   [junit4]   2> 291143 WARN  (TEST-InfixSuggestersTest.testBlendedInfixSuggesterBuildThenReload-seed#[73F5578926B30E68]) [    x:collection1] o.a.s.r.ManagedResourceStorage Cannot write to config directory /home/jenkins/workspace/Lucene-Solr-7.x-Linux/solr/core/src/test-files/solr/collection1/conf; switching to use InMemory storage instead.
   [junit4]   2> 291143 INFO  (TEST-InfixSuggestersTest.testBlendedInfixSuggesterBuildThenReload-seed#[73F5578926B30E68]) [    x:collection1] o.a.s.h.c.SuggestComponent Initializing SuggestComponent
   [junit4]   2> 291143 INFO  (TEST-InfixSuggestersTest.testBlendedInfixSuggesterBuildThenReload-seed#[73F5578926B30E68]) [    x:collection1] o.a.s.s.s.SolrSuggester init: {name=shortRandomAnalyzingInfixSuggester,lookupImpl=AnalyzingInfixLookupFactory,dictionaryImpl=RandomTestDictionaryFactory,randDictMaxItems=100,indexPath=short_random_analyzing_infix_suggester,suggestAnalyzerFieldType=text,buildOnCommit=false,buildOnStartup=false}
   [junit4]   2> 291145 INFO  (TEST-InfixSuggestersTest.testBlendedInfixSuggesterBuildThenReload-seed#[73F5578926B30E68]) [    x:collection1] o.a.s.s.s.SolrSuggester Dictionary loaded with params: {name=shortRandomAnalyzingInfixSuggester,lookupImpl=AnalyzingInfixLookupFactory,dictionaryImpl=RandomTestDictionaryFactory,randDictMaxItems=100,indexPath=short_random_analyzing_infix_suggester,suggestAnalyzerFieldType=text,buildOnCommit=false,buildOnStartup=false}
   [junit4]   2> 291145 INFO  (TEST-InfixSuggestersTest.testBlendedInfixSuggesterBuildThenReload-seed#[73F5578926B30E68]) [    x:collection1] o.a.s.h.c.SuggestComponent Initializing SuggestComponent
   [junit4]   2> 291145 INFO  (TEST-InfixSuggestersTest.testBlendedInfixSuggesterBuildThenReload-seed#[73F5578926B30E68]) [    x:collection1] o.a.s.s.s.SolrSuggester init: {name=longRandomAnalyzingInfixSuggester,lookupImpl=AnalyzingInfixLookupFactory,dictionaryImpl=RandomTestDictionaryFactory,randDictMaxItems=100000,indexPath=long_random_analyzing_infix_suggester,suggestAnalyzerFieldType=text,buildOnCommit=false,buildOnStartup=false}
   [junit4]   2> 291147 INFO  (TEST-InfixSuggestersTest.testBlendedInfixSuggesterBuildThenReload-seed#[73F5578926B30E68]) [    x:collection1] o.a.s.s.s.SolrSuggester Dictionary loaded with params: {name=longRandomAnalyzingInfixSuggester,lookupImpl=AnalyzingInfixLookupFactory,dictionaryImpl=RandomTestDictionaryFactory,randDictMaxItems=100000,indexPath=long_random_analyzing_infix_suggester,suggestAnalyzerFieldType=text,buildOnCommit=false,buildOnStartup=false}
   [junit4]   2> 291147 INFO  (TEST-InfixSuggestersTest.testBlendedInfixSuggesterBuildThenReload-seed#[73F5578926B30E68]) [    x:collection1] o.a.s.h.c.SuggestComponent Initializing SuggestComponent
   [junit4]   2> 291147 INFO  (TEST-InfixSuggestersTest.testBlendedInfixSuggesterBuildThenReload-seed#[73F5578926B30E68]) [    x:collection1] o.a.s.s.s.SolrSuggester init: {name=shortRandomBlendedInfixSuggester,lookupImpl=BlendedInfixLookupFactory,dictionaryImpl=RandomTestDictionaryFactory,randDictMaxItems=100,blenderType=position_linear,suggestAnalyzerFieldType=text,indexPath=short_random_blended_infix_suggester,highlight=true,buildOnStartup=false,buildOnCommit=false}
   [junit4]   2> 291149 INFO  (TEST-InfixSuggestersTest.testBlendedInfixSuggesterBuildThenReload-seed#[73F5578926B30E68]) [    x:collection1] o.a.s.s.s.SolrSuggester Dictionary loaded with params: {name=shortRandomBlendedInfixSuggester,lookupImpl=BlendedInfixLookupFactory,dictionaryImpl=RandomTestDictionaryFactory,randDictMaxItems=100,blenderType=position_linear,suggestAnalyzerFieldType=text,indexPath=short_random_blended_infix_suggester,highlight=true,buildOnStartup=false,buildOnCommit=false}
   [junit4]   2> 291149 INFO  (TEST-InfixSuggestersTest.testBlendedInfixSuggesterBuildThenReload-seed#[73F5578926B30E68]) [    x:collection1] o.a.s.h.ReplicationHandler Commits will be reserved for 10000ms.
   [junit4]   2> 291149 INFO  (TEST-InfixSuggestersTest.testBlendedInfixSuggesterBuildThenReload-seed#[73F5578926B30E68]) [    x:collection1] o.a.s.u.RandomMergePolicy RandomMergePolicy wrapping class org.apache.lucene.index.TieredMergePolicy: [TieredMergePolicy: maxMergeAtOnce=27, maxMergeAtOnceExplicit=39, maxMergedSegmentMB=22.6484375, floorSegmentMB=2.1953125, forceMergeDeletesPctAllowed=24.0422390728127, segmentsPerTier=17.0, maxCFSSegmentSizeMB=8.796093022207999E12, noCFSRatio=1.0, reclaimDeletesWeight=2.4884565689993425
   [junit4]   2> 291150 INFO  (TEST-InfixSuggestersTest.testBlendedInfixSuggesterBuildThenReload-seed#[73F5578926B30E68]) [    x:collection1] o.a.s.u.DefaultSolrCoreState New IndexWriter is ready to be used.
   [junit4]   2> 291156 INFO  (searcherExecutor-1080-thread-1-processing-x:collection1) [    x:collection1] o.a.s.c.SolrCore [collection1] Registered new searcher Searcher@681fd012[collection1] main{ExitableDirectoryReader(UninvertingDirectoryReader())}
   [junit4]   2> 291156 INFO  (TEST-InfixSuggestersTest.testBlendedInfixSuggesterBuildThenReload-seed#[73F5578926B30E68]) [    x:collection1] o.a.s.s.SolrIndexSearcher Opening [Searcher@70db3127[collection1] main]
   [junit4]   2> 291156 INFO  (TEST-InfixSuggestersTest.testBlendedInfixSuggesterBuildThenReload-seed#[73F5578926B30E68]) [    x:collection1] o.a.s.c.SolrCore [collection1]  CLOSING SolrCore org.apache.solr.core.SolrCore@bbd9c43
   [junit4]   2> 291156 INFO  (TEST-InfixSuggestersTest.testBlendedInfixSuggesterBuildThenReload-seed#[73F5578926B30E68]) [    x:collection1] o.a.s.m.SolrMetricManager Closing metric reporters for registry=solr.core.collection1, tag=bbd9c43
   [junit4]   2> 291156 INFO  (TEST-InfixSuggestersTest.testBlendedInfixSuggesterBuildThenReload-seed#[73F5578926B30E68]) [    x:collection1] o.a.s.m.r.SolrJmxReporter Closing reporter [org.apache.solr.metrics.reporters.SolrJmxReporter@30d820a5: rootName = null, domain = solr.core.collection1, service url = null, agent id = null] for registry solr.core.collection1 / com.codahale.metrics.MetricRegistry@496f0e3a
   [junit4]   2> 291165 INFO  (TEST-InfixSuggestersTest.testBlendedInfixSuggesterBuildThenReload-seed#[73F5578926B30E68]) [    x:collection1] o.a.s.SolrTestCaseJ4 ###Ending testBlendedInfixSuggesterBuildThenReload
   [junit4]   2> 291166 INFO  (TEST-InfixSuggestersTest.testAnalyzingInfixSuggesterBuildThenReload-seed#[73F5578926B30E68]) [    x:collection1] o.a.s.SolrTestCaseJ4 ###Starting testAnalyzingInfixSuggesterBuildThenReload
   [junit4]   2> 291167 INFO  (TEST-InfixSuggestersTest.testAnalyzingInfixSuggesterBuildThenReload-seed#[73F5578926B30E68]) [    x:collection1] o.a.s.h.c.SuggestComponent SuggestComponent prepare with : qt=/suggest_analyzing_infix_short_dictionary&suggest=true&suggest.buildAll=true&wt=xml&indent=off
   [junit4]   2> 291167 INFO  (TEST-InfixSuggestersTest.testAnalyzingInfixSuggesterBuildThenReload-seed#[73F5578926B30E68]) [    x:collection1] o.a.s.s.s.SolrSuggester SolrSuggester.build(shortRandomAnalyzingInfixSuggester)
   [junit4]   2> 291168 INFO  (searcherExecutor-1080-thread-1-processing-x:collection1) [    x:collection1] o.a.s.c.SolrCore [collection1] Registered new searcher Searcher@70db3127[collection1] main{ExitableDirectoryReader(UninvertingDirectoryReader())}
   [junit4]   2> 291173 INFO  (TEST-InfixSuggestersTest.testAnalyzingInfixSuggesterBuildThenReload-seed#[73F5578926B30E68]) [    x:collection1] o.a.s.s.s.RandomTestDictionaryFactory org.apache.solr.spelling.suggest.RandomTestDictionaryFactory$RandomTestDictionary.enabled.shortRandomAnalyzingInfixSuggester disabled after emitting 100 items.
   [junit4]   2> 291389 INFO  (TEST-InfixSuggestersTest.testAnalyzingInfixSuggesterBuildThenReload-seed#[73F5578926B30E68]) [    x:collection1] o.a.s.h.c.SuggestComponent SuggestComponent process with : qt=/suggest_analyzing_infix_short_dictionary&suggest=true&suggest.buildAll=true&wt=xml&indent=off
   [junit4]   2> 291389 INFO  (TEST-InfixSuggestersTest.testAnalyzingInfixSuggesterBuildThenReload-seed#[73F5578926B30E68]) [    x:collection1] o.a.s.c.S.Request [collection1]  webapp=null path=null params={qt=/suggest_analyzing_infix_short_dictionary&suggest.buildAll=true&wt=xml} status=0 QTime=222
   [junit4]   2> 291389 ERROR (TEST-InfixSuggestersTest.testAnalyzingInfixSuggesterBuildThenReload-seed#[73F5578926B30E68]) [    x:collection1] o.a.s.c.CorePropertiesLocator Couldn't load core descriptor from /home/jenkins/workspace/Lucene-Solr-7.x-Linux/solr/core/src/test-files/solr/collection1/core.properties:java.nio.file.NoSuchFileException: /home/jenkins/workspace/Lucene-Solr-7.x-Linux/solr/core/src/test-files/solr/collection1/core.properties
   [junit4]   2> 291390 INFO  (TEST-InfixSuggestersTest.testAnalyzingInfixSuggesterBuildThenReload-seed#[73F5578926B30E68]) [    x:collection1] o.a.s.c.SolrResourceLoader [null] Added 2 libs to classloader, from paths: [/home/jenkins/workspace/Lucene-Solr-7.x-Linux/solr/core/src/test-files/solr/collection1/lib, /home/jenkins/workspace/Lucene-Solr-7.x-Linux/solr/core/src/test-files/solr/collection1/lib/classes]
   [junit4]   2> 291403 INFO  (TEST-InfixSuggestersTest.testAnalyzingInfixSuggesterBuildThenReload-seed#[73F5578926B30E68]) [    x:collection1] o.a.s.c.SolrConfig Using Lucene MatchVersion: 7.5.0
   [junit4]   2> 291410 INFO  (TEST-InfixSuggestersTest.testAnalyzingInfixSuggesterBuildThenReload-seed#[73F5578926B30E68]) [    x:collection1] o.a.s.s.IndexSchema [collection1] Schema name=test
   [junit4]   2> 291476 INFO  (TEST-InfixSuggestersTest.testAnalyzingInfixSuggesterBuildThenReload-seed#[73F5578926B30E68]) [    x:collection1] o.a.s.s.IndexSchema Loaded schema test/1.0 wi

[...truncated too long message...]

926B30E68]) [    x:collection1] o.a.s.s.s.SolrSuggester init: {name=longRandomAnalyzingInfixSuggester,lookupImpl=AnalyzingInfixLookupFactory,dictionaryImpl=RandomTestDictionaryFactory,randDictMaxItems=100000,indexPath=long_random_analyzing_infix_suggester,suggestAnalyzerFieldType=text,buildOnCommit=false,buildOnStartup=false}
   [junit4]   2> 292461 INFO  (TEST-InfixSuggestersTest.testTwoSuggestersBuildThenReload-seed#[73F5578926B30E68]) [    x:collection1] o.a.s.s.s.SolrSuggester Dictionary loaded with params: {name=longRandomAnalyzingInfixSuggester,lookupImpl=AnalyzingInfixLookupFactory,dictionaryImpl=RandomTestDictionaryFactory,randDictMaxItems=100000,indexPath=long_random_analyzing_infix_suggester,suggestAnalyzerFieldType=text,buildOnCommit=false,buildOnStartup=false}
   [junit4]   2> 292461 INFO  (TEST-InfixSuggestersTest.testTwoSuggestersBuildThenReload-seed#[73F5578926B30E68]) [    x:collection1] o.a.s.h.c.SuggestComponent Initializing SuggestComponent
   [junit4]   2> 292461 INFO  (TEST-InfixSuggestersTest.testTwoSuggestersBuildThenReload-seed#[73F5578926B30E68]) [    x:collection1] o.a.s.s.s.SolrSuggester init: {name=shortRandomBlendedInfixSuggester,lookupImpl=BlendedInfixLookupFactory,dictionaryImpl=RandomTestDictionaryFactory,randDictMaxItems=100,blenderType=position_linear,suggestAnalyzerFieldType=text,indexPath=short_random_blended_infix_suggester,highlight=true,buildOnStartup=false,buildOnCommit=false}
   [junit4]   2> 292462 INFO  (TEST-InfixSuggestersTest.testTwoSuggestersBuildThenReload-seed#[73F5578926B30E68]) [    x:collection1] o.a.s.s.s.SolrSuggester Dictionary loaded with params: {name=shortRandomBlendedInfixSuggester,lookupImpl=BlendedInfixLookupFactory,dictionaryImpl=RandomTestDictionaryFactory,randDictMaxItems=100,blenderType=position_linear,suggestAnalyzerFieldType=text,indexPath=short_random_blended_infix_suggester,highlight=true,buildOnStartup=false,buildOnCommit=false}
   [junit4]   2> 292462 INFO  (TEST-InfixSuggestersTest.testTwoSuggestersBuildThenReload-seed#[73F5578926B30E68]) [    x:collection1] o.a.s.h.ReplicationHandler Commits will be reserved for 10000ms.
   [junit4]   2> 292463 INFO  (TEST-InfixSuggestersTest.testTwoSuggestersBuildThenReload-seed#[73F5578926B30E68]) [    x:collection1] o.a.s.u.RandomMergePolicy RandomMergePolicy wrapping class org.apache.lucene.index.TieredMergePolicy: [TieredMergePolicy: maxMergeAtOnce=36, maxMergeAtOnceExplicit=38, maxMergedSegmentMB=32.2626953125, floorSegmentMB=1.1162109375, forceMergeDeletesPctAllowed=22.136928514529533, segmentsPerTier=49.0, maxCFSSegmentSizeMB=8.796093022207999E12, noCFSRatio=1.0, reclaimDeletesWeight=3.858310792154749
   [junit4]   2> 292463 INFO  (TEST-InfixSuggestersTest.testTwoSuggestersBuildThenReload-seed#[73F5578926B30E68]) [    x:collection1] o.a.s.u.DefaultSolrCoreState New IndexWriter is ready to be used.
   [junit4]   2> 292464 INFO  (searcherExecutor-1096-thread-1-processing-x:collection1) [    x:collection1] o.a.s.c.SolrCore [collection1] Registered new searcher Searcher@7d36d7b9[collection1] main{ExitableDirectoryReader(UninvertingDirectoryReader())}
   [junit4]   2> 292464 INFO  (TEST-InfixSuggestersTest.testTwoSuggestersBuildThenReload-seed#[73F5578926B30E68]) [    x:collection1] o.a.s.s.SolrIndexSearcher Opening [Searcher@4d4c73f8[collection1] main]
   [junit4]   2> 292464 INFO  (TEST-InfixSuggestersTest.testTwoSuggestersBuildThenReload-seed#[73F5578926B30E68]) [    x:collection1] o.a.s.c.SolrCore [collection1]  CLOSING SolrCore org.apache.solr.core.SolrCore@4c22d164
   [junit4]   2> 292464 INFO  (TEST-InfixSuggestersTest.testTwoSuggestersBuildThenReload-seed#[73F5578926B30E68]) [    x:collection1] o.a.s.m.SolrMetricManager Closing metric reporters for registry=solr.core.collection1, tag=4c22d164
   [junit4]   2> 292464 INFO  (TEST-InfixSuggestersTest.testTwoSuggestersBuildThenReload-seed#[73F5578926B30E68]) [    x:collection1] o.a.s.m.r.SolrJmxReporter Closing reporter [org.apache.solr.metrics.reporters.SolrJmxReporter@58243cf1: rootName = null, domain = solr.core.collection1, service url = null, agent id = null] for registry solr.core.collection1 / com.codahale.metrics.MetricRegistry@496f0e3a
   [junit4]   2> 292465 INFO  (searcherExecutor-1096-thread-1-processing-x:collection1) [    x:collection1] o.a.s.c.SolrCore [collection1] Registered new searcher Searcher@4d4c73f8[collection1] main{ExitableDirectoryReader(UninvertingDirectoryReader())}
   [junit4]   2> 292473 INFO  (TEST-InfixSuggestersTest.testTwoSuggestersBuildThenReload-seed#[73F5578926B30E68]) [    x:collection1] o.a.s.SolrTestCaseJ4 ###Ending testTwoSuggestersBuildThenReload
   [junit4]   2> 292473 INFO  (SUITE-InfixSuggestersTest-seed#[73F5578926B30E68]-worker) [    x:collection1] o.a.s.SolrTestCaseJ4 ###deleteCore
   [junit4]   2> 292473 INFO  (SUITE-InfixSuggestersTest-seed#[73F5578926B30E68]-worker) [    x:collection1] o.a.s.c.CoreContainer Shutting down CoreContainer instance=76228720
   [junit4]   2> 292473 INFO  (SUITE-InfixSuggestersTest-seed#[73F5578926B30E68]-worker) [    x:collection1] o.a.s.m.SolrMetricManager Closing metric reporters for registry=solr.node, tag=null
   [junit4]   2> 292473 INFO  (SUITE-InfixSuggestersTest-seed#[73F5578926B30E68]-worker) [    x:collection1] o.a.s.m.r.SolrJmxReporter Closing reporter [org.apache.solr.metrics.reporters.SolrJmxReporter@1b346c3: rootName = null, domain = solr.node, service url = null, agent id = null] for registry solr.node / com.codahale.metrics.MetricRegistry@5374a6f1
   [junit4]   2> 292476 INFO  (SUITE-InfixSuggestersTest-seed#[73F5578926B30E68]-worker) [    x:collection1] o.a.s.m.SolrMetricManager Closing metric reporters for registry=solr.jvm, tag=null
   [junit4]   2> 292476 INFO  (SUITE-InfixSuggestersTest-seed#[73F5578926B30E68]-worker) [    x:collection1] o.a.s.m.r.SolrJmxReporter Closing reporter [org.apache.solr.metrics.reporters.SolrJmxReporter@57af4852: rootName = null, domain = solr.jvm, service url = null, agent id = null] for registry solr.jvm / com.codahale.metrics.MetricRegistry@34afb6dc
   [junit4]   2> 292477 INFO  (SUITE-InfixSuggestersTest-seed#[73F5578926B30E68]-worker) [    x:collection1] o.a.s.m.SolrMetricManager Closing metric reporters for registry=solr.jetty, tag=null
   [junit4]   2> 292477 INFO  (SUITE-InfixSuggestersTest-seed#[73F5578926B30E68]-worker) [    x:collection1] o.a.s.m.r.SolrJmxReporter Closing reporter [org.apache.solr.metrics.reporters.SolrJmxReporter@427c9bb3: rootName = null, domain = solr.jetty, service url = null, agent id = null] for registry solr.jetty / com.codahale.metrics.MetricRegistry@499ad6e3
   [junit4]   2> 292478 INFO  (coreCloseExecutor-1100-thread-1-processing-x:collection1) [    x:collection1] o.a.s.c.SolrCore [collection1]  CLOSING SolrCore org.apache.solr.core.SolrCore@32ea061b
   [junit4]   2> 292478 INFO  (coreCloseExecutor-1100-thread-1-processing-x:collection1) [    x:collection1] o.a.s.m.SolrMetricManager Closing metric reporters for registry=solr.core.collection1, tag=32ea061b
   [junit4]   2> 292478 INFO  (coreCloseExecutor-1100-thread-1-processing-x:collection1) [    x:collection1] o.a.s.m.r.SolrJmxReporter Closing reporter [org.apache.solr.metrics.reporters.SolrJmxReporter@7c313abe: rootName = null, domain = solr.core.collection1, service url = null, agent id = null] for registry solr.core.collection1 / com.codahale.metrics.MetricRegistry@496f0e3a
   [junit4]   2> NOTE: leaving temporary files on disk at: /home/jenkins/workspace/Lucene-Solr-7.x-Linux/solr/build/solr-core/test/J0/temp/solr.handler.component.InfixSuggestersTest_73F5578926B30E68-001
   [junit4]   2> NOTE: test params are: codec=Asserting(Lucene70): {textgrams=FSTOrd50, text=FSTOrd50, exacttext=PostingsFormat(name=LuceneFixedGap)}, docValues:{weight=DocValuesFormat(name=Asserting), text=DocValuesFormat(name=Direct)}, maxPointsInLeafNode=641, maxMBSortInHeap=5.631349523045444, sim=RandomSimilarity(queryNorm=true): {}, locale=en-ZM, timezone=Europe/Dublin
   [junit4]   2> NOTE: Linux 4.15.0-24-generic amd64/Oracle Corporation 10.0.1 (64-bit)/cpus=8,threads=1,free=150753448,total=529530880
   [junit4]   2> NOTE: All tests run in this JVM: [TestNestedDocsSort, SSLMigrationTest, SystemInfoHandlerTest, EchoParamsTest, TestCustomStream, DistribDocExpirationUpdateProcessorTest, PeerSyncWithLeaderTest, ExecutePlanActionTest, ClassificationUpdateProcessorTest, TestPKIAuthenticationPlugin, JvmMetricsTest, AnalyticsQueryTest, TestDFRSimilarityFactory, AliasIntegrationTest, TestInitParams, TestMergePolicyConfig, SampleTest, LeaderElectionIntegrationTest, TestHdfsUpdateLog, SolrCoreTest, TestPerFieldSimilarityWithDefaultOverride, InfixSuggestersTest]
   [junit4] Completed [113/823 (1!)] on J0 in 4.06s, 7 tests, 1 error <<< FAILURES!

[...truncated 44417 lines...]
[repro] Jenkins log URL: https://jenkins.thetaphi.de/job/Lucene-Solr-7.x-Linux/2306/consoleText

[repro] Revision: f4c5380137b498079f203c865c6611a99f5765d0

[repro] Ant options: "-Dargs=-XX:-UseCompressedOops -XX:+UseParallelGC"
[repro] Repro line:  ant test  -Dtestcase=InfixSuggestersTest -Dtests.method=testShutdownDuringBuild -Dtests.seed=73F5578926B30E68 -Dtests.multiplier=3 -Dtests.slow=true -Dtests.locale=en-ZM -Dtests.timezone=Europe/Dublin -Dtests.asserts=true -Dtests.file.encoding=UTF-8

[repro] ant clean

[...truncated 6 lines...]
[repro] Test suites by module:
[repro]    solr/core
[repro]       InfixSuggestersTest
[repro] ant compile-test

[...truncated 3323 lines...]
[repro] ant test-nocompile -Dtests.dups=5 -Dtests.maxfailures=5 -Dtests.class="*.InfixSuggestersTest" -Dtests.showOutput=onerror "-Dargs=-XX:-UseCompressedOops -XX:+UseParallelGC" -Dtests.seed=73F5578926B30E68 -Dtests.multiplier=3 -Dtests.slow=true -Dtests.locale=en-ZM -Dtests.timezone=Europe/Dublin -Dtests.asserts=true -Dtests.file.encoding=UTF-8

[...truncated 106 lines...]
[repro] Failures:
[repro]   0/5 failed: org.apache.solr.handler.component.InfixSuggestersTest
[repro] Exiting with code 0

[...truncated 40 lines...]

Mime
View raw message