lucene-dev mailing list archives

Site index · List index
Message view « Date » · « Thread »
Top « Date » · « Thread »
From Policeman Jenkins Server <jenk...@thetaphi.de>
Subject [JENKINS] Lucene-Solr-master-Solaris (64bit/jdk1.8.0) - Build # 1960 - Still Unstable!
Date Tue, 10 Jul 2018 02:56:11 GMT
Build: https://jenkins.thetaphi.de/job/Lucene-Solr-master-Solaris/1960/
Java: 64bit/jdk1.8.0 -XX:-UseCompressedOops -XX:+UseG1GC

10 tests failed.
FAILED:  junit.framework.TestSuite.org.apache.solr.handler.component.SuggestComponentTest

Error Message:
Suite timeout exceeded (>= 7200000 msec).

Stack Trace:
java.lang.Exception: Suite timeout exceeded (>= 7200000 msec).
	at __randomizedtesting.SeedInfo.seed([F7A686C744D181DD]:0)


FAILED:  junit.framework.TestSuite.org.apache.solr.handler.component.SuggestComponentTest

Error Message:
Suite timeout exceeded (>= 7200000 msec).

Stack Trace:
java.lang.Exception: Suite timeout exceeded (>= 7200000 msec).
	at __randomizedtesting.SeedInfo.seed([F7A686C744D181DD]:0)


FAILED:  junit.framework.TestSuite.org.apache.solr.handler.component.SuggestComponentTest

Error Message:
Suite timeout exceeded (>= 7200000 msec).

Stack Trace:
java.lang.Exception: Suite timeout exceeded (>= 7200000 msec).
	at __randomizedtesting.SeedInfo.seed([F7A686C744D181DD]:0)


FAILED:  org.apache.solr.client.solrj.embedded.TestSolrProperties.testProperties

Error Message:
Test abandoned because suite timeout was reached.

Stack Trace:
java.lang.Exception: Test abandoned because suite timeout was reached.
	at __randomizedtesting.SeedInfo.seed([CD721C422716FDFD]:0)


FAILED:  junit.framework.TestSuite.org.apache.solr.client.solrj.embedded.TestSolrProperties

Error Message:
Suite timeout exceeded (>= 7200000 msec).

Stack Trace:
java.lang.Exception: Suite timeout exceeded (>= 7200000 msec).
	at __randomizedtesting.SeedInfo.seed([CD721C422716FDFD]:0)


FAILED:  org.apache.solr.client.solrj.embedded.TestSolrProperties.testProperties

Error Message:
Test abandoned because suite timeout was reached.

Stack Trace:
java.lang.Exception: Test abandoned because suite timeout was reached.
	at __randomizedtesting.SeedInfo.seed([CD721C422716FDFD]:0)


FAILED:  junit.framework.TestSuite.org.apache.solr.client.solrj.embedded.TestSolrProperties

Error Message:
Suite timeout exceeded (>= 7200000 msec).

Stack Trace:
java.lang.Exception: Suite timeout exceeded (>= 7200000 msec).
	at __randomizedtesting.SeedInfo.seed([CD721C422716FDFD]:0)


FAILED:  org.apache.solr.handler.component.SuggestComponentTest.testBuildOnStartupWithCoreReload

Error Message:
Test abandoned because suite timeout was reached.

Stack Trace:
java.lang.Exception: Test abandoned because suite timeout was reached.
	at __randomizedtesting.SeedInfo.seed([F7A686C744D181DD]:0)


FAILED:  org.apache.solr.handler.component.SuggestComponentTest.testBuildOnStartupWithCoreReload

Error Message:
Test abandoned because suite timeout was reached.

Stack Trace:
java.lang.Exception: Test abandoned because suite timeout was reached.
	at __randomizedtesting.SeedInfo.seed([F7A686C744D181DD]:0)


FAILED:  org.apache.solr.handler.component.SuggestComponentTest.testBuildOnStartupWithCoreReload

Error Message:
Test abandoned because suite timeout was reached.

Stack Trace:
java.lang.Exception: Test abandoned because suite timeout was reached.
	at __randomizedtesting.SeedInfo.seed([F7A686C744D181DD]:0)




Build Log:
[...truncated 14646 lines...]
   [junit4] Suite: org.apache.solr.handler.component.SuggestComponentTest
   [junit4]   2> Creating dataDir: /export/home/jenkins/workspace/Lucene-Solr-master-Solaris/solr/build/solr-core/test/J0/temp/solr.handler.component.SuggestComponentTest_F7A686C744D181DD-001/init-core-data-001
   [junit4]   2> 459342 WARN  (SUITE-SuggestComponentTest-seed#[F7A686C744D181DD]-worker) [    ] o.a.s.SolrTestCaseJ4 startTrackingSearchers: numOpens=2 numCloses=2
   [junit4]   2> 459342 INFO  (SUITE-SuggestComponentTest-seed#[F7A686C744D181DD]-worker) [    ] o.a.s.SolrTestCaseJ4 Using PointFields (NUMERIC_POINTS_SYSPROP=true) w/NUMERIC_DOCVALUES_SYSPROP=true
   [junit4]   2> 459343 INFO  (SUITE-SuggestComponentTest-seed#[F7A686C744D181DD]-worker) [    ] o.a.s.SolrTestCaseJ4 Randomized ssl (false) and clientAuth (false) via: @org.apache.solr.util.RandomizeSSL(reason=, value=NaN, ssl=NaN, clientAuth=NaN)
   [junit4]   2> 459344 INFO  (SUITE-SuggestComponentTest-seed#[F7A686C744D181DD]-worker) [    ] o.a.s.SolrTestCaseJ4 SecureRandom sanity checks: test.solr.allowed.securerandom=null & java.security.egd=file:/dev/./urandom
   [junit4]   2> 459344 INFO  (SUITE-SuggestComponentTest-seed#[F7A686C744D181DD]-worker) [    ] o.a.s.SolrTestCaseJ4 ####initCore
   [junit4]   2> 459344 INFO  (SUITE-SuggestComponentTest-seed#[F7A686C744D181DD]-worker) [    ] o.a.s.c.SolrResourceLoader [null] Added 2 libs to classloader, from paths: [/export/home/jenkins/workspace/Lucene-Solr-master-Solaris/solr/core/src/test-files/solr/collection1/lib, /export/home/jenkins/workspace/Lucene-Solr-master-Solaris/solr/core/src/test-files/solr/collection1/lib/classes]
   [junit4]   2> 459362 INFO  (SUITE-SuggestComponentTest-seed#[F7A686C744D181DD]-worker) [    ] o.a.s.c.SolrConfig Using Lucene MatchVersion: 8.0.0
   [junit4]   2> 459371 INFO  (SUITE-SuggestComponentTest-seed#[F7A686C744D181DD]-worker) [    ] o.a.s.s.IndexSchema [null] Schema name=test
   [junit4]   2> 459449 INFO  (SUITE-SuggestComponentTest-seed#[F7A686C744D181DD]-worker) [    ] o.a.s.s.IndexSchema Loaded schema test/1.0 with uniqueid field id
   [junit4]   2> 459737 INFO  (SUITE-SuggestComponentTest-seed#[F7A686C744D181DD]-worker) [    ] o.a.s.c.TransientSolrCoreCacheDefault Allocating transient cache for 2147483647 transient cores
   [junit4]   2> 459737 INFO  (SUITE-SuggestComponentTest-seed#[F7A686C744D181DD]-worker) [    ] o.a.s.h.a.MetricsHistoryHandler No .system collection, keeping metrics history in memory.
   [junit4]   2> 459749 INFO  (SUITE-SuggestComponentTest-seed#[F7A686C744D181DD]-worker) [    ] o.a.s.m.r.SolrJmxReporter JMX monitoring for 'solr.node' (registry 'solr.node') enabled at server: com.sun.jmx.mbeanserver.JmxMBeanServer@2cec25e9
   [junit4]   2> 459754 INFO  (SUITE-SuggestComponentTest-seed#[F7A686C744D181DD]-worker) [    ] o.a.s.m.r.SolrJmxReporter JMX monitoring for 'solr.jvm' (registry 'solr.jvm') enabled at server: com.sun.jmx.mbeanserver.JmxMBeanServer@2cec25e9
   [junit4]   2> 459754 INFO  (SUITE-SuggestComponentTest-seed#[F7A686C744D181DD]-worker) [    ] o.a.s.m.r.SolrJmxReporter JMX monitoring for 'solr.jetty' (registry 'solr.jetty') enabled at server: com.sun.jmx.mbeanserver.JmxMBeanServer@2cec25e9
   [junit4]   2> 459756 INFO  (coreLoadExecutor-1712-thread-1) [    x:collection1] o.a.s.c.SolrResourceLoader [null] Added 2 libs to classloader, from paths: [/export/home/jenkins/workspace/Lucene-Solr-master-Solaris/solr/core/src/test-files/solr/collection1/lib, /export/home/jenkins/workspace/Lucene-Solr-master-Solaris/solr/core/src/test-files/solr/collection1/lib/classes]
   [junit4]   2> 459777 INFO  (coreLoadExecutor-1712-thread-1) [    x:collection1] o.a.s.c.SolrConfig Using Lucene MatchVersion: 8.0.0
   [junit4]   2> 459799 INFO  (coreLoadExecutor-1712-thread-1) [    x:collection1] o.a.s.s.IndexSchema [collection1] Schema name=test
   [junit4]   2> 459866 INFO  (coreLoadExecutor-1712-thread-1) [    x:collection1] o.a.s.s.IndexSchema Loaded schema test/1.0 with uniqueid field id
   [junit4]   2> 459873 INFO  (coreLoadExecutor-1712-thread-1) [    x:collection1] o.a.s.c.CoreContainer Creating SolrCore 'collection1' using configuration from instancedir /export/home/jenkins/workspace/Lucene-Solr-master-Solaris/solr/core/src/test-files/solr/collection1, trusted=true
   [junit4]   2> 459873 INFO  (coreLoadExecutor-1712-thread-1) [    x:collection1] o.a.s.m.r.SolrJmxReporter JMX monitoring for 'solr.core.collection1' (registry 'solr.core.collection1') enabled at server: com.sun.jmx.mbeanserver.JmxMBeanServer@2cec25e9
   [junit4]   2> 459873 INFO  (coreLoadExecutor-1712-thread-1) [    x:collection1] o.a.s.c.SolrCore solr.RecoveryStrategy.Builder
   [junit4]   2> 459873 INFO  (coreLoadExecutor-1712-thread-1) [    x:collection1] o.a.s.c.SolrCore [[collection1] ] Opening new SolrCore at [/export/home/jenkins/workspace/Lucene-Solr-master-Solaris/solr/core/src/test-files/solr/collection1], dataDir=[/export/home/jenkins/workspace/Lucene-Solr-master-Solaris/solr/build/solr-core/test/J0/temp/solr.handler.component.SuggestComponentTest_F7A686C744D181DD-001/init-core-data-001/]
   [junit4]   2> 459875 INFO  (coreLoadExecutor-1712-thread-1) [    x:collection1] o.a.s.u.RandomMergePolicy RandomMergePolicy wrapping class org.apache.lucene.index.LogByteSizeMergePolicy: [LogByteSizeMergePolicy: minMergeSize=1677721, mergeFactor=50, maxMergeSize=2147483648, maxMergeSizeForForcedMerge=9223372036854775807, calibrateSizeByDeletes=true, maxMergeDocs=2147483647, maxCFSSegmentSizeMB=8.796093022207999E12, noCFSRatio=0.0]
   [junit4]   2> 460042 INFO  (coreLoadExecutor-1712-thread-1) [    x:collection1] o.a.s.u.CommitTracker Hard AutoCommit: disabled
   [junit4]   2> 460042 INFO  (coreLoadExecutor-1712-thread-1) [    x:collection1] o.a.s.u.CommitTracker Soft AutoCommit: disabled
   [junit4]   2> 460043 INFO  (coreLoadExecutor-1712-thread-1) [    x:collection1] o.a.s.u.RandomMergePolicy RandomMergePolicy wrapping class org.apache.lucene.index.TieredMergePolicy: [TieredMergePolicy: maxMergeAtOnce=42, maxMergeAtOnceExplicit=48, maxMergedSegmentMB=39.974609375, floorSegmentMB=1.5390625, forceMergeDeletesPctAllowed=7.5474369730797015, segmentsPerTier=24.0, maxCFSSegmentSizeMB=8.796093022207999E12, noCFSRatio=0.3555991963834727, reclaimDeletesWeight=1.6453406176473577
   [junit4]   2> 460044 INFO  (coreLoadExecutor-1712-thread-1) [    x:collection1] o.a.s.s.SolrIndexSearcher Opening [Searcher@4d78e7f0[collection1] main]
   [junit4]   2> 460044 WARN  (coreLoadExecutor-1712-thread-1) [    x:collection1] o.a.s.r.ManagedResourceStorage Cannot write to config directory /export/home/jenkins/workspace/Lucene-Solr-master-Solaris/solr/core/src/test-files/solr/collection1/conf; switching to use InMemory storage instead.
   [junit4]   2> 460044 INFO  (coreLoadExecutor-1712-thread-1) [    x:collection1] o.a.s.h.c.SuggestComponent Initializing SuggestComponent
   [junit4]   2> 460050 INFO  (coreLoadExecutor-1712-thread-1) [    x:collection1] o.a.s.s.s.SolrSuggester init: {name=suggest_fuzzy_with_high_freq_dict,lookupImpl=FuzzyLookupFactory,field=cat,storeDir=suggest_fuzzy_with_high_freq_dict,suggestAnalyzerFieldType=text,buildOnCommit=true,threshold=0.0}
   [junit4]   2> 460075 INFO  (coreLoadExecutor-1712-thread-1) [    x:collection1] o.a.s.s.s.SolrSuggester No dictionaryImpl parameter was provided falling back to org.apache.solr.spelling.suggest.HighFrequencyDictionaryFactory
   [junit4]   2> 460075 INFO  (coreLoadExecutor-1712-thread-1) [    x:collection1] o.a.s.s.s.SolrSuggester Dictionary loaded with params: {name=suggest_fuzzy_with_high_freq_dict,lookupImpl=FuzzyLookupFactory,field=cat,storeDir=suggest_fuzzy_with_high_freq_dict,suggestAnalyzerFieldType=text,buildOnCommit=true,threshold=0.0}
   [junit4]   2> 460076 INFO  (coreLoadExecutor-1712-thread-1) [    x:collection1] o.a.s.h.c.SuggestComponent Registering searcher listener for suggester: suggest_fuzzy_with_high_freq_dict - SuggesterListener [core=org.apache.solr.core.SolrCore@75075ec8, suggester=SolrSuggester [ name=suggest_fuzzy_with_high_freq_dict, sourceLocation=null, storeDir=/export/home/jenkins/workspace/Lucene-Solr-master-Solaris/solr/build/solr-core/test/J0/temp/solr.handler.component.SuggestComponentTest_F7A686C744D181DD-001/init-core-data-001/suggest_fuzzy_with_high_freq_dict, lookupImpl=FuzzyLookupFactory, dictionaryImpl=org.apache.solr.spelling.suggest.HighFrequencyDictionaryFactory, sizeInBytes=0 ], buildOnCommit=true, buildOnOptimize=false, buildOnStartup=true, isCoreReload=false]
   [junit4]   2> 460076 INFO  (coreLoadExecutor-1712-thread-1) [    x:collection1] o.a.s.s.s.SolrSuggester init: {name=suggest_fuzzy_file_based,lookupImpl=FuzzyLookupFactory,sourceLocation=fuzzysuggest.txt,storeDir=suggest_fuzzy_file_based,suggestAnalyzerFieldType=text,buildOnCommit=true}
   [junit4]   2> 460077 INFO  (coreLoadExecutor-1712-thread-1) [    x:collection1] o.a.s.s.s.SolrSuggester No dictionaryImpl parameter was provided falling back to org.apache.solr.spelling.suggest.FileDictionaryFactory
   [junit4]   2> 460077 INFO  (coreLoadExecutor-1712-thread-1) [    x:collection1] o.a.s.s.s.SolrSuggester Dictionary loaded with params: {name=suggest_fuzzy_file_based,lookupImpl=FuzzyLookupFactory,sourceLocation=fuzzysuggest.txt,storeDir=suggest_fuzzy_file_based,suggestAnalyzerFieldType=text,buildOnCommit=true}
   [junit4]   2> 460077 INFO  (coreLoadExecutor-1712-thread-1) [    x:collection1] o.a.s.h.c.SuggestComponent Registering searcher listener for suggester: suggest_fuzzy_file_based - SuggesterListener [core=org.apache.solr.core.SolrCore@75075ec8, suggester=SolrSuggester [ name=suggest_fuzzy_file_based, sourceLocation=fuzzysuggest.txt, storeDir=/export/home/jenkins/workspace/Lucene-Solr-master-Solaris/solr/build/solr-core/test/J0/temp/solr.handler.component.SuggestComponentTest_F7A686C744D181DD-001/init-core-data-001/suggest_fuzzy_file_based, lookupImpl=FuzzyLookupFactory, dictionaryImpl=org.apache.solr.spelling.suggest.FileDictionaryFactory, sizeInBytes=0 ], buildOnCommit=true, buildOnOptimize=false, buildOnStartup=true, isCoreReload=false]
   [junit4]   2> 460077 INFO  (coreLoadExecutor-1712-thread-1) [    x:collection1] o.a.s.s.s.SolrSuggester init: {name=suggest_fuzzy_doc_dict,lookupImpl=FuzzyLookupFactory,dictionaryImpl=DocumentDictionaryFactory,field=cat,weightField=price,suggestAnalyzerFieldType=text,buildOnCommit=true,buildOnStartup=false}
   [junit4]   2> 460089 INFO  (coreLoadExecutor-1712-thread-1) [    x:collection1] o.a.s.s.s.SolrSuggester Dictionary loaded with params: {name=suggest_fuzzy_doc_dict,lookupImpl=FuzzyLookupFactory,dictionaryImpl=DocumentDictionaryFactory,field=cat,weightField=price,suggestAnalyzerFieldType=text,buildOnCommit=true,buildOnStartup=false}
   [junit4]   2> 460089 INFO  (coreLoadExecutor-1712-thread-1) [    x:collection1] o.a.s.h.c.SuggestComponent Registering searcher listener for suggester: suggest_fuzzy_doc_dict - SuggesterListener [core=org.apache.solr.core.SolrCore@75075ec8, suggester=SolrSuggester [ name=suggest_fuzzy_doc_dict, sourceLocation=null, storeDir=, lookupImpl=FuzzyLookupFactory, dictionaryImpl=DocumentDictionaryFactory, sizeInBytes=0 ], buildOnCommit=true, buildOnOptimize=false, buildOnStartup=false, isCoreReload=false]
   [junit4]   2> 460089 INFO  (coreLoadExecutor-1712-thread-1) [    x:collection1] o.a.s.s.s.SolrSuggester init: {name=suggest_fuzzy_doc_expr_dict,dictionaryImpl=DocumentExpressionDictionaryFactory,lookupImpl=FuzzyLookupFactory,field=cat,weightExpression=((price * 2) + weight),sortField=weight,sortField=price,storeDir=suggest_fuzzy_doc_expr_dict,suggestAnalyzerFieldType=text,buildOnCommit=true}
   [junit4]   2> 460103 INFO  (coreLoadExecutor-1712-thread-1) [    x:collection1] o.a.s.s.s.SolrSuggester Dictionary loaded with params: {name=suggest_fuzzy_doc_expr_dict,dictionaryImpl=DocumentExpressionDictionaryFactory,lookupImpl=FuzzyLookupFactory,field=cat,weightExpression=((price * 2) + weight),sortField=weight,sortField=price,storeDir=suggest_fuzzy_doc_expr_dict,suggestAnalyzerFieldType=text,buildOnCommit=true}
   [junit4]   2> 460103 INFO  (coreLoadExecutor-1712-thread-1) [    x:collection1] o.a.s.h.c.SuggestComponent Registering searcher listener for suggester: suggest_fuzzy_doc_expr_dict - SuggesterListener [core=org.apache.solr.core.SolrCore@75075ec8, suggester=SolrSuggester [ name=suggest_fuzzy_doc_expr_dict, sourceLocation=null, storeDir=/export/home/jenkins/workspace/Lucene-Solr-master-Solaris/solr/build/solr-core/test/J0/temp/solr.handler.component.SuggestComponentTest_F7A686C744D181DD-001/init-core-data-001/suggest_fuzzy_doc_expr_dict, lookupImpl=FuzzyLookupFactory, dictionaryImpl=DocumentExpressionDictionaryFactory, sizeInBytes=0 ], buildOnCommit=true, buildOnOptimize=false, buildOnStartup=true, isCoreReload=false]
   [junit4]   2> 460103 INFO  (coreLoadExecutor-1712-thread-1) [    x:collection1] o.a.s.s.s.SolrSuggester init: {name=suggest_fuzzy_doc_dict_build_startup,lookupImpl=FuzzyLookupFactory,dictionaryImpl=DocumentDictionaryFactory,field=cat,weightField=price,suggestAnalyzerFieldType=text,buildOnCommit=false,buildOnStartup=true}
   [junit4]   2> 460103 INFO  (coreLoadExecutor-1712-thread-1) [    x:collection1] o.a.s.s.s.SolrSuggester Dictionary loaded with params: {name=suggest_fuzzy_doc_dict_build_startup,lookupImpl=FuzzyLookupFactory,dictionaryImpl=DocumentDictionaryFactory,field=cat,weightField=price,suggestAnalyzerFieldType=text,buildOnCommit=false,buildOnStartup=true}
   [junit4]   2> 460103 INFO  (coreLoadExecutor-1712-thread-1) [    x:collection1] o.a.s.h.c.SuggestComponent Registering searcher listener for suggester: suggest_fuzzy_doc_dict_build_startup - SuggesterListener [core=org.apache.solr.core.SolrCore@75075ec8, suggester=SolrSuggester [ name=suggest_fuzzy_doc_dict_build_startup, sourceLocation=null, storeDir=, lookupImpl=FuzzyLookupFactory, dictionaryImpl=DocumentDictionaryFactory, sizeInBytes=0 ], buildOnCommit=false, buildOnOptimize=false, buildOnStartup=true, isCoreReload=false]
   [junit4]   2> 460103 INFO  (coreLoadExecutor-1712-thread-1) [    x:collection1] o.a.s.s.s.SolrSuggester init: {name=suggest_fuzzy_doc_manal_build,lookupImpl=FuzzyLookupFactory,dictionaryImpl=DocumentDictionaryFactory,field=cat,weightField=price,suggestAnalyzerFieldType=text,buildOnCommit=false,buildOnStartup=false,storeDir=suggest_fuzzy_doc_manal_build}
   [junit4]   2> 460103 INFO  (coreLoadExecutor-1712-thread-1) [    x:collection1] o.a.s.s.s.SolrSuggester Dictionary loaded with params: {name=suggest_fuzzy_doc_manal_build,lookupImpl=FuzzyLookupFactory,dictionaryImpl=DocumentDictionaryFactory,field=cat,weightField=price,suggestAnalyzerFieldType=text,buildOnCommit=false,buildOnStartup=false,storeDir=suggest_fuzzy_doc_manal_build}
   [junit4]   2> 460103 INFO  (coreLoadExecutor-1712-thread-1) [    x:collection1] o.a.s.s.s.SolrSuggester init: {name=suggest_doc_default_startup,lookupImpl=AnalyzingLookupFactory,dictionaryImpl=DocumentDictionaryFactory,field=cat,weightField=price,suggestAnalyzerFieldType=text,buildOnCommit=false,storeDir=suggest_doc_default_startup}
   [junit4]   2> 460116 INFO  (coreLoadExecutor-1712-thread-1) [    x:collection1] o.a.s.s.s.SolrSuggester Dictionary loaded with params: {name=suggest_doc_default_startup,lookupImpl=AnalyzingLookupFactory,dictionaryImpl=DocumentDictionaryFactory,field=cat,weightField=price,suggestAnalyzerFieldType=text,buildOnCommit=false,storeDir=suggest_doc_default_startup}
   [junit4]   2> 460116 INFO  (coreLoadExecutor-1712-thread-1) [    x:collection1] o.a.s.h.c.SuggestComponent Registering searcher listener for suggester: suggest_doc_default_startup - SuggesterListener [core=org.apache.solr.core.SolrCore@75075ec8, suggester=SolrSuggester [ name=suggest_doc_default_startup, sourceLocation=null, storeDir=/export/home/jenkins/workspace/Lucene-Solr-master-Solaris/solr/build/solr-core/test/J0/temp/solr.handler.component.SuggestComponentTest_F7A686C744D181DD-001/init-core-data-001/suggest_doc_default_startup, lookupImpl=AnalyzingLookupFactory, dictionaryImpl=DocumentDictionaryFactory, sizeInBytes=0 ], buildOnCommit=false, buildOnOptimize=false, buildOnStartup=true, isCoreReload=false]
   [junit4]   2> 460117 INFO  (coreLoadExecutor-1712-thread-1) [    x:collection1] o.a.s.s.s.SolrSuggester init: {name=suggest_doc_default_startup_no_store,lookupImpl=AnalyzingLookupFactory,dictionaryImpl=DocumentDictionaryFactory,field=cat,weightField=price,suggestAnalyzerFieldType=text,buildOnCommit=false}
   [junit4]   2> 460117 INFO  (coreLoadExecutor-1712-thread-1) [    x:collection1] o.a.s.s.s.SolrSuggester Dictionary loaded with params: {name=suggest_doc_default_startup_no_store,lookupImpl=AnalyzingLookupFactory,dictionaryImpl=DocumentDictionaryFactory,field=cat,weightField=price,suggestAnalyzerFieldType=text,buildOnCommit=false}
   [junit4]   2> 460117 INFO  (coreLoadExecutor-1712-thread-1) [    x:collection1] o.a.s.h.c.SuggestComponent Registering searcher listener for suggester: suggest_doc_default_startup_no_store - SuggesterListener [core=org.apache.solr.core.SolrCore@75075ec8, suggester=SolrSuggester [ name=suggest_doc_default_startup_no_store, sourceLocation=null, storeDir=, lookupImpl=AnalyzingLookupFactory, dictionaryImpl=DocumentDictionaryFactory, sizeInBytes=0 ], buildOnCommit=false, buildOnOptimize=false, buildOnStartup=true, isCoreReload=false]
   [junit4]   2> 460117 INFO  (coreLoadExecutor-1712-thread-1) [    x:collection1] o.a.s.h.ReplicationHandler Commits will be reserved for 10000ms.
   [junit4]   2> 460117 INFO  (searcherExecutor-1713-thread-1-processing-x:collection1) [    x:collection1] o.a.s.h.c.SuggestComponent buildOnStartup: suggest_fuzzy_with_high_freq_dict
   [junit4]   2> 460117 INFO  (searcherExecutor-1713-thread-1-processing-x:collection1) [    x:collection1] o.a.s.s.s.SolrSuggester SolrSuggester.build(suggest_fuzzy_with_high_freq_dict)
   [junit4]   2> 460118 INFO  (SUITE-SuggestComponentTest-seed#[F7A686C744D181DD]-worker) [    ] o.a.s.SolrTestCaseJ4 ####initCore end
   [junit4]   2> 460122 INFO  (TEST-SuggestComponentTest.testBadSuggesterName-seed#[F7A686C744D181DD]) [    ] o.a.s.SolrTestCaseJ4 ###Starting testBadSuggesterName
   [junit4]   2> 460126 INFO  (TEST-SuggestComponentTest.testBadSuggesterName-seed#[F7A686C744D181DD]) [    ] o.a.s.u.p.LogUpdateProcessorFactory [collection1]  webapp=null path=null params={}{add=[0]} 0 4
   [junit4]   2> 460128 INFO  (TEST-SuggestComponentTest.testBadSuggesterName-seed#[F7A686C744D181DD]) [    ] o.a.s.u.p.LogUpdateProcessorFactory [collection1]  webapp=null path=null params={}{add=[1]} 0 0
   [junit4]   2> 460128 INFO  (TEST-SuggestComponentTest.testBadSuggesterName-seed#[F7A686C744D181DD]) [    ] o.a.s.u.p.LogUpdateProcessorFactory [collection1]  webapp=null path=null params={}{add=[2]} 0 0
   [junit4]   2> 460128 INFO  (TEST-SuggestComponentTest.testBadSuggesterName-seed#[F7A686C744D181DD]) [    ] o.a.s.u.p.LogUpdateProcessorFactory [collection1]  webapp=null path=null params={}{add=[3]} 0 0
   [junit4]   2> 460129 INFO  (TEST-SuggestComponentTest.testBadSuggesterName-seed#[F7A686C744D181DD]) [    ] o.a.s.u.p.LogUpdateProcessorFactory [collection1]  webapp=null path=null params={}{add=[4]} 0 0
   [junit4]   2> 460129 INFO  (TEST-SuggestComponentTest.testBadSuggesterName-seed#[F7A686C744D181DD]) [    ] o.a.s.u.p.LogUpdateProcessorFactory [collection1]  webapp=null path=null params={}{add=[5]} 0 0
   [junit4]   2> 460129 INFO  (TEST-SuggestComponentTest.testBadSuggesterName-seed#[F7A686C744D181DD]) [    ] o.a.s.u.p.LogUpdateProcessorFactory [collection1]  webapp=null path=null params={}{add=[6]} 0 0
   [junit4]   2> 460129 INFO  (TEST-SuggestComponentTest.testBadSuggesterName-seed#[F7A686C744D181DD]) [    ] o.a.s.u.p.LogUpdateProcessorFactory [collection1]  webapp=null path=null params={}{add=[7]} 0 0
   [junit4]   2> 460130 INFO  (TEST-SuggestComponentTest.testBadSuggesterName-seed#[F7A686C744D181DD]) [    ] o.a.s.u.p.LogUpdateProcessorFactory [collection1]  webapp=null path=null params={}{add=[8]} 0 0
   [junit4]   2> 460130 INFO  (TEST-SuggestComponentTest.testBadSuggesterName-seed#[F7A686C744D181DD]) [    ] o.a.s.u.p.LogUpdateProcessorFactory [collection1]  webapp=null path=null params={}{add=[9]} 0 0
   [junit4]   2> 460130 INFO  (TEST-SuggestComponentTest.testBadSuggesterName-seed#[F7A686C744D181DD]) [    ] o.a.s.u.p.LogUpdateProcessorFactory [collection1]  webapp=null path=null params={}{add=[10]} 0 0
   [junit4]   2> 460130 INFO  (TEST-SuggestComponentTest.testBadSuggesterName-seed#[F7A686C744D181DD]) [    ] o.a.s.u.DirectUpdateHandler2 start commit{,optimize=false,openSearcher=true,waitSearcher=true,expungeDeletes=false,softCommit=false,prepareCommit=false}
   [junit4]   2> 460130 INFO  (TEST-SuggestComponentTest.testBadSuggesterName-seed#[F7A686C744D181DD]) [    ] o.a.s.u.SolrIndexWriter Calling setCommitData with IW:org.apache.solr.update.SolrIndexWriter@3522e50b commitCommandVersion:0
   [junit4]   2> 460147 ERROR (searcherExecutor-1713-thread-1-processing-x:collection1) [    x:collection1] o.a.s.s.s.SolrSuggester Store Lookup build failed
   [junit4]   2> 460147 INFO  (searcherExecutor-1713-thread-1-processing-x:collection1) [    x:collection1] o.a.s.h.c.SuggestComponent buildOnStartup: suggest_fuzzy_file_based
   [junit4]   2> 460147 INFO  (searcherExecutor-1713-thread-1-processing-x:collection1) [    x:collection1] o.a.s.s.s.SolrSuggester SolrSuggester.build(suggest_fuzzy_file_based)
   [junit4]   2> 460167 INFO  (searcherExecutor-1713-thread-1-processing-x:collection1) [    x:collection1] o.a.s.s.s.SolrSuggester Stored suggest data to: /export/home/jenkins/workspace/Lucene-Solr-master-Solaris/solr/build/solr-core/test/J0/temp/solr.handler.component.SuggestComponentTest_F7A686C744D181DD-001/init-core-data-001/suggest_fuzzy_file_based/fwfsta.bin
   [junit4]   2> 460168 INFO  (searcherExecutor-1713-thread-1-processing-x:collection1) [    x:collection1] o.a.s.h.c.SuggestComponent buildOnStartup: suggest_fuzzy_doc_expr_dict
   [junit4]   2> 460168 INFO  (searcherExecutor-1713-thread-1-processing-x:collection1) [    x:collection1] o.a.s.s.s.SolrSuggester SolrSuggester.build(suggest_fuzzy_doc_expr_dict)
   [junit4]   2> 460400 ERROR (searcherExecutor-1713-thread-1-processing-x:collection1) [    x:collection1] o.a.s.s.s.SolrSuggester Store Lookup build failed
   [junit4]   2> 460400 INFO  (searcherExecutor-1713-thread-1-processing-x:collection1) [    x:collection1] o.a.s.h.c.SuggestComponent buildOnStartup: suggest_fuzzy_doc_dict_build_startup
   [junit4]   2> 460400 INFO  (searcherExecutor-1713-thread-1-processing-x:collection1) [    x:collection1] o.a.s.s.s.SolrSuggester SolrSuggester.build(suggest_fuzzy_doc_dict_build_startup)
   [junit4]   2> 460401 INFO  (searcherExecutor-1713-thread-1-processing-x:collection1) [    x:collection1] o.a.s.h.c.SuggestComponent buildOnStartup: suggest_doc_default_startup
   [junit4]   2> 460401 INFO  (searcherExecutor-1713-thread-1-processing-x:collection1) [    x:collection1] o.a.s.s.s.SolrSuggester SolrSuggester.build(suggest_doc_default_startup)
   [junit4]   2> 460401 ERROR (searcherExecutor-1713-thread-1-processing-x:collection1) [    x:collection1] o.a.s.s.s.SolrSuggester Store Lookup build failed
   [junit4]   2> 460401 INFO  (searcherExecutor-1713-thread-1-processing-x:collection1) [    x:collection1] o.a.s.h.c.SuggestComponent buildOnStartup: suggest_doc_default_startup_no_store
   [junit4]   2> 460401 INFO  (searcherExecutor-1713-thread-1-processing-x:collection1) [    x:collection1] o.a.s.s.s.SolrSuggester SolrSuggester.build(suggest_doc_default_startup_no_store)
   [junit4]   2> 460402 INFO  (searcherExecutor-1713-thread-1-processing-x:collection1) [    x:collection1] o.a.s.c.SolrCore [collection1] Registered new searcher Searcher@4d78e7f0[collection1] main{ExitableDirectoryReader(UninvertingDirectoryReader())}
   [junit4]   2> 460405 INFO  (TEST-SuggestComponentTest.testBadSuggesterName-seed#[F7A686C744D181DD]) [    ] o.a.s.s.SolrIndexSearcher Opening [Searcher@10bb4543[collection1] main]
   [junit4]   2> 460405 INFO  (TEST-SuggestComponentTest.testBadSuggesterName-seed#[F7A686C744D181DD]) [    ] o.a.s.u.DirectUpdateHandler2 end_commit_flush
   [junit4]   2> 460405 INFO  (searcherExecutor-1713-thread-1) [    ] o.a.s.h.c.SuggestComponent buildOnCommit: suggest_fuzzy_with_high_freq_dict
   [junit4]   2> 460405 INFO  (searcherExecutor-1713-thread-1) [    ] o.a.s.s.s.SolrSuggester SolrSuggester.build(suggest_fuzzy_with_high_freq_dict)
   [junit4]   2> 460408 INFO  (searcherExecutor-1713-thread-1) [    ] o.a.s.s.s.SolrSuggester Stored suggest data to: /export/home/jenkins/workspace/Lucene-Solr-master-Solaris/solr/build/solr-core/test/J0/temp/solr.handler.component.SuggestComponentTest_F7A686C744D181DD-001/init-core-data-001/suggest_fuzzy_with_high_freq_dict/fwfsta.bin
   [junit4]   2> 460408 INFO  (searcherExecutor-1713-thread-1) [    ] o.a.s.h.c.SuggestComponent buildOnCommit: suggest_fuzzy_file_based
   [junit4]   2> 460408 INFO  (searcherExecutor-1713-thread-1) [    ] o.a.s.s.s.SolrSuggester SolrSuggester.build(suggest_fuzzy_file_based)
   [junit4]   2> 460409 INFO  (searcherExecutor-1713-thread-1) [    ] o.a.s.s.s.SolrSuggester Stored suggest data to: /export/home/jenkins/workspace/Lucene-Solr-master-Solaris/solr/build/solr-core/test/J0/temp/solr.handler.component.SuggestComponentTest_F7A686C744D181DD-001/init-core-data-001/suggest_fuzzy_file_based/fwfsta.bin
   [junit4]   2> 460409 INFO  (searcherExecutor-1713-thread-1) [    ] o.a.s.h.c.SuggestComponent buildOnCommit: suggest_fuzzy_doc_dict
   [junit4]   2> 460409 INFO  (searcherExecutor-1713-thread-1) [    ] o.a.s.s.s.SolrSuggester SolrSuggester.build(suggest_fuzzy_doc_dict)
   [junit4]   2> 460412 INFO  (searcherExecutor-1713-thread-1) [    ] o.a.s.h.c.SuggestComponent buildOnCommit: suggest_fuzzy_doc_expr_dict
   [junit4]   2> 460412 INFO  (searcherExecutor-1713-thread-1) [    ] o.a.s.s.s.SolrSuggester SolrSuggester.build(suggest_fuzzy_doc_expr_dict)
   [junit4]   2> 460417 INFO  (searcherExecutor-1713-thread-1) [    ] o.a.s.s.s.SolrSuggester Stored suggest data to: /export/home/jenkins/workspace/Lucene-Solr-master-Solaris/solr/build/solr-core/test/J0/temp/solr.handler.component.SuggestComponentTest_F7A686C744D181DD-001/init-core-data-001/suggest_fuzzy_doc_expr_dict/fwfsta.bin
   [junit4]   2> 460418 INFO  (searcherExecutor-1713-thread-1) [    ] o.a.s.c.SolrCore [collection1] Registered new searcher Searcher@10bb4543[collection1] main{ExitableDirectoryReader(UninvertingDirectoryReader(Uninverting(_0(8.0.0):C11)))}
   [junit4]   2> 460419 INFO  (TEST-SuggestComponentTest.testBadSuggesterName-seed#[F7A686C744D181DD]) [    ] o.a.s.u.p.LogUpdateProcessorFactory [collection1]  webapp=null path=null params={}{commit=} 0 288
   [junit4]   2> 460419 INFO  (TEST-SuggestComponentTest.testBadSuggesterName-seed#[F7A686C744D181DD]) [    ] o.a.s.h.c.SuggestComponent SuggestComponent prepare with : suggest.count=5&qt=/suggest&suggest=true&suggest.dictionary=does-not-exist&wt=xml&suggest.q=exampel
   [junit4]   2> 460420 INFO  (TEST-SuggestComponentTest.testBadSuggesterName-seed#[F7A686C744D181DD]) [    ] o.a.s.h.RequestHandlerBase Ignoring exception matching .
   [junit4]   2> 460420 INFO  (TEST-SuggestComponentTest.testBadSuggesterName-seed#[F7A686C744D181DD]) [    ] o.a.s.c.S.Request [collection1]  webapp=null path=null params={qt=/suggest&suggest.q=exampel&suggest.count=5&suggest.dictionary=does-not-exist&wt=xml} status=400 QTime=0
   [junit4]   2> 460420 INFO  (TEST-SuggestComponentTest.testBadSuggesterName-seed#[F7A686C744D181DD]) [    ] o.a.s.h.c.SuggestComponent SuggestComponent prepare with : suggest.count=5&qt=/suggest&suggest=true&wt=xml&suggest.q=exampel
   [junit4]   2> 460420 INFO  (TEST-SuggestComponentTest.testBadSuggesterName-seed#[F7A686C744D181DD]) [    ] o.a.s.h.RequestHandlerBase Ignoring exception matching .
   [junit4]   2> 460420 INFO  (TEST-SuggestComponentTest.testBadSuggesterName-seed#[F7A686C744D181DD]) [    ] o.a.s.c.S.Request [collection1]  webapp=null path=null params={qt=/suggest&suggest.q=exampel&suggest.count=5&wt=xml} status=400 QTime=0
   [junit4]   2> 460420 INFO  (TEST-SuggestComponentTest.testBadSuggesterName-seed#[F7A686C744D181DD]) [    ] o.a.s.SolrTestCaseJ4 ###Ending testBadSuggesterName
   [junit4]   2> 460420 INFO  (TEST-SuggestComponentTest.testBadSuggesterName-seed#[F7A686C744D181DD]) [    ] o.a.s.u.DirectUpdateHandler2 [collection1] REMOVING ALL DOCUMENTS FROM INDEX
   [junit4]   2> 460420 INFO  (TEST-SuggestComponentTest.testBadSuggesterName-seed#[F7A686C744D181DD]) [    ] o.a.s.u.p.LogUpdateProcessorFactory [collection1]  webapp=null path=null params={}{deleteByQuery=*:*} 0 0
   [junit4]   2> 460421 INFO  (TEST-SuggestComponentTest.testBadSuggesterName-seed#[F7A686C744D181DD]) [    ] o.a.s.u.DirectUpdateHandler2 start commit{,optimize=false,openSearcher=true,waitSearcher=true,expungeDeletes=false,softCommit=false,prepareCommit=false}
   [junit4]   2> 460421 INFO  (TEST-SuggestComponentTest.testBadSuggesterName-seed#[F7A686C744D181DD]) [    ] o.a.s.u.SolrIndexWriter Calling setCommitData with IW:org.apache.solr.update.SolrIndexWriter@3522e50b commitCommandVersion:0
   [junit4]   2> 460429 INFO  (TEST-SuggestComponentTest.testBadSuggesterName-seed#[F7A686C744D181DD]) [    ] o.a.s.s.SolrIndexSearcher Opening [Searcher@19e31fcf[collection1] main]
   [junit4]   2> 460430 INFO  (TEST-SuggestComponentTest.testBadSuggesterName-seed#[F7A686C744D181DD]) [    ] o.a.s.u.DirectUpdateHandler2 end_commit_flush
   [junit4]   2> 460430 INFO  (searcherExecutor-1713-thread-1) [    ] o.a.s.h.c.SuggestComponent buildOnCommit: suggest_fuzzy_with_high_freq_dict
   [junit4]   2> 460430 INFO  (searcherExecutor-1713-thread-1) [    ] o.a.s.s.s.SolrSuggester SolrSuggester.build(suggest_fuzzy_with_high_freq_dict)
   [junit4]   2> 460431 ERROR (searcherExecutor-1713-thread-1) [    ] o.a.s.s.s.SolrSuggester Store Lookup build failed
   [junit4]   2> 460431 INFO  (searcherExecutor-1713-thread-1) [    ] o.a.s.h.c.SuggestComponent buildOnCommit: suggest_fuzzy_file_based
   [junit4]   2> 460431 INFO  (searcherExecutor-1713-thread-1) [    ] o.a.s.s.s.SolrSuggester SolrSuggester.build(suggest_fuzzy_file_based)
   [junit4]   2> 460432 INFO  (searcherExecutor-1713-thread-1) [    ] o.a.s.s.s.SolrSuggester Stored suggest data to: /export/home/jenkins/workspace/Lucene-Solr-master-Solaris/solr/build/solr-core/test/J0/temp/solr.handler.component.SuggestComponentTest_F7A686C744D181DD-001/init-core-data-001/suggest_fuzzy_file_based/fwfsta.bin
   [junit4]   2> 460432 INFO  (searcherExecutor-1713-thread-1) [    ] o.a.s.h.c.SuggestComponent buildOnCommit: suggest_fuzzy_doc_dict
   [junit4]   2> 460432 INFO  (searcherExecutor-1713-thread-1) [    ] o.a.s.s.s.SolrSuggester SolrSuggester.build(suggest_fuzzy_doc_dict)
   [junit4]   2> 460433 INFO  (searcherExecutor-1713-thread-1) [    ] o.a.s.h.c.SuggestComponent buildOnCommit: suggest_fuzzy_doc_expr_dict
   [junit4]   2> 460433 INFO  (searcherExecutor-1713-thread-1) [    ] o.a.s.s.s.SolrSuggester SolrSuggester.build(suggest_fuzzy_doc_expr_dict)
   [junit4]   2> 460434 ERROR (searcherExecutor-1713-thread-1) [    ] o.a.s.s.s.SolrSuggester Store Lookup build failed
   [junit4]   2> 460435 INFO  (searcherExecutor-1713-thread-1) [    ] o.a.s.c.SolrCore [collection1] Registered new searcher Searcher@19e31fcf[collection1] main{ExitableDirectoryReader(UninvertingDirectoryReader())}
   [junit4]   2> 460436 INFO  (TEST-SuggestComponentTest.testBadSuggesterName-seed#[F7A686C744D181DD]) [    ] o.a.s.u.p.LogUpdateProcessorFactory [collection1]  webapp=null path=null params={}{commit=} 0 15
   [junit4]   2> 460437 INFO  (TEST-SuggestComponentTest.testBadSuggesterName-seed#[F7A686C744D181DD]) [    ] o.a.s.h.c.SuggestComponent SuggestComponent prepare with : qt=/suggest&suggest=true&suggest.buildAll=true&wt=xml&indent=off
   [junit4]   2> 460437 INFO  (TEST-SuggestComponentTest.testBadSuggesterName-seed#[F7A686C744D181DD]) [    ] o.a.s.s.s.SolrSuggester SolrSuggester.build(suggest_fuzzy_doc_expr_dict)
   [junit4]   2> 460439 ERROR (TEST-SuggestComponentTest.testBadSuggesterName-seed#[F7A686C744D181DD]) [    ] o.a.s.s.s.SolrSuggester Store Lookup build failed
   [junit4]   2> 460439 INFO  (TEST-SuggestComponentTest.testBadSuggesterName-seed#[F7A686C744D181DD]) [    ] o.a.s.s.s.SolrSuggester SolrSuggester.build(suggest_fuzzy_doc_dict)
   [junit4]   2> 460440 INFO  (TEST-SuggestComponentTest.testBadSuggesterName-seed#[F7A686C744D181DD]) [    ] o.a.s.s.s.SolrSuggester SolrSuggester.build(suggest_fuzzy_with_high_freq_dict)
   [junit4]   2> 460440 ERROR (TEST-SuggestComponentTest.testBadSuggesterName-seed#[F7A686C744D181DD]) [    ] o.a.s.s.s.SolrSuggester Store Lookup build failed
   [junit4]   2> 460440 INFO  (TEST-SuggestComponentTest.testBadSuggesterName-seed#[F7A686C744D181DD]) [    ] o.a.s.s.s.SolrSuggester SolrSuggester.build(suggest_doc_default_startup)
   [junit4]   2> 460441 ERROR (TEST-SuggestComponentTest.testBadSuggesterName-seed#[F7A686C744D181DD]) [    ] o.a.s.s.s.SolrSuggester Store Lookup build failed
   [junit4]   2> 460441 INFO  (TEST-SuggestComponentTest.testBadSuggesterName-seed#[F7A686C744D181DD]) [    ] o.a.s.s.s.SolrSuggester SolrSuggester.build(suggest_doc_default_startup_no_store)
   [junit4]   2> 460441 INFO  (TEST-SuggestComponentTest.testBadSuggesterName-seed#[F7A686C744D181DD]) [    ] o.a.s.s.s.SolrSuggester SolrSuggester.build(suggest_fuzzy_file_based)
   [junit4]   2> 460443 INFO  (TEST-SuggestComponentTest.testBadSuggesterName-seed#[F7A686C744D181DD]) [    ] o.a.s.s.s.SolrSuggester Stored suggest data to: /export/home/jenkins/workspace/Lucene-Solr-master-Solaris/solr/build/solr-core/test/J0/temp/solr.handler.component.SuggestComponentTest_F7A686C744D181DD-001/init-core-data-001/suggest_fuzzy_file_based/fwfsta.bin
   [junit4]   2> 460443 INFO  (TEST-SuggestComponentTest.testBadSuggesterName-seed#[F7A686C744D181DD]) [    ] o.a.s.s.s.SolrSuggester SolrSuggester.build(suggest_fuzzy_doc_dict_build_startup)
   [junit4]   2> 460443 INFO  (TEST-SuggestComponentTest.testBadSuggesterName-seed#[F7A686C744D181DD]) [    ] o.a.s.s.s.SolrSuggester SolrSuggester.build(suggest_fuzzy_doc_manal_build)
   [junit4]   2> 460444 ERROR (TEST-SuggestComponentTest.testBadSuggesterName-seed#[F7A686C744D181DD]) [    ] o.a.s.s.s.SolrSuggester Store Lookup build failed
   [junit4]   2> 460444 INFO  (TEST-SuggestComponentTest.testBadSuggesterName-seed#[F7A686C744D181DD]) [    ] o.a.s.h.c.SuggestComponent SuggestComponent process with : qt=/suggest&suggest=true&suggest.buildAll=true&wt=xml&indent=off
   [junit4]   2> 460444 INFO  (TEST-SuggestComponentTest.testBadSuggesterName-seed#[F7A686C744D181DD]) [    ] o.a.s.c.S.Request [collection1]  webapp=null path=null params={qt=/suggest&suggest.buildAll=true&wt=xml} status=0 QTime=7
   [junit4]   2> 460455 INFO  (TEST-SuggestComponentTest.testBuildOnStartupWithCoreReload-seed#[F7A686C744D181DD]) [    ] o.a.s.SolrTestCaseJ4 ###Starting testBuildOnStartupWithCoreReload
   [junit4]   2> 460456 INFO  (TEST-SuggestComponentTest.testBuildOnStartupWithCoreReload-seed#[F7A686C744D181DD]) [    ] o.a.s.u.p.LogUpdateProcessorFactory [collection1]  webapp=null path=null params={}{add=[0]} 0 0
   [junit4]   2> 460456 INFO  (TEST-SuggestComponentTest.testBuildOnStartupWithCoreReload-seed#[F7A686C744D181DD]) [    ] o.a.s.u.p.LogUpdateProcessorFactory [collection1]  webapp=null path=null params={}{add=[1]} 0 0
   [junit4]   2> 460456 INFO  (TEST-SuggestComponentTest.testBuildOnStartupWithCoreReload-seed#[F7A686C744D181DD]) [    ] o.a.s.u.p.LogUpdateProcessorFactory [collection1]  webapp=null path=null params={}{add=[2]} 0 0
   [junit4]   2> 460457 INFO  (TEST-SuggestComponentTest.testBuildOnStartupWithCoreReload-seed#[F7A686C744D181DD]) [    ] o.a.s.u.p.LogUpdateProcessorFactory [collection1]  webapp=null path=null params={}{add=[3]} 0 0
   [junit4]   2> 460457 INFO  (TEST-SuggestComponentTest.testBuildOnStartupWithCoreReload-seed#[F7A686C744D181DD]) [    ] o.a.s.u.p.LogUpdateProcessorFactory [collection1]  webapp=null path=null params={}{add=[4]} 0 0
   [junit4]   2> 460457 INFO  (TEST-SuggestComponentTest.testBuildOnStartupWithCoreReload-seed#[F7A686C744D181DD]) [    ] o.a.s.u.p.LogUpdateProcessorFactory [collection1]  webapp=null path=null params={}{add=[5]} 0 0
   [junit4]   2> 460457 INFO  (TEST-SuggestComponentTest.testBuildOnStartupWithCoreReload-seed#[F7A686C744D181DD]) [    ] o.a.s.u.p.LogUpdateProcessorFactory [collection1]  webapp=null path=null params={}{add=[6]} 0 0
   [junit4]   2> 460458 INFO  (TEST-SuggestComponentTest.testBuildOnStartupWithCoreReload-seed#[F7A686C744D181DD]) [    ] o.a.s.u.p.LogUpdateProcessorFactory [collection1]  webapp=null path=null params={}{add=[7]} 0 0
   [junit4]   2> 460458 INFO  (TEST-SuggestComponentTest.testBuildOnStartupWithCoreReload-seed#[F7A686C744D181DD]) [    ] o.a.s.u.p.LogUpdateProcessorFactory [collection1]  webapp=null path=null params={}{add=[8]} 0 0
   [junit4]   2> 460459 INFO  (TEST-SuggestComponentTest.testBuildOnStartupWithCoreReload-seed#[F7A686C744D181DD]) [    ] o.a.s.u.p.LogUpdateProcessorFactory [collection1]  webapp=null path=null params={}{add=[9]} 0 0
   [junit4]   2> 460460 INFO  (TEST-SuggestComponentTest.testBuildOnStartupWithCoreReload-seed#[F7A686C744D181DD]) [    ] o.a.s.u.p.LogUpdateProcessorFactory [collection1]  webapp=null path=null params={}{add=[10]} 0 0
   [junit4]   2> 460460 INFO  (TEST-SuggestComponentTest.testBuildOnStartupWithCoreReload-seed#[F7A686C744D181DD]) [    ] o.a.s.u.DirectUpdateHandler2 start commit{,optimize=false,openSearcher=true,waitSearcher=true,expungeDeletes=false,softCommit=false,prepareCommit=false}
   [junit4]   2> 460460 INFO  (TEST-SuggestComponentTest.testBuildOnStartupWithCoreReload-seed#[F7A686C744D181DD]) [    ] o.a.s.u.SolrIndexWriter Calling setCommitData with IW:org.apache.solr.update.SolrIndexWriter@3522e50b commitCommandVersion:0
   [junit4]   2> 460517 INFO  (TEST-SuggestComponentTest.testBuildOnStartupWithCoreReload-seed#[F7A686C744D181DD]) [    ] o.a.s.s.SolrIndexSearcher Opening [Searcher@53c8e285[collection1] main]
   [junit4]   2> 460518 INFO  (TEST-SuggestComponentTest.testBuildOnStartupWithCoreReload-seed#[F7A686C744D181DD]) [    ] o.a.s.u.DirectUpdateHandler2 end_commit_flush
   [junit4]   2> 460518 INFO  (searcherExecutor-1713-thread-1) [    ] o.a.s.h.c.SuggestComponent buildOnCommit: suggest_fuzzy_with_high_freq_dict
   [junit4]   2> 460518 INFO  (searcherExecutor-1713-thread-1) [    ] o.a.s.s.s.SolrSuggester SolrSuggester.build(suggest_fuzzy_with_high_freq_dict)
   [junit4]   2> 460520 INFO  (searcherExecutor-1713-thread-1) [    ] o.a.s.s.s.SolrSuggester Stored suggest data to: /export/home/jenkins/workspace/Lucene-Solr-master-Solaris/solr/build/solr-core/test/J0/temp/solr.handler.component.SuggestComponentTest_F7A686C744D181DD-001/init-core-data-001/suggest_fuzzy_with_high_freq_dict/fwfsta.bin
   [junit4]   2> 460520 INFO  (searcherExecutor-1713-thread-1) [    ] o.a.s.h.c.SuggestComponent buildOnCommit: suggest_fuzzy_file_based
   [junit4]   2> 460520 INFO  (searcherExecutor-1713-thread-1) [    ] o.a.s.s.s.SolrSuggester SolrSuggester.build(suggest_fuzzy_file_based)
   [junit4]   2> 460522 INFO  (searcherExecutor-1713-thread-1) [    ] o.a.s.s.s.SolrSuggester Stored suggest data to: /export/home/jenkins/workspace/Lucene-Solr-master-Solaris/solr/build/solr-core/test/J0/temp/solr.handler.component.SuggestComponentTest_F7A686C744D181DD-001/init-core-data-001/suggest_fuzzy_file_based/fwfsta.bin
   [junit4]   2> 460522 INFO  (searcherExecutor-1713-thread-1) [    ] o.a.s.h.c.SuggestComponent buildOnCommit: suggest_fuzzy_doc_dict
   [junit4]   2> 460522 INFO  (searcherExecutor-1713-thread-1) [    ] o.a.s.s.s.SolrSuggester SolrSuggester.build(suggest_fuzzy_doc_dict)
   [junit4]   2> 460524 INFO  (searcherExecutor-1713-thread-1) [    ] o.a.s.h.c.SuggestComponent buildOnCommit: suggest_fuzzy_doc_expr_dict
   [junit4]   2> 460524 INFO  (searcherExecutor-1713-thread-1) [    ] o.a.s.s.s.SolrSuggester SolrSuggester.build(suggest_fuzzy_doc_expr_dict)
   [junit4]   2> 460529 INFO  (searcherExecutor-1713-thread-1) [    ] o.a.s.s.s.SolrSuggester Stored suggest data to: /export/home/jenkins/workspace/Lucene-Solr-master-Solaris/solr/build/solr-core/test/J0/temp/solr.handler.component.SuggestComponentTest_F7A686C744D181DD-001/init-core-data-001/suggest_fuzzy_doc_expr_dict/fwfsta.bin
   [junit4]   2> 460530 INFO  (searcherExecutor-1713-thread-1) [    ] o.a.s.c.SolrCore [collection1] Registered new searcher Searcher@53c8e285[collection1] main{ExitableDirectoryReader(UninvertingDirectoryReader(Uninverting(_1(8.0.0):C11)))}
   [junit4]   2> 460531 INFO  (TEST-SuggestComponentTest.testBuildOnStartupWithCoreReload-seed#[F7A686C744D181DD]) [    ] o.a.s.u.p.LogUpdateProcessorFactory [collection1]  webapp=null path=null params={}{commit=} 0 70
   [junit4]   2> 460532 INFO  (TEST-SuggestComponentTest.testBuildOnStartupWithCoreReload-seed#[F7A686C744D181DD]) [    ] o.a.s.h.c.SuggestComponent SuggestComponent prepare with : qt=/suggest&indent=off&suggest.q=exampel&suggest.count=5&suggest=true&suggest.dictionary=suggest_fuzzy_doc_dict&wt=xml
   [junit4]   2> 460532 INFO  (TEST-SuggestComponentTest.testBuildOnStartupWithCoreReload-seed#[F7A686C744D181DD]) [    ] o.a.s.h.c.SuggestComponent SuggestComponent process with : qt=/suggest&indent=off&suggest.q=exampel&suggest.count=5&suggest=true&suggest.dictionary=suggest_fuzzy_doc_dict&wt=xml
   [junit4]   2> 460546 INFO  (TEST-SuggestComponentTest.testBuildOnStartupWithCoreReload-seed#[F7A686C744D181DD]) [    ] o.a.s.c.S.Request [collection1]  webapp=null path=null params={qt=/suggest&suggest.q=exampel&suggest.count=5&suggest.dictionary=suggest_fuzzy_doc_dict&wt=xml} status=0 QTime=14
   [junit4]   2> 460547 ERROR (TEST-SuggestComponentTest.testBuildOnStartupWithCoreReload-seed#[F7A686C744D181DD]) [    ] o.a.s.c.CorePropertiesLocator Couldn't load core descriptor from /export/home/jenkins/workspace/Lucene-Solr-master-Solaris/solr/core/src/test-files/solr/collection1/core.properties:java.nio.file.NoSuchFileException: /export/home/jenkins/workspace/Lucene-Solr-master-Solaris/solr/core/src/test-files/solr/collection1/core.properties
   [junit4]   2> 460547 INFO  (TEST-SuggestComponentTest.testBuildOnStartupWithCoreReload-seed#[F7A686C744D181DD]) [    ] o.a.s.c.SolrResourceLoader [null] Added 2 libs to classloader, from paths: [/export/home/jenkins/workspace/Lucene-Solr-master-Solaris/solr/core/src/test-files/solr/collection1/lib, /export/home/jenkins/workspace/Lucene-Solr-master-Solaris/solr/core/src/test-files/solr/collection1/lib/classes]
   [junit4]   2> 460570 INFO  (TEST-SuggestComponentTest.testBuildOnStartupWithCoreReload-seed#[F7A686C744D181DD]) [    ] o.a.s.c.SolrConfig Using Lucene MatchVersion: 8.0.0
   [junit4]   2> 460578 INFO  (TEST-SuggestComponentTest.testBuildOnStartupWithCoreReload-seed#[F7A686C744D181DD]) [    ] o.a.s.s.IndexSchema [collection1] Schema name=test
   [junit4]   2> 460697 INFO  (TEST-SuggestComponentTest.testBuildOnStartupWithCoreReload-seed#[F7A686C744D181DD]) [    ] o.a.s.s.IndexSchema Loaded schema test/1.0 with uniqueid field id
   [junit4]   2> 460705 INFO  (TEST-SuggestComponentTest.testBuildOnStartupWithCoreReload-seed#[F7A686C744D181DD]) [    ] o.a.s.c.CoreContainer Reloading SolrCore 'collection1' using configuration from instancedir /export/home/jenkins/workspace/Lucene-Solr-master-Solaris/solr/core/src/test-files/solr/collection1
   [junit4]   2> 460724 INFO  (TEST-SuggestComponentTest.testBuildOnStartupWithCoreReload-seed#[F7A686C744D181DD]) [    x:collection1] o.a.s.m.r.SolrJmxReporter JMX monitoring for 'solr.core.collection1' (registry 'solr.core.collection1') enabled at server: com.sun.jmx.mbeanserver.JmxMBeanServer@2cec25e9
   [junit4]   2> 460724 INFO  (TEST-SuggestComponentTest.testBuildOnStartupWithCoreReload-seed#[F7A686C744D181DD]) [    x:collection1] o.a.s.c.SolrCore [[collection1] ] Opening new SolrCore at [/export/home/jenkins/workspace/Lucene-Solr-master-Solaris/solr/core/src/test-files/solr/collection1], dataDir=[/export/home/jenkins/workspace/Lucene-Solr-master-Solaris/solr/build/solr-core/test/J0/temp/solr.handler.component.SuggestComponentTest_F7A686C744D181DD-001/init-core-data-001/]
   [junit4]   2> 460769 INFO  (TEST-SuggestComponentTest.testBuildOnStartupWithCoreReload-seed#[F7A686C744D181DD]) [    x:collection1] o.a.s.u.CommitTracker Hard AutoCommit: disabled
   [junit4]   2> 460769 INFO  (TEST-SuggestComponentTest.testBuildOnStartupWithCoreReload-seed#[F7A686C744D181DD]) [    x:collection1] o.a.s.u.CommitTracker Soft AutoCommit: disabled
   [junit4]   2> 460771 INFO  (TEST-SuggestComponentTest.testBuildOnStartupWithCoreReload-seed#[F7A686C744D181DD]) [    x:collection1] o.a.s.s.SolrIndexSearcher Opening [Searcher@1e110bd7[collection1] main]
   [junit4]   2> 460772 WARN  (TEST-SuggestComponentTest.testBuildOnStartupWithCoreReload-seed#[F7A686C744D181DD]) [    x:collection1] o.a.s.r.ManagedResourceStorage Cannot write to config directory /export/home/jenkins/workspace/Lucene-Solr-master-Solaris/solr/core/src/test-files/solr/collection1/conf; switching to use InMemory storage instead.
   [junit4]   2> 460772 INFO  (TEST-SuggestComponentTest.testBuildOnStartupWithCoreReload-seed#[F7A686C744D181DD]) [    x:collection1] o.a.s.h.c.SuggestComponent Initializing SuggestComponent
   [junit4]   2> 460773 INFO  (TEST-SuggestComponentTest.testBuildOnStartupWithCoreReload-seed#[F7A686C744D181DD]) [    x:collection1] o.a.s.s.s.SolrSuggester init: {name=suggest_fuzzy_with_high_freq_dict,lookupImpl=FuzzyLookupFactory,field=cat,storeDir=suggest_fuzzy_with_high_freq_dict,suggestAnalyzerFieldType=text,buildOnCommit=true,threshold=0.0}
   [junit4]   2> 460774 INFO  (TEST-SuggestComponentTest.testBuildOnStartupWithCoreReload-seed#[F7A686C744D181DD]) [    x:collection1] o.a.s.s.s.SolrSuggester No dictionaryImpl parameter was provided falling back to org.apache.solr.spelling.suggest.HighFrequencyDictionaryFactory
   [junit4]   2> 460774 INFO  (TEST-SuggestComponentTest.testBuildOnStartupWithCoreReload-seed#[F7A686C744D181DD]) [    x:collection1] o.a.s.s.s.SolrSuggester Dictionary loaded with params: {name=suggest_fuzzy_with_high_freq_dict,lookupImpl=FuzzyLookupFactory,field=cat,storeDir=suggest_fuzzy_with_high_freq_dict,suggestAnalyzerFieldType=text,buildOnCommit=true,threshold=0.0}
   [junit4]   2> 460774 INFO  (TEST-SuggestComponentTest.testBuildOnStartupWithCoreReload-seed#[F7A686C744D181DD]) [    x:collection1] o.a.s.h.c.SuggestComponent Registering searcher listener for suggester: suggest_fuzzy_with_high_freq_dict - SuggesterListener [core=org.apache.solr.core.SolrCore@54b67ad8, suggester=SolrSuggester [ name=suggest_fuzzy_with_high_freq_dict, sourceLocation=null, storeDir=/export/home/jenkins/workspace/Lucene-Solr-master-Solaris/solr/build/solr-core/test/J0/temp/solr.handler.component.SuggestComponentTest_F7A686C744D181DD-001/init-core-data-001/suggest_fuzzy_with_high_freq_dict, lookupImpl=FuzzyLookupFactory, dictionaryImpl=org.apache.solr.spelling.suggest.HighFrequencyDictionaryFactory, sizeInBytes=550 ], buildOnCommit=true, buildOnOptimize=false, buildOnStartup=false, isCoreReload=true]
   [junit4]   2> 460775 INFO  (TEST-SuggestComponentTest.testBuildOnStartupWithCoreReload-seed#[F7A686C744D181DD]) [    x:collection1] o.a.s.s.s.SolrSuggester init: {name=suggest_fuzzy_file_based,lookupImpl=FuzzyLookupFactory,sourceLocation=fuzzysuggest.txt,storeDir=suggest_fuzzy_file_based,suggestAnalyzerFieldType=text,buildOnCommit=true}
   [junit4]   2> 460775 INFO  (TEST-SuggestComponentTest.testBuildOnStartupWithCoreReload-seed#[F7A686C744D181DD]) [    x:collection1] o.a.s.s.s.SolrSuggester No dictionaryImpl parameter was provided falling back to org.apache.solr.spelling.suggest.FileDictionaryFactory
   [junit4]   2> 460775 INFO  (TEST-SuggestComponentTest.testBuildOnStartupWithCoreReload-seed#[F7A686C744D181DD]) [    x:collection1] o.a.s.s.s.SolrSuggester Dictionary loaded with params: {name=suggest_fuzzy_file_based,lookupImpl=FuzzyLookupFactory,sourceLocation=fuzzysuggest.txt,storeDir=suggest_fuzzy_file_based,suggestAnalyzerFieldType=text,buildOnCommit=true}
   [junit4]   2> 460775 INFO  (TEST-SuggestComponentTest.testBuildOnStartupWithCoreReload-seed#[F7A686C744D181DD]) [    x:collection1] o.a.s.h.c.SuggestComponent Registering searcher listener for suggester: suggest_fuzzy_file_based - SuggesterListener [core=org.apache.solr.core.SolrCore@54b67ad8, suggester=SolrSuggester [ name=suggest_fuzzy_file_based, sourceLocation=fuzzysuggest.txt, storeDir=/export/home/jenkins/workspace/Lucene-Solr-master-Solaris/solr/build/solr-core/test/J0/temp/solr.handler.component.SuggestComponentTest_F7A686C744D181DD-001/init-core-data-001/suggest_fuzzy_file_based, lookupImpl=FuzzyLookupFactory, dictionaryImpl=org.apache.solr.spelling.suggest.FileDictionaryFactory, sizeInBytes=274 ], buildOnCommit=true, buildOnOptimize=false, buildOnStartup=false, isCoreReload=true]
   [junit4]   2> 460775 INFO  (TEST-SuggestComponentTest.testBuildOnStartupWithCoreReload-seed#[F7A686C744D181DD]) [    x:collection1] o.a.s.s.s.SolrSuggester init: {name=suggest_fuzzy_doc_dict,lookupImpl=FuzzyLookupFactory,dictionaryImpl=DocumentDictionaryFactory,field=cat,weightField=price,suggestAnalyzerFieldType=text,buildOnCommit=true,buildOnStartup=false}
   [junit4]   2> 460775 INFO  (TEST-SuggestComponentTest.testBuildOnStartupWithCoreReload-seed#[F7A686C744D181DD]) [    x:collection1] o.a.s.s.s.SolrSuggester Dictionary loaded with params: {name=suggest_fuzzy_doc_dict,lookupImpl=FuzzyLookupFactory,dictionaryImpl=DocumentDictionaryFactory,field=cat,weightField=price,suggestAnalyzerFieldType=text,buildOnCommit=true,buildOnStartup=false}
   [junit4]   2> 460775 INFO  (TEST-SuggestComponentTest.testBuildOnStartupWithCoreReload-seed#[F7A686C744D181DD]) [    x:collection1] o.a.s.h.c.SuggestComponent Registering searcher listener for suggester: suggest_fuzzy_doc_dict - SuggesterListener [core=org.apache.solr.core.SolrCore@54b67ad8, suggester=SolrSuggester [ name=suggest_fuzzy_doc_dict, sourceLocation=null, storeDir=, lookupImpl=FuzzyLookupFactory, dictionaryImpl=DocumentDictionaryFactory, sizeInBytes=0 ], buildOnCommit=true, buildOnOptimize=false, buildOnStartup=false, isCoreReload=true]
   [junit4]   2> 460775 INFO  (TEST-SuggestComponentTest.testBuildOnStartupWithCoreReload-seed#[F7A686C744D181DD]) [    x:collection1] o.a.s.s.s.SolrSuggester init: {name=suggest_fuzzy_doc_expr_dict,dictionaryImpl=DocumentExpressionDictionaryFactory,lookupImpl=FuzzyLookupFactory,field=cat,weightExpression=((price * 2) + weight),sortField=weight,sortField=price,storeDir=suggest_fuzzy_doc_expr_dict,suggestAnalyzerFieldType=text,buildOnCommit=true}
   [junit4]   2> 460775 INFO  (TEST-SuggestComponentTest.testBuildOnStartupWithCoreReload-seed#[F7A686C744D181DD]) [    x:collection1] o.a.s.s.s.SolrSuggester Dictionary loaded with params: {name=suggest_fuzzy_doc_expr_dict,dictionaryImpl=DocumentExpressionDictionaryFactory,lookupImpl=FuzzyLookupFactory,field=cat,weightExpression=((price * 2) + weight),sortField=weight,sortField=price,storeDir=suggest_fuzzy_doc_expr_dict,suggestAnalyzerFieldType=text,buildOnCommit=true}
   [junit4]   2> 460775 INFO  (TEST-SuggestComponentTest.testBuildOnStartupWithCoreReload-seed#[F7A686C744D181DD]) [    x:collection1] o.a.s.h.c.SuggestComponent Registering searcher listener for suggester: suggest_fuzzy_doc_expr_dict - SuggesterListener [core=org.apache.solr.core.SolrCore@54b67ad8, suggester=SolrSuggester [ name=suggest_fuzzy_doc_expr_dict, sourceLocation=null, storeDir=/export/home/jenkins/workspace/Lucene-Solr-master-Solaris/solr/build/solr-core/test/J0/temp/solr.handler.component.SuggestComponentTest_F7A686C744D181DD-001/init-core-data-001/suggest_fuzzy_doc_expr_dict, lookupImpl=FuzzyLookupFactory, dictionaryImpl=DocumentExpressionDictionaryFactory, sizeInBytes=552 ], buildOnCommit=true, buildOnOptimize=false, buildOnStartup=false, isCoreReload=true]
   [junit4]   2> 460775 INFO  (TEST-SuggestComponentTest.testBuildOnStartupWithCoreReload-seed#[F7A686C744D181DD]) [    x:collection1] o.a.s.s.s.SolrSuggester init: {name=suggest_fuzzy_doc_dict_build_startup,lookupImpl=FuzzyLookupFactory,dictionaryImpl=DocumentDictionaryFactory,field=cat,weightField=price,suggestAnalyzerFieldType=text,buildOnCommit=false,buildOnStartup=true}
   [junit4]   2> 460776 INFO  (TEST-SuggestComponentTest.testBuildOnStartupWithCoreReload-seed#[F7A686C744D181DD]) [    x:collection1] o.a.s.s.s.SolrSuggester Dictionary loaded with params: {name=suggest_fuzzy_doc_dict_build_startup,lookupImpl=FuzzyLookupFactory,dictionaryImpl=DocumentDictionaryFactory,field=cat,weightField=price,suggestAnalyzerFieldType=text,buildOnCommit=false,buildOnStartup=true}
   [junit4]   2> 460776 INFO  (TEST-SuggestComponentTest.testBuildOnStartupWithCoreReload-seed#[F7A686C744D181DD]) [    x:collection1] o.a.s.h.c.SuggestComponent Registering searcher listener for suggester: suggest_fuzzy_doc_dict_build_startup - SuggesterListener [core=org.apache.solr.core.SolrCore@54b67ad8, suggester=SolrSuggester [ name=suggest_fuzzy_doc_dict_build_startup, sourceLocation=null, storeDir=, lookupImpl=FuzzyLookupFactory, dictionaryImpl=DocumentDictionaryFactory, sizeInBytes=0 ], buildOnCommit=false, buildOnOptimize=false, buildOnStartup=true, isCoreReload=true]
   [junit4]   2> 460776 INFO  (TEST-SuggestComponentTest.testBuildOnStartupWithCoreReload-seed#[F7A686C744D181DD]) [    x:collection1] o.a.s.s.s.SolrSuggester init: {name=suggest_fuzzy_doc_manal_build,lookupImpl=FuzzyLookupFactory,dictionaryImpl=DocumentDictionaryFactory,field=cat,weightField=price,suggestAnalyzerFieldType=text,buildOnCommit=false,buildOnStartup=false,storeDir=suggest_fuzzy_doc_manal_build}
   [junit4]   2> 460776 WARN  (TEST-SuggestComponentTest.testBuildOnStartupWithCoreReload-seed#[F7A686C744D181DD]) [    x:collection1] o.a.s.s.s.SolrSuggester Loading stored lookup data failed, possibly not cached yet
   [junit4]   2> 460776 INFO  (TEST-SuggestComponentTest.testBuildOnStartupWithCoreReload-seed#[F7A686C744D181DD]) [    x:collection1] o.a.s.s.s.SolrSuggester Dictionary loaded with params: {name=suggest_fuzzy_doc_manal_build,lookupImpl=FuzzyLookupFactory,dictionaryImpl=DocumentDictionaryFactory,field=cat,weightField=price,suggestAnalyzerFieldType=text,buildOnCommit=false,buildOnStartup=false,storeDir=suggest_fuzzy_doc_manal_build}
   [junit4]   2> 460776 INFO  (TEST-SuggestComponentTest.testBuildOnStartupWithCoreReload-seed#[F7A686C744D181DD]) [    x:collection1] o.a.s.s.s.SolrSuggester init: {name=suggest_doc_default_startup,lookupImpl=AnalyzingLookupFactory,dictionaryImpl=DocumentDictionaryFactory,field=cat,weightField=price,suggestAnalyzerFieldType=text,buildOnCommit=false,storeDir=suggest_doc_default_startup}
   [junit4]   2> 460776 WARN  (TEST-SuggestComponentTest.testBuildOnStartupWithCoreReload-seed#[F7A686C744D181DD]) [    x:collection1] o.a.s.s.s.SolrSuggester Loading stored lookup data failed, possibly not cached yet
   [junit4]   2> 460776 INFO  (TEST-SuggestComponentTest.testBuildOnStartupWithCoreReload-seed#[F7A686C744D181DD]) [    x:collection1] o.a.s.s.s.SolrSuggester Dictionary loaded with params: {name=suggest_doc_default_startup,lookupImpl=AnalyzingLookupFactory,dictionaryImpl=DocumentDictionaryFactory,field=cat,weightField=price,suggestAnalyzerFieldType=text,buildOnCommit=false,storeDir=suggest_doc_default_startup}
   [junit4]   2> 460776 INFO  (TEST-SuggestComponentTest.testBuildOnStartupWithCoreReload-seed#[F7A686C744D181DD]) [    x:collection1] o.a.s.s.s.SolrSuggester init: {name=suggest_doc_default_startup_no_store,lookupImpl=AnalyzingLookupFactory,dictionaryImpl=DocumentDictionaryFactory,field=cat,weightField=price,suggestAnalyzerFieldType=text,buildOnCommit=false}
   [junit4]   2> 460776 INFO  (TEST-SuggestComponentTest.testBuildOnStartupWithCoreReload-seed#[F7A686C744D181DD]) [    x:collection1] o.a.s.s.s.SolrSuggester Dictionary loaded with params: {name=suggest_doc_default_startup_no_store,lookupImpl=AnalyzingLookupFactory,dictionaryImpl=DocumentDictionaryFactory,field=cat,weightField=price,suggestAnalyzerFieldType=text,buildOnCommit=false}
   [junit4]   2> 460776 INFO  (TEST-SuggestComponentTest.testBuildOnStartupWithCoreReload-seed#[F7A686C744D181DD]) [    x:collection1] o.a.s.h.c.SuggestComponent Registering searcher listener for suggester: suggest_doc_default_startup_no_store - SuggesterListener [core=org.apache.solr.core.SolrCore@54b67ad8, suggester=SolrSuggester [ name=suggest_doc_default_startup_no_store, sourceLocation=null, storeDir=, lookupImpl=AnalyzingLookupFactory, dictionaryImpl=DocumentDictionaryFactory, sizeInBytes=0 ], buildOnCommit=false, buildOnOptimize=false, buildOnStartup=true, isCoreReload=true]
   [junit4]   2> 460776 INFO  (TEST-SuggestComponentTest.testBuildOnStartupWithCoreReload-seed#[F7A686C744D181DD]) [    x:collection1] o.a.s.h.ReplicationHandler Commits will be reserved for 10000ms.
   [junit4]   2> 460776 INFO  (searcherExecutor-1717-thread-1-processing-x:collection1) [    x:collection1] o.a.s.h.c.SuggestComponent Skipping first newSearcher call for suggester SolrSuggester [ name=suggest_fuzzy_with_high_freq_dict, sourceLocation=null, storeDir=/export/home/jenkins/workspace/Lucene-Solr-master-Solaris/solr/build/solr-core/test/J0/temp/solr.handler.component.SuggestComponentTest_F7A686C744D181DD-001/init-core-data-001/suggest_fuzzy_with_high_freq_dict, lookupImpl=FuzzyLookupFactory, dictionaryImpl=org.apache.solr.spelling.suggest.HighFrequencyDictionaryFactory, sizeInBytes=550 ] in core reload
   [junit4]   2> 460777 INFO  (searcherExecutor-1717-thread-1-processing-x:collection1) [    x:collection1] o.a.s.h.c.SuggestComponent Skipping first newSearcher call for suggester SolrSuggester [ name=suggest_fuzzy_file_based, sourceLocation=fuzzysuggest.txt, storeDir=/export/home/jenkins/workspace/Lucene-Solr-master-Solaris/solr/build/solr-core/test/J0/temp/solr.handler.component.SuggestComponentTest_F7A686C744D181DD-001/init-core-data-001/suggest_fuzzy_file_based, lookupImpl=FuzzyLookupFactory, dictionaryImpl=org.apache.solr.spelling.suggest.FileDictionaryFactory, sizeInBytes=274 ] in core reload
   [junit4]   2> 460777 INFO  (searcherExecutor-1717-thread-1-processing-x:collection1) [    x:collection1] o.a.s.h.c.SuggestComponent Skipping first newSearcher call for suggester SolrSuggester [ name=suggest_fuzzy_doc_dict, sourceLocation=null, storeDir=, lookupImpl=FuzzyLookupFactory, dictionaryImpl=DocumentDictionaryFactory, sizeInBytes=0 ] in core reload
   [junit4]   2> 460777 INFO  (searcherExecutor-1717-thread-1-processing-x:collection1) [    x:collection1] o.a.s.h.c.SuggestComponent Skipping first newSearcher call for suggester SolrSuggester [ name=suggest_fuzzy_doc_expr_dict, sourceLocation=null, storeDir=/export/home/jenkins/workspace/Lucene-Solr-master-Solaris/solr/build/solr-core/test/J0/temp/solr.handler.component.SuggestComponentTest_F7A686C744D181DD-001/init-core-data-001/suggest_fuzzy_doc_expr_dict, lookupImpl=FuzzyLookupFactory, dictionaryImpl=DocumentExpressionDictionaryFactory, sizeInBytes=552 ] in core reload
   [junit4]   2> 460777 INFO  (searcherExecutor-1717-thread-1-processing-x:collection1) [    x:collection1] o.a.s.h.c.SuggestComponent Skipping first newSearcher call for suggester SolrSuggester [ name=suggest_fuzzy_doc_dict_build_startup, sourceLocation=null, storeDir=, lookupImpl=FuzzyLookupFactory, dictionaryImpl=DocumentDictionaryFactory, sizeInBytes=0 ] in core reload
   [junit4]   2> 460777 INFO  (searcherExecutor-1717-thread-1-processing-x:collection1) [    x:collection1] o.a.s.h.c.SuggestComponent Skipping first newSearcher call for suggester SolrSuggester [ name=suggest_doc_default_startup_no_store, sourceLocation=null, storeDir=, lookupImpl=AnalyzingLookupFactory, dictionaryImpl=DocumentDictionaryFactory, sizeInBytes=0 ] in core reload
   [junit4]   2> 460778 INFO  (searcherExecutor-1717-thread-1-processing-x:collection1) [    x:collection1] o.a.s.c.SolrCore [collection1] Registered new searcher Searcher@1e110bd7[collection1] main{ExitableDirectoryReader(UninvertingDirectoryReader(Uninverting(_1(8.0.0):C11)))}
   [junit4]   2> Lul 09, 2018 11:30:29 WN com.carrotsearch.randomizedtesting.ThreadLeakControl$2 evaluate
   [junit4]   2> WARNING: Suite execution timed out: org.apache.solr.handler.component.SuggestComponentTest
   [junit4]   2> ==== jstack at approximately timeout time ====
   [junit4]   2> "SolrRrdBackendFactory-1710-thread-2" ID=4148 WAITING on java.util.concurrent.locks.AbstractQueuedSynchronizer$ConditionObject@4304907a
   [junit4]   2> 	at sun.misc.Unsafe.park(Native Method)
   [junit4]   2> 	- waiting on java.util.concurrent.locks.AbstractQueuedSynchronizer$ConditionObject@4304907a
   [junit4]   2> 	at java.util.concurrent.locks.LockSupport.park(LockSupport.java:175)
   [junit4]   2> 	at java.util.concurrent.locks.AbstractQueuedSynchronizer$ConditionObject.await(AbstractQueuedSynchronizer.java:2039)
   [junit4]   2> 	at java.util.concurrent.ScheduledThreadPoolExecutor$DelayedWorkQueue.take(ScheduledThreadPoolExecutor.java:1088)
   [junit4]   2> 	at java.util.concurrent.ScheduledThreadPoolExecutor$DelayedWorkQueue.take(ScheduledThreadPoolExecutor.java:809)
   [junit4]   2> 	at java.util.concurrent.ThreadPoolExecutor.getTask(ThreadPoolExecutor.java:1074)
   [junit4]   2> 	at java.util.concurrent.ThreadPoolExecutor.runWorker(ThreadPoolExecutor.java:1134)
   [junit4]   2> 	at java.util.concurrent.ThreadPoolExecutor$Worker.run(ThreadPoolExecutor.java:624)
   [junit4]   2> 	at java.lang.Thread.run(Thread.java:748)
   [junit4]   2> 
   [junit4]   2> "searcherExecutor-1717-thread-1" ID=4147 WAITING on java.util.concurrent.locks.AbstractQueuedSynchronizer$ConditionObject@3c28ceb1
   [junit4]   2> 	at sun.misc.Unsafe.park(Native Method)
   [junit4]   2> 	- waiting on java.util.concurrent.locks.AbstractQueuedSynchronizer$ConditionObject@3c28ceb1
   [junit4]   2> 	at java.util.concurrent.locks.LockSupport.park(LockSupport.java:175)
   [junit4]   2> 	at java.util.concurrent.locks.AbstractQueuedSynchronizer$ConditionObject.await(AbstractQueuedSynchronizer.java:2039)
   [junit4]   2> 	at java.util.concurrent.LinkedBlockingQueue.take(LinkedBlockingQueue.java:442)
   [junit4]   2> 	at java.util.concurrent.ThreadPoolExecutor.getTask(ThreadPoolExecutor.java:1074)
   [junit4]   2> 	at java.util.concurrent.ThreadPoolExecutor.runWorker(ThreadPoolExecutor.java:1134)
   [junit4]   2> 	at java.util.concurrent.ThreadPoolExecutor$Worker.run(ThreadPoolExecutor.java:624)
   [junit4]   2> 	at java.lang.Thread.run(Thread.java:748)
   [junit4]   2> 
   [junit4]   2> "searcherExecutor-1713-thread-1" ID=4145 WAITING on java.util.concurrent.locks.AbstractQueuedSynchronizer$ConditionObject@720db0e7
   [junit4]   2> 	at sun.misc.Unsafe.park(Native Method)
   [junit4]   2> 	- waiting on java.util.concurrent.locks.AbstractQueuedSynchronizer$ConditionObject@720db0e7
   [junit4]   2> 	at java.util.concurrent.locks.LockSupport.park(LockSupport.java:175)
   [junit4]   2> 	at java.util.concurrent.locks.AbstractQueuedSynchronizer$ConditionObject.await(AbstractQueuedSynchronizer.java:2039)
   [junit4]   2> 	at java.util.concurrent.LinkedBlockingQueue.take(LinkedBlockingQueue.java:442)
   [junit4]   2> 	at java.util.concurrent.ThreadPoolExecutor.getTask(ThreadPoolExecutor.java:1074)
   [junit4]   2> 	at java.util.concurrent.ThreadPoolExecutor.runWorker(ThreadPoolExecutor.java:1134)
   [junit4]   2> 	at java.util.concurrent.ThreadPoolExecutor$Worker.run(ThreadPoolExecutor.java:624)
   [junit4]   2> 	at java.lang.Thread.run(Thread.java:748)
   [junit4]   2> 
   [junit4]   2> "Thread-791" ID=4143 WAITING on java.lang.Object@44cbb096
   [junit4]   2> 	at java.lang.Object.wait(Native Method)
   [junit4]   2> 	- waiting on java.lang.Object@44cbb096
   [junit4]   2> 	at java.lang.Object.wait(Object.java:502)
   [junit4]   2> 	at org.apache.solr.core.CloserThread.run(CoreContainer.java:1848)
   [junit4]   2> 
   [junit4]   2> "MetricsHistoryHandler-1711-thread-1" ID=4141 TIMED_WAITING on java.util.concurrent.locks.AbstractQueuedSynchronizer$ConditionObject@232b6f35
   [junit4]   2> 	at sun.misc.Unsafe.park(Native Method)
   [junit4]   2> 	- timed waiting on java.util.concurrent.locks.AbstractQueuedSynchronizer$ConditionObject@232b6f35
   [junit4]   2> 	at java.util.concurrent.locks.LockSupport.parkNanos(LockSupport.java:215)
   [junit4]   2> 	at java.util.concurrent.locks.AbstractQueuedSynchronizer$ConditionObject.awaitNanos(AbstractQueuedSynchronizer.java:2078)
   [junit4]   2> 	at java.util.concurrent.ScheduledThreadPoolExecutor$DelayedWorkQueue.take(ScheduledThreadPoolExecutor.java:1093)
   [junit4]   2> 	at java.util.concurrent.ScheduledThreadPoolExecutor$DelayedWorkQueue.take(ScheduledThreadPoolExecutor.java:809)
   [junit4]   2> 	at java.util.concurrent.ThreadPoolExecutor.getTask(ThreadPoolExecutor.java:1074)
   [junit4]   2> 	at java.util.concurrent.ThreadPoolExecutor.runWorker(ThreadPoolExecutor.java:1134)
   [junit4]   2> 	at java.util.concurrent.ThreadPoolExecutor$Worker.run(ThreadPoolExecutor.java:624)
   [junit4]   2> 	at java.lang.Thread.run(Thread.java:748)
   [junit4]   2> 
   [junit4]   2> "SolrRrdBackendFactory-1710-thread-1" ID=4140 TIMED_WAITING on java.util.concurrent.locks.AbstractQueuedSynchronizer$ConditionObject@4304907a
   [junit4]   2> 	at sun.misc.Unsafe.park(Native Method)
   [junit4]   2> 	- timed waiting on java.util.concurrent.locks.AbstractQueuedSynchronizer$ConditionObject@4304907a
   [junit4]   2> 	at java.util.concurrent.locks.LockSupport.parkNanos(LockSupport.java:215)
   [junit4]   2> 	at java.util.concurrent.locks.AbstractQueuedSynchronizer$ConditionObject.awaitNanos(AbstractQueuedSynchronizer.java:2078)
   [junit4]   2> 	at java.util.concurrent.ScheduledThreadPoolExecutor$DelayedWorkQueue.take(ScheduledThreadPoolExecutor.java:1093)
   [junit4]   2> 	at java.util.concurrent.ScheduledThreadPoolExecutor$DelayedWorkQueue.take(ScheduledThreadPoolExecutor.java:809)
   [junit4]   2> 	at java.util.concurrent.ThreadPoolExecutor.getTask(ThreadPoolExecutor.java:1074)
   [junit4]   2> 	at java.util.concurrent.ThreadPoolExecutor.runWorker(ThreadPoolExecutor.java:1134)
   [junit4]   2> 	at java.util.concurrent.ThreadPoolExecutor$Worker.run(ThreadPoolExecutor.java:624)
   [junit4]   2> 	at java.lang.Thread.run(Thread.java:748)
   [junit4]   2> 
   [junit4]   2> "Connection evictor" ID=4139 TIMED_WAITING
   [junit4]   2> 	at java.lang.Thread.sleep(Native Method)
   [junit4]   2> 	at org.apache.http.impl.client.IdleConnectionEvictor$1.run(IdleConnectionEvictor.java:66)
   [junit4]   2> 	at java.lang.Thread.run(Thread.java:748)
   [junit4]   2> 
   [junit4]   2> "Connection evictor" ID=4138 TIMED_WAITING
   [junit4]   2> 	at java.lang.Thread.sleep(Native Method)
   [junit4]   2> 	at org.apache.http.impl.client.IdleConnectionEvictor$1.run(IdleConnectionEvictor.java:66)
   [junit4]   2> 	at java.lang.Thread.run(Thread.java:748)
   [junit4]   2> 
   [junit4]   2> "Connection evictor" ID=4137 TIMED_WAITING
   [junit4]   2> 	at java.lang.Thread.sleep(Native Method)
   [junit4]   2> 	at org.apache.http.impl.client.IdleConnectionEvictor$1.run(IdleConnectionEvictor.java:66)
   [junit4]   2> 	at java.lang.Thread.run(Thread.java:748)
   [junit4]   2> 
   [junit4]   2> "TEST-SuggestComponentTest.testBuildOnStartupWithCoreReload-seed#[F7A686C744D181DD]" ID=4136 TIMED_WAITING on java.util.concurrent.locks.ReentrantReadWriteLock$NonfairSync@461979e9
   [junit4]   2> 	at sun.misc.Unsafe.park(Native Method)
   [junit4]   2> 	- timed waiting on java.util.concurrent.locks.ReentrantReadWriteLock$NonfairSync@461979e9
   [junit4]   2> 	at java.util.concurrent.locks.LockSupport.parkNanos(LockSupport.java:215)
   [junit4]   2> 	at java.util.concurrent.locks.AbstractQueuedSynchronizer.doAcquireNanos(AbstractQueuedSynchronizer.java:934)
   [junit4]   2> 	at java.util.concurrent.locks.AbstractQueuedSynchronizer.tryAcquireNanos(AbstractQueuedSynchronizer.java:1247)
   [junit4]   2> 	at java.util.concurrent.locks.ReentrantReadWriteLock$WriteLock.tryLock(ReentrantReadWriteLock.java:1115)
   [junit4]   2> 	at org.apache.solr.update.DefaultSolrCoreState.lock(DefaultSolrCoreState.java:176)
   [junit4]   2> 	at org.apache.solr.update.DefaultSolrCoreState.newIndexWriter(DefaultSolrCoreState.java:227)
   [junit4]   2> 	at org.apache.solr.core.SolrCore.reload(SolrCore.java:669)
   [junit4]   2> 	- locked java.lang.Object@590c60a7
   [junit4]   2> 	at org.apache.solr.core.CoreContainer.reload(CoreContainer.java:1395)
   [junit4]   2> 	at org.apache.solr.util.TestHarness.reload(TestHarness.java:265)
   [junit4]   2> 	at org.apache.solr.handler.component.SuggestComponentTest.reloadCore(SuggestComponentTest.java:514)
   [junit4]   2> 	at org.apache.solr.handler.component.SuggestComponentTest.doTestBuildOnStartup(SuggestComponentTest.java:424)
   [junit4]   2> 	at org.apache.solr.handler.component.SuggestComponentTest.testBuildOnStartupWithCoreReload(SuggestComponentTest.java:389)
   [junit4]   2> 	at sun.reflect.NativeMethodAccessorImpl.invoke0(Native Method)
   [junit4]   2> 	at sun.reflect.NativeMethodAccessorImpl.invoke(NativeMethodAccessorImpl.java:62)
   [junit4]   2> 	at sun.reflect.DelegatingMethodAccessorImpl.invoke(DelegatingMethodAccessorImpl.java:43)
   [junit4]   2> 	at java.lang.reflect.Method.invoke(Method.java:498)
   [junit4]   2> 	at com.carrotsearch.randomizedtesting.RandomizedRunner.invoke(RandomizedRunner.java:1737)
   [junit4]   2> 	at com.carrotsearch.randomizedtesting.RandomizedRunner$8.evaluate(RandomizedRunner.java:934)
   [junit4]   2> 	at com.carrotsearch.randomizedtesting.RandomizedRunner$9.evaluate(RandomizedRunner.java:970)
   [junit4]   2> 	at com.carrotsearch.randomizedtesting.RandomizedRunner$10.evaluate(RandomizedRunner.java:984)
   [junit4]   2> 	at com.carrotsearch.randomizedtesting.rules.SystemPropertiesRestoreRule$1.evaluate(SystemPropertiesRestoreRule.java:57)
   [junit4]   2> 	at org.apache.lucene.util.TestRuleSetupTeardownChained$1.evaluate(TestRuleSetupTeardownChained.java:49)
   [junit4]   2> 	at org.apache.lucene.util.AbstractBeforeAfterRule$1.evaluate(AbstractBeforeAfterRule.java:45)
   [junit4]   2> 	at org.apache.lucene.util.TestRuleThreadAndTestName$1.evaluate(TestRuleThreadAndTestName.java:48)
   [junit4]   2> 	at org.apache.lucene.util.TestRuleIgnoreAfterMaxFailures$1.evaluate(TestRuleIgnoreAfterMaxFailures.java:64)
   [junit4]   2> 	at org.apache.lucene.util.TestRuleMarkFailure$1.evaluate(TestRuleMarkFailure.java:47)
   [junit4]   2> 	at com.carrotsearch.randomizedtesting.rules.StatementAdapter.evaluate(StatementAdapter.java:36)
   [junit4]   2> 	at com.carrotsearch.randomizedtesting.ThreadLeakControl$StatementRunner.run(ThreadLeakControl.java:368)
   [junit4]   2> 	at com.carrotsearch.randomizedtesting.ThreadLeakControl.forkTimeoutingTask(ThreadLeakControl.java:817)
   [junit4]   2> 	at com.carrotsearch.randomizedtesting.ThreadLeakControl$3.evaluate(ThreadLeakControl.java:468)
   [junit4]   2> 	at com.carrotsearch.randomizedtesting.RandomizedRunner.runSingleTest(RandomizedRunner.java:943)
   [junit4]   2> 	at com.carrotsearch.randomizedtesting.RandomizedRunner$5.evaluate(RandomizedRunner.java:829)
   [junit4]   2> 	at com.carrotsearch.randomizedtesting.RandomizedRunner$6.evaluate(RandomizedRunner.java:879)
   [junit4]   2> 	at com.carrotsearch.randomizedtesting.RandomizedRunner$7.evaluate(RandomizedRunner.java:890)
   [junit4]   2> 	at com.carrotsearch.randomizedtesting.rules.StatementAdapter.evaluate(StatementAdapter.java:36)
   [junit4]   2> 	at com.carrotsearch.randomizedtesting.rules.SystemPropertiesRestoreRule$1.evaluate(SystemPropertiesRestoreRule.java:57)
   [junit4]   2> 	at org.apache.lucene.util.AbstractBeforeAfterRule$1.evaluate(AbstractBeforeAfterRule.java:45)
   [junit4]   2> 	at com.carrotsearch.randomizedtesting.rules.StatementAdapter.evaluate(StatementAdapter.java:36)
   [junit4]   2> 	at org.apache.lucene.util.TestRuleStoreClassName$1.evaluate(TestRuleStoreClassName.java:41)
   [junit4]   2> 	at com.carrotsearch.randomizedtesting.rules.NoShadowingOrOverridesOnMethodsRule$1.evaluate(NoShadowingOrOverridesOnMethodsRule.java:40)
   [junit4]   2> 	at com.carrotsearch.randomizedtesting.rules.NoShadowingOrOverridesOnMethodsRule$1.evaluate(NoShadowingOrOverridesOnMethodsRule.java:40)
   [junit4]   2> 	at com.carrotsearch.randomizedtesting.rules.StatementAdapter.evaluate(StatementAdapter.java:36)
   [junit4]   2> 	at com.carrotsearch.randomizedtesting.rules.StatementAdapter.evaluate(StatementAdapter.java:36)
   [junit4]   2> 	at com.carrotsearch.randomizedtesting.rules.StatementAdapter.evaluate(StatementAdapter.java:36)
   [junit4]   2> 	at org.apache.lucene.util.TestRuleAssertionsRequired$1.evaluate(TestRuleAssertionsRequired.java:53)
   [junit4]   2> 	at org.apache.lucene.util.TestRuleMarkFailure$1.evaluate(TestRuleMarkFailure.java:47)
   [junit4]   2> 	at org.apache.lucene.util.TestRuleIgnoreAfterMaxFailures$1.evaluate(TestRuleIgnoreAfterMaxFailures.java:64)
   [junit4]   2> 	at org.apache.lucene.util.TestRuleIgnoreTestSuites$1.evaluate(TestRuleIgnoreTestSuites.java:54)
   [junit4]   2> 	at com.carrotsearch.randomizedtesting.rules.StatementAdapter.evaluate(StatementAdapter.java:36)
   [junit4]   2> 	at com.carrotsearch.randomizedtesting.ThreadLeakControl$StatementRunner.run(ThreadLeakControl.java:368)
   [junit4]   2> 	at java.lang.Thread.run(Thread.java:748)
   [junit4]   2> 
   [junit4]   2> "SUITE-SuggestComponentTest-seed#[F7A686C744D181DD]" ID=4135 RUNNABLE
   [junit4]   2> 	at sun.management.ThreadImpl.dumpThreads0(Native Method)
   [junit4]   2> 	at sun.management.ThreadImpl.dumpAllThreads(ThreadImpl.java:454)
   [junit4]   2> 	at com.carrotsearch.randomizedtesting.ThreadLeakControl.formatThreadStacksFull(ThreadLeakControl.java:681)
   [junit4]   2> 	at com.carrotsearch.randomizedtesting.ThreadLeakControl.access$1000(ThreadLeakControl.java:65)
   [junit4]   2> 	at com.carrotsearch.randomizedtesting.ThreadLeakControl$2.evaluate(ThreadLeakControl.java:415)
   [junit4]   2> 	- locked java.lang.Object@5fcf3ebc
   [junit4]   2> 	at com.carrotsearch.randomizedtesting.RandomizedRunner.runSuite(RandomizedRunner.java:705)
   [junit4]   2> 	at com.carrotsearch.randomizedtesting.RandomizedRunner.access$200(RandomizedRunner.java:139)
   [junit4]   2> 	at com.carrotsearch.randomizedtesting.RandomizedRunner$2.run(RandomizedRunner.java:626)
   [junit4]   2> 
   [junit4]   2> "Java2D Disposer" ID=2267 WAITING on java.lang.ref.ReferenceQueue$Lock@2765b0b7
   [junit4]   2> 	at java.lang.Object.wait(Native Method)
   [junit4]   2> 	- waiting on java.lang.ref.ReferenceQueue$Lock@2765b0b7
   [junit4]   2> 	at java.lang.ref.ReferenceQueue.remove(ReferenceQueue.java:144)
   [junit4]   2> 	at java.lang.ref.ReferenceQueue.remove(ReferenceQueue.java:165)
   [junit4]   2> 	at sun.java2d.Disposer.run(Disposer.java:148)
   [junit4]   2> 	at java.lang.Thread.run(Thread.java:748)
   [junit4]   2> 
   [junit4]   2> "JUnit4-serializer-daemon" ID=9 TIMED_WAITING
   [junit4]   2> 	at java.lang.Thread.sleep(Native Method)
   [junit4]   2> 	at com.carrotsearch.ant.tasks.junit4.events.Serializer$1.run(Serializer.java:50)
   [junit4]   2> 
   [junit4]   2> "Signal Dispatcher" ID=5 RUNNABLE
   [junit4]   2> 
   [junit4]   2> "Finalizer" ID=3 WAITING on java.lang.ref.ReferenceQueue$Lock@1dd6e5a4
   [junit4]   2> 	at java.lang.Object.wait(Native Method)
   [junit4]   2> 	- waiting on java.lang.ref.ReferenceQueue$Lock@1dd6e5a4
   [junit4]   2> 	at java.lang.ref.ReferenceQueue.remove(ReferenceQueue.java:144)
   [junit4]   2> 	at java.lang.ref.ReferenceQueue.remove(ReferenceQueue.java:165)
   [junit4]   2> 	at java.lang.ref.Finalizer$FinalizerThread.run(Finalizer.java:216)
   [junit4]   2> 
   [junit4]   2> "Reference Handler" ID=2 WAITING on java.lang.ref.Reference$Lock@108d11c6
   [junit4]   2> 	at java.lang.Object.wait(Native Method)
   [junit4]   2> 	- waiting on java.lang.ref.Reference$Lock@108d11c6
   [junit4]   2> 	at java.lang.Object.wait(Object.java:502)
   [junit4]   2> 	at java.lang.ref.Reference.tryHandlePending(Reference.java:191)
   [junit4]   2> 	at java.lang.ref.Reference$ReferenceHandler.run(Reference.java:153)
   [junit4]   2> 
   [junit4]   2> "main" ID=1 WAITING on com.carrotsearch.randomizedtesting.RandomizedRunner$2@2399a41
   [junit4]   2> 	at java.lang.Object.wait(Native Method)
   [junit4]   2> 	- waiting on com.carrotsearch.randomizedtesting.RandomizedRunner$2@2399a41
   [junit4]   2> 	at java.lang.Thread.join(Thread.java:1252)
   [junit4]   2> 	at java.lang.Thread.join(Thread.java:1326)
   [junit4]   2> 	at com.carrotsearch.randomizedtesting.RandomizedRunner.runSuite(RandomizedRunner.java:636)
   [junit4]   2> 	at com.carrotsearch.randomizedtesting.RandomizedRunner.run(RandomizedRunner.java:493)
   [junit4]   2> 	at com.carrotsearch.ant.tasks.junit4.slave.SlaveMain.execute(SlaveMain.java:251)
   [junit4]   2> 	at com.carrotsearch.ant.tasks.junit4.slave.SlaveMain.main(SlaveMain.java:368)
   [junit4]   2> 	at com.carrotsearch.ant.tasks.junit4.slave.SlaveMainSafe.main(SlaveMainSafe.java:13)
   [junit4]   2> 
   [junit4]   2> ^^==============================================
   [junit4]   2> 
   [junit4]   2> NOTE: reproduce with: ant test  -Dtestcase=SuggestComponentTest -Dtests.method=testBuildOnStartupWithCoreReload -Dtests.seed=F7A686C744D181DD -Dtests.slow=true -Dtests.locale=mt-MT -Dtests.timezone=Europe/Kiev -Dtests.asserts=true -Dtests.file.encoding=ISO-8859-1
   [junit4] ERROR   7199s J0 | SuggestComponentTest.testBuildOnStartupWithCoreReload <<<
   [junit4]    > Throwable #1: java.lang.Exception: Test abandoned because suite timeout was reached.
   [junit4]    > 	at __randomizedtesting.SeedInfo.seed([F7A686C744D181DD]:0)
   [junit4]   2> Lul 09, 2018 11:30:29 WN com.carrotsearch.randomizedtesting.ThreadLeakControl checkThreadLeaks
   [junit4]   2> WARNING: Will linger awaiting termination of 10 leaked thread(s).
   [junit4]   2> Lul 09, 2018 11:31:49 WN com.carrotsearch.randomizedtesting.ThreadLeakControl checkThreadLeaks
   [junit4]   2> SEVERE: 10 threads leaked from SUITE scope at org.apache.solr.handler.component.SuggestComponentTest: 
   [junit4]   2>    1) Thread[id=4137, name=Connection evictor, state=TIMED_WAITING, group=TGRP-SuggestComponentTest]
   [junit4]   2>         at java.lang.Thread.sleep(Native Method)
   [junit4]   2>         at org.apache.http.impl.client.IdleConnectionEvictor$1.run(IdleConnectionEvictor.java:66)
   [junit4]   2>         at java.lang.Thread.run(Thread.java:748)
   [junit4]   2>    2) Thread[id=4139, name=Connection evictor, state=TIMED_WAITING, group=TGRP-SuggestComponentTest]
   [junit4]   2>         at java.lang.Thread.sleep(Native Method)
   [junit4]   2>         at org.apache.http.impl.client.IdleConnectionEvictor$1.run(IdleConnectionEvictor.java:66)
   [junit4]   2>         at java.lang.Thread.run(Thread.java:748)
   [junit4]   2>    3) Thread[id=4141, name=MetricsHistoryHandler-1711-thread-1, state=TIMED_WAITING, group=TGRP-SuggestComponentTest]
   [junit4]   2>         at sun.misc.Unsafe.park(Native Method)
   [junit4]   2>         at java.util.concurrent.locks.LockSupport.parkNanos(LockSupport.java:215)
   [junit4]   2>         at java.util.concurrent.locks.AbstractQueuedSynchronizer$ConditionObject.awaitNanos(AbstractQueuedSynchronizer.java:2078)
   [junit4]   2>         at java.util.concurrent.ScheduledThreadPoolExecutor$DelayedWorkQueue.take(ScheduledThreadPoolExecutor.java:1093)
   [junit4]   2>         at java.util.concurrent.ScheduledThreadPoolExecutor$DelayedWorkQueue.take(ScheduledThreadPoolExecutor.java:809)
   [junit4]   2>         at java.util.concurrent.ThreadPoolExecutor.getTask(ThreadPoolExecutor.java:1074)
   [junit4]   2>         at java.util.concurrent.ThreadPoolExecutor.runWorker(ThreadPoolExecutor.java:1134)
   [junit4]   2>         at java.util.concurrent.ThreadPoolExecutor$Worker.run(ThreadPoolExecutor.java:624)
   [junit4]   2>         at java.lang.Thread.run(Thread.java:748)
   [junit4]   2>    4) Thread[id=4138, name=Connection evictor, state=TIMED_WAITING, group=TGRP-SuggestComponentTest]
   [junit4]   2>         at java.lang.Thread.sleep(Native Method)
   [junit4]   2>         at org.apache.http.impl.client.IdleConnectionEvictor$1.run(IdleConnectionEvictor.java:66)
   [junit4]   2>         at java.lang.Thread.run(Thread.java:748)
   [junit4]   2>    5) Thread[id=4140, name=SolrRrdBackendFactory-1710-thread-1, state=TIMED_WAITING, group=TGRP-SuggestComponentTest]
   [junit4]   2>         at sun.misc.Unsafe.park(Native Method)
   [junit4]   2>         at java.util.concurrent.locks.LockSupport.parkNanos(LockSupport.java:215)
   [junit4]   2>         at java.util.concurrent.locks.AbstractQueuedSynchronizer$ConditionObject.awaitNanos(AbstractQueuedSynchronizer.java:2078)
   [junit4]   2>         at java.util.concurrent.ScheduledThreadPoolExecutor$DelayedWorkQueue.take(ScheduledThreadPoolExecutor.java:1093)
   [junit4]   2>         at java.util.concurrent.ScheduledThreadPoolExecutor$DelayedWorkQueue.take(ScheduledThreadPoolExecutor.java:809)
   [junit4]   2>         at java.util.concurrent.ThreadPoolExecutor.getTask(ThreadPoolExecutor.java:1074)
   [junit4]   2>         at java.util.concurrent.ThreadPoolExecutor.runWorker(ThreadPoolExecutor.java:1134)
   [junit4]   2>         at java.util.concurrent.ThreadPoolExecutor$Worker.run(ThreadPoolExecutor.java:624)
   [junit4]   2>         at java.lang.Thread.run(Thread.java:748)
   [junit4]   2>    6) Thread[id=4136, name=TEST-SuggestComponentTest.testBuildOnStartupWithCoreReload-seed#[F7A686C744D181DD], state=TIMED_WAITING, group=TGRP-SuggestComponentTest]
   [junit4]   2>         at sun.misc.Unsafe.park(Native Method)
   [junit4]   2>         at java.util.concurrent.locks.LockSupport.parkNanos(LockSupport.java:215)
   [junit4]   2>         at java.util.concurrent.locks.AbstractQueuedSynchronizer.doAcquireNanos(AbstractQueuedSynchronizer.java:934)
   [junit4]   2>         at java.util.concurrent.locks.AbstractQueuedSynchronizer.tryAcquireNanos(AbstractQueuedSynchronizer.java:1247)
   [junit4]   2>         at java.util.concurrent.locks.ReentrantReadWriteLock$WriteLock.tryLock(ReentrantReadWriteLock.java:1115)
   [junit4]   2>         at org.apache.solr.update.DefaultSolrCoreState.lock(DefaultSolrCoreState.java:176)
   [junit4]   2>         at org.apache.solr.update.DefaultSolrCoreState.newIndexWriter(DefaultSolrCoreState.java:227)
   [junit4]   2>         at org.apache.solr.core.SolrCore.reload(SolrCore.java:669)
   [junit4]   2>         at org.apache.solr.core.CoreContainer.reload(CoreContainer.java:1395)
   [junit4]   2>         at org.apache.solr.util.TestHarness.reload(TestHarness.java:265)
   [junit4]   2>         at org.apache.solr.handler.component.SuggestComponentTest.reloadCore(SuggestComponentTest.java:514)
   [junit4]   2>         at org.apache.solr.handler.component.SuggestComponentTest.doTestBuildOnStartup(SuggestComponentTest.java:424)
   [junit4]   2>         at org.apache.solr.handler.component.SuggestComponentTest.testBuildOnStartupWithCoreReload(SuggestComponentTest.java:389)
   [junit4]   2>         at sun.reflect.NativeMethodAccessorImpl.invoke0(Native Method)
   [junit4]   2>         at sun.reflect.NativeMethodAccessorImpl.invoke(NativeMethodAccessorImpl.java:62)
   [junit4]   2>         at sun.reflect.DelegatingMethodAccessorImpl.invoke(DelegatingMethodAccessorImpl.java:43)
   [junit4]   2>         at java.lang.reflect.Method.invoke(Method.java:498)
   [junit4]   2>         at com.carrotsearch.randomizedtesting.RandomizedRunner.invoke(RandomizedRunner.java:1737)
   [junit4]   2>         at com.carrotsearch.randomizedtesting.RandomizedRunner$8.evaluate(RandomizedRunner.java:934)
   [junit4]   2>         at com.carrotsearch.randomizedtesting.RandomizedRunner$9.evaluate(RandomizedRunner.java:970)
   [junit4]   2>         at com.carrotsearch.randomizedtesting.RandomizedRunner$10.evaluate(RandomizedRunner.java:984)
   [junit4]   2>         at com.carrotsearch.randomizedtesting.rules.SystemPropertiesRestoreRule$1.evaluate(SystemPropertiesRestoreRule.java:57)
   [junit4]   2>         at org.apache.lucene.util.TestRuleSetupTeardownChained$1.evaluate(TestRuleSetupTeardownChained.java:49)
   [junit4]   2>         at org.apache.lucene.util.AbstractBeforeAfterRule$1.evaluate(AbstractBeforeAfterRule.java:45)
   [junit4]   2>         at org.apache.lucene.util.TestRuleThreadAndTestName$1.evaluate(TestRuleThreadAndTestName.java:48)
   [junit4]   2>         at org.apache.lucene.util.TestRuleIgnoreAfterMaxFailures$1.evaluate(TestRuleIgnoreAfterMaxFailures.java:64)
   [junit4]   2>         at org.apache.lucene.util.TestRuleMarkFailure$1.evaluate(TestRuleMarkFailure.java:47)
   [junit4]   2>         at com.carrotsearch.randomizedtesting.rules.StatementAdapter.evaluate(StatementAdapter.java:36)
   [junit4]   2>         at com.carrotsearch.randomizedtesting.ThreadLeakControl$StatementRunner.run(ThreadLeakControl.java:368)
   [junit4]   2>         at com.carrotsearch.randomizedtesting.ThreadLeakControl.forkTimeoutingTask(ThreadLeakControl.java:817)
   [junit4]   2>         at com.carrotsearch.randomizedtesting.ThreadLeakControl$3.evaluate(ThreadLeakControl.java:468)
   [junit4]   2>         at com.carrotsearch.randomizedtesting.RandomizedRunner.runSingleTest(RandomizedRunner.java:943)
   [junit4]   2>         at com.carrotsearch.randomizedtesting.RandomizedRunner$5.evaluate(RandomizedRunner.java:829)
   [junit4]   2>         at com.carrotsearch.randomizedtesting.RandomizedRunner$6.evaluate(RandomizedRunner.java:879)
   [junit4]   2>         at com.carrotsearch.randomizedtesting.RandomizedRunner$7.evaluate(RandomizedRunner.java:890)
   [junit4]   2>         at com.carrotsearch.randomizedtesting.rules.StatementAdapter.evaluate(StatementAdapter.java:36)
   [junit4]   2>         at com.carrotsearch.randomizedtesting.rules.SystemPropertiesRestoreRule$1.evaluate(SystemPropertiesRestoreRule.java:57)
   [junit4]   2>         at org.apache.lucene.util.AbstractBeforeAfterRule$1.evaluate(AbstractBeforeAfterRule.java:45)
   [junit4]   2>         at com.carrotsearch.randomizedtesting.rules.StatementAdapter.evaluate(StatementAdapter.java:36)
   [junit4]   2>         at org.apache.lucene.util.TestRuleStoreClassName$1.evaluate(TestRuleStoreClassName.java:41)
   [junit4]   2>         at com.carrotsearch.randomizedtesting.rules.NoShadowingOrOverridesOnMethodsRule$1.evaluate(NoShadowingOrOverridesOnMethodsRule.java:40)
   [junit4]   2>         at com.carrotsearch.randomizedtesting.rules.NoShadowingOrOverridesOnMethodsRule$1.evaluate(NoShadowingOrOverridesOnMethodsRule.

[...truncated too long message...]

lures.java:64)
   [junit4]   2>         at org.apache.lucene.util.TestRuleIgnoreTestSuites$1.evaluate(TestRuleIgnoreTestSuites.java:54)
   [junit4]   2>         at com.carrotsearch.randomizedtesting.rules.StatementAdapter.evaluate(StatementAdapter.java:36)
   [junit4]   2>         at com.carrotsearch.randomizedtesting.ThreadLeakControl$StatementRunner.run(ThreadLeakControl.java:368)
   [junit4]   2>         at java.lang.Thread.run(Thread.java:748)
   [junit4]   2>    2) Thread[id=17, name=MetricsHistoryHandler-8-thread-1, state=TIMED_WAITING, group=TGRP-SuggestComponentTest]
   [junit4]   2>         at sun.misc.Unsafe.park(Native Method)
   [junit4]   2>         at java.util.concurrent.locks.LockSupport.parkNanos(LockSupport.java:215)
   [junit4]   2>         at java.util.concurrent.locks.AbstractQueuedSynchronizer$ConditionObject.awaitNanos(AbstractQueuedSynchronizer.java:2078)
   [junit4]   2>         at java.util.concurrent.ScheduledThreadPoolExecutor$DelayedWorkQueue.take(ScheduledThreadPoolExecutor.java:1093)
   [junit4]   2>         at java.util.concurrent.ScheduledThreadPoolExecutor$DelayedWorkQueue.take(ScheduledThreadPoolExecutor.java:809)
   [junit4]   2>         at java.util.concurrent.ThreadPoolExecutor.getTask(ThreadPoolExecutor.java:1074)
   [junit4]   2>         at java.util.concurrent.ThreadPoolExecutor.runWorker(ThreadPoolExecutor.java:1134)
   [junit4]   2>         at java.util.concurrent.ThreadPoolExecutor$Worker.run(ThreadPoolExecutor.java:624)
   [junit4]   2>         at java.lang.Thread.run(Thread.java:748)
   [junit4]   2>    3) Thread[id=21, name=searcherExecutor-10-thread-1, state=WAITING, group=TGRP-SuggestComponentTest]
   [junit4]   2>         at sun.misc.Unsafe.park(Native Method)
   [junit4]   2>         at java.util.concurrent.locks.LockSupport.park(LockSupport.java:175)
   [junit4]   2>         at java.util.concurrent.locks.AbstractQueuedSynchronizer$ConditionObject.await(AbstractQueuedSynchronizer.java:2039)
   [junit4]   2>         at java.util.concurrent.LinkedBlockingQueue.take(LinkedBlockingQueue.java:442)
   [junit4]   2>         at java.util.concurrent.ThreadPoolExecutor.getTask(ThreadPoolExecutor.java:1074)
   [junit4]   2>         at java.util.concurrent.ThreadPoolExecutor.runWorker(ThreadPoolExecutor.java:1134)
   [junit4]   2>         at java.util.concurrent.ThreadPoolExecutor$Worker.run(ThreadPoolExecutor.java:624)
   [junit4]   2>         at java.lang.Thread.run(Thread.java:748)
   [junit4]   2>    4) Thread[id=24, name=SolrRrdBackendFactory-7-thread-2, state=WAITING, group=TGRP-SuggestComponentTest]
   [junit4]   2>         at sun.misc.Unsafe.park(Native Method)
   [junit4]   2>         at java.util.concurrent.locks.LockSupport.park(LockSupport.java:175)
   [junit4]   2>         at java.util.concurrent.locks.AbstractQueuedSynchronizer$ConditionObject.await(AbstractQueuedSynchronizer.java:2039)
   [junit4]   2>         at java.util.concurrent.ScheduledThreadPoolExecutor$DelayedWorkQueue.take(ScheduledThreadPoolExecutor.java:1088)
   [junit4]   2>         at java.util.concurrent.ScheduledThreadPoolExecutor$DelayedWorkQueue.take(ScheduledThreadPoolExecutor.java:809)
   [junit4]   2>         at java.util.concurrent.ThreadPoolExecutor.getTask(ThreadPoolExecutor.java:1074)
   [junit4]   2>         at java.util.concurrent.ThreadPoolExecutor.runWorker(ThreadPoolExecutor.java:1134)
   [junit4]   2>         at java.util.concurrent.ThreadPoolExecutor$Worker.run(ThreadPoolExecutor.java:624)
   [junit4]   2>         at java.lang.Thread.run(Thread.java:748)
   [junit4]   2>    5) Thread[id=19, name=Thread-1, state=WAITING, group=TGRP-SuggestComponentTest]
   [junit4]   2>         at java.lang.Object.wait(Native Method)
   [junit4]   2>         at java.lang.Object.wait(Object.java:502)
   [junit4]   2>         at org.apache.solr.core.CloserThread.run(CoreContainer.java:1848)
   [junit4]   2>    6) Thread[id=23, name=searcherExecutor-14-thread-1, state=WAITING, group=TGRP-SuggestComponentTest]
   [junit4]   2>         at sun.misc.Unsafe.park(Native Method)
   [junit4]   2>         at java.util.concurrent.locks.LockSupport.park(LockSupport.java:175)
   [junit4]   2>         at java.util.concurrent.locks.AbstractQueuedSynchronizer$ConditionObject.await(AbstractQueuedSynchronizer.java:2039)
   [junit4]   2>         at java.util.concurrent.LinkedBlockingQueue.take(LinkedBlockingQueue.java:442)
   [junit4]   2>         at java.util.concurrent.ThreadPoolExecutor.getTask(ThreadPoolExecutor.java:1074)
   [junit4]   2>         at java.util.concurrent.ThreadPoolExecutor.runWorker(ThreadPoolExecutor.java:1134)
   [junit4]   2>         at java.util.concurrent.ThreadPoolExecutor$Worker.run(ThreadPoolExecutor.java:624)
   [junit4]   2>         at java.lang.Thread.run(Thread.java:748)
   [junit4]   2>    7) Thread[id=16, name=SolrRrdBackendFactory-7-thread-1, state=TIMED_WAITING, group=TGRP-SuggestComponentTest]
   [junit4]   2>         at sun.misc.Unsafe.park(Native Method)
   [junit4]   2>         at java.util.concurrent.locks.LockSupport.parkNanos(LockSupport.java:215)
   [junit4]   2>         at java.util.concurrent.locks.AbstractQueuedSynchronizer$ConditionObject.awaitNanos(AbstractQueuedSynchronizer.java:2078)
   [junit4]   2>         at java.util.concurrent.ScheduledThreadPoolExecutor$DelayedWorkQueue.take(ScheduledThreadPoolExecutor.java:1093)
   [junit4]   2>         at java.util.concurrent.ScheduledThreadPoolExecutor$DelayedWorkQueue.take(ScheduledThreadPoolExecutor.java:809)
   [junit4]   2>         at java.util.concurrent.ThreadPoolExecutor.getTask(ThreadPoolExecutor.java:1074)
   [junit4]   2>         at java.util.concurrent.ThreadPoolExecutor.runWorker(ThreadPoolExecutor.java:1134)
   [junit4]   2>         at java.util.concurrent.ThreadPoolExecutor$Worker.run(ThreadPoolExecutor.java:624)
   [junit4]   2>         at java.lang.Thread.run(Thread.java:748)
   [junit4]   2> NOTE: test params are: codec=Lucene70, sim=Asserting(org.apache.lucene.search.similarities.AssertingSimilarity@3622490d), locale=mt-MT, timezone=Europe/Kiev
   [junit4]   2> NOTE: SunOS 5.11 amd64/Oracle Corporation 1.8.0_172 (64-bit)/cpus=3,threads=8,free=57306904,total=100663296
   [junit4]   2> NOTE: All tests run in this JVM: [SuggestComponentTest]
   [junit4]   2> NOTE: reproduce with: ant test  -Dtestcase=SuggestComponentTest -Dtests.seed=F7A686C744D181DD -Dtests.slow=true -Dtests.badapples=true -Dtests.locale=mt-MT -Dtests.timezone=Europe/Kiev -Dtests.asserts=true -Dtests.file.encoding=ISO-8859-1
   [junit4] ERROR   0.00s J1 | SuggestComponentTest (suite) <<<
   [junit4]    > Throwable #1: java.lang.Exception: Suite timeout exceeded (>= 7200000 msec).
   [junit4]    > 	at __randomizedtesting.SeedInfo.seed([F7A686C744D181DD]:0)
   [junit4] Completed [3/5 (2!)] on J1 in 7285.04s, 2 tests, 2 errors <<< FAILURES!
   [junit4] 
   [junit4] Suite: org.apache.solr.handler.component.SuggestComponentTest
   [junit4] Completed [4/5 (2!)] on J0 in 0.00s, 12 tests, 12 skipped
   [junit4] 
   [junit4] Suite: org.apache.solr.handler.component.SuggestComponentTest
   [junit4] Completed [5/5 (2!)] on J1 in 0.01s, 12 tests, 12 skipped
   [junit4] 
   [junit4] 
   [junit4] Tests with failures [seed: F7A686C744D181DD]:
   [junit4]   - org.apache.solr.handler.component.SuggestComponentTest.testBuildOnStartupWithCoreReload
   [junit4]   - org.apache.solr.handler.component.SuggestComponentTest.testBuildOnStartupWithCoreReload
   [junit4]   - org.apache.solr.handler.component.SuggestComponentTest (suite)
   [junit4]   - org.apache.solr.handler.component.SuggestComponentTest (suite)
   [junit4] 
   [junit4] 
   [junit4] JVM J0:     0.68 ..  7286.75 =  7286.07s
   [junit4] JVM J1:     0.68 ..  7286.86 =  7286.18s
   [junit4] Execution time total: 2 hours 1 minute 26 seconds
   [junit4] Tests summary: 5 suites, 40 tests, 2 suite-level errors, 2 errors, 36 ignored

BUILD FAILED
/export/home/jenkins/workspace/Lucene-Solr-master-Solaris/lucene/common-build.xml:1568: The following error occurred while executing this line:
/export/home/jenkins/workspace/Lucene-Solr-master-Solaris/lucene/common-build.xml:1092: There were test failures: 5 suites, 40 tests, 2 suite-level errors, 2 errors, 36 ignored [seed: F7A686C744D181DD]

Total time: 121 minutes 28 seconds

[repro] Setting last failure code to 256

[repro] Failures:
[repro]   2/5 failed: org.apache.solr.client.solrj.embedded.TestSolrProperties
[repro]   2/5 failed: org.apache.solr.handler.component.SuggestComponentTest
[repro] Exiting with code 256
+ mv lucene/build lucene/build.repro
+ mv solr/build solr/build.repro
+ mv lucene/build.orig lucene/build
+ mv solr/build.orig solr/build
Archiving artifacts
Setting ANT_1_8_2_HOME=/export/home/jenkins/tools/hudson.tasks.Ant_AntInstallation/ANT_1.8.2
[WARNINGS] Parsing warnings in console log with parser Java Compiler (javac)
Setting ANT_1_8_2_HOME=/export/home/jenkins/tools/hudson.tasks.Ant_AntInstallation/ANT_1.8.2
Setting ANT_1_8_2_HOME=/export/home/jenkins/tools/hudson.tasks.Ant_AntInstallation/ANT_1.8.2
<Git Blamer> Using GitBlamer to create author and commit information for all warnings.
<Git Blamer> GIT_COMMIT=ad01baedbfacc4d7ccb375c6af6f79ff2c478509, workspace=/export/home/jenkins/workspace/Lucene-Solr-master-Solaris
[WARNINGS] Computing warning deltas based on reference build #1959
Recording test results
Setting ANT_1_8_2_HOME=/export/home/jenkins/tools/hudson.tasks.Ant_AntInstallation/ANT_1.8.2
Build step 'Publish JUnit test result report' changed build result to UNSTABLE
Email was triggered for: Unstable (Test Failures)
Sending email for trigger: Unstable (Test Failures)
Setting ANT_1_8_2_HOME=/export/home/jenkins/tools/hudson.tasks.Ant_AntInstallation/ANT_1.8.2
Setting ANT_1_8_2_HOME=/export/home/jenkins/tools/hudson.tasks.Ant_AntInstallation/ANT_1.8.2
Setting ANT_1_8_2_HOME=/export/home/jenkins/tools/hudson.tasks.Ant_AntInstallation/ANT_1.8.2
Setting ANT_1_8_2_HOME=/export/home/jenkins/tools/hudson.tasks.Ant_AntInstallation/ANT_1.8.2

Mime
View raw message