lucene-dev mailing list archives

Site index · List index
Message view « Date » · « Thread »
Top « Date » · « Thread »
From Apache Jenkins Server <jenk...@builds.apache.org>
Subject [JENKINS] Lucene-Solr-BadApples-Tests-master - Build # 90 - Still Unstable
Date Wed, 04 Jul 2018 11:41:26 GMT
Build: https://builds.apache.org/job/Lucene-Solr-BadApples-Tests-master/90/

6 tests failed.
FAILED:  org.apache.solr.cloud.ForceLeaderTest.testReplicasInLowerTerms

Error Message:
Address already in use

Stack Trace:
java.net.BindException: Address already in use
	at __randomizedtesting.SeedInfo.seed([FE73765F74045A74:7047561CB4A3FA00]:0)
	at sun.nio.ch.Net.bind0(Native Method)
	at sun.nio.ch.Net.bind(Net.java:433)
	at sun.nio.ch.Net.bind(Net.java:425)
	at sun.nio.ch.ServerSocketChannelImpl.bind(ServerSocketChannelImpl.java:223)
	at sun.nio.ch.ServerSocketAdaptor.bind(ServerSocketAdaptor.java:74)
	at org.eclipse.jetty.server.ServerConnector.openAcceptChannel(ServerConnector.java:331)
	at org.eclipse.jetty.server.ServerConnector.open(ServerConnector.java:299)
	at org.eclipse.jetty.server.AbstractNetworkConnector.doStart(AbstractNetworkConnector.java:80)
	at org.eclipse.jetty.server.ServerConnector.doStart(ServerConnector.java:235)
	at org.eclipse.jetty.util.component.AbstractLifeCycle.start(AbstractLifeCycle.java:68)
	at org.eclipse.jetty.server.Server.doStart(Server.java:398)
	at org.eclipse.jetty.util.component.AbstractLifeCycle.start(AbstractLifeCycle.java:68)
	at org.apache.solr.client.solrj.embedded.JettySolrRunner.start(JettySolrRunner.java:396)
	at org.apache.solr.client.solrj.embedded.JettySolrRunner.start(JettySolrRunner.java:369)
	at org.apache.solr.cloud.ForceLeaderTest.bringBackOldLeaderAndSendDoc(ForceLeaderTest.java:396)
	at org.apache.solr.cloud.ForceLeaderTest.testReplicasInLowerTerms(ForceLeaderTest.java:144)
	at sun.reflect.NativeMethodAccessorImpl.invoke0(Native Method)
	at sun.reflect.NativeMethodAccessorImpl.invoke(NativeMethodAccessorImpl.java:62)
	at sun.reflect.DelegatingMethodAccessorImpl.invoke(DelegatingMethodAccessorImpl.java:43)
	at java.lang.reflect.Method.invoke(Method.java:498)
	at com.carrotsearch.randomizedtesting.RandomizedRunner.invoke(RandomizedRunner.java:1737)
	at com.carrotsearch.randomizedtesting.RandomizedRunner$8.evaluate(RandomizedRunner.java:934)
	at com.carrotsearch.randomizedtesting.RandomizedRunner$9.evaluate(RandomizedRunner.java:970)
	at com.carrotsearch.randomizedtesting.RandomizedRunner$10.evaluate(RandomizedRunner.java:984)
	at org.apache.solr.BaseDistributedSearchTestCase$ShardsRepeatRule$ShardsFixedStatement.callStatement(BaseDistributedSearchTestCase.java:1008)
	at org.apache.solr.BaseDistributedSearchTestCase$ShardsRepeatRule$ShardsStatement.evaluate(BaseDistributedSearchTestCase.java:983)
	at com.carrotsearch.randomizedtesting.rules.SystemPropertiesRestoreRule$1.evaluate(SystemPropertiesRestoreRule.java:57)
	at org.apache.lucene.util.TestRuleSetupTeardownChained$1.evaluate(TestRuleSetupTeardownChained.java:49)
	at org.apache.lucene.util.AbstractBeforeAfterRule$1.evaluate(AbstractBeforeAfterRule.java:45)
	at org.apache.lucene.util.TestRuleThreadAndTestName$1.evaluate(TestRuleThreadAndTestName.java:48)
	at org.apache.lucene.util.TestRuleIgnoreAfterMaxFailures$1.evaluate(TestRuleIgnoreAfterMaxFailures.java:64)
	at org.apache.lucene.util.TestRuleMarkFailure$1.evaluate(TestRuleMarkFailure.java:47)
	at com.carrotsearch.randomizedtesting.rules.StatementAdapter.evaluate(StatementAdapter.java:36)
	at com.carrotsearch.randomizedtesting.ThreadLeakControl$StatementRunner.run(ThreadLeakControl.java:368)
	at com.carrotsearch.randomizedtesting.ThreadLeakControl.forkTimeoutingTask(ThreadLeakControl.java:817)
	at com.carrotsearch.randomizedtesting.ThreadLeakControl$3.evaluate(ThreadLeakControl.java:468)
	at com.carrotsearch.randomizedtesting.RandomizedRunner.runSingleTest(RandomizedRunner.java:943)
	at com.carrotsearch.randomizedtesting.RandomizedRunner$5.evaluate(RandomizedRunner.java:829)
	at com.carrotsearch.randomizedtesting.RandomizedRunner$6.evaluate(RandomizedRunner.java:879)
	at com.carrotsearch.randomizedtesting.RandomizedRunner$7.evaluate(RandomizedRunner.java:890)
	at com.carrotsearch.randomizedtesting.rules.StatementAdapter.evaluate(StatementAdapter.java:36)
	at com.carrotsearch.randomizedtesting.rules.SystemPropertiesRestoreRule$1.evaluate(SystemPropertiesRestoreRule.java:57)
	at org.apache.lucene.util.AbstractBeforeAfterRule$1.evaluate(AbstractBeforeAfterRule.java:45)
	at com.carrotsearch.randomizedtesting.rules.StatementAdapter.evaluate(StatementAdapter.java:36)
	at org.apache.lucene.util.TestRuleStoreClassName$1.evaluate(TestRuleStoreClassName.java:41)
	at com.carrotsearch.randomizedtesting.rules.NoShadowingOrOverridesOnMethodsRule$1.evaluate(NoShadowingOrOverridesOnMethodsRule.java:40)
	at com.carrotsearch.randomizedtesting.rules.NoShadowingOrOverridesOnMethodsRule$1.evaluate(NoShadowingOrOverridesOnMethodsRule.java:40)
	at com.carrotsearch.randomizedtesting.rules.StatementAdapter.evaluate(StatementAdapter.java:36)
	at com.carrotsearch.randomizedtesting.rules.StatementAdapter.evaluate(StatementAdapter.java:36)
	at com.carrotsearch.randomizedtesting.rules.StatementAdapter.evaluate(StatementAdapter.java:36)
	at org.apache.lucene.util.TestRuleAssertionsRequired$1.evaluate(TestRuleAssertionsRequired.java:53)
	at org.apache.lucene.util.TestRuleMarkFailure$1.evaluate(TestRuleMarkFailure.java:47)
	at org.apache.lucene.util.TestRuleIgnoreAfterMaxFailures$1.evaluate(TestRuleIgnoreAfterMaxFailures.java:64)
	at org.apache.lucene.util.TestRuleIgnoreTestSuites$1.evaluate(TestRuleIgnoreTestSuites.java:54)
	at com.carrotsearch.randomizedtesting.rules.StatementAdapter.evaluate(StatementAdapter.java:36)
	at com.carrotsearch.randomizedtesting.ThreadLeakControl$StatementRunner.run(ThreadLeakControl.java:368)
	at java.lang.Thread.run(Thread.java:748)


FAILED:  org.apache.solr.cloud.api.collections.TestCollectionsAPIViaSolrCloudCluster.testCollectionCreateSearchDelete

Error Message:
Error from server at http://127.0.0.1:39833/solr/testcollection_shard1_replica_n2: Expected mime type application/octet-stream but got text/html. <html> <head> <meta http-equiv="Content-Type" content="text/html;charset=utf-8"/> <title>Error 404 Can not find: /solr/testcollection_shard1_replica_n2/update</title> </head> <body><h2>HTTP ERROR 404</h2> <p>Problem accessing /solr/testcollection_shard1_replica_n2/update. Reason: <pre>    Can not find: /solr/testcollection_shard1_replica_n2/update</pre></p><hr><a href="http://eclipse.org/jetty">Powered by Jetty:// 9.4.11.v20180605</a><hr/>  </body> </html> 

Stack Trace:
org.apache.solr.client.solrj.impl.CloudSolrClient$RouteException: Error from server at http://127.0.0.1:39833/solr/testcollection_shard1_replica_n2: Expected mime type application/octet-stream but got text/html. <html>
<head>
<meta http-equiv="Content-Type" content="text/html;charset=utf-8"/>
<title>Error 404 Can not find: /solr/testcollection_shard1_replica_n2/update</title>
</head>
<body><h2>HTTP ERROR 404</h2>
<p>Problem accessing /solr/testcollection_shard1_replica_n2/update. Reason:
<pre>    Can not find: /solr/testcollection_shard1_replica_n2/update</pre></p><hr><a href="http://eclipse.org/jetty">Powered by Jetty:// 9.4.11.v20180605</a><hr/>

</body>
</html>

	at __randomizedtesting.SeedInfo.seed([FE73765F74045A74:5D89D8FAF3ECB0D1]:0)
	at org.apache.solr.client.solrj.impl.CloudSolrClient.directUpdate(CloudSolrClient.java:551)
	at org.apache.solr.client.solrj.impl.CloudSolrClient.sendRequest(CloudSolrClient.java:1015)
	at org.apache.solr.client.solrj.impl.CloudSolrClient.requestWithRetryOnStaleState(CloudSolrClient.java:886)
	at org.apache.solr.client.solrj.impl.CloudSolrClient.requestWithRetryOnStaleState(CloudSolrClient.java:948)
	at org.apache.solr.client.solrj.impl.CloudSolrClient.requestWithRetryOnStaleState(CloudSolrClient.java:948)
	at org.apache.solr.client.solrj.impl.CloudSolrClient.requestWithRetryOnStaleState(CloudSolrClient.java:948)
	at org.apache.solr.client.solrj.impl.CloudSolrClient.requestWithRetryOnStaleState(CloudSolrClient.java:948)
	at org.apache.solr.client.solrj.impl.CloudSolrClient.requestWithRetryOnStaleState(CloudSolrClient.java:948)
	at org.apache.solr.client.solrj.impl.CloudSolrClient.request(CloudSolrClient.java:819)
	at org.apache.solr.client.solrj.SolrRequest.process(SolrRequest.java:194)
	at org.apache.solr.client.solrj.request.UpdateRequest.commit(UpdateRequest.java:233)
	at org.apache.solr.cloud.api.collections.TestCollectionsAPIViaSolrCloudCluster.testCollectionCreateSearchDelete(TestCollectionsAPIViaSolrCloudCluster.java:170)
	at sun.reflect.NativeMethodAccessorImpl.invoke0(Native Method)
	at sun.reflect.NativeMethodAccessorImpl.invoke(NativeMethodAccessorImpl.java:62)
	at sun.reflect.DelegatingMethodAccessorImpl.invoke(DelegatingMethodAccessorImpl.java:43)
	at java.lang.reflect.Method.invoke(Method.java:498)
	at com.carrotsearch.randomizedtesting.RandomizedRunner.invoke(RandomizedRunner.java:1737)
	at com.carrotsearch.randomizedtesting.RandomizedRunner$8.evaluate(RandomizedRunner.java:934)
	at com.carrotsearch.randomizedtesting.RandomizedRunner$9.evaluate(RandomizedRunner.java:970)
	at com.carrotsearch.randomizedtesting.RandomizedRunner$10.evaluate(RandomizedRunner.java:984)
	at com.carrotsearch.randomizedtesting.rules.SystemPropertiesRestoreRule$1.evaluate(SystemPropertiesRestoreRule.java:57)
	at org.apache.lucene.util.TestRuleSetupTeardownChained$1.evaluate(TestRuleSetupTeardownChained.java:49)
	at org.apache.lucene.util.AbstractBeforeAfterRule$1.evaluate(AbstractBeforeAfterRule.java:45)
	at org.apache.lucene.util.TestRuleThreadAndTestName$1.evaluate(TestRuleThreadAndTestName.java:48)
	at org.apache.lucene.util.TestRuleIgnoreAfterMaxFailures$1.evaluate(TestRuleIgnoreAfterMaxFailures.java:64)
	at org.apache.lucene.util.TestRuleMarkFailure$1.evaluate(TestRuleMarkFailure.java:47)
	at com.carrotsearch.randomizedtesting.rules.StatementAdapter.evaluate(StatementAdapter.java:36)
	at com.carrotsearch.randomizedtesting.ThreadLeakControl$StatementRunner.run(ThreadLeakControl.java:368)
	at com.carrotsearch.randomizedtesting.ThreadLeakControl.forkTimeoutingTask(ThreadLeakControl.java:817)
	at com.carrotsearch.randomizedtesting.ThreadLeakControl$3.evaluate(ThreadLeakControl.java:468)
	at com.carrotsearch.randomizedtesting.RandomizedRunner.runSingleTest(RandomizedRunner.java:943)
	at com.carrotsearch.randomizedtesting.RandomizedRunner$5.evaluate(RandomizedRunner.java:829)
	at com.carrotsearch.randomizedtesting.RandomizedRunner$6.evaluate(RandomizedRunner.java:879)
	at com.carrotsearch.randomizedtesting.RandomizedRunner$7.evaluate(RandomizedRunner.java:890)
	at com.carrotsearch.randomizedtesting.rules.StatementAdapter.evaluate(StatementAdapter.java:36)
	at com.carrotsearch.randomizedtesting.rules.SystemPropertiesRestoreRule$1.evaluate(SystemPropertiesRestoreRule.java:57)
	at org.apache.lucene.util.AbstractBeforeAfterRule$1.evaluate(AbstractBeforeAfterRule.java:45)
	at com.carrotsearch.randomizedtesting.rules.StatementAdapter.evaluate(StatementAdapter.java:36)
	at org.apache.lucene.util.TestRuleStoreClassName$1.evaluate(TestRuleStoreClassName.java:41)
	at com.carrotsearch.randomizedtesting.rules.NoShadowingOrOverridesOnMethodsRule$1.evaluate(NoShadowingOrOverridesOnMethodsRule.java:40)
	at com.carrotsearch.randomizedtesting.rules.NoShadowingOrOverridesOnMethodsRule$1.evaluate(NoShadowingOrOverridesOnMethodsRule.java:40)
	at com.carrotsearch.randomizedtesting.rules.StatementAdapter.evaluate(StatementAdapter.java:36)
	at com.carrotsearch.randomizedtesting.rules.StatementAdapter.evaluate(StatementAdapter.java:36)
	at com.carrotsearch.randomizedtesting.rules.StatementAdapter.evaluate(StatementAdapter.java:36)
	at org.apache.lucene.util.TestRuleAssertionsRequired$1.evaluate(TestRuleAssertionsRequired.java:53)
	at org.apache.lucene.util.TestRuleMarkFailure$1.evaluate(TestRuleMarkFailure.java:47)
	at org.apache.lucene.util.TestRuleIgnoreAfterMaxFailures$1.evaluate(TestRuleIgnoreAfterMaxFailures.java:64)
	at org.apache.lucene.util.TestRuleIgnoreTestSuites$1.evaluate(TestRuleIgnoreTestSuites.java:54)
	at com.carrotsearch.randomizedtesting.rules.StatementAdapter.evaluate(StatementAdapter.java:36)
	at com.carrotsearch.randomizedtesting.ThreadLeakControl$StatementRunner.run(ThreadLeakControl.java:368)
	at java.lang.Thread.run(Thread.java:748)
Caused by: org.apache.solr.client.solrj.impl.HttpSolrClient$RemoteSolrException: Error from server at http://127.0.0.1:39833/solr/testcollection_shard1_replica_n2: Expected mime type application/octet-stream but got text/html. <html>
<head>
<meta http-equiv="Content-Type" content="text/html;charset=utf-8"/>
<title>Error 404 Can not find: /solr/testcollection_shard1_replica_n2/update</title>
</head>
<body><h2>HTTP ERROR 404</h2>
<p>Problem accessing /solr/testcollection_shard1_replica_n2/update. Reason:
<pre>    Can not find: /solr/testcollection_shard1_replica_n2/update</pre></p><hr><a href="http://eclipse.org/jetty">Powered by Jetty:// 9.4.11.v20180605</a><hr/>

</body>
</html>

	at org.apache.solr.client.solrj.impl.HttpSolrClient.executeMethod(HttpSolrClient.java:607)
	at org.apache.solr.client.solrj.impl.HttpSolrClient.request(HttpSolrClient.java:255)
	at org.apache.solr.client.solrj.impl.HttpSolrClient.request(HttpSolrClient.java:244)
	at org.apache.solr.client.solrj.impl.LBHttpSolrClient.doRequest(LBHttpSolrClient.java:483)
	at org.apache.solr.client.solrj.impl.LBHttpSolrClient.request(LBHttpSolrClient.java:413)
	at org.apache.solr.client.solrj.impl.CloudSolrClient.lambda$directUpdate$0(CloudSolrClient.java:528)
	at java.util.concurrent.FutureTask.run(FutureTask.java:266)
	at org.apache.solr.common.util.ExecutorUtil$MDCAwareThreadPoolExecutor.lambda$execute$0(ExecutorUtil.java:209)
	at java.util.concurrent.ThreadPoolExecutor.runWorker(ThreadPoolExecutor.java:1149)
	at java.util.concurrent.ThreadPoolExecutor$Worker.run(ThreadPoolExecutor.java:624)
	... 1 more


FAILED:  org.apache.solr.cloud.autoscaling.SearchRateTriggerIntegrationTest.testDeleteNode

Error Message:
unexpected DELETENODE status: {responseHeader={status=0,QTime=5},status={state=notfound,msg=Did not find [search_rate_trigger3/6df7c66b973658T1f7726pjk2wwhro1lfpym82s1/0] in any tasks queue}}

Stack Trace:
java.lang.AssertionError: unexpected DELETENODE status: {responseHeader={status=0,QTime=5},status={state=notfound,msg=Did not find [search_rate_trigger3/6df7c66b973658T1f7726pjk2wwhro1lfpym82s1/0] in any tasks queue}}
	at __randomizedtesting.SeedInfo.seed([FE73765F74045A74:DCE1B8DD43CED509]:0)
	at org.junit.Assert.fail(Assert.java:93)
	at org.apache.solr.cloud.autoscaling.SearchRateTriggerIntegrationTest.lambda$testDeleteNode$6(SearchRateTriggerIntegrationTest.java:670)
	at java.util.ArrayList.forEach(ArrayList.java:1257)
	at org.apache.solr.cloud.autoscaling.SearchRateTriggerIntegrationTest.testDeleteNode(SearchRateTriggerIntegrationTest.java:662)
	at sun.reflect.NativeMethodAccessorImpl.invoke0(Native Method)
	at sun.reflect.NativeMethodAccessorImpl.invoke(NativeMethodAccessorImpl.java:62)
	at sun.reflect.DelegatingMethodAccessorImpl.invoke(DelegatingMethodAccessorImpl.java:43)
	at java.lang.reflect.Method.invoke(Method.java:498)
	at com.carrotsearch.randomizedtesting.RandomizedRunner.invoke(RandomizedRunner.java:1737)
	at com.carrotsearch.randomizedtesting.RandomizedRunner$8.evaluate(RandomizedRunner.java:934)
	at com.carrotsearch.randomizedtesting.RandomizedRunner$9.evaluate(RandomizedRunner.java:970)
	at com.carrotsearch.randomizedtesting.RandomizedRunner$10.evaluate(RandomizedRunner.java:984)
	at com.carrotsearch.randomizedtesting.rules.SystemPropertiesRestoreRule$1.evaluate(SystemPropertiesRestoreRule.java:57)
	at org.apache.lucene.util.TestRuleSetupTeardownChained$1.evaluate(TestRuleSetupTeardownChained.java:49)
	at org.apache.lucene.util.AbstractBeforeAfterRule$1.evaluate(AbstractBeforeAfterRule.java:45)
	at org.apache.lucene.util.TestRuleThreadAndTestName$1.evaluate(TestRuleThreadAndTestName.java:48)
	at org.apache.lucene.util.TestRuleIgnoreAfterMaxFailures$1.evaluate(TestRuleIgnoreAfterMaxFailures.java:64)
	at org.apache.lucene.util.TestRuleMarkFailure$1.evaluate(TestRuleMarkFailure.java:47)
	at com.carrotsearch.randomizedtesting.rules.StatementAdapter.evaluate(StatementAdapter.java:36)
	at com.carrotsearch.randomizedtesting.ThreadLeakControl$StatementRunner.run(ThreadLeakControl.java:368)
	at com.carrotsearch.randomizedtesting.ThreadLeakControl.forkTimeoutingTask(ThreadLeakControl.java:817)
	at com.carrotsearch.randomizedtesting.ThreadLeakControl$3.evaluate(ThreadLeakControl.java:468)
	at com.carrotsearch.randomizedtesting.RandomizedRunner.runSingleTest(RandomizedRunner.java:943)
	at com.carrotsearch.randomizedtesting.RandomizedRunner$5.evaluate(RandomizedRunner.java:829)
	at com.carrotsearch.randomizedtesting.RandomizedRunner$6.evaluate(RandomizedRunner.java:879)
	at com.carrotsearch.randomizedtesting.RandomizedRunner$7.evaluate(RandomizedRunner.java:890)
	at com.carrotsearch.randomizedtesting.rules.StatementAdapter.evaluate(StatementAdapter.java:36)
	at com.carrotsearch.randomizedtesting.rules.SystemPropertiesRestoreRule$1.evaluate(SystemPropertiesRestoreRule.java:57)
	at org.apache.lucene.util.AbstractBeforeAfterRule$1.evaluate(AbstractBeforeAfterRule.java:45)
	at com.carrotsearch.randomizedtesting.rules.StatementAdapter.evaluate(StatementAdapter.java:36)
	at org.apache.lucene.util.TestRuleStoreClassName$1.evaluate(TestRuleStoreClassName.java:41)
	at com.carrotsearch.randomizedtesting.rules.NoShadowingOrOverridesOnMethodsRule$1.evaluate(NoShadowingOrOverridesOnMethodsRule.java:40)
	at com.carrotsearch.randomizedtesting.rules.NoShadowingOrOverridesOnMethodsRule$1.evaluate(NoShadowingOrOverridesOnMethodsRule.java:40)
	at com.carrotsearch.randomizedtesting.rules.StatementAdapter.evaluate(StatementAdapter.java:36)
	at com.carrotsearch.randomizedtesting.rules.StatementAdapter.evaluate(StatementAdapter.java:36)
	at com.carrotsearch.randomizedtesting.rules.StatementAdapter.evaluate(StatementAdapter.java:36)
	at org.apache.lucene.util.TestRuleAssertionsRequired$1.evaluate(TestRuleAssertionsRequired.java:53)
	at org.apache.lucene.util.TestRuleMarkFailure$1.evaluate(TestRuleMarkFailure.java:47)
	at org.apache.lucene.util.TestRuleIgnoreAfterMaxFailures$1.evaluate(TestRuleIgnoreAfterMaxFailures.java:64)
	at org.apache.lucene.util.TestRuleIgnoreTestSuites$1.evaluate(TestRuleIgnoreTestSuites.java:54)
	at com.carrotsearch.randomizedtesting.rules.StatementAdapter.evaluate(StatementAdapter.java:36)
	at com.carrotsearch.randomizedtesting.ThreadLeakControl$StatementRunner.run(ThreadLeakControl.java:368)
	at java.lang.Thread.run(Thread.java:748)


FAILED:  org.apache.solr.cloud.autoscaling.sim.TestLargeCluster.testNodeLost

Error Message:
did not finish processing all events in time: started=5, finished=4

Stack Trace:
java.lang.AssertionError: did not finish processing all events in time: started=5, finished=4
	at __randomizedtesting.SeedInfo.seed([FE73765F74045A74:4166B8A1F7EE3FF2]:0)
	at org.junit.Assert.fail(Assert.java:93)
	at org.apache.solr.cloud.autoscaling.sim.TestLargeCluster.doTestNodeLost(TestLargeCluster.java:525)
	at org.apache.solr.cloud.autoscaling.sim.TestLargeCluster.testNodeLost(TestLargeCluster.java:378)
	at sun.reflect.NativeMethodAccessorImpl.invoke0(Native Method)
	at sun.reflect.NativeMethodAccessorImpl.invoke(NativeMethodAccessorImpl.java:62)
	at sun.reflect.DelegatingMethodAccessorImpl.invoke(DelegatingMethodAccessorImpl.java:43)
	at java.lang.reflect.Method.invoke(Method.java:498)
	at com.carrotsearch.randomizedtesting.RandomizedRunner.invoke(RandomizedRunner.java:1737)
	at com.carrotsearch.randomizedtesting.RandomizedRunner$8.evaluate(RandomizedRunner.java:934)
	at com.carrotsearch.randomizedtesting.RandomizedRunner$9.evaluate(RandomizedRunner.java:970)
	at com.carrotsearch.randomizedtesting.RandomizedRunner$10.evaluate(RandomizedRunner.java:984)
	at com.carrotsearch.randomizedtesting.rules.SystemPropertiesRestoreRule$1.evaluate(SystemPropertiesRestoreRule.java:57)
	at org.apache.lucene.util.TestRuleSetupTeardownChained$1.evaluate(TestRuleSetupTeardownChained.java:49)
	at org.apache.lucene.util.AbstractBeforeAfterRule$1.evaluate(AbstractBeforeAfterRule.java:45)
	at org.apache.lucene.util.TestRuleThreadAndTestName$1.evaluate(TestRuleThreadAndTestName.java:48)
	at org.apache.lucene.util.TestRuleIgnoreAfterMaxFailures$1.evaluate(TestRuleIgnoreAfterMaxFailures.java:64)
	at org.apache.lucene.util.TestRuleMarkFailure$1.evaluate(TestRuleMarkFailure.java:47)
	at com.carrotsearch.randomizedtesting.rules.StatementAdapter.evaluate(StatementAdapter.java:36)
	at com.carrotsearch.randomizedtesting.ThreadLeakControl$StatementRunner.run(ThreadLeakControl.java:368)
	at com.carrotsearch.randomizedtesting.ThreadLeakControl.forkTimeoutingTask(ThreadLeakControl.java:817)
	at com.carrotsearch.randomizedtesting.ThreadLeakControl$3.evaluate(ThreadLeakControl.java:468)
	at com.carrotsearch.randomizedtesting.RandomizedRunner.runSingleTest(RandomizedRunner.java:943)
	at com.carrotsearch.randomizedtesting.RandomizedRunner$5.evaluate(RandomizedRunner.java:829)
	at com.carrotsearch.randomizedtesting.RandomizedRunner$6.evaluate(RandomizedRunner.java:879)
	at com.carrotsearch.randomizedtesting.RandomizedRunner$7.evaluate(RandomizedRunner.java:890)
	at com.carrotsearch.randomizedtesting.rules.StatementAdapter.evaluate(StatementAdapter.java:36)
	at com.carrotsearch.randomizedtesting.rules.SystemPropertiesRestoreRule$1.evaluate(SystemPropertiesRestoreRule.java:57)
	at org.apache.lucene.util.AbstractBeforeAfterRule$1.evaluate(AbstractBeforeAfterRule.java:45)
	at com.carrotsearch.randomizedtesting.rules.StatementAdapter.evaluate(StatementAdapter.java:36)
	at org.apache.lucene.util.TestRuleStoreClassName$1.evaluate(TestRuleStoreClassName.java:41)
	at com.carrotsearch.randomizedtesting.rules.NoShadowingOrOverridesOnMethodsRule$1.evaluate(NoShadowingOrOverridesOnMethodsRule.java:40)
	at com.carrotsearch.randomizedtesting.rules.NoShadowingOrOverridesOnMethodsRule$1.evaluate(NoShadowingOrOverridesOnMethodsRule.java:40)
	at com.carrotsearch.randomizedtesting.rules.StatementAdapter.evaluate(StatementAdapter.java:36)
	at com.carrotsearch.randomizedtesting.rules.StatementAdapter.evaluate(StatementAdapter.java:36)
	at com.carrotsearch.randomizedtesting.rules.StatementAdapter.evaluate(StatementAdapter.java:36)
	at org.apache.lucene.util.TestRuleAssertionsRequired$1.evaluate(TestRuleAssertionsRequired.java:53)
	at org.apache.lucene.util.TestRuleMarkFailure$1.evaluate(TestRuleMarkFailure.java:47)
	at org.apache.lucene.util.TestRuleIgnoreAfterMaxFailures$1.evaluate(TestRuleIgnoreAfterMaxFailures.java:64)
	at org.apache.lucene.util.TestRuleIgnoreTestSuites$1.evaluate(TestRuleIgnoreTestSuites.java:54)
	at com.carrotsearch.randomizedtesting.rules.StatementAdapter.evaluate(StatementAdapter.java:36)
	at com.carrotsearch.randomizedtesting.ThreadLeakControl$StatementRunner.run(ThreadLeakControl.java:368)
	at java.lang.Thread.run(Thread.java:748)


FAILED:  org.apache.solr.cloud.autoscaling.sim.TestLargeCluster.testAddNode

Error Message:
trigger did not fire

Stack Trace:
java.lang.AssertionError: trigger did not fire
	at __randomizedtesting.SeedInfo.seed([FE73765F74045A74:599C6BFCBB49D56C]:0)
	at org.junit.Assert.fail(Assert.java:93)
	at org.junit.Assert.assertTrue(Assert.java:43)
	at org.apache.solr.cloud.autoscaling.sim.TestLargeCluster.testAddNode(TestLargeCluster.java:309)
	at sun.reflect.NativeMethodAccessorImpl.invoke0(Native Method)
	at sun.reflect.NativeMethodAccessorImpl.invoke(NativeMethodAccessorImpl.java:62)
	at sun.reflect.DelegatingMethodAccessorImpl.invoke(DelegatingMethodAccessorImpl.java:43)
	at java.lang.reflect.Method.invoke(Method.java:498)
	at com.carrotsearch.randomizedtesting.RandomizedRunner.invoke(RandomizedRunner.java:1737)
	at com.carrotsearch.randomizedtesting.RandomizedRunner$8.evaluate(RandomizedRunner.java:934)
	at com.carrotsearch.randomizedtesting.RandomizedRunner$9.evaluate(RandomizedRunner.java:970)
	at com.carrotsearch.randomizedtesting.RandomizedRunner$10.evaluate(RandomizedRunner.java:984)
	at com.carrotsearch.randomizedtesting.rules.SystemPropertiesRestoreRule$1.evaluate(SystemPropertiesRestoreRule.java:57)
	at org.apache.lucene.util.TestRuleSetupTeardownChained$1.evaluate(TestRuleSetupTeardownChained.java:49)
	at org.apache.lucene.util.AbstractBeforeAfterRule$1.evaluate(AbstractBeforeAfterRule.java:45)
	at org.apache.lucene.util.TestRuleThreadAndTestName$1.evaluate(TestRuleThreadAndTestName.java:48)
	at org.apache.lucene.util.TestRuleIgnoreAfterMaxFailures$1.evaluate(TestRuleIgnoreAfterMaxFailures.java:64)
	at org.apache.lucene.util.TestRuleMarkFailure$1.evaluate(TestRuleMarkFailure.java:47)
	at com.carrotsearch.randomizedtesting.rules.StatementAdapter.evaluate(StatementAdapter.java:36)
	at com.carrotsearch.randomizedtesting.ThreadLeakControl$StatementRunner.run(ThreadLeakControl.java:368)
	at com.carrotsearch.randomizedtesting.ThreadLeakControl.forkTimeoutingTask(ThreadLeakControl.java:817)
	at com.carrotsearch.randomizedtesting.ThreadLeakControl$3.evaluate(ThreadLeakControl.java:468)
	at com.carrotsearch.randomizedtesting.RandomizedRunner.runSingleTest(RandomizedRunner.java:943)
	at com.carrotsearch.randomizedtesting.RandomizedRunner$5.evaluate(RandomizedRunner.java:829)
	at com.carrotsearch.randomizedtesting.RandomizedRunner$6.evaluate(RandomizedRunner.java:879)
	at com.carrotsearch.randomizedtesting.RandomizedRunner$7.evaluate(RandomizedRunner.java:890)
	at com.carrotsearch.randomizedtesting.rules.StatementAdapter.evaluate(StatementAdapter.java:36)
	at com.carrotsearch.randomizedtesting.rules.SystemPropertiesRestoreRule$1.evaluate(SystemPropertiesRestoreRule.java:57)
	at org.apache.lucene.util.AbstractBeforeAfterRule$1.evaluate(AbstractBeforeAfterRule.java:45)
	at com.carrotsearch.randomizedtesting.rules.StatementAdapter.evaluate(StatementAdapter.java:36)
	at org.apache.lucene.util.TestRuleStoreClassName$1.evaluate(TestRuleStoreClassName.java:41)
	at com.carrotsearch.randomizedtesting.rules.NoShadowingOrOverridesOnMethodsRule$1.evaluate(NoShadowingOrOverridesOnMethodsRule.java:40)
	at com.carrotsearch.randomizedtesting.rules.NoShadowingOrOverridesOnMethodsRule$1.evaluate(NoShadowingOrOverridesOnMethodsRule.java:40)
	at com.carrotsearch.randomizedtesting.rules.StatementAdapter.evaluate(StatementAdapter.java:36)
	at com.carrotsearch.randomizedtesting.rules.StatementAdapter.evaluate(StatementAdapter.java:36)
	at com.carrotsearch.randomizedtesting.rules.StatementAdapter.evaluate(StatementAdapter.java:36)
	at org.apache.lucene.util.TestRuleAssertionsRequired$1.evaluate(TestRuleAssertionsRequired.java:53)
	at org.apache.lucene.util.TestRuleMarkFailure$1.evaluate(TestRuleMarkFailure.java:47)
	at org.apache.lucene.util.TestRuleIgnoreAfterMaxFailures$1.evaluate(TestRuleIgnoreAfterMaxFailures.java:64)
	at org.apache.lucene.util.TestRuleIgnoreTestSuites$1.evaluate(TestRuleIgnoreTestSuites.java:54)
	at com.carrotsearch.randomizedtesting.rules.StatementAdapter.evaluate(StatementAdapter.java:36)
	at com.carrotsearch.randomizedtesting.ThreadLeakControl$StatementRunner.run(ThreadLeakControl.java:368)
	at java.lang.Thread.run(Thread.java:748)


FAILED:  org.apache.solr.cloud.api.collections.ShardSplitTest.testSplitWithChaosMonkey

Error Message:
We think that split was successful but sub-shard states were not updated even after 2 minutes.

Stack Trace:
java.lang.AssertionError: We think that split was successful but sub-shard states were not updated even after 2 minutes.
	at __randomizedtesting.SeedInfo.seed([FE73765F74045A74:7554A58E3502F1F0]:0)
	at org.junit.Assert.fail(Assert.java:93)
	at org.apache.solr.cloud.api.collections.ShardSplitTest.testSplitWithChaosMonkey(ShardSplitTest.java:555)
	at sun.reflect.NativeMethodAccessorImpl.invoke0(Native Method)
	at sun.reflect.NativeMethodAccessorImpl.invoke(NativeMethodAccessorImpl.java:62)
	at sun.reflect.DelegatingMethodAccessorImpl.invoke(DelegatingMethodAccessorImpl.java:43)
	at java.lang.reflect.Method.invoke(Method.java:498)
	at com.carrotsearch.randomizedtesting.RandomizedRunner.invoke(RandomizedRunner.java:1737)
	at com.carrotsearch.randomizedtesting.RandomizedRunner$8.evaluate(RandomizedRunner.java:934)
	at com.carrotsearch.randomizedtesting.RandomizedRunner$9.evaluate(RandomizedRunner.java:970)
	at com.carrotsearch.randomizedtesting.RandomizedRunner$10.evaluate(RandomizedRunner.java:984)
	at org.apache.solr.BaseDistributedSearchTestCase$ShardsRepeatRule$ShardsFixedStatement.callStatement(BaseDistributedSearchTestCase.java:1008)
	at org.apache.solr.BaseDistributedSearchTestCase$ShardsRepeatRule$ShardsStatement.evaluate(BaseDistributedSearchTestCase.java:983)
	at com.carrotsearch.randomizedtesting.rules.SystemPropertiesRestoreRule$1.evaluate(SystemPropertiesRestoreRule.java:57)
	at org.apache.lucene.util.TestRuleSetupTeardownChained$1.evaluate(TestRuleSetupTeardownChained.java:49)
	at org.apache.lucene.util.AbstractBeforeAfterRule$1.evaluate(AbstractBeforeAfterRule.java:45)
	at org.apache.lucene.util.TestRuleThreadAndTestName$1.evaluate(TestRuleThreadAndTestName.java:48)
	at org.apache.lucene.util.TestRuleIgnoreAfterMaxFailures$1.evaluate(TestRuleIgnoreAfterMaxFailures.java:64)
	at org.apache.lucene.util.TestRuleMarkFailure$1.evaluate(TestRuleMarkFailure.java:47)
	at com.carrotsearch.randomizedtesting.rules.StatementAdapter.evaluate(StatementAdapter.java:36)
	at com.carrotsearch.randomizedtesting.ThreadLeakControl$StatementRunner.run(ThreadLeakControl.java:368)
	at com.carrotsearch.randomizedtesting.ThreadLeakControl.forkTimeoutingTask(ThreadLeakControl.java:817)
	at com.carrotsearch.randomizedtesting.ThreadLeakControl$3.evaluate(ThreadLeakControl.java:468)
	at com.carrotsearch.randomizedtesting.RandomizedRunner.runSingleTest(RandomizedRunner.java:943)
	at com.carrotsearch.randomizedtesting.RandomizedRunner$5.evaluate(RandomizedRunner.java:829)
	at com.carrotsearch.randomizedtesting.RandomizedRunner$6.evaluate(RandomizedRunner.java:879)
	at com.carrotsearch.randomizedtesting.RandomizedRunner$7.evaluate(RandomizedRunner.java:890)
	at com.carrotsearch.randomizedtesting.rules.StatementAdapter.evaluate(StatementAdapter.java:36)
	at com.carrotsearch.randomizedtesting.rules.SystemPropertiesRestoreRule$1.evaluate(SystemPropertiesRestoreRule.java:57)
	at org.apache.lucene.util.AbstractBeforeAfterRule$1.evaluate(AbstractBeforeAfterRule.java:45)
	at com.carrotsearch.randomizedtesting.rules.StatementAdapter.evaluate(StatementAdapter.java:36)
	at org.apache.lucene.util.TestRuleStoreClassName$1.evaluate(TestRuleStoreClassName.java:41)
	at com.carrotsearch.randomizedtesting.rules.NoShadowingOrOverridesOnMethodsRule$1.evaluate(NoShadowingOrOverridesOnMethodsRule.java:40)
	at com.carrotsearch.randomizedtesting.rules.NoShadowingOrOverridesOnMethodsRule$1.evaluate(NoShadowingOrOverridesOnMethodsRule.java:40)
	at com.carrotsearch.randomizedtesting.rules.StatementAdapter.evaluate(StatementAdapter.java:36)
	at com.carrotsearch.randomizedtesting.rules.StatementAdapter.evaluate(StatementAdapter.java:36)
	at com.carrotsearch.randomizedtesting.rules.StatementAdapter.evaluate(StatementAdapter.java:36)
	at org.apache.lucene.util.TestRuleAssertionsRequired$1.evaluate(TestRuleAssertionsRequired.java:53)
	at org.apache.lucene.util.TestRuleMarkFailure$1.evaluate(TestRuleMarkFailure.java:47)
	at org.apache.lucene.util.TestRuleIgnoreAfterMaxFailures$1.evaluate(TestRuleIgnoreAfterMaxFailures.java:64)
	at org.apache.lucene.util.TestRuleIgnoreTestSuites$1.evaluate(TestRuleIgnoreTestSuites.java:54)
	at com.carrotsearch.randomizedtesting.rules.StatementAdapter.evaluate(StatementAdapter.java:36)
	at com.carrotsearch.randomizedtesting.ThreadLeakControl$StatementRunner.run(ThreadLeakControl.java:368)
	at java.lang.Thread.run(Thread.java:748)




Build Log:
[...truncated 12759 lines...]
   [junit4] Suite: org.apache.solr.cloud.autoscaling.sim.TestLargeCluster
   [junit4]   2> Creating dataDir: /x1/jenkins/jenkins-slave/workspace/Lucene-Solr-BadApples-Tests-master/solr/build/solr-core/test/J0/temp/solr.cloud.autoscaling.sim.TestLargeCluster_FE73765F74045A74-001/init-core-data-001
   [junit4]   2> 496005 WARN  (SUITE-TestLargeCluster-seed#[FE73765F74045A74]-worker) [    ] o.a.s.SolrTestCaseJ4 startTrackingSearchers: numOpens=3 numCloses=3
   [junit4]   2> 496006 INFO  (SUITE-TestLargeCluster-seed#[FE73765F74045A74]-worker) [    ] o.a.s.SolrTestCaseJ4 Using PointFields (NUMERIC_POINTS_SYSPROP=true) w/NUMERIC_DOCVALUES_SYSPROP=false
   [junit4]   2> 496007 INFO  (SUITE-TestLargeCluster-seed#[FE73765F74045A74]-worker) [    ] o.a.s.SolrTestCaseJ4 Randomized ssl (false) and clientAuth (true) via: @org.apache.solr.util.RandomizeSSL(reason=, ssl=NaN, value=NaN, clientAuth=NaN)
   [junit4]   2> 496007 INFO  (SUITE-TestLargeCluster-seed#[FE73765F74045A74]-worker) [    ] o.a.s.SolrTestCaseJ4 SecureRandom sanity checks: test.solr.allowed.securerandom=null & java.security.egd=file:/dev/./urandom
   [junit4]   2> 496110 DEBUG (Simulated OverseerAutoScalingTriggerThread) [    ] o.a.s.c.a.OverseerTriggerThread Adding .auto_add_replicas and .scheduled_maintenance triggers
   [junit4]   2> 496110 DEBUG (Simulated OverseerAutoScalingTriggerThread) [    ] o.a.s.c.a.OverseerTriggerThread Refreshing /autoscaling.json with znode version 0
   [junit4]   2> 496111 DEBUG (Simulated OverseerAutoScalingTriggerThread) [    ] o.a.s.c.a.OverseerTriggerThread Current znodeVersion 0, lastZnodeVersion -1
   [junit4]   2> 496111 DEBUG (Simulated OverseerAutoScalingTriggerThread) [    ] o.a.s.c.a.OverseerTriggerThread Processed trigger updates upto znodeVersion 0
   [junit4]   2> 496118 DEBUG (SUITE-TestLargeCluster-seed#[FE73765F74045A74]-worker) [    ] o.a.s.c.a.s.SimClusterStateProvider --- new Overseer leader: 127.0.0.1:10000_solr
   [junit4]   2> 496129 DEBUG (Simulated OverseerAutoScalingTriggerThread) [    ] o.a.s.c.a.NodeLostTrigger NodeLostTrigger .auto_add_replicas - Initial livenodes: [127.0.0.1:10000_solr]
   [junit4]   2> 496145 INFO  (SUITE-TestLargeCluster-seed#[FE73765F74045A74]-worker) [    ] o.a.s.h.a.MetricsHistoryHandler No .system collection, keeping metrics history in memory.
   [junit4]   2> 496152 DEBUG (Simulated OverseerAutoScalingTriggerThread) [    ] o.a.s.c.a.OverseerTriggerThread -- clean old nodeAdded markers
   [junit4]   2> 496152 DEBUG (Simulated OverseerAutoScalingTriggerThread) [    ] o.a.s.c.a.OverseerTriggerThread Current znodeVersion 0, lastZnodeVersion 0
   [junit4]   2> 496152 DEBUG (ScheduledTrigger-2005-thread-3) [    ] o.a.s.c.a.NodeLostTrigger Running NodeLostTrigger: .auto_add_replicas with currently live nodes: 27
   [junit4]   2> 496179 DEBUG (ScheduledTrigger-2005-thread-1) [    ] o.a.s.c.a.NodeLostTrigger Running NodeLostTrigger: .auto_add_replicas with currently live nodes: 86
   [junit4]   2> 496196 INFO  (TEST-TestLargeCluster.testBasic-seed#[FE73765F74045A74]) [    ] o.a.s.SolrTestCaseJ4 ###Starting testBasic
   [junit4]   2> 496196 DEBUG (TEST-TestLargeCluster.testBasic-seed#[FE73765F74045A74]) [    ] o.a.s.c.a.OverseerTriggerThread Refreshing /autoscaling.json with znode version 1
   [junit4]   2> 496196 DEBUG (Simulated OverseerAutoScalingTriggerThread) [    ] o.a.s.c.a.OverseerTriggerThread Processed trigger updates upto znodeVersion 1
   [junit4]   2> 496197 DEBUG (Simulated OverseerAutoScalingTriggerThread) [    ] o.a.s.c.a.OverseerTriggerThread -- clean old nodeLost markers
   [junit4]   2> 496198 DEBUG (Simulated OverseerAutoScalingTriggerThread) [    ] o.a.s.c.a.OverseerTriggerThread -- clean old nodeAdded markers
   [junit4]   2> 496198 DEBUG (Simulated OverseerAutoScalingTriggerThread) [    ] o.a.s.c.a.OverseerTriggerThread Current znodeVersion 1, lastZnodeVersion 1
   [junit4]   2> 496199 INFO  (TEST-TestLargeCluster.testBasic-seed#[FE73765F74045A74]) [    ] o.a.s.c.a.s.SimCloudManager === Restarting OverseerTriggerThread and clearing object cache...
   [junit4]   2> 496199 WARN  (Simulated OverseerAutoScalingTriggerThread) [    ] o.a.s.c.a.OverseerTriggerThread Interrupted
   [junit4]   2> java.lang.InterruptedException: null
   [junit4]   2> 	at java.util.concurrent.locks.AbstractQueuedSynchronizer$ConditionObject.reportInterruptAfterWait(AbstractQueuedSynchronizer.java:2014) ~[?:1.8.0_172]
   [junit4]   2> 	at java.util.concurrent.locks.AbstractQueuedSynchronizer$ConditionObject.await(AbstractQueuedSynchronizer.java:2048) ~[?:1.8.0_172]
   [junit4]   2> 	at org.apache.solr.cloud.autoscaling.OverseerTriggerThread.run(OverseerTriggerThread.java:189) [java/:?]
   [junit4]   2> 	at java.lang.Thread.run(Thread.java:748) [?:1.8.0_172]
   [junit4]   2> 496201 DEBUG (TEST-TestLargeCluster.testBasic-seed#[FE73765F74045A74]) [    ] o.a.s.c.a.ScheduledTriggers Shutting down scheduled thread pool executor now
   [junit4]   2> 496207 DEBUG (TEST-TestLargeCluster.testBasic-seed#[FE73765F74045A74]) [    ] o.a.s.c.a.ScheduledTriggers Shutting down action executor now
   [junit4]   2> 496207 DEBUG (TEST-TestLargeCluster.testBasic-seed#[FE73765F74045A74]) [    ] o.a.s.c.a.ScheduledTriggers Awaiting termination for action executor
   [junit4]   2> 496207 DEBUG (TEST-TestLargeCluster.testBasic-seed#[FE73765F74045A74]) [    ] o.a.s.c.a.ScheduledTriggers Awaiting termination for scheduled thread pool executor
   [junit4]   2> 496207 DEBUG (TEST-TestLargeCluster.testBasic-seed#[FE73765F74045A74]) [    ] o.a.s.c.a.ScheduledTriggers ScheduledTriggers closed completely
   [junit4]   2> 496207 DEBUG (TEST-TestLargeCluster.testBasic-seed#[FE73765F74045A74]) [    ] o.a.s.c.a.OverseerTriggerThread OverseerTriggerThread has been closed explicitly
   [junit4]   2> 496219 DEBUG (Simulated OverseerAutoScalingTriggerThread) [    ] o.a.s.c.a.OverseerTriggerThread Adding .auto_add_replicas and .scheduled_maintenance triggers
   [junit4]   2> 496219 DEBUG (Simulated OverseerAutoScalingTriggerThread) [    ] o.a.s.c.a.OverseerTriggerThread Refreshing /autoscaling.json with znode version 2
   [junit4]   2> 496220 DEBUG (Simulated OverseerAutoScalingTriggerThread) [    ] o.a.s.c.a.OverseerTriggerThread Current znodeVersion 2, lastZnodeVersion -1
   [junit4]   2> 496220 DEBUG (Simulated OverseerAutoScalingTriggerThread) [    ] o.a.s.c.a.OverseerTriggerThread Processed trigger updates upto znodeVersion 2
   [junit4]   2> 496232 DEBUG (Simulated OverseerAutoScalingTriggerThread) [    ] o.a.s.c.a.NodeLostTrigger NodeLostTrigger .auto_add_replicas - Initial livenodes: [127.0.0.1:10082_solr, 127.0.0.1:10004_solr, 127.0.0.1:10018_solr, 127.0.0.1:10049_solr, 127.0.0.1:10020_solr, 127.0.0.1:10065_solr, 127.0.0.1:10021_solr, 127.0.0.1:10005_solr, 127.0.0.1:10066_solr, 127.0.0.1:10035_solr, 127.0.0.1:10051_solr, 127.0.0.1:10019_solr, 127.0.0.1:10096_solr, 127.0.0.1:10022_solr, 127.0.0.1:10033_solr, 127.0.0.1:10017_solr, 127.0.0.1:10047_solr, 127.0.0.1:10095_solr, 127.0.0.1:10081_solr, 127.0.0.1:10084_solr, 127.0.0.1:10036_solr, 127.0.0.1:10052_solr, 127.0.0.1:10006_solr, 127.0.0.1:10079_solr, 127.0.0.1:10098_solr, 127.0.0.1:10003_solr, 127.0.0.1:10001_solr, 127.0.0.1:10054_solr, 127.0.0.1:10099_solr, 127.0.0.1:10071_solr, 127.0.0.1:10023_solr, 127.0.0.1:10076_solr, 127.0.0.1:10007_solr, 127.0.0.1:10055_solr, 127.0.0.1:10010_solr, 127.0.0.1:10016_solr, 127.0.0.1:10070_solr, 127.0.0.1:10077_solr, 127.0.0.1:10038_solr, 127.0.0.1:10032_solr, 127.0.0.1:10093_solr, 127.0.0.1:10061_solr, 127.0.0.1:10067_solr, 127.0.0.1:10086_solr, 127.0.0.1:10089_solr, 127.0.0.1:10045_solr, 127.0.0.1:10042_solr, 127.0.0.1:10029_solr, 127.0.0.1:10083_solr, 127.0.0.1:10080_solr, 127.0.0.1:10048_solr, 127.0.0.1:10064_solr, 127.0.0.1:10043_solr, 127.0.0.1:10057_solr, 127.0.0.1:10074_solr, 127.0.0.1:10026_solr, 127.0.0.1:10012_solr, 127.0.0.1:10060_solr, 127.0.0.1:10073_solr, 127.0.0.1:10058_solr, 127.0.0.1:10013_solr, 127.0.0.1:10090_solr, 127.0.0.1:10088_solr, 127.0.0.1:10027_solr, 127.0.0.1:10039_solr, 127.0.0.1:10025_solr, 127.0.0.1:10044_solr, 127.0.0.1:10028_solr, 127.0.0.1:10092_solr, 127.0.0.1:10041_solr, 127.0.0.1:10087_solr, 127.0.0.1:10009_solr, 127.0.0.1:10000_solr, 127.0.0.1:10030_solr, 127.0.0.1:10014_solr, 127.0.0.1:10011_solr, 127.0.0.1:10040_solr, 127.0.0.1:10085_solr, 127.0.0.1:10046_solr, 127.0.0.1:10068_solr, 127.0.0.1:10063_solr, 127.0.0.1:10015_solr, 127.0.0.1:10069_solr, 127.0.0.1:10062_solr, 127.0.0.1:10008_solr, 127.0.0.1:10024_solr, 127.0.0.1:10050_solr, 127.0.0.1:10075_solr, 127.0.0.1:10078_solr, 127.0.0.1:10002_solr, 127.0.0.1:10097_solr, 127.0.0.1:10031_solr, 127.0.0.1:10034_solr, 127.0.0.1:10091_solr, 127.0.0.1:10094_solr, 127.0.0.1:10037_solr, 127.0.0.1:10053_solr, 127.0.0.1:10059_solr, 127.0.0.1:10056_solr, 127.0.0.1:10072_solr]
   [junit4]   2> 496240 DEBUG (Simulated OverseerAutoScalingTriggerThread) [    ] o.a.s.c.a.OverseerTriggerThread -- clean old nodeAdded markers
   [junit4]   2> 496240 DEBUG (Simulated OverseerAutoScalingTriggerThread) [    ] o.a.s.c.a.OverseerTriggerThread Current znodeVersion 2, lastZnodeVersion 2
   [junit4]   2> 496240 DEBUG (ScheduledTrigger-2010-thread-2) [    ] o.a.s.c.a.NodeLostTrigger Running NodeLostTrigger: .auto_add_replicas with currently live nodes: 100
   [junit4]   2> 496283 DEBUG (ScheduledTrigger-2010-thread-2) [    ] o.a.s.c.a.NodeLostTrigger Running NodeLostTrigger: .auto_add_replicas with currently live nodes: 100
   [junit4]   2> 496303 DEBUG (ScheduledTrigger-2010-thread-2) [    ] o.a.s.c.a.NodeLostTrigger Running NodeLostTrigger: .auto_add_replicas with currently live nodes: 100
   [junit4]   2> 496324 DEBUG (ScheduledTrigger-2010-thread-1) [    ] o.a.s.c.a.NodeLostTrigger Running NodeLostTrigger: .auto_add_replicas with currently live nodes: 100
   [junit4]   2> 496344 DEBUG (ScheduledTrigger-2010-thread-4) [    ] o.a.s.c.a.NodeLostTrigger Running NodeLostTrigger: .auto_add_replicas with currently live nodes: 100
   [junit4]   2> 496364 DEBUG (ScheduledTrigger-2010-thread-4) [    ] o.a.s.c.a.NodeLostTrigger Running NodeLostTrigger: .auto_add_replicas with currently live nodes: 100
   [junit4]   2> 496385 DEBUG (ScheduledTrigger-2010-thread-4) [    ] o.a.s.c.a.NodeLostTrigger Running NodeLostTrigger: .auto_add_replicas with currently live nodes: 100
   [junit4]   2> 496389 DEBUG (simCloudManagerPool-2009-thread-1) [    ] o.a.s.c.a.AutoScalingHandler Verified autoscaling configuration
   [junit4]   2> 496390 DEBUG (simCloudManagerPool-2009-thread-1) [    ] o.a.s.c.a.OverseerTriggerThread Refreshing /autoscaling.json with znode version 3
   [junit4]   2> 496406 DEBUG (ScheduledTrigger-2010-thread-4) [    ] o.a.s.c.a.NodeLostTrigger Running NodeLostTrigger: .auto_add_replicas with currently live nodes: 100
   [junit4]   2> 496426 DEBUG (ScheduledTrigger-2010-thread-4) [    ] o.a.s.c.a.NodeLostTrigger Running NodeLostTrigger: .auto_add_replicas with currently live nodes: 100
   [junit4]   2> 496430 DEBUG (Simulated OverseerAutoScalingTriggerThread) [    ] o.a.s.c.a.OverseerTriggerThread Processed trigger updates upto znodeVersion 3
   [junit4]   2> 496430 DEBUG (Simulated OverseerAutoScalingTriggerThread) [    ] o.a.s.c.a.OverseerTriggerThread -- clean old nodeAdded markers
   [junit4]   2> 496430 DEBUG (Simulated OverseerAutoScalingTriggerThread) [    ] o.a.s.c.a.OverseerTriggerThread Current znodeVersion 3, lastZnodeVersion 3
   [junit4]   2> 496447 DEBUG (ScheduledTrigger-2010-thread-4) [    ] o.a.s.c.a.NodeLostTrigger Running NodeLostTrigger: .auto_add_replicas with currently live nodes: 100
   [junit4]   2> 496452 DEBUG (simCloudManagerPool-2009-thread-2) [    ] o.a.s.c.a.AutoScalingHandler Verified autoscaling configuration
   [junit4]   2> 496453 DEBUG (simCloudManagerPool-2009-thread-2) [    ] o.a.s.c.a.OverseerTriggerThread Refreshing /autoscaling.json with znode version 4
   [junit4]   2> 496467 DEBUG (ScheduledTrigger-2010-thread-4) [    ] o.a.s.c.a.NodeLostTrigger Running NodeLostTrigger: .auto_add_replicas with currently live nodes: 100
   [junit4]   2> 496480 DEBUG (Simulated OverseerAutoScalingTriggerThread) [    ] o.a.s.c.a.OverseerTriggerThread Processed trigger updates upto znodeVersion 4
   [junit4]   2> 496487 DEBUG (ScheduledTrigger-2010-thread-4) [    ] o.a.s.c.a.NodeLostTrigger Running NodeLostTrigger: .auto_add_replicas with currently live nodes: 100
   [junit4]   2> 496492 DEBUG (Simulated OverseerAutoScalingTriggerThread) [    ] o.a.s.c.a.OverseerTriggerThread -- clean old nodeLost markers
   [junit4]   2> 496492 DEBUG (Simulated OverseerAutoScalingTriggerThread) [    ] o.a.s.c.a.OverseerTriggerThread -- clean old nodeAdded markers
   [junit4]   2> 496492 DEBUG (Simulated OverseerAutoScalingTriggerThread) [    ] o.a.s.c.a.OverseerTriggerThread Current znodeVersion 4, lastZnodeVersion 4
   [junit4]   2> 496666 DEBUG (simCloudManagerPool-2009-thread-5) [    ] o.a.s.c.a.AutoScalingHandler Verified autoscaling configuration
   [junit4]   2> 496667 DEBUG (simCloudManagerPool-2009-thread-5) [    ] o.a.s.c.a.OverseerTriggerThread Refreshing /autoscaling.json with znode version 5
   [junit4]   2> 496679 DEBUG (Simulated OverseerAutoScalingTriggerThread) [    ] o.a.s.c.a.OverseerTriggerThread Processed trigger updates upto znodeVersion 5
   [junit4]   2> 496679 DEBUG (Simulated OverseerAutoScalingTriggerThread) [    ] o.a.s.c.a.NodeLostTrigger NodeLostTrigger node_lost_trigger1 - Initial livenodes: [127.0.0.1:10082_solr, 127.0.0.1:10004_solr, 127.0.0.1:10018_solr, 127.0.0.1:10049_solr, 127.0.0.1:10020_solr, 127.0.0.1:10065_solr, 127.0.0.1:10021_solr, 127.0.0.1:10005_solr, 127.0.0.1:10066_solr, 127.0.0.1:10035_solr, 127.0.0.1:10051_solr, 127.0.0.1:10019_solr, 127.0.0.1:10096_solr, 127.0.0.1:10022_solr, 127.0.0.1:10033_solr, 127.0.0.1:10017_solr, 127.0.0.1:10047_solr, 127.0.0.1:10095_solr, 127.0.0.1:10081_solr, 127.0.0.1:10084_solr, 127.0.0.1:10036_solr, 127.0.0.1:10052_solr, 127.0.0.1:10006_solr, 127.0.0.1:10079_solr, 127.0.0.1:10098_solr, 127.0.0.1:10003_solr, 127.0.0.1:10001_solr, 127.0.0.1:10054_solr, 127.0.0.1:10099_solr, 127.0.0.1:10071_solr, 127.0.0.1:10023_solr, 127.0.0.1:10076_solr, 127.0.0.1:10007_solr, 127.0.0.1:10055_solr, 127.0.0.1:10010_solr, 127.0.0.1:10016_solr, 127.0.0.1:10070_solr, 127.0.0.1:10077_solr, 127.0.0.1:10038_solr, 127.0.0.1:10032_solr, 127.0.0.1:10093_solr, 127.0.0.1:10061_solr, 127.0.0.1:10067_solr, 127.0.0.1:10086_solr, 127.0.0.1:10089_solr, 127.0.0.1:10045_solr, 127.0.0.1:10042_solr, 127.0.0.1:10029_solr, 127.0.0.1:10083_solr, 127.0.0.1:10080_solr, 127.0.0.1:10048_solr, 127.0.0.1:10064_solr, 127.0.0.1:10043_solr, 127.0.0.1:10057_solr, 127.0.0.1:10074_solr, 127.0.0.1:10026_solr, 127.0.0.1:10012_solr, 127.0.0.1:10060_solr, 127.0.0.1:10073_solr, 127.0.0.1:10058_solr, 127.0.0.1:10013_solr, 127.0.0.1:10090_solr, 127.0.0.1:10088_solr, 127.0.0.1:10027_solr, 127.0.0.1:10039_solr, 127.0.0.1:10025_solr, 127.0.0.1:10044_solr, 127.0.0.1:10028_solr, 127.0.0.1:10092_solr, 127.0.0.1:10041_solr, 127.0.0.1:10087_solr, 127.0.0.1:10009_solr, 127.0.0.1:10000_solr, 127.0.0.1:10030_solr, 127.0.0.1:10014_solr, 127.0.0.1:10011_solr, 127.0.0.1:10040_solr, 127.0.0.1:10085_solr, 127.0.0.1:10046_solr, 127.0.0.1:10068_solr, 127.0.0.1:10063_solr, 127.0.0.1:10015_solr, 127.0.0.1:10069_solr, 127.0.0.1:10062_solr, 127.0.0.1:10008_solr, 127.0.0.1:10024_solr, 127.0.0.1:10050_solr, 127.0.0.1:10075_solr, 127.0.0.1:10078_solr, 127.0.0.1:10002_solr, 127.0.0.1:10097_solr, 127.0.0.1:10031_solr, 127.0.0.1:10034_solr, 127.0.0.1:10091_solr, 127.0.0.1:10094_solr, 127.0.0.1:10037_solr, 127.0.0.1:10053_solr, 127.0.0.1:10059_solr, 127.0.0.1:10056_solr, 127.0.0.1:10072_solr]
   [junit4]   2> 496679 DEBUG (Simulated OverseerAutoScalingTriggerThread) [    ] o.a.s.c.a.OverseerTriggerThread -- clean old nodeAdded markers
   [junit4]   2> 496680 DEBUG (Simulated OverseerAutoScalingTriggerThread) [    ] o.a.s.c.a.OverseerTriggerThread Current znodeVersion 5, lastZnodeVersion 5
   [junit4]   2> 496680 DEBUG (ScheduledTrigger-2010-thread-2) [    ] o.a.s.c.a.NodeLostTrigger Running NodeLostTrigger: node_lost_trigger1 with currently live nodes: 100
   [junit4]   2> 496685 DEBUG (simCloudManagerPool-2009-thread-6) [    ] o.a.s.c.a.AutoScalingHandler Verified autoscaling configuration
   [junit4]   2> 496685 DEBUG (simCloudManagerPool-2009-thread-6) [    ] o.a.s.c.a.OverseerTriggerThread Refreshing /autoscaling.json with znode version 6
   [junit4]   2> 496700 DEBUG (ScheduledTrigger-2010-thread-2) [    ] o.a.s.c.a.NodeLostTrigger Running NodeLostTrigger: node_lost_trigger1 with currently live nodes: 100
   [junit4]   2> 496700 DEBUG (Simulated OverseerAutoScalingTriggerThread) [    ] o.a.s.c.a.OverseerTriggerThread Processed trigger updates upto znodeVersion 6
   [junit4]   2> 496701 DEBUG (Simulated OverseerAutoScalingTriggerThread) [    ] o.a.s.c.a.OverseerTriggerThread -- clean old nodeAdded markers
   [junit4]   2> 496701 DEBUG (Simulated OverseerAutoScalingTriggerThread) [    ] o.a.s.c.a.OverseerTriggerThread Current znodeVersion 6, lastZnodeVersion 6
   [junit4]   2> 496722 DEBUG (ScheduledTrigger-2010-thread-2) [    ] o.a.s.c.a.NodeLostTrigger Running NodeLostTrigger: node_lost_trigger1 with currently live nodes: 100
   [junit4]   2> 496743 DEBUG (ScheduledTrigger-2010-thread-2) [    ] o.a.s.c.a.NodeLostTrigger Running NodeLostTrigger: node_lost_trigger1 with currently live nodes: 100
   [junit4]   2> 496763 DEBUG (ScheduledTrigger-2010-thread-2) [    ] o.a.s.c.a.NodeLostTrigger Running NodeLostTrigger: node_lost_trigger1 with currently live nodes: 100
   [junit4]   2> 496784 DEBUG (ScheduledTrigger-2010-thread-2) [    ] o.a.s.c.a.NodeLostTrigger Running NodeLostTrigger: node_lost_trigger1 with currently live nodes: 100
   [junit4]   2> 496804 DEBUG (ScheduledTrigger-2010-thread-2) [    ] o.a.s.c.a.NodeLostTrigger Running NodeLostTrigger: node_lost_trigger1 with currently live nodes: 100
   [junit4]   2> 496824 DEBUG (ScheduledTrigger-2010-thread-2) [    ] o.a.s.c.a.NodeLostTrigger Running NodeLostTrigger: node_lost_trigger1 with currently live nodes: 100
   [junit4]   2> 496845 DEBUG (ScheduledTrigger-2010-thread-2) [    ] o.a.s.c.a.NodeLostTrigger Running NodeLostTrigger: node_lost_trigger1 with currently live nodes: 100
   [junit4]   2> 496865 DEBUG (ScheduledTrigger-2010-thread-2) [    ] o.a.s.c.a.NodeLostTrigger Running NodeLostTrigger: node_lost_trigger1 with currently live nodes: 100
   [junit4]   2> 496885 DEBUG (ScheduledTrigger-2010-thread-2) [    ] o.a.s.c.a.NodeLostTrigger Running NodeLostTrigger: node_lost_trigger1 with currently live nodes: 100
   [junit4]   2> 496906 DEBUG (ScheduledTrigger-2010-thread-2) [    ] o.a.s.c.a.NodeLostTrigger Running NodeLostTrigger: node_lost_trigger1 with currently live nodes: 100
   [junit4]   2> 496926 DEBUG (ScheduledTrigger-2010-thread-2) [    ] o.a.s.c.a.NodeLostTrigger Running NodeLostTrigger: node_lost_trigger1 with currently live nodes: 100
   [junit4]   2> 496946 DEBUG (ScheduledTrigger-2010-thread-2) [    ] o.a.s.c.a.NodeLostTrigger Running NodeLostTrigger: node_lost_trigger1 with currently live nodes: 100
   [junit4]   2> 496967 DEBUG (ScheduledTrigger-2010-thread-2) [    ] o.a.s.c.a.NodeLostTrigger Running NodeLostTrigger: node_lost_trigger1 with currently live nodes: 100
   [junit4]   2> 496987 DEBUG (ScheduledTrigger-2010-thread-2) [    ] o.a.s.c.a.NodeLostTrigger Running NodeLostTrigger: node_lost_trigger1 with currently live nodes: 100
   [junit4]   2> 497007 DEBUG (ScheduledTrigger-2010-thread-2) [    ] o.a.s.c.a.NodeLostTrigger Running NodeLostTrigger: node_lost_trigger1 with currently live nodes: 100
   [junit4]   2> 497028 DEBUG (ScheduledTrigger-2010-thread-2) [    ] o.a.s.c.a.NodeLostTrigger Running NodeLostTrigger: node_lost_trigger1 with currently live nodes: 100
   [junit4]   2> 497048 DEBUG (ScheduledTrigger-2010-thread-2) [    ] o.a.s.c.a.NodeLostTrigger Running NodeLostTrigger: node_lost_trigger1 with currently live nodes: 100
   [junit4]   2> 497181 DEBUG (ScheduledTrigger-2010-thread-2) [    ] o.a.s.c.a.NodeLostTrigger Running NodeLostTrigger: node_lost_trigger1 with currently live nodes: 100
   [junit4]   2> 497202 DEBUG (ScheduledTrigger-2010-thread-2) [    ] o.a.s.c.a.NodeLostTrigger Running NodeLostTrigger: node_lost_trigger1 with currently live nodes: 100
   [junit4]   2> 497222 DEBUG (ScheduledTrigger-2010-thread-2) [    ] o.a.s.c.a.NodeLostTrigger Running NodeLostTrigger: node_lost_trigger1 with currently live nodes: 100
   [junit4]   2> 497242 DEBUG (ScheduledTrigger-2010-thread-2) [    ] o.a.s.c.a.NodeLostTrigger Running NodeLostTrigger: node_lost_trigger1 with currently live nodes: 100
   [junit4]   2> 497263 DEBUG (ScheduledTrigger-2010-thread-2) [    ] o.a.s.c.a.NodeLostTrigger Running NodeLostTrigger: node_lost_trigger1 with currently live nodes: 100
   [junit4]   2> 497283 DEBUG (ScheduledTrigger-2010-thread-2) [    ] o.a.s.c.a.NodeLostTrigger Running NodeLostTrigger: node_lost_trigger1 with currently live nodes: 100
   [junit4]   2> 497303 DEBUG (ScheduledTrigger-2010-thread-2) [    ] o.a.s.c.a.NodeLostTrigger Running NodeLostTrigger: node_lost_trigger1 with currently live nodes: 100
   [junit4]   2> 497324 DEBUG (ScheduledTrigger-2010-thread-2) [    ] o.a.s.c.a.NodeLostTrigger Running NodeLostTrigger: node_lost_trigger1 with currently live nodes: 100
   [junit4]   2> 497344 DEBUG (ScheduledTrigger-2010-thread-2) [    ] o.a.s.c.a.NodeLostTrigger Running NodeLostTrigger: node_lost_trigger1 with currently live nodes: 100
   [junit4]   2> 497364 DEBUG (ScheduledTrigger-2010-thread-2) [    ] o.a.s.c.a.NodeLostTrigger Running NodeLostTrigger: node_lost_trigger1 with currently live nodes: 100
   [junit4]   2> 497384 DEBUG (ScheduledTrigger-2010-thread-2) [    ] o.a.s.c.a.NodeLostTrigger Running NodeLostTrigger: node_lost_trigger1 with currently live nodes: 100
   [junit4]   2> 497405 DEBUG (ScheduledTrigger-2010-thread-2) [    ] o.a.s.c.a.NodeLostTrigger Running NodeLostTrigger: node_lost_trigger1 with currently live nodes: 100
   [junit4]   2> 497425 DEBUG (ScheduledTrigger-2010-thread-2) [    ] o.a.s.c.a.NodeLostTrigger Running NodeLostTrigger: node_lost_trigger1 with currently live nodes: 100
   [junit4]   2> 497445 DEBUG (ScheduledTrigger-2010-thread-2) [    ] o.a.s.c.a.NodeLostTrigger Running NodeLostTrigger: node_lost_trigger1 with currently live nodes: 100
   [junit4]   2> 497466 DEBUG (ScheduledTrigger-2010-thread-2) [    ] o.a.s.c.a.NodeLostTrigger Running NodeLostTrigger: node_lost_trigger1 with currently live nodes: 100
   [junit4]   2> 497486 DEBUG (ScheduledTrigger-2010-thread-2) [    ] o.a.s.c.a.NodeLostTrigger Running NodeLostTrigger: node_lost_trigger1 with currently live nodes: 100
   [junit4]   2> 497506 DEBUG (ScheduledTrigger-2010-thread-2) [    ] o.a.s.c.a.NodeLostTrigger Running NodeLostTrigger: node_lost_trigger1 with currently live nodes: 100
   [junit4]   2> 497527 DEBUG (ScheduledTrigger-2010-thread-2) [    ] o.a.s.c.a.NodeLostTrigger Running NodeLostTrigger: node_lost_trigger1 with currently live nodes: 100
   [junit4]   2> 497547 DEBUG (ScheduledTrigger-2010-thread-2) [    ] o.a.s.c.a.NodeLostTrigger Running NodeLostTrigger: node_lost_trigger1 with currently live nodes: 100
   [junit4]   2> 497567 DEBUG (ScheduledTrigger-2010-thread-2) [    ] o.a.s.c.a.NodeLostTrigger Running NodeLostTrigger: node_lost_trigger1 with currently live nodes: 100
   [junit4]   2> 497588 DEBUG (ScheduledTrigger-2010-thread-2) [    ] o.a.s.c.a.NodeLostTrigger Running NodeLostTrigger: node_lost_trigger1 with currently live nodes: 100
   [junit4]   2> 497681 DEBUG (ScheduledTrigger-2010-thread-2) [    ] o.a.s.c.a.NodeLostTrigger Running NodeLostTrigger: node_lost_trigger1 with currently live nodes: 100
   [junit4]   2> 497702 DEBUG (ScheduledTrigger-2010-thread-2) [    ] o.a.s.c.a.NodeLostTrigger Running NodeLostTrigger: node_lost_trigger1 with currently live nodes: 100
   [junit4]   2> 497722 DEBUG (ScheduledTrigger-2010-thread-2) [    ] o.a.s.c.a.NodeLostTrigger Running NodeLostTrigger: node_lost_trigger1 with currently live nodes: 100
   [junit4]   2> 497742 DEBUG (ScheduledTrigger-2010-thread-2) [    ] o.a.s.c.a.NodeLostTrigger Running NodeLostTrigger: node_lost_trigger1 with currently live nodes: 100
   [junit4]   2> 497763 DEBUG (ScheduledTrigger-2010-thread-2) [    ] o.a.s.c.a.NodeLostTrigger Running NodeLostTrigger: node_lost_trigger1 with currently live nodes: 100
   [junit4]   2> 497783 DEBUG (ScheduledTrigger-2010-thread-2) [    ] o.a.s.c.a.NodeLostTrigger Running NodeLostTrigger: node_lost_trigger1 with currently live nodes: 100
   [junit4]   2> 497803 DEBUG (ScheduledTrigger-2010-thread-2) [    ] o.a.s.c.a.NodeLostTrigger Running NodeLostTrigger: node_lost_trigger1 with currently live nodes: 100
   [junit4]   2> 497869 DEBUG (ScheduledTrigger-2010-thread-2) [    ] o.a.s.c.a.NodeLostTrigger Running NodeLostTrigger: node_lost_trigger1 with currently live nodes: 100
   [junit4]   2> 497889 DEBUG (ScheduledTrigger-2010-thread-2) [    ] o.a.s.c.a.NodeLostTrigger Running NodeLostTrigger: node_lost_trigger1 with currently live nodes: 100
   [junit4]   2> 497897 DEBUG (simCloudManagerPool-2009-thread-83) [    ] o.a.s.c.a.s.SimClusterStateProvider -- elected new leader for testBasic / shard2: {"core_node17":{
   [junit4]   2>     "core":"testBasic_shard2_replica_n17",
   [junit4]   2>     "leader":"true",
   [junit4]   2>     "SEARCHER.searcher.maxDoc":0,
   [junit4]   2>     "SEARCHER.searcher.deletedDocs":0,
   [junit4]   2>     "INDEX.sizeInBytes":10240,
   [junit4]   2>     "node_name":"127.0.0.1:10029_solr",
   [junit4]   2>     "state":"active",
   [junit4]   2>     "type":"NRT",
   [junit4]   2>     "INDEX.sizeInGB":9.5367431640625E-6,
   [junit4]   2>     "SEARCHER.searcher.numDocs":0,
   [junit4]   2>     "shard":"shard2",
   [junit4]   2>     "collection":"testBasic"}}
   [junit4]   2> 497910 DEBUG (ScheduledTrigger-2010-thread-2) [    ] o.a.s.c.a.NodeLostTrigger Running NodeLostTrigger: node_lost_trigger1 with currently live nodes: 100
   [junit4]   2> 497918 DEBUG (simCloudManagerPool-2009-thread-84) [    ] o.a.s.c.a.s.SimClusterStateProvider -- elected new leader for testBasic / shard3: {"core_node39":{
   [junit4]   2>     "core":"testBasic_shard3_replica_t39",
   [junit4]   2>     "leader":"true",
   [junit4]   2>     "SEARCHER.searcher.maxDoc":0,
   [junit4]   2>     "SEARCHER.searcher.deletedDocs":0,
   [junit4]   2>     "INDEX.sizeInBytes":10240,
   [junit4]   2>     "node_name":"127.0.0.1:10060_solr",
   [junit4]   2>     "state":"active",
   [junit4]   2>     "type":"TLOG",
   [junit4]   2>     "INDEX.sizeInGB":9.5367431640625E-6,
   [junit4]   2>     "SEARCHER.searcher.numDocs":0,
   [junit4]   2>     "shard":"shard3",
   [junit4]   2>     "collection":"testBasic"}}
   [junit4]   2> 497918 DEBUG (simCloudManagerPool-2009-thread-85) [    ] o.a.s.c.a.s.SimClusterStateProvider -- elected new leader for testBasic / shard4: {"core_node50":{
   [junit4]   2>     "core":"testBasic_shard4_replica_n50",
   [junit4]   2>     "leader":"true",
   [junit4]   2>     "SEARCHER.searcher.maxDoc":0,
   [junit4]   2>     "SEARCHER.searcher.deletedDocs":0,
   [junit4]   2>     "INDEX.sizeInBytes":10240,
   [junit4]   2>     "node_name":"127.0.0.1:10022_solr",
   [junit4]   2>     "state":"active",
   [junit4]   2>     "type":"NRT",
   [junit4]   2>     "INDEX.sizeInGB":9.5367431640625E-6,
   [junit4]   2>     "SEARCHER.searcher.numDocs":0,
   [junit4]   2>     "shard":"shard4",
   [junit4]   2>     "collection":"testBasic"}}
   [junit4]   2> 497918 DEBUG (simCloudManagerPool-2009-thread-86) [    ] o.a.s.c.a.s.SimClusterStateProvider -- elected new leader for testBasic / shard5: {"core_node61":{
   [junit4]   2>     "core":"testBasic_shard5_replica_n61",
   [junit4]   2>     "leader":"true",
   [junit4]   2>     "SEARCHER.searcher.maxDoc":0,
   [junit4]   2>     "SEARCHER.searcher.deletedDocs":0,
   [junit4]   2>     "INDEX.sizeInBytes":10240,
   [junit4]   2>     "node_name":"127.0.0.1:10082_solr",
   [junit4]   2>     "state":"active",
   [junit4]   2>     "type":"NRT",
   [junit4]   2>     "INDEX.sizeInGB":9.5367431640625E-6,
   [junit4]   2>     "SEARCHER.searcher.numDocs":0,
   [junit4]   2>     "shard":"shard5",
   [junit4]   2>     "collection":"testBasic"}}
   [junit4]   2> 497925 DEBUG (simCloudManagerPool-2009-thread-87) [    ] o.a.s.c.a.s.SimClusterStateProvider -- elected new leader for testBasic / shard1: {"core_node1":{
   [junit4]   2>     "core":"testBasic_shard1_replica_n1",
   [junit4]   2>     "leader":"true",
   [junit4]   2>     "SEARCHER.searcher.maxDoc":0,
   [junit4]   2>     "SEARCHER.searcher.deletedDocs":0,
   [junit4]   2>     "INDEX.sizeInBytes":10240,
   [junit4]   2>     "node_name":"127.0.0.1:10079_solr",
   [junit4]   2>     "state":"active",
   [junit4]   2>     "type":"NRT",
   [junit4]   2>     "INDEX.sizeInGB":9.5367431640625E-6,
   [junit4]   2>     "SEARCHER.searcher.numDocs":0,
   [junit4]   2>     "shard":"shard1",
   [junit4]   2>     "collection":"testBasic"}}
   [junit4]   2> 497930 DEBUG (ScheduledTrigger-2010-thread-2) [    ] o.a.s.c.a.NodeLostTrigger Running NodeLostTrigger: node_lost_trigger1 with currently live nodes: 100
   [junit4]   2> 497950 DEBUG (ScheduledTrigger-2010-thread-2) [    ] o.a.s.c.a.NodeLostTrigger Running NodeLostTrigger: node_lost_trigger1 with currently live nodes: 100
   [junit4]   2> 497971 DEBUG (ScheduledTrigger-2010-thread-2) [    ] o.a.s.c.a.NodeLostTrigger Running NodeLostTrigger: node_lost_trigger1 with currently live nodes: 100
   [junit4]   2> 497991 DEBUG (ScheduledTrigger-2010-thread-2) [    ] o.a.s.c.a.NodeLostTrigger Running NodeLostTrigger: node_lost_trigger1 with currently live nodes: 100
   [junit4]   2> 498011 DEBUG (ScheduledTrigger-2010-thread-2) [    ] o.a.s.c.a.NodeLostTrigger Running NodeLostTrigger: node_lost_trigger1 with currently live nodes: 100
   [junit4]   2> 498031 DEBUG (ScheduledTrigger-2010-thread-2) [    ] o.a.s.c.a.NodeLostTrigger Running NodeLostTrigger: node_lost_trigger1 with currently live nodes: 100
   [junit4]   2> 498052 DEBUG (ScheduledTrigger-2010-thread-2) [    ] o.a.s.c.a.NodeLostTrigger Running NodeLostTrigger: node_lost_trigger1 with currently live nodes: 100
   [junit4]   2> 498072 DEBUG (ScheduledTrigger-2010-thread-2) [    ] o.a.s.c.a.NodeLostTrigger Running NodeLostTrigger: node_lost_trigger1 with currently live nodes: 100
   [junit4]   2> 498129 DEBUG (ScheduledTrigger-2010-thread-2) [    ] o.a.s.c.a.NodeLostTrigger Running NodeLostTrigger: node_lost_trigger1 with currently live nodes: 100
   [junit4]   2> 498151 DEBUG (ScheduledTrigger-2010-thread-2) [    ] o.a.s.c.a.NodeLostTrigger Running NodeLostTrigger: node_lost_trigger1 with currently live nodes: 100
   [junit4]   2> 498171 DEBUG (ScheduledTrigger-2010-thread-2) [    ] o.a.s.c.a.NodeLostTrigger Running NodeLostTrigger: node_lost_trigger1 with currently live nodes: 100
   [junit4]   2> 498191 DEBUG (ScheduledTrigger-2010-thread-2) [    ] o.a.s.c.a.NodeLostTrigger Running NodeLostTrigger: node_lost_trigger1 with currently live nodes: 100
   [junit4]   2> 498212 DEBUG (ScheduledTrigger-2010-thread-2) [    ] o.a.s.c.a.NodeLostTrigger Running NodeLostTrigger: node_lost_trigger1 with currently live nodes: 100
   [junit4]   2> 498232 DEBUG (ScheduledTrigger-2010-thread-2) [    ] o.a.s.c.a.NodeLostTrigger Running NodeLostTrigger: node_lost_trigger1 with currently live nodes: 100
   [junit4]   2> 498253 DEBUG (ScheduledTrigger-2010-thread-2) [    ] o.a.s.c.a.NodeLostTrigger Running NodeLostTrigger: node_lost_trigger1 with currently live nodes: 100
   [junit4]   2> 498273 DEBUG (ScheduledTrigger-2010-thread-2) [    ] o.a.s.c.a.NodeLostTrigger Running NodeLostTrigger: node_lost_trigger1 with currently live nodes: 100
   [junit4]   2> 498293 DEBUG (ScheduledTrigger-2010-thread-2) [    ] o.a.s.c.a.NodeLostTrigger Running NodeLostTrigger: node_lost_trigger1 with currently live nodes: 100
   [junit4]   2> 498313 DEBUG (ScheduledTrigger-2010-thread-2) [    ] o.a.s.c.a.NodeLostTrigger Running NodeLostTrigger: node_lost_trigger1 with currently live nodes: 100
   [junit4]   2> 498334 DEBUG (ScheduledTrigger-2010-thread-2) [    ] o.a.s.c.a.NodeLostTrigger Running NodeLostTrigger: node_lost_trigger1 with currently live nodes: 100
   [junit4]   2> 498354 DEBUG (ScheduledTrigger-2010-thread-2) [    ] o.a.s.c.a.NodeLostTrigger Running NodeLostTrigger: node_lost_trigger1 with currently live nodes: 100
   [junit4]   2> 498374 DEBUG (ScheduledTrigger-2010-thread-2) [    ] o.a.s.c.a.NodeLostTrigger Running NodeLostTrigger: node_lost_trigger1 with currently live nodes: 100
   [junit4]   2> 498391 INFO  (TEST-TestLargeCluster.testBasic-seed#[FE73765F74045A74]) [    ] o.a.s.c.a.s.TestLargeCluster Ready after 24025ms
   [junit4]   2> 498395 DEBUG (ScheduledTrigger-2010-thread-2) [    ] o.a.s.c.a.NodeLostTrigger Running NodeLostTrigger: node_lost_trigger1 with currently live nodes: 99
   [junit4]   2> 498395 DEBUG (ScheduledTrigger-2010-thread-2) [    ] o.a.s.c.a.NodeLostTrigger Tracking lost node: 127.0.0.1:10026_solr
   [junit4]   2> 498415 DEBUG (ScheduledTrigger-2010-thread-2) [    ] o.a.s.c.a.NodeLostTrigger Running NodeLostTrigger: node_lost_trigger1 with currently live nodes: 99
   [junit4]   2> 498435 DEBUG (ScheduledTrigger-2010-thread-2) [    ] o.a.s.c.a.NodeLostTrigger Running NodeLostTrigger: node_lost_trigger1 with currently live nodes: 99
   [junit4]   2> 498456 DEBUG (ScheduledTrigger-2010-thread-2) [    ] o.a.s.c.a.NodeLostTrigger Running NodeLostTrigger: node_lost_trigger1 with currently live nodes: 98
   [junit4]   2> 498456 DEBUG (ScheduledTrigger-2010-thread-2) [    ] o.a.s.c.a.NodeLostTrigger Tracking lost node: 127.0.0.1:10016_solr
   [junit4]   2> 498476 DEBUG (ScheduledTrigger-2010-thread-2) [    ] o.a.s.c.a.NodeLostTrigger Running NodeLostTrigger: node_lost_trigger1 with currently live nodes: 98
   [junit4]   2> 498496 DEBUG (ScheduledTrigger-2010-thread-2) [    ] o.a.s.c.a.NodeLostTrigger Running NodeLostTrigger: node_lost_trigger1 with currently live nodes: 98
   [junit4]   2> 498497 DEBUG (ScheduledTrigger-2010-thread-2) [    ] o.a.s.c.a.NodeLostTrigger NodeLostTrigger firing registered processor for lost nodes: [127.0.0.1:10026_solr]
   [junit4]   2> 498500 DEBUG (ScheduledTrigger-2010-thread-2) [    ] o.a.s.c.a.ScheduledTriggers ++++++++ Cooldown inactive - processing event: {
   [junit4]   2>   "id":"6df53833e0c66fT1f7726pjk2wwhro1lfpym7xhi",
   [junit4]   2>   "source":"node_lost_trigger1",
   [junit4]   2>   "eventTime":30950394198804079,
   [junit4]   2>   "eventType":"NODELOST",
   [junit4]   2>   "properties":{
   [junit4]   2>     "eventTimes":[30950394198804079],
   [junit4]   2>     "nodeNames":["127.0.0.1:10026_solr"]}}
   [junit4]   2> 498539 DEBUG (ScheduledTrigger-2010-thread-2) [    ] o.a.s.c.a.ScheduledTriggers Pausing all triggers: [node_lost_trigger1]
   [junit4]   2> 498824 INFO  (simCloudManagerPool-2009-thread-127) [    ] o.a.s.c.ActionThrottle Throttling leader attempts - waiting for 4890ms
   [junit4]   2> 498828 DEBUG (simCloudManagerPool-2009-thread-99) [    ] o.a.s.c.a.s.SimClusterStateProvider -- no leader in shard1:{
   [junit4]   2>   "replicas":{"core_node1":{
   [junit4]   2>       "core":".system_shard1_replica_n1",
   [junit4]   2>       "SEARCHER.searcher.maxDoc":0,
   [junit4]   2>       "SEARCHER.searcher.deletedDocs":0,
   [junit4]   2>       "INDEX.sizeInBytes":10240,
   [junit4]   2>       "node_name":"127.0.0.1:10091_solr",
   [junit4]   2>       "state":"active",
   [junit4]   2>       "type":"NRT",
   [junit4]   2>       "INDEX.sizeInGB":9.5367431640625E-6,
   [junit4]   2>       "SEARCHER.searcher.numDocs":0}},
   [junit4]   2>   "range":"80000000-7fffffff",
   [junit4]   2>   "state":"active"}
   [junit4]   2> 498840 DEBUG (simCloudManagerPool-2009-thread-101) [    ] o.a.s.c.a.s.SimClusterStateProvider -- no leader in shard1:{
   [junit4]   2>   "replicas":{"core_node1":{
   [junit4]   2>       "core":".system_shard1_replica_n1",
   [junit4]   2>       "SEARCHER.searcher.maxDoc":0,
   [junit4]   2>       "SEARCHER.searcher.deletedDocs":0,
   [junit4]   2>       "INDEX.sizeInBytes":10240,
   [junit4]   2>       "node_name":"127.0.0.1:10091_solr",
   [junit4]   2>       "state":"active",
   [junit4]   2>       "type":"NRT",
   [junit4]   2>       "INDEX.sizeInGB":9.5367431640625E-6,
   [junit4]   2>       "SEARCHER.searcher.numDocs":0}},
   [junit4]   2>   "range":"80000000-7fffffff",
   [junit4]   2>   "state":"active"}
   [junit4]   2> 498844 DEBUG (simCloudManagerPool-2009-thread-122) [    ] o.a.s.c.a.s.SimClusterStateProvider -- elected new leader for testBasic / shard4: {"core_node54":{
   [junit4]   2>     "core":"testBasic_shard4_replica_t54",
   [junit4]   2>     "leader":"true",
   [junit4]   2>     "SEARCHER.searcher.maxDoc":0,
   [junit4]   2>     "SEARCHER.searcher.deletedDocs":0,
   [junit4]   2>     "INDEX.sizeInBytes":10240,
   [junit4]   2>     "node_name":"127.0.0.1:10087_solr",
   [junit4]   2>     "state":"active",
   [junit4]   2>     "type":"TLOG",
   [junit4]   2>     "INDEX.sizeInGB":9.5367431640625E-6,
   [junit4]   2>     "SEARCHER.searcher.numDocs":0,
   [junit4]   2>     "shard":"shard4",
   [junit4]   2>     "collection":"testBasic"}}
   [junit4]   2> 498882 DEBUG (simCloudManagerPool-2009-thread-130) [    ] o.a.s.c.a.s.SimClusterStateProvider -- no leader in shard1:{
   [junit4]   2>   "replicas":{"core_node1":{
   [junit4]   2>       "core":".system_shard1_replica_n1",
   [junit4]   2>       "SEARCHER.searcher.maxDoc":0,
   [junit4]   2>       "SEARCHER.searcher.deletedDocs":0,
   [junit4]   2>       "INDEX.sizeInBytes":10240,
   [junit4]   2>       "node_name":"127.0.0.1:10091_solr",
   [junit4]   2>       "state":"active",
   [junit4]   2>       "type":"NRT",
   [junit4]   2>       "INDEX.sizeInGB":9.5367431640625E-6,
   [junit4]   2>       "SEARCHER.searcher.numDocs":0}},
   [junit4]   2>   "range":"80000000-7fffffff",
   [junit4]   2>   "state":"active"}
   [junit4]   2> 498886 DEBUG (AutoscalingActionExecutor-2011-thread-1) [    ] o.a.s.c.a.ScheduledTriggers -- processing actions for {
   [junit4]   2>   "id":"6df53833e0c66fT1f7726pjk2wwhro1lfpym7xhi",
   [junit4]   2>   "source":"node_lost_trigger1",
   [junit4]   2>   "eventTime":30950394198804079,
   [junit4]   2>   "eventType":"NODELOST",
   [junit4]   2>   "properties":{
   [junit4]   2>     "eventTimes":[30950394198804079],
   [junit4]   2>     "_enqueue_time_":30950401464535479,
   [junit4]   2>     "nodeNames":["127.0.0.1:10026_solr"]}}
   [junit4]   2> 498901 DEBUG (AutoscalingActionExecutor-2011-thread-1) [    ] o.a.s.c.a.ComputePlanAction -- processing event: {
   [junit4]   2>   "id":"6df53833e0c66fT1f7726pjk2wwhro1lfpym7xhi",
   [junit4]   2>   "source":"node_lost_trigger1",
   [junit4]   2>   "eventTime":30950394198804079,
   [junit4]   2>   "eventType":"NODELOST",
   [junit4]   2>   "properties":{
   [junit4]   2>     "eventTimes":[30950394198804079],
   [junit4]   2>     "_enqueue_time_":30950401464535479,
   [junit4]   2>     "nodeNames":["127.0.0.1:10026_solr"]}} with context properties: {AFTER_ACTION=[start], BEFORE_ACTION=[start, compute]}
   [junit4]   2> 498911 DEBUG (simCloudManagerPool-2009-thread-131) [    ] o.a.s.c.a.s.SimClusterStateProvider -- no leader in shard1:{
   [junit4]   2>   "replicas":{"core_node1":{
   [junit4]   2>       "core":".system_shard1_replica_n1",
   [junit4]   2>       "SEARCHER.searcher.maxDoc":0,
   [junit4]   2>       "SEARCHER.searcher.deletedDocs":0,
   [junit4]   2>       "INDEX.sizeInBytes":10240,
   [junit4]   2>       "node_name":"127.0.0.1:10091_solr",
   [junit4]   2>       "state":"active",
   [junit4]   2>       "type":"NRT",
   [junit4]   2>       "INDEX.sizeInGB":9.5367431640625E-6,
   [junit4]   2>       "SEARCHER.searcher.numDocs":0}},
   [junit4]   2>   "range":"80000000-7fffffff",
   [junit4]   2>   "state":"active"}
   [junit4]   2> 498923 DEBUG (simCloudManagerPool-2009-thread-132) [    ] o.a.s.c.a.s.SimClusterStateProvider -- no leader in shard1:{
   [junit4]   2>   "replicas":{"core_node1":{
   [junit4]   2>       "core":".system_shard1_replica_n1",
   [junit4]   2>       "SEARCHER.searcher.maxDoc":0,
   [junit4]   2>       "SEARCHER.searcher.deletedDocs":0,
   [junit4]   2>       "INDEX.sizeInBytes":10240,
   [junit4]   2>       "node_name":"127.0.0.1:10091_solr",
   [junit4]   2>       "state":"active",
   [junit4]   2>       "type":"NRT",
   [junit4]   2>       "INDEX.sizeInGB":9.5367431640625E-6,
   [junit4]   2>       "SEARCHER.searcher.numDocs":0}},
   [junit4]   2>   "range":"80000000-7fffffff",
   [junit4]   2>   "state":"active"}
   [junit4]   2> 499274 INFO  (AutoscalingActionExecutor-2011-thread-1) [    ] o.a.s.c.a.ComputePlanAction Computed Plan: action=MOVEREPLICA&collection=testBasic&targetNode=127.0.0.1:10072_solr&inPlaceMove=true&replica=core_node19
   [junit4]   2> 499277 INFO  (AutoscalingActionExecutor-2011-thread-1) [    ] o.a.s.c.s.c.a.PolicyHelper returnSession, curr-time 30950438315 sessionWrapper.createTime 30950423879844829, this.sessionWrapper.createTime 30950423879844829 
   [junit4]   2> 499277 DEBUG (AutoscalingActionExecutor-2011-thread-1) [    ] o.a.s.c.a.ExecutePlanAction -- processing event: {
   [junit4]   2>   "id":"6df53833e0c66fT1f7726pjk2wwhro1lfpym7xhi",
   [junit4]   2>   "source":"node_lost_trigger1",
   [junit4]   2>   "eventTime":30950394198804079,
   [junit4]   2>   "eventType":"NODELOST",
   [junit4]   2>   "properties":{
   [junit4]   2>     "eventTimes":[30950394198804079],
   [junit4]   2>     "_enqueue_time_":30950401464535479,
   [junit4]   2>     "nodeNames":["127.0.0.1:10026_solr"]}} with context properties: {operations=[org.apache.solr.client.solrj.request.CollectionAdminRequest$MoveReplica@41cd0cb], AFTER_ACTION=[start, compute], BEFORE_ACTION=[start, compute, execute]}
   [junit4]   2> 499278 DEBUG (AutoscalingActionExecutor-2011-thread-1) [    ] o.a.s.c.a.ExecutePlanAction Executing operation: action=MOVEREPLICA&collection=testBasic&targetNode=127.0.0.1:10072_solr&inPlaceMove=true&replica=core_node19
   [junit4]   2> 499379 DEBUG (simCloudManagerPool-2009-thread-134) [    ] o.a.s.c.a.s.SimClusterStateProvider -- new replica: {"core_node77":{
   [junit4]   2>     "core":"testBasic_shard2_replica_n76",
   [junit4]   2>     "shard":"shard2",
   [junit4]   2>     "collection":"testBasic",
   [junit4]   2>     "node_name":"127.0.0.1:10072_solr",
   [junit4]   2>     "type":"NRT"}}
   [junit4]   2> 499609 DEBUG (simCloudManagerPool-2009-thread-142) [    ] o.a.s.c.a.s.SimClusterStateProvider -- no leader in shard1:{
   [junit4]   2>   "replicas":{"core_node1":{
   [junit4]   2>       "core":".system_shard1_replica_n1",
   [junit4]   2>       "SEARCHER.searcher.maxDoc":0,
   [junit4]   2>       "SEARCHER.searcher.deletedDocs":0,
   [junit4]   2>       "INDEX.sizeInBytes":10240,
   [junit4]   2>       "node_name":"127.0.0.1:10091_solr",
   [junit4]   2>       "state":"active",
   [junit4]   2>       "type":"NRT",
   [junit4]   2>       "INDEX.sizeInGB":9.5367431640625E-6,
   [junit4]   2>       "SEARCHER.searcher.numDocs":0}},
   [junit4]   2>   "range":"80000000-7fffffff",
   [junit4]   2>   "state":"active"}
   [junit4]   2> 499611 DEBUG (AutoscalingActionExecutor-2011-thread-1) [    ] o.a.s.c.a.ScheduledTriggers Resuming trigger: node_lost_trigger1 after 100ms
   [junit4]   2> 499612 DEBUG (AutoscalingActionExecutor-2011-thread-1) [    ] o.a.s.c.a.ScheduledTriggers -- processing took 36256 ms for event id=6df53833e0c66fT1f7726pjk2wwhro1lfpym7xhi
   [junit4]   2> 499713 DEBUG (ScheduledTrigger-2010-thread-3) [    ] o.a.s.c.a.NodeLostTrigger Running NodeLostTrigger: node_lost_trigger1 with currently live nodes: 92
   [junit4]   2> 499713 DEBUG (ScheduledTrigger-2010-thread-3) [    ] o.a.s.c.a.NodeLostTrigger Tracking lost node: 127.0.0.1:10066_solr
   [junit4]   2> 499713 DEBUG (ScheduledTrigger-2010-thread-3) [    ] o.a.s.c.a.NodeLostTrigger Tracking lost node: 127.0.0.1:10022_solr
   [junit4]   2> 499713 DEBUG (ScheduledTrigger-2010-thread-3) [    ] o.a.s.c.a.NodeLostTrigger Tracking lost node: 127.0.0.1:10095_solr
   [junit4]   2> 499713 DEBUG (ScheduledTrigger-2010-thread-3) [    ] o.a.s.c.a.NodeLostTrigger Tracking lost node: 127.0.0.1:10055_solr
   [junit4]   2> 499713 DEBUG (ScheduledTrigger-2010-thread-3) [    ] o.a.s.c.a.NodeLostTrigger Tracking lost node: 127.0.0.1:10025_solr
   [junit4]   2> 499713 DEBUG (ScheduledTrigger-2010-thread-3) [    ] o.a.s.c.a.NodeLostTrigger Tracking lost node: 127.0.0.1:10011_solr
   [junit4]   2> 499714 DEBUG (ScheduledTrigger-2010-thread-3) [    ] o.a.s.c.a.NodeLostTrigger NodeLostTrigger firing registered processor for lost nodes: [127.0.0.1:10016_solr]
   [junit4]   2> 499714 DEBUG (ScheduledTrigger-2010-thread-3) [    ] o.a.s.c.a.ScheduledTriggers ++++++++ Cooldown inactive - processing event: {
   [junit4]   2>   "id":"6df538e9e4008fT1f7726pjk2wwhro1lfpym7xhl",
   [junit4]   2>   "source":"node_lost_trigger1",
   [junit4]   2>   "eventTime":30950397252468879,
   [junit4]   2>   "eventType":"NODELOST",
   [junit4]   2>   "properties":{
   [junit4]   2>     "eventTimes":[30950397252468879],
   [junit4]   2>     "nodeNames":["127.0.0.1:10016_solr"]}}
   [junit4]   2> 499714 DEBUG (ScheduledTrigger-2010-thread-3) [    ] o.a.s.c.a.ScheduledTriggers Pausing all triggers: [node_lost_trigger1]
   [junit4]   2> 499734 DEBUG (simCloudManagerPool-2009-thread-143) [    ] o.a.s.c.a.s.SimClusterStateProvider -- no leader in shard1:{
   [junit4]   2>   "replicas":{"core_node1":{
   [junit4]   2>       "core":".system_shard1_replica_n1",
   [junit4]   2>       "SEARCHER.searcher.maxDoc":0,
   [junit4]   2>       "SEARCHER.searcher.deletedDocs":0,
   [junit4]   2>       "INDEX.sizeInBytes":10240,
   [junit4]   2>       "node_name":"127.0.0.1:10091_solr",
   [junit4]   2>       "state":"active",
   [junit4]   2>       "type":"NRT",
   [junit4]   2>       "INDEX.sizeInGB":9.5367431640625E-6,
   [junit4]   2>       "SEARCHER.searcher.numDocs":0}},
   [junit4]   2>   "range":"80000000-7fffffff",
   [junit4]   2>   "state":"active"}
   [junit4]   2> 499734 DEBUG (AutoscalingActionExecutor-2011-thread-1) [    ] o.a.s.c.a.ScheduledTriggers -- processing actions for {
   [junit4]   2>   "id":"6df538e9e4008fT1f7726pjk2wwhro1lfpym7xhl",
   [junit4]   2>   "source":"node_lost_trigger1",
   [junit4]   2>   "eventTime":30950397252468879,
   [junit4]   2>   "eventType":"NODELOST",
   [junit4]   2>   "properties":{
   [junit4]   2>     "eventTimes":[30950397252468879],
   [junit4]   2>     "_enqueue_time_":30950460146581979,
   [junit4]   2>     "nodeNames":["127.0.0.1:10016_solr"]}}
   [junit4]   2> 499734 DEBUG (AutoscalingActionExecutor-2011-thread-1) [    ] o.a.s.c.a.ComputePlanAction -- processing event: {
   [junit4]   2>   "id":"6df538e9e4008fT1f7726pjk2wwhro1lfpym7xhl",
   [junit4]   2>   "source":"node_lost_trigger1",
   [junit4]   2>   "eventTime":30950397252468879,
   [junit4]   2>   "eventType":"NODELOST",
   [junit4]   2>   "properties":{
   [junit4]   2>     "eventTimes":[30950397252468879],
   [junit4]   2>     "_enqueue_time_":30950460146581979,
   [junit4]   2>     "nodeNames":["127.0.0.1:10016_solr"]}} with context properties: {AFTER_ACTION=[start], BEFORE_ACTION=[start, compute]}
   [junit4]   2> 499855 INFO  (AutoscalingActionExecutor-2011-thread-1) [    ] o.a.s.c.a.ComputePlanAction Computed Plan: action=MOVEREPLICA&collection=testBasic&targetNode=127.0.0.1:10056_solr&inPlaceMove=true&replica=core_node9
   [junit4]   2> 499857 INFO  (AutoscalingActionExecutor-2011-thread-1) [    ] o.a.s.c.s.c.a.PolicyHelper returnSession, curr-time 30950467294 sessionWrapper.createTime 30950461302797929, this.sessionWrapper.createTime 30950461302797929 
   [junit4]   2> 499857 DEBUG (AutoscalingActionExecutor-2011-thread-1) [    ] o.a.s.c.a.ExecutePlanAction -- processing event: {
   [junit4]   2>   "id":"6df538e9e4008fT1f7726pjk2wwhro1lfpym7xhl",
   [junit4]   2>   "source":"node_lost_trigger1",
   [junit4]   2>   "eventTime":30950397252468879,
   [junit4]   2>   "eventType":"NODELOST",
   [junit4]   2>   "properties":{
   [junit4]   2>     "eventTimes":[30950397252468879],
   [junit4]   2>     "_enqueue_time_":30950460146581979,
   [junit4]   2>     "nodeNames":["127.0.0.1:10016_solr"]}} with context properties: {operations=[org.apache.solr.client.solrj.request.CollectionAdminRequest$MoveReplica@3140badf], AFTER_ACTION=[start, compute], BEFORE_ACTION=[start, compute, execute]}
   [junit4]   2> 499857 DEBUG (AutoscalingActionExecutor-2011-thread-1) [    ] o.a.s.c.a.ExecutePlanAction Executing operation: action=MOVEREPLICA&collection=testBasic&targetNode=127.0.0.1:10056_solr&inPlaceMove=true&replica=core_node9
   [junit4]   2> 499978 DEBUG (simCloudManagerPool-2009-thread-144) [    ] o.a.s.c.a.s.SimClusterStateProvider -- new replica: {"core_node79":{
   [junit4]   2>     "core":"testBasic_shard1_replica_t78",
   [junit4]   2>     "shard":"shard1",
   [junit4]   2>     "collection":"testBasic",
   [junit4]   2>     "node_name":"127.0.0.1:10056_solr",
   [junit4]   2>     "type":"TLOG"}}
   [junit4]   2> 500235 DEBUG (simCloudManagerPool-2009-thread-152) [    ] o.a.s.c.a.s.SimClusterStateProvider -- no leader in shard1:{
   [junit4]   2>   "replicas":{"core_node1":{
   [junit4]   2>       "core":".system_shard1_replica_n1",
   [junit4]   2>       "SEARCHER.searcher.maxDoc":0,
   [junit4]   2>       "SEARCHER.searcher.deletedDocs":0,
   [junit4]   2>       "INDEX.sizeInBytes":10240,
   [junit4]   2>       "node_name":"127.0.0.1:10091_solr",
   [junit4]   2>       "state":"active",
   [junit4]   2>       "type":"NRT",
   [junit4]   2>       "INDEX.sizeInGB":9.5367431640625E-6,
   [junit4]   2>       "SEARCHER.searcher.numDocs":0}},
   [junit4]   2>   "range":"80000000-7fffffff",
   [junit4]   2>   "state":"active"}
   [junit4]   2> 500235 DEBUG (AutoscalingActionExecutor-2011-thread-1) [    ] o.a.s.c.a.ScheduledTriggers Resuming trigger: node_lost_trigger1 after 100ms
   [junit4]   2> 500235 DEBUG (AutoscalingActionExecutor-2011-thread-1) [    ] o.a.s.c.a.ScheduledTriggers -- processing took 25038 ms for event id=6df538e9e4008fT1f7726pjk2wwhro1lfpym7xhl
   [junit4]   2> 500335 DEBUG (ScheduledTrigger-2010-thread-4) [    ] o.a.s.c.a.NodeLostTrigger Running NodeLostTrigger: node_lost_trigger1 with currently live nodes: 92
   [junit4]   2> 500336 DEBUG (ScheduledTrigger-2010-thread-4) [    ] o.a.s.c.a.NodeLostTrigger NodeLostTrigger firing registered processor for lost nodes: [127.0.0.1:10022_solr, 127.0.0.1:10055_solr, 127.0.0.1:10025_solr, 127.0.0.1:10066_solr, 127.0.0.1:10095_solr, 127.0.0.1:10011_solr]
   [junit4]   2> 500336 DEBUG (ScheduledTrigger-2010-thread-4) [    ] o.a.s.c.a.ScheduledTriggers ++++++++ Cooldown inactive - processing event: {
   [junit4]   2>   "id":"6df5478d9dda7bT1f7726pjk2wwhro1lfpym7xho",
   [junit4]   2>   "source":"node_lost_trigger1",
   [junit4]   2>   "eventTime":30950460128877179,
   [junit4]   2>   "eventType":"NODELOST",
   [junit4]   2>   "properties":{
   [junit4]   2>     "eventTimes":[
   [junit4]   2>       30950460128877179,
   [junit4]   2>       30950460130752729,
   [junit4]   2>       30950460131666129,
   [junit4]   2>       30950460127525379,
   [junit4]   2>       30950460129830179,
   [junit4]   2>       30950460132575379],
   [junit4]   2>     "nodeNames":[
   [junit4]   2>       "127.0.0.1:10022_solr",
   [junit4]   2>       "127.0.0.1:10055_solr",
   [junit4]   2>       "127.0.0.1:10025_solr",
   [junit4]   2>       "127.0.0.1:10066_solr",
   [junit4]   2>       "127.0.0.1:10095_solr",
   [junit4]   2>       "127.0.0.1:10011_solr"]}}
   [junit4]   2> 500336 DEBUG (ScheduledTrigger-2010-thread-4) [    ] o.a.s.c.a.ScheduledTriggers Pausing all triggers: [node_lost_trigger1]
   [junit4]   2> 500337 DEBUG (simCloudManagerPool-2009-thread-153) [    ] o.a.s.c.a.s.SimClusterStateProvider -- no leader in shard1:{
   [junit4]   2>   "replicas":{"core_node1":{
   [junit4]   2>       "core":".system_shard1_replica_n1",
   [junit4]   2>       "SEARCHER.searcher.maxDoc":0,
   [junit4]   2>       "SEARCHER.searcher.deletedDocs":0,
   [junit4]   2>       "INDEX.sizeInBytes":10240,
   [junit4]   2>       "node_name":"127.0.0.1:10091_solr",
   [junit4]   2>       "state":"active",
   [junit4]   2>       "type":"NRT",
   [junit4]   2>       "INDEX.sizeInGB":9.5367431640625E-6,
   [junit4]   2>       "SEARCHER.searcher.numDocs":0}},
   [junit4]   2>   "range":"80000000-7fffffff",
   [junit4]   2>   "state":"active"}
   [junit4]   2> 500337 DEBUG (AutoscalingActionExecutor-2011-thread-1) [    ] o.a.s.c.a.ScheduledTriggers -- processing actions for {
   [junit4]   2>   "id":"6df5478d9dda7bT1f7726pjk2wwhro1lfpym7xho",
   [junit4]   2>   "source":"node_lost_trigger1",
   [junit4]   2>   "eventTime":30950460128877179,
   [junit4]   2>   "eventType":"NODELOST",
   [junit4]   2>   "properties":{
   [junit4]   2>     "eventTimes":[
   [junit4]   2>       30950460128877179,
   [junit4]   2>       30950460130752729,
   [junit4]   2>       30950460131666129,
   [junit4]   2>       30950460127525379,
   [junit4]   2>       30950460129830179,
   [junit4]   2>       30950460132575379],
   [junit4]   2>     "_enqueue_time_":30950491252585029,
   [junit4]   2>     "nodeNames":[
   [junit4]   2>       "127.0.0.1:10022_solr",
   [junit4]   2>       "127.0.0.1:10055_solr",
   [junit4]   2>       "127.0.0.1:10025_solr",
   [junit4]   2>       "127.0.0.1:10066_solr",
   [junit4]   2>       "127.0.0.1:10095_solr",
   [junit4]   2>       "127.0.0.1:10011_solr"]}}
   [junit4]   2> 500338 DEBUG (AutoscalingActionExecutor-2011-thread-1) [    ] o.a.s.c.a.ComputePlanAction -- processing event: {
   [junit4]   2>   "id":"6df5478d9dda7bT1f7726pjk2wwhro1lfpym7xho",
   [junit4]   2>   "source":"node_lost_trigger1",
   [junit4]   2>   "eventTime":30950460128877179,
   [junit4]   2>   "eventType":"NODELOST",
   [junit4]   2>   "properties":{
   [junit4]   2>     "eventTimes":[
   [junit4]   2>       30950460128877179,
   [junit4]   2>       30950460130752729,
   [junit4]   2>       30950460131666129,
   [junit4]   2>       30950460127525379,
   [junit4]   2>       30950460129830179,
   [junit4]   2>       30950460132575379],
   [junit4]   2>     "_enqueue_time_":30950491252585029,
   [junit4]   2>     "nodeNames":[
   [junit4]   2>       "127.0.0.1:10022_solr",
   [junit4]   2>       "127.0.0.1:10055_solr",
   [junit4]   2>       "127.0.0.1:10025_solr",
   [junit4]   2>       "127.0.0.1:10066_solr",
   [junit4]   2>       "127.0.0.1:10095_solr",
   [junit4]   2>       "127.0.0.1:10011_solr"]}} with context properties: {AFTER_ACTION=[start], BEFORE_ACTION=[start, compute]}
   [junit4]   2> 500693 INFO  (AutoscalingActionExecutor-2011-thread-1) [    ] o.a.s.c.a.ComputePlanAction Computed Plan: action=MOVEREPLICA&collection=testBasic&targetNode=127.0.0.1:10059_solr&inPlaceMove=true&replica=core_node23
   [junit4]   2> 500851 INFO  (AutoscalingActionExecutor-2011-thread-1) [    ] o.a.s.c.a.ComputePlanAction Computed Plan: action=MOVEREPLICA&collection=testBasic&targetNode=127.0.0.1:10053_solr&inPlaceMove=true&replica=core_node50
   [junit4]   2> 500914 INFO  (AutoscalingActionExecutor-2011-thread-1) [    ] o.a.s.c.a.ComputePlanAction Computed Plan: action=MOVEREPLICA&collection=testBasic&targetNode=127.0.0.1:10037_solr&inPlaceMove=true&replica=core_node60
   [junit4]   2> 500960 INFO  (AutoscalingActionExecutor-2011-thread-1) [    ] o.a.s.c.a.ComputePlanAction Computed Plan: action=MOVEREPLICA&collection=testBasic&targetNode=127.0.0.1:10094_solr&inPlaceMove=true&replica=core_node34
   [junit4]   2> 501008 INFO  (AutoscalingActionExecutor-2011-thread-1) [    ] o.a.s.c.a.ComputePlanAction Computed Plan: action=MOVEREPLICA&collection=testBasic&targetNode=127.0.0.1:10034_solr&inPlaceMove=true&replica=core_node70
   [junit4]   2> 501025 INFO  (AutoscalingActionExecutor-2011-thread-1) [    ] o.a.s.c.a.ComputePlanAction Computed Plan: action=MOVEREPLICA&collection=testBasic&targetNode=127.0.0.1:10031_solr&inPlaceMove=true&replica=core_node72
   [junit4]   2> 501025 INFO  (AutoscalingActionExecutor-2011-thread-1) [    ] o.a.s.c.s.c.a.PolicyHelper returnSession, curr-time 30950525711 sessionWrapper.createTime 30950491440165479, this.sessionWrapper.createTime 30950491440165479 
   [junit4]   2> 501025 DEBUG (AutoscalingActionExecutor-2011-thread-1) [    ] o.a.s.c.a.ExecutePlanAction -- processing event: {
   [junit4]   2>   "id":"6df5478d9dda7bT1f7726pjk2wwhro1lfpym7xho",
   [junit4]   2>   "source":"node_lost_trigger1",
   [junit4]   2>   "eventTime":30950460128877179,
   [junit4]   2>   "eventType":"NODELOST",
   [junit4]   2>   "properties":{
   [junit4]   2>     "eventTimes":[
   [junit4]   2>       30950460128877179,
   [junit4]   2>       30950460130752729,
   [junit4]   2>       30950460131666129,
   [junit4]   2>       30950460127525379,
   [junit4]   2>       30950460129830179,
   [junit4]   2>       30950460132575379],
   [junit4]   2>     "_enqueue_time_":30950491252585029,
   [junit4]   2>     "nodeNames":[
   [junit4]   2>       "127.0.0.1:10022_solr",
   [junit4]   2>       "127.0.0.1:10055_solr",
   [junit4]   2>       "127.0.0.1:10025_solr",
   [junit4]   2>       "127.0.0.1:10066_solr",
   [junit4]   2>       "127.0.0.1:10095_solr",
   [junit4]   2>       "127.0.0.1:10011_solr"]}} with context properties: {operations=[org.apache.solr.client.solrj.request.CollectionAdminRequest$MoveReplica@2f420b25, org.apache.solr.client.solrj.request.CollectionAdminRequest$MoveReplica@6f248a7e, org.apache.solr.client.solrj.request.CollectionAdminRequest$MoveReplica@6794e605, org.apache.solr.client.solrj.request.CollectionAdminRequest$MoveReplica@649be8e, org.apache.solr.client.solrj.request.CollectionAdminRequest$MoveReplica@39ed8641, org.apache.solr.client.solrj.request.CollectionAdminRequest$MoveReplica@72d19c78], AFTER_ACTION=[start, compute], BEFORE_ACTION=[start, compute, execute]}
   [junit4]   2> 501025 DEBUG (AutoscalingActionExecutor-2011-thread-1) [    ] o.a.s.c.a.ExecutePlanAction Executing operation: action=MOVEREPLICA&collection=testBasic&targetNode=127.0.0.1:10059_solr&inPlaceMove=true&replica=core_node23
   [junit4]   2> 501137 DEBUG (simCloudManagerPool-2009-thread-154) [    ] o.a.s.c.a.s.SimClusterStateProvider -- new replica: {"core_node81"

[...truncated too long message...]

rkspace/Lucene-Solr-BadApples-Tests-master/lucene/top-level-ivy-settings.xml

resolve:

ivy-availability-check:
[loadresource] Do not set property disallowed.ivy.jars.list as its length is 0.

-ivy-fail-disallowed-ivy-version:

ivy-fail:

ivy-fail:

ivy-configure:
[ivy:configure] :: loading settings :: file = /x1/jenkins/jenkins-slave/workspace/Lucene-Solr-BadApples-Tests-master/lucene/top-level-ivy-settings.xml

resolve:

ivy-availability-check:
[loadresource] Do not set property disallowed.ivy.jars.list as its length is 0.

-ivy-fail-disallowed-ivy-version:

ivy-fail:

ivy-configure:
[ivy:configure] :: loading settings :: file = /x1/jenkins/jenkins-slave/workspace/Lucene-Solr-BadApples-Tests-master/lucene/top-level-ivy-settings.xml

resolve:

ivy-availability-check:
[loadresource] Do not set property disallowed.ivy.jars.list as its length is 0.

-ivy-fail-disallowed-ivy-version:

ivy-fail:

ivy-fail:

ivy-configure:
[ivy:configure] :: loading settings :: file = /x1/jenkins/jenkins-slave/workspace/Lucene-Solr-BadApples-Tests-master/lucene/top-level-ivy-settings.xml

resolve:

ivy-availability-check:
[loadresource] Do not set property disallowed.ivy.jars.list as its length is 0.

-ivy-fail-disallowed-ivy-version:

ivy-fail:

ivy-fail:

ivy-configure:
[ivy:configure] :: loading settings :: file = /x1/jenkins/jenkins-slave/workspace/Lucene-Solr-BadApples-Tests-master/lucene/top-level-ivy-settings.xml

resolve:

ivy-availability-check:
[loadresource] Do not set property disallowed.ivy.jars.list as its length is 0.

-ivy-fail-disallowed-ivy-version:

ivy-fail:

ivy-fail:

ivy-configure:
[ivy:configure] :: loading settings :: file = /x1/jenkins/jenkins-slave/workspace/Lucene-Solr-BadApples-Tests-master/lucene/top-level-ivy-settings.xml

resolve:

ivy-availability-check:
[loadresource] Do not set property disallowed.ivy.jars.list as its length is 0.

-ivy-fail-disallowed-ivy-version:

ivy-fail:

ivy-fail:

ivy-configure:
[ivy:configure] :: loading settings :: file = /x1/jenkins/jenkins-slave/workspace/Lucene-Solr-BadApples-Tests-master/lucene/top-level-ivy-settings.xml

resolve:

ivy-availability-check:
[loadresource] Do not set property disallowed.ivy.jars.list as its length is 0.

-ivy-fail-disallowed-ivy-version:

ivy-fail:

ivy-fail:

ivy-configure:
[ivy:configure] :: loading settings :: file = /x1/jenkins/jenkins-slave/workspace/Lucene-Solr-BadApples-Tests-master/lucene/top-level-ivy-settings.xml

resolve:

ivy-availability-check:
[loadresource] Do not set property disallowed.ivy.jars.list as its length is 0.

-ivy-fail-disallowed-ivy-version:

ivy-fail:

ivy-fail:

ivy-configure:
[ivy:configure] :: loading settings :: file = /x1/jenkins/jenkins-slave/workspace/Lucene-Solr-BadApples-Tests-master/lucene/top-level-ivy-settings.xml

resolve:

ivy-availability-check:
[loadresource] Do not set property disallowed.ivy.jars.list as its length is 0.

-ivy-fail-disallowed-ivy-version:

ivy-fail:

ivy-fail:

ivy-configure:
[ivy:configure] :: loading settings :: file = /x1/jenkins/jenkins-slave/workspace/Lucene-Solr-BadApples-Tests-master/lucene/top-level-ivy-settings.xml

resolve:

ivy-availability-check:
[loadresource] Do not set property disallowed.ivy.jars.list as its length is 0.

-ivy-fail-disallowed-ivy-version:

ivy-fail:

ivy-fail:

ivy-configure:
[ivy:configure] :: loading settings :: file = /x1/jenkins/jenkins-slave/workspace/Lucene-Solr-BadApples-Tests-master/lucene/top-level-ivy-settings.xml

resolve:

ivy-availability-check:
[loadresource] Do not set property disallowed.ivy.jars.list as its length is 0.

-ivy-fail-disallowed-ivy-version:

ivy-fail:

ivy-fail:

ivy-configure:
[ivy:configure] :: loading settings :: file = /x1/jenkins/jenkins-slave/workspace/Lucene-Solr-BadApples-Tests-master/lucene/top-level-ivy-settings.xml

resolve:

ivy-availability-check:
[loadresource] Do not set property disallowed.ivy.jars.list as its length is 0.

-ivy-fail-disallowed-ivy-version:

ivy-fail:

ivy-fail:

ivy-configure:
[ivy:configure] :: loading settings :: file = /x1/jenkins/jenkins-slave/workspace/Lucene-Solr-BadApples-Tests-master/lucene/top-level-ivy-settings.xml

resolve:

ivy-availability-check:
[loadresource] Do not set property disallowed.ivy.jars.list as its length is 0.

-ivy-fail-disallowed-ivy-version:

ivy-fail:

ivy-fail:

ivy-configure:
[ivy:configure] :: loading settings :: file = /x1/jenkins/jenkins-slave/workspace/Lucene-Solr-BadApples-Tests-master/lucene/top-level-ivy-settings.xml

resolve:

jar-checksums:
    [mkdir] Created dir: /x1/jenkins/jenkins-slave/workspace/Lucene-Solr-BadApples-Tests-master/solr/null960204395
     [copy] Copying 247 files to /x1/jenkins/jenkins-slave/workspace/Lucene-Solr-BadApples-Tests-master/solr/null960204395
   [delete] Deleting directory /x1/jenkins/jenkins-slave/workspace/Lucene-Solr-BadApples-Tests-master/solr/null960204395

check-working-copy:
[ivy:cachepath] :: resolving dependencies :: org.eclipse.jgit#org.eclipse.jgit-caller;working
[ivy:cachepath] 	confs: [default]
[ivy:cachepath] 	found org.eclipse.jgit#org.eclipse.jgit;4.6.0.201612231935-r in public
[ivy:cachepath] 	found com.jcraft#jsch;0.1.53 in public
[ivy:cachepath] 	found com.googlecode.javaewah#JavaEWAH;1.1.6 in public
[ivy:cachepath] 	found org.apache.httpcomponents#httpclient;4.3.6 in public
[ivy:cachepath] 	found org.apache.httpcomponents#httpcore;4.3.3 in public
[ivy:cachepath] 	found commons-logging#commons-logging;1.1.3 in public
[ivy:cachepath] 	found commons-codec#commons-codec;1.6 in public
[ivy:cachepath] 	found org.slf4j#slf4j-api;1.7.2 in public
[ivy:cachepath] :: resolution report :: resolve 123ms :: artifacts dl 212ms
	---------------------------------------------------------------------
	|                  |            modules            ||   artifacts   |
	|       conf       | number| search|dwnlded|evicted|| number|dwnlded|
	---------------------------------------------------------------------
	|      default     |   8   |   0   |   0   |   0   ||   8   |   0   |
	---------------------------------------------------------------------
[wc-checker] Initializing working copy...
[wc-checker] SLF4J: Failed to load class "org.slf4j.impl.StaticLoggerBinder".
[wc-checker] SLF4J: Defaulting to no-operation (NOP) logger implementation
[wc-checker] SLF4J: See http://www.slf4j.org/codes.html#StaticLoggerBinder for further details.
[wc-checker] Checking working copy status...

-jenkins-base:

BUILD SUCCESSFUL
Total time: 176 minutes 7 seconds
Archiving artifacts
java.lang.InterruptedException: no matches found within 10000
	at hudson.FilePath$34.hasMatch(FilePath.java:2678)
	at hudson.FilePath$34.invoke(FilePath.java:2557)
	at hudson.FilePath$34.invoke(FilePath.java:2547)
	at hudson.FilePath$FileCallableWrapper.call(FilePath.java:2918)
Also:   hudson.remoting.Channel$CallSiteStackTrace: Remote call to lucene
		at hudson.remoting.Channel.attachCallSiteStackTrace(Channel.java:1741)
		at hudson.remoting.UserRequest$ExceptionResponse.retrieve(UserRequest.java:357)
		at hudson.remoting.Channel.call(Channel.java:955)
		at hudson.FilePath.act(FilePath.java:1036)
		at hudson.FilePath.act(FilePath.java:1025)
		at hudson.FilePath.validateAntFileMask(FilePath.java:2547)
		at hudson.tasks.ArtifactArchiver.perform(ArtifactArchiver.java:243)
		at hudson.tasks.BuildStepCompatibilityLayer.perform(BuildStepCompatibilityLayer.java:81)
		at hudson.tasks.BuildStepMonitor$1.perform(BuildStepMonitor.java:20)
		at hudson.model.AbstractBuild$AbstractBuildExecution.perform(AbstractBuild.java:744)
		at hudson.model.AbstractBuild$AbstractBuildExecution.performAllBuildSteps(AbstractBuild.java:690)
		at hudson.model.Build$BuildExecution.post2(Build.java:186)
		at hudson.model.AbstractBuild$AbstractBuildExecution.post(AbstractBuild.java:635)
		at hudson.model.Run.execute(Run.java:1819)
		at hudson.model.FreeStyleBuild.run(FreeStyleBuild.java:43)
		at hudson.model.ResourceController.execute(ResourceController.java:97)
		at hudson.model.Executor.run(Executor.java:429)
Caused: hudson.FilePath$TunneledInterruptedException
	at hudson.FilePath$FileCallableWrapper.call(FilePath.java:2920)
	at hudson.remoting.UserRequest.perform(UserRequest.java:212)
	at hudson.remoting.UserRequest.perform(UserRequest.java:54)
	at hudson.remoting.Request$2.run(Request.java:369)
	at hudson.remoting.InterceptingExecutorService$1.call(InterceptingExecutorService.java:72)
	at java.util.concurrent.FutureTask.run(FutureTask.java:266)
	at java.util.concurrent.ThreadPoolExecutor.runWorker(ThreadPoolExecutor.java:1142)
	at java.util.concurrent.ThreadPoolExecutor$Worker.run(ThreadPoolExecutor.java:617)
	at java.lang.Thread.run(Thread.java:748)
Caused: java.lang.InterruptedException: java.lang.InterruptedException: no matches found within 10000
	at hudson.FilePath.act(FilePath.java:1038)
	at hudson.FilePath.act(FilePath.java:1025)
	at hudson.FilePath.validateAntFileMask(FilePath.java:2547)
	at hudson.tasks.ArtifactArchiver.perform(ArtifactArchiver.java:243)
	at hudson.tasks.BuildStepCompatibilityLayer.perform(BuildStepCompatibilityLayer.java:81)
	at hudson.tasks.BuildStepMonitor$1.perform(BuildStepMonitor.java:20)
	at hudson.model.AbstractBuild$AbstractBuildExecution.perform(AbstractBuild.java:744)
	at hudson.model.AbstractBuild$AbstractBuildExecution.performAllBuildSteps(AbstractBuild.java:690)
	at hudson.model.Build$BuildExecution.post2(Build.java:186)
	at hudson.model.AbstractBuild$AbstractBuildExecution.post(AbstractBuild.java:635)
	at hudson.model.Run.execute(Run.java:1819)
	at hudson.model.FreeStyleBuild.run(FreeStyleBuild.java:43)
	at hudson.model.ResourceController.execute(ResourceController.java:97)
	at hudson.model.Executor.run(Executor.java:429)
No artifacts found that match the file pattern "**/*.events,heapdumps/**,**/hs_err_pid*". Configuration error?
Recording test results
Build step 'Publish JUnit test result report' changed build result to UNSTABLE
Email was triggered for: Unstable (Test Failures)
Sending email for trigger: Unstable (Test Failures)

Mime
View raw message