lucene-dev mailing list archives

Site index · List index
Message view « Date » · « Thread »
Top « Date » · « Thread »
From Policeman Jenkins Server <jenk...@thetaphi.de>
Subject [JENKINS] Lucene-Solr-7.x-Solaris (64bit/jdk1.8.0) - Build # 723 - Failure!
Date Sun, 15 Jul 2018 07:00:49 GMT
Build: https://jenkins.thetaphi.de/job/Lucene-Solr-7.x-Solaris/723/
Java: 64bit/jdk1.8.0 -XX:+UseCompressedOops -XX:+UseG1GC

1 tests failed.
FAILED:  org.apache.lucene.document.TestLatLonShape.testBasicIntersects

Error Message:
Java heap space

Stack Trace:
java.lang.OutOfMemoryError: Java heap space
	at __randomizedtesting.SeedInfo.seed([BA969FCC6B96978E:8DEB6C39570134F0]:0)
	at org.apache.lucene.store.TrackingDirectoryWrapper.getCreatedFiles(TrackingDirectoryWrapper.java:73)
	at org.apache.lucene.util.bkd.BKDWriter.finish(BKDWriter.java:1029)
	at org.apache.lucene.index.RandomCodec$1$1.writeField(RandomCodec.java:141)
	at org.apache.lucene.codecs.asserting.AssertingPointsFormat$AssertingPointsWriter.writeField(AssertingPointsFormat.java:137)
	at org.apache.lucene.index.PointValuesWriter.flush(PointValuesWriter.java:183)
	at org.apache.lucene.index.DefaultIndexingChain.writePoints(DefaultIndexingChain.java:204)
	at org.apache.lucene.index.DefaultIndexingChain.flush(DefaultIndexingChain.java:139)
	at org.apache.lucene.index.DocumentsWriterPerThread.flush(DocumentsWriterPerThread.java:470)
	at org.apache.lucene.index.DocumentsWriter.doFlush(DocumentsWriter.java:554)
	at org.apache.lucene.index.DocumentsWriter.postUpdate(DocumentsWriter.java:413)
	at org.apache.lucene.index.DocumentsWriter.updateDocuments(DocumentsWriter.java:470)
	at org.apache.lucene.index.IndexWriter.updateDocuments(IndexWriter.java:1293)
	at org.apache.lucene.index.IndexWriter.addDocuments(IndexWriter.java:1266)
	at org.apache.lucene.index.RandomIndexWriter.addDocument(RandomIndexWriter.java:159)
	at org.apache.lucene.document.TestLatLonShape.testBasicIntersects(TestLatLonShape.java:93)
	at sun.reflect.NativeMethodAccessorImpl.invoke0(Native Method)
	at sun.reflect.NativeMethodAccessorImpl.invoke(NativeMethodAccessorImpl.java:62)
	at sun.reflect.DelegatingMethodAccessorImpl.invoke(DelegatingMethodAccessorImpl.java:43)
	at java.lang.reflect.Method.invoke(Method.java:498)
	at com.carrotsearch.randomizedtesting.RandomizedRunner.invoke(RandomizedRunner.java:1737)
	at com.carrotsearch.randomizedtesting.RandomizedRunner$8.evaluate(RandomizedRunner.java:934)
	at com.carrotsearch.randomizedtesting.RandomizedRunner$9.evaluate(RandomizedRunner.java:970)
	at com.carrotsearch.randomizedtesting.RandomizedRunner$10.evaluate(RandomizedRunner.java:984)
	at org.apache.lucene.util.TestRuleSetupTeardownChained$1.evaluate(TestRuleSetupTeardownChained.java:49)
	at org.apache.lucene.util.AbstractBeforeAfterRule$1.evaluate(AbstractBeforeAfterRule.java:45)
	at org.apache.lucene.util.TestRuleThreadAndTestName$1.evaluate(TestRuleThreadAndTestName.java:48)
	at org.apache.lucene.util.TestRuleIgnoreAfterMaxFailures$1.evaluate(TestRuleIgnoreAfterMaxFailures.java:64)
	at org.apache.lucene.util.TestRuleMarkFailure$1.evaluate(TestRuleMarkFailure.java:47)
	at com.carrotsearch.randomizedtesting.rules.StatementAdapter.evaluate(StatementAdapter.java:36)
	at com.carrotsearch.randomizedtesting.ThreadLeakControl$StatementRunner.run(ThreadLeakControl.java:368)
	at com.carrotsearch.randomizedtesting.ThreadLeakControl.forkTimeoutingTask(ThreadLeakControl.java:817)
	at com.carrotsearch.randomizedtesting.ThreadLeakControl$3.evaluate(ThreadLeakControl.java:468)




Build Log:
[...truncated 9505 lines...]
   [junit4] Suite: org.apache.lucene.document.TestLatLonShape
   [junit4]   2> NOTE: reproduce with: ant test  -Dtestcase=TestLatLonShape -Dtests.method=testBasicIntersects
-Dtests.seed=BA969FCC6B96978E -Dtests.slow=true -Dtests.locale=ar-IQ -Dtests.timezone=Europe/Samara
-Dtests.asserts=true -Dtests.file.encoding=ISO-8859-1
   [junit4] ERROR   19.0s J0 | TestLatLonShape.testBasicIntersects <<<
   [junit4]    > Throwable #1: java.lang.OutOfMemoryError: Java heap space
   [junit4]    > 	at __randomizedtesting.SeedInfo.seed([BA969FCC6B96978E:8DEB6C39570134F0]:0)
   [junit4]    > 	at org.apache.lucene.store.TrackingDirectoryWrapper.getCreatedFiles(TrackingDirectoryWrapper.java:73)
   [junit4]    > 	at org.apache.lucene.util.bkd.BKDWriter.finish(BKDWriter.java:1029)
   [junit4]    > 	at org.apache.lucene.index.RandomCodec$1$1.writeField(RandomCodec.java:141)
   [junit4]    > 	at org.apache.lucene.codecs.asserting.AssertingPointsFormat$AssertingPointsWriter.writeField(AssertingPointsFormat.java:137)
   [junit4]    > 	at org.apache.lucene.index.PointValuesWriter.flush(PointValuesWriter.java:183)
   [junit4]    > 	at org.apache.lucene.index.DefaultIndexingChain.writePoints(DefaultIndexingChain.java:204)
   [junit4]    > 	at org.apache.lucene.index.DefaultIndexingChain.flush(DefaultIndexingChain.java:139)
   [junit4]    > 	at org.apache.lucene.index.DocumentsWriterPerThread.flush(DocumentsWriterPerThread.java:470)
   [junit4]    > 	at org.apache.lucene.index.DocumentsWriter.doFlush(DocumentsWriter.java:554)
   [junit4]    > 	at org.apache.lucene.index.DocumentsWriter.postUpdate(DocumentsWriter.java:413)
   [junit4]    > 	at org.apache.lucene.index.DocumentsWriter.updateDocuments(DocumentsWriter.java:470)
   [junit4]    > 	at org.apache.lucene.index.IndexWriter.updateDocuments(IndexWriter.java:1293)
   [junit4]    > 	at org.apache.lucene.index.IndexWriter.addDocuments(IndexWriter.java:1266)
   [junit4]    > 	at org.apache.lucene.index.RandomIndexWriter.addDocument(RandomIndexWriter.java:159)
   [junit4]    > 	at org.apache.lucene.document.TestLatLonShape.testBasicIntersects(TestLatLonShape.java:93)
   [junit4]   2> NOTE: test params are: codec=Asserting(Lucene70): {}, docValues:{}, maxPointsInLeafNode=1310,
maxMBSortInHeap=7.196126657203814, sim=RandomSimilarity(queryNorm=true): {}, locale=ar-IQ,
timezone=Europe/Samara
   [junit4]   2> NOTE: SunOS 5.11 amd64/Oracle Corporation 1.8.0_172 (64-bit)/cpus=3,threads=1,free=34516328,total=536870912
   [junit4]   2> NOTE: All tests run in this JVM: [TestDoubleRangeField, TestIntervalQuery,
TestLatLonShape]
   [junit4] Completed [7/24 (1!)] on J0 in 19.01s, 2 tests, 1 error, 1 skipped <<<
FAILURES!

[...truncated 76 lines...]
   [junit4] JVM J0: stdout was not empty, see: /export/home/jenkins/workspace/Lucene-Solr-7.x-Solaris/lucene/build/sandbox/test/temp/junit4-J0-20180715_054105_1505696215473948931008.sysout
   [junit4] >>> JVM J0 emitted unexpected output (verbatim) ----
   [junit4] java.lang.OutOfMemoryError: Java heap space
   [junit4] Dumping heap to /export/home/jenkins/workspace/Lucene-Solr-7.x-Solaris/heapdumps/java_pid10195.hprof
...
   [junit4] Heap dump file created [557242127 bytes in 5.170 secs]
   [junit4] <<< JVM J0: EOF ----

[...truncated 14286 lines...]
BUILD FAILED
/export/home/jenkins/workspace/Lucene-Solr-7.x-Solaris/build.xml:633: The following error
occurred while executing this line:
/export/home/jenkins/workspace/Lucene-Solr-7.x-Solaris/build.xml:585: Some of the tests produced
a heap dump, but did not fail. Maybe a suppressed OutOfMemoryError? Dumps created:
* java_pid10195.hprof

Total time: 99 minutes 3 seconds
Build step 'Invoke Ant' marked build as failure
Archiving artifacts
Setting ANT_1_8_2_HOME=/export/home/jenkins/tools/hudson.tasks.Ant_AntInstallation/ANT_1.8.2
[WARNINGS] Skipping publisher since build result is FAILURE
Recording test results
Setting ANT_1_8_2_HOME=/export/home/jenkins/tools/hudson.tasks.Ant_AntInstallation/ANT_1.8.2
Email was triggered for: Failure - Any
Sending email for trigger: Failure - Any
Setting ANT_1_8_2_HOME=/export/home/jenkins/tools/hudson.tasks.Ant_AntInstallation/ANT_1.8.2
Setting ANT_1_8_2_HOME=/export/home/jenkins/tools/hudson.tasks.Ant_AntInstallation/ANT_1.8.2
Setting ANT_1_8_2_HOME=/export/home/jenkins/tools/hudson.tasks.Ant_AntInstallation/ANT_1.8.2
Setting ANT_1_8_2_HOME=/export/home/jenkins/tools/hudson.tasks.Ant_AntInstallation/ANT_1.8.2

Mime
View raw message