lucene-dev mailing list archives

Site index · List index
Message view « Date » · « Thread »
Top « Date » · « Thread »
From Policeman Jenkins Server <jenk...@thetaphi.de>
Subject [JENKINS] Lucene-Solr-7.x-Windows (32bit/jdk1.8.0_172) - Build # 686 - Still Unstable!
Date Thu, 12 Jul 2018 18:53:48 GMT
Build: https://jenkins.thetaphi.de/job/Lucene-Solr-7.x-Windows/686/
Java: 32bit/jdk1.8.0_172 -server -XX:+UseSerialGC

4 tests failed.
FAILED:  org.apache.solr.cloud.LeaderTragicEventTest.testOtherReplicasAreNotActive

Error Message:
Jetty Connector is not open: -2

Stack Trace:
java.lang.IllegalStateException: Jetty Connector is not open: -2
	at __randomizedtesting.SeedInfo.seed([3BF8F71365D99989:BE4CDB6459262011]:0)
	at org.apache.solr.client.solrj.embedded.JettySolrRunner.getBaseUrl(JettySolrRunner.java:499)
	at org.apache.solr.cloud.MiniSolrCloudCluster.getReplicaJetty(MiniSolrCloudCluster.java:539)
	at org.apache.solr.cloud.LeaderTragicEventTest.corruptLeader(LeaderTragicEventTest.java:100)
	at org.apache.solr.cloud.LeaderTragicEventTest.testOtherReplicasAreNotActive(LeaderTragicEventTest.java:150)
	at sun.reflect.NativeMethodAccessorImpl.invoke0(Native Method)
	at sun.reflect.NativeMethodAccessorImpl.invoke(NativeMethodAccessorImpl.java:62)
	at sun.reflect.DelegatingMethodAccessorImpl.invoke(DelegatingMethodAccessorImpl.java:43)
	at java.lang.reflect.Method.invoke(Method.java:498)
	at com.carrotsearch.randomizedtesting.RandomizedRunner.invoke(RandomizedRunner.java:1737)
	at com.carrotsearch.randomizedtesting.RandomizedRunner$8.evaluate(RandomizedRunner.java:934)
	at com.carrotsearch.randomizedtesting.RandomizedRunner$9.evaluate(RandomizedRunner.java:970)
	at com.carrotsearch.randomizedtesting.RandomizedRunner$10.evaluate(RandomizedRunner.java:984)
	at com.carrotsearch.randomizedtesting.rules.SystemPropertiesRestoreRule$1.evaluate(SystemPropertiesRestoreRule.java:57)
	at org.apache.lucene.util.TestRuleSetupTeardownChained$1.evaluate(TestRuleSetupTeardownChained.java:49)
	at org.apache.lucene.util.AbstractBeforeAfterRule$1.evaluate(AbstractBeforeAfterRule.java:45)
	at org.apache.lucene.util.TestRuleThreadAndTestName$1.evaluate(TestRuleThreadAndTestName.java:48)
	at org.apache.lucene.util.TestRuleIgnoreAfterMaxFailures$1.evaluate(TestRuleIgnoreAfterMaxFailures.java:64)
	at org.apache.lucene.util.TestRuleMarkFailure$1.evaluate(TestRuleMarkFailure.java:47)
	at com.carrotsearch.randomizedtesting.rules.StatementAdapter.evaluate(StatementAdapter.java:36)
	at com.carrotsearch.randomizedtesting.ThreadLeakControl$StatementRunner.run(ThreadLeakControl.java:368)
	at com.carrotsearch.randomizedtesting.ThreadLeakControl.forkTimeoutingTask(ThreadLeakControl.java:817)
	at com.carrotsearch.randomizedtesting.ThreadLeakControl$3.evaluate(ThreadLeakControl.java:468)
	at com.carrotsearch.randomizedtesting.RandomizedRunner.runSingleTest(RandomizedRunner.java:943)
	at com.carrotsearch.randomizedtesting.RandomizedRunner$5.evaluate(RandomizedRunner.java:829)
	at com.carrotsearch.randomizedtesting.RandomizedRunner$6.evaluate(RandomizedRunner.java:879)
	at com.carrotsearch.randomizedtesting.RandomizedRunner$7.evaluate(RandomizedRunner.java:890)
	at com.carrotsearch.randomizedtesting.rules.StatementAdapter.evaluate(StatementAdapter.java:36)
	at com.carrotsearch.randomizedtesting.rules.SystemPropertiesRestoreRule$1.evaluate(SystemPropertiesRestoreRule.java:57)
	at org.apache.lucene.util.AbstractBeforeAfterRule$1.evaluate(AbstractBeforeAfterRule.java:45)
	at com.carrotsearch.randomizedtesting.rules.StatementAdapter.evaluate(StatementAdapter.java:36)
	at org.apache.lucene.util.TestRuleStoreClassName$1.evaluate(TestRuleStoreClassName.java:41)
	at com.carrotsearch.randomizedtesting.rules.NoShadowingOrOverridesOnMethodsRule$1.evaluate(NoShadowingOrOverridesOnMethodsRule.java:40)
	at com.carrotsearch.randomizedtesting.rules.NoShadowingOrOverridesOnMethodsRule$1.evaluate(NoShadowingOrOverridesOnMethodsRule.java:40)
	at com.carrotsearch.randomizedtesting.rules.StatementAdapter.evaluate(StatementAdapter.java:36)
	at com.carrotsearch.randomizedtesting.rules.StatementAdapter.evaluate(StatementAdapter.java:36)
	at com.carrotsearch.randomizedtesting.rules.StatementAdapter.evaluate(StatementAdapter.java:36)
	at org.apache.lucene.util.TestRuleAssertionsRequired$1.evaluate(TestRuleAssertionsRequired.java:53)
	at org.apache.lucene.util.TestRuleMarkFailure$1.evaluate(TestRuleMarkFailure.java:47)
	at org.apache.lucene.util.TestRuleIgnoreAfterMaxFailures$1.evaluate(TestRuleIgnoreAfterMaxFailures.java:64)
	at org.apache.lucene.util.TestRuleIgnoreTestSuites$1.evaluate(TestRuleIgnoreTestSuites.java:54)
	at com.carrotsearch.randomizedtesting.rules.StatementAdapter.evaluate(StatementAdapter.java:36)
	at com.carrotsearch.randomizedtesting.ThreadLeakControl$StatementRunner.run(ThreadLeakControl.java:368)
	at java.lang.Thread.run(Thread.java:748)


FAILED:  org.apache.solr.cloud.LeaderTragicEventTest.test

Error Message:
Error from server at https://127.0.0.1:55653/solr: collection already exists: collection1

Stack Trace:
org.apache.solr.client.solrj.impl.HttpSolrClient$RemoteSolrException: Error from server at https://127.0.0.1:55653/solr: collection already exists: collection1
	at __randomizedtesting.SeedInfo.seed([3BF8F71365D99989:B3ACC8C9CB25F471]:0)
	at org.apache.solr.client.solrj.impl.HttpSolrClient.executeMethod(HttpSolrClient.java:643)
	at org.apache.solr.client.solrj.impl.HttpSolrClient.request(HttpSolrClient.java:255)
	at org.apache.solr.client.solrj.impl.HttpSolrClient.request(HttpSolrClient.java:244)
	at org.apache.solr.client.solrj.impl.LBHttpSolrClient.doRequest(LBHttpSolrClient.java:483)
	at org.apache.solr.client.solrj.impl.LBHttpSolrClient.request(LBHttpSolrClient.java:413)
	at org.apache.solr.client.solrj.impl.CloudSolrClient.sendRequest(CloudSolrClient.java:1106)
	at org.apache.solr.client.solrj.impl.CloudSolrClient.requestWithRetryOnStaleState(CloudSolrClient.java:886)
	at org.apache.solr.client.solrj.impl.CloudSolrClient.request(CloudSolrClient.java:819)
	at org.apache.solr.client.solrj.SolrRequest.process(SolrRequest.java:194)
	at org.apache.solr.client.solrj.SolrRequest.process(SolrRequest.java:211)
	at org.apache.solr.cloud.LeaderTragicEventTest.test(LeaderTragicEventTest.java:70)
	at sun.reflect.NativeMethodAccessorImpl.invoke0(Native Method)
	at sun.reflect.NativeMethodAccessorImpl.invoke(NativeMethodAccessorImpl.java:62)
	at sun.reflect.DelegatingMethodAccessorImpl.invoke(DelegatingMethodAccessorImpl.java:43)
	at java.lang.reflect.Method.invoke(Method.java:498)
	at com.carrotsearch.randomizedtesting.RandomizedRunner.invoke(RandomizedRunner.java:1737)
	at com.carrotsearch.randomizedtesting.RandomizedRunner$8.evaluate(RandomizedRunner.java:934)
	at com.carrotsearch.randomizedtesting.RandomizedRunner$9.evaluate(RandomizedRunner.java:970)
	at com.carrotsearch.randomizedtesting.RandomizedRunner$10.evaluate(RandomizedRunner.java:984)
	at com.carrotsearch.randomizedtesting.rules.SystemPropertiesRestoreRule$1.evaluate(SystemPropertiesRestoreRule.java:57)
	at org.apache.lucene.util.TestRuleSetupTeardownChained$1.evaluate(TestRuleSetupTeardownChained.java:49)
	at org.apache.lucene.util.AbstractBeforeAfterRule$1.evaluate(AbstractBeforeAfterRule.java:45)
	at org.apache.lucene.util.TestRuleThreadAndTestName$1.evaluate(TestRuleThreadAndTestName.java:48)
	at org.apache.lucene.util.TestRuleIgnoreAfterMaxFailures$1.evaluate(TestRuleIgnoreAfterMaxFailures.java:64)
	at org.apache.lucene.util.TestRuleMarkFailure$1.evaluate(TestRuleMarkFailure.java:47)
	at com.carrotsearch.randomizedtesting.rules.StatementAdapter.evaluate(StatementAdapter.java:36)
	at com.carrotsearch.randomizedtesting.ThreadLeakControl$StatementRunner.run(ThreadLeakControl.java:368)
	at com.carrotsearch.randomizedtesting.ThreadLeakControl.forkTimeoutingTask(ThreadLeakControl.java:817)
	at com.carrotsearch.randomizedtesting.ThreadLeakControl$3.evaluate(ThreadLeakControl.java:468)
	at com.carrotsearch.randomizedtesting.RandomizedRunner.runSingleTest(RandomizedRunner.java:943)
	at com.carrotsearch.randomizedtesting.RandomizedRunner$5.evaluate(RandomizedRunner.java:829)
	at com.carrotsearch.randomizedtesting.RandomizedRunner$6.evaluate(RandomizedRunner.java:879)
	at com.carrotsearch.randomizedtesting.RandomizedRunner$7.evaluate(RandomizedRunner.java:890)
	at com.carrotsearch.randomizedtesting.rules.StatementAdapter.evaluate(StatementAdapter.java:36)
	at com.carrotsearch.randomizedtesting.rules.SystemPropertiesRestoreRule$1.evaluate(SystemPropertiesRestoreRule.java:57)
	at org.apache.lucene.util.AbstractBeforeAfterRule$1.evaluate(AbstractBeforeAfterRule.java:45)
	at com.carrotsearch.randomizedtesting.rules.StatementAdapter.evaluate(StatementAdapter.java:36)
	at org.apache.lucene.util.TestRuleStoreClassName$1.evaluate(TestRuleStoreClassName.java:41)
	at com.carrotsearch.randomizedtesting.rules.NoShadowingOrOverridesOnMethodsRule$1.evaluate(NoShadowingOrOverridesOnMethodsRule.java:40)
	at com.carrotsearch.randomizedtesting.rules.NoShadowingOrOverridesOnMethodsRule$1.evaluate(NoShadowingOrOverridesOnMethodsRule.java:40)
	at com.carrotsearch.randomizedtesting.rules.StatementAdapter.evaluate(StatementAdapter.java:36)
	at com.carrotsearch.randomizedtesting.rules.StatementAdapter.evaluate(StatementAdapter.java:36)
	at com.carrotsearch.randomizedtesting.rules.StatementAdapter.evaluate(StatementAdapter.java:36)
	at org.apache.lucene.util.TestRuleAssertionsRequired$1.evaluate(TestRuleAssertionsRequired.java:53)
	at org.apache.lucene.util.TestRuleMarkFailure$1.evaluate(TestRuleMarkFailure.java:47)
	at org.apache.lucene.util.TestRuleIgnoreAfterMaxFailures$1.evaluate(TestRuleIgnoreAfterMaxFailures.java:64)
	at org.apache.lucene.util.TestRuleIgnoreTestSuites$1.evaluate(TestRuleIgnoreTestSuites.java:54)
	at com.carrotsearch.randomizedtesting.rules.StatementAdapter.evaluate(StatementAdapter.java:36)
	at com.carrotsearch.randomizedtesting.ThreadLeakControl$StatementRunner.run(ThreadLeakControl.java:368)
	at java.lang.Thread.run(Thread.java:748)


FAILED:  org.apache.solr.cloud.LeaderTragicEventTest.testOtherReplicasAreNotActive

Error Message:
Jetty Connector is not open: -2

Stack Trace:
java.lang.IllegalStateException: Jetty Connector is not open: -2
	at __randomizedtesting.SeedInfo.seed([3BF8F71365D99989:BE4CDB6459262011]:0)
	at org.apache.solr.client.solrj.embedded.JettySolrRunner.getBaseUrl(JettySolrRunner.java:499)
	at org.apache.solr.cloud.MiniSolrCloudCluster.getReplicaJetty(MiniSolrCloudCluster.java:539)
	at org.apache.solr.cloud.LeaderTragicEventTest.corruptLeader(LeaderTragicEventTest.java:100)
	at org.apache.solr.cloud.LeaderTragicEventTest.testOtherReplicasAreNotActive(LeaderTragicEventTest.java:150)
	at sun.reflect.NativeMethodAccessorImpl.invoke0(Native Method)
	at sun.reflect.NativeMethodAccessorImpl.invoke(NativeMethodAccessorImpl.java:62)
	at sun.reflect.DelegatingMethodAccessorImpl.invoke(DelegatingMethodAccessorImpl.java:43)
	at java.lang.reflect.Method.invoke(Method.java:498)
	at com.carrotsearch.randomizedtesting.RandomizedRunner.invoke(RandomizedRunner.java:1737)
	at com.carrotsearch.randomizedtesting.RandomizedRunner$8.evaluate(RandomizedRunner.java:934)
	at com.carrotsearch.randomizedtesting.RandomizedRunner$9.evaluate(RandomizedRunner.java:970)
	at com.carrotsearch.randomizedtesting.RandomizedRunner$10.evaluate(RandomizedRunner.java:984)
	at com.carrotsearch.randomizedtesting.rules.SystemPropertiesRestoreRule$1.evaluate(SystemPropertiesRestoreRule.java:57)
	at org.apache.lucene.util.TestRuleSetupTeardownChained$1.evaluate(TestRuleSetupTeardownChained.java:49)
	at org.apache.lucene.util.AbstractBeforeAfterRule$1.evaluate(AbstractBeforeAfterRule.java:45)
	at org.apache.lucene.util.TestRuleThreadAndTestName$1.evaluate(TestRuleThreadAndTestName.java:48)
	at org.apache.lucene.util.TestRuleIgnoreAfterMaxFailures$1.evaluate(TestRuleIgnoreAfterMaxFailures.java:64)
	at org.apache.lucene.util.TestRuleMarkFailure$1.evaluate(TestRuleMarkFailure.java:47)
	at com.carrotsearch.randomizedtesting.rules.StatementAdapter.evaluate(StatementAdapter.java:36)
	at com.carrotsearch.randomizedtesting.ThreadLeakControl$StatementRunner.run(ThreadLeakControl.java:368)
	at com.carrotsearch.randomizedtesting.ThreadLeakControl.forkTimeoutingTask(ThreadLeakControl.java:817)
	at com.carrotsearch.randomizedtesting.ThreadLeakControl$3.evaluate(ThreadLeakControl.java:468)
	at com.carrotsearch.randomizedtesting.RandomizedRunner.runSingleTest(RandomizedRunner.java:943)
	at com.carrotsearch.randomizedtesting.RandomizedRunner$5.evaluate(RandomizedRunner.java:829)
	at com.carrotsearch.randomizedtesting.RandomizedRunner$6.evaluate(RandomizedRunner.java:879)
	at com.carrotsearch.randomizedtesting.RandomizedRunner$7.evaluate(RandomizedRunner.java:890)
	at com.carrotsearch.randomizedtesting.rules.StatementAdapter.evaluate(StatementAdapter.java:36)
	at com.carrotsearch.randomizedtesting.rules.SystemPropertiesRestoreRule$1.evaluate(SystemPropertiesRestoreRule.java:57)
	at org.apache.lucene.util.AbstractBeforeAfterRule$1.evaluate(AbstractBeforeAfterRule.java:45)
	at com.carrotsearch.randomizedtesting.rules.StatementAdapter.evaluate(StatementAdapter.java:36)
	at org.apache.lucene.util.TestRuleStoreClassName$1.evaluate(TestRuleStoreClassName.java:41)
	at com.carrotsearch.randomizedtesting.rules.NoShadowingOrOverridesOnMethodsRule$1.evaluate(NoShadowingOrOverridesOnMethodsRule.java:40)
	at com.carrotsearch.randomizedtesting.rules.NoShadowingOrOverridesOnMethodsRule$1.evaluate(NoShadowingOrOverridesOnMethodsRule.java:40)
	at com.carrotsearch.randomizedtesting.rules.StatementAdapter.evaluate(StatementAdapter.java:36)
	at com.carrotsearch.randomizedtesting.rules.StatementAdapter.evaluate(StatementAdapter.java:36)
	at com.carrotsearch.randomizedtesting.rules.StatementAdapter.evaluate(StatementAdapter.java:36)
	at org.apache.lucene.util.TestRuleAssertionsRequired$1.evaluate(TestRuleAssertionsRequired.java:53)
	at org.apache.lucene.util.TestRuleMarkFailure$1.evaluate(TestRuleMarkFailure.java:47)
	at org.apache.lucene.util.TestRuleIgnoreAfterMaxFailures$1.evaluate(TestRuleIgnoreAfterMaxFailures.java:64)
	at org.apache.lucene.util.TestRuleIgnoreTestSuites$1.evaluate(TestRuleIgnoreTestSuites.java:54)
	at com.carrotsearch.randomizedtesting.rules.StatementAdapter.evaluate(StatementAdapter.java:36)
	at com.carrotsearch.randomizedtesting.ThreadLeakControl$StatementRunner.run(ThreadLeakControl.java:368)
	at java.lang.Thread.run(Thread.java:748)


FAILED:  org.apache.solr.cloud.LeaderTragicEventTest.test

Error Message:
Error from server at https://127.0.0.1:57534/solr: collection already exists: collection1

Stack Trace:
org.apache.solr.client.solrj.impl.HttpSolrClient$RemoteSolrException: Error from server at https://127.0.0.1:57534/solr: collection already exists: collection1
	at __randomizedtesting.SeedInfo.seed([3BF8F71365D99989:B3ACC8C9CB25F471]:0)
	at org.apache.solr.client.solrj.impl.HttpSolrClient.executeMethod(HttpSolrClient.java:643)
	at org.apache.solr.client.solrj.impl.HttpSolrClient.request(HttpSolrClient.java:255)
	at org.apache.solr.client.solrj.impl.HttpSolrClient.request(HttpSolrClient.java:244)
	at org.apache.solr.client.solrj.impl.LBHttpSolrClient.doRequest(LBHttpSolrClient.java:483)
	at org.apache.solr.client.solrj.impl.LBHttpSolrClient.request(LBHttpSolrClient.java:413)
	at org.apache.solr.client.solrj.impl.CloudSolrClient.sendRequest(CloudSolrClient.java:1106)
	at org.apache.solr.client.solrj.impl.CloudSolrClient.requestWithRetryOnStaleState(CloudSolrClient.java:886)
	at org.apache.solr.client.solrj.impl.CloudSolrClient.request(CloudSolrClient.java:819)
	at org.apache.solr.client.solrj.SolrRequest.process(SolrRequest.java:194)
	at org.apache.solr.client.solrj.SolrRequest.process(SolrRequest.java:211)
	at org.apache.solr.cloud.LeaderTragicEventTest.test(LeaderTragicEventTest.java:70)
	at sun.reflect.NativeMethodAccessorImpl.invoke0(Native Method)
	at sun.reflect.NativeMethodAccessorImpl.invoke(NativeMethodAccessorImpl.java:62)
	at sun.reflect.DelegatingMethodAccessorImpl.invoke(DelegatingMethodAccessorImpl.java:43)
	at java.lang.reflect.Method.invoke(Method.java:498)
	at com.carrotsearch.randomizedtesting.RandomizedRunner.invoke(RandomizedRunner.java:1737)
	at com.carrotsearch.randomizedtesting.RandomizedRunner$8.evaluate(RandomizedRunner.java:934)
	at com.carrotsearch.randomizedtesting.RandomizedRunner$9.evaluate(RandomizedRunner.java:970)
	at com.carrotsearch.randomizedtesting.RandomizedRunner$10.evaluate(RandomizedRunner.java:984)
	at com.carrotsearch.randomizedtesting.rules.SystemPropertiesRestoreRule$1.evaluate(SystemPropertiesRestoreRule.java:57)
	at org.apache.lucene.util.TestRuleSetupTeardownChained$1.evaluate(TestRuleSetupTeardownChained.java:49)
	at org.apache.lucene.util.AbstractBeforeAfterRule$1.evaluate(AbstractBeforeAfterRule.java:45)
	at org.apache.lucene.util.TestRuleThreadAndTestName$1.evaluate(TestRuleThreadAndTestName.java:48)
	at org.apache.lucene.util.TestRuleIgnoreAfterMaxFailures$1.evaluate(TestRuleIgnoreAfterMaxFailures.java:64)
	at org.apache.lucene.util.TestRuleMarkFailure$1.evaluate(TestRuleMarkFailure.java:47)
	at com.carrotsearch.randomizedtesting.rules.StatementAdapter.evaluate(StatementAdapter.java:36)
	at com.carrotsearch.randomizedtesting.ThreadLeakControl$StatementRunner.run(ThreadLeakControl.java:368)
	at com.carrotsearch.randomizedtesting.ThreadLeakControl.forkTimeoutingTask(ThreadLeakControl.java:817)
	at com.carrotsearch.randomizedtesting.ThreadLeakControl$3.evaluate(ThreadLeakControl.java:468)
	at com.carrotsearch.randomizedtesting.RandomizedRunner.runSingleTest(RandomizedRunner.java:943)
	at com.carrotsearch.randomizedtesting.RandomizedRunner$5.evaluate(RandomizedRunner.java:829)
	at com.carrotsearch.randomizedtesting.RandomizedRunner$6.evaluate(RandomizedRunner.java:879)
	at com.carrotsearch.randomizedtesting.RandomizedRunner$7.evaluate(RandomizedRunner.java:890)
	at com.carrotsearch.randomizedtesting.rules.StatementAdapter.evaluate(StatementAdapter.java:36)
	at com.carrotsearch.randomizedtesting.rules.SystemPropertiesRestoreRule$1.evaluate(SystemPropertiesRestoreRule.java:57)
	at org.apache.lucene.util.AbstractBeforeAfterRule$1.evaluate(AbstractBeforeAfterRule.java:45)
	at com.carrotsearch.randomizedtesting.rules.StatementAdapter.evaluate(StatementAdapter.java:36)
	at org.apache.lucene.util.TestRuleStoreClassName$1.evaluate(TestRuleStoreClassName.java:41)
	at com.carrotsearch.randomizedtesting.rules.NoShadowingOrOverridesOnMethodsRule$1.evaluate(NoShadowingOrOverridesOnMethodsRule.java:40)
	at com.carrotsearch.randomizedtesting.rules.NoShadowingOrOverridesOnMethodsRule$1.evaluate(NoShadowingOrOverridesOnMethodsRule.java:40)
	at com.carrotsearch.randomizedtesting.rules.StatementAdapter.evaluate(StatementAdapter.java:36)
	at com.carrotsearch.randomizedtesting.rules.StatementAdapter.evaluate(StatementAdapter.java:36)
	at com.carrotsearch.randomizedtesting.rules.StatementAdapter.evaluate(StatementAdapter.java:36)
	at org.apache.lucene.util.TestRuleAssertionsRequired$1.evaluate(TestRuleAssertionsRequired.java:53)
	at org.apache.lucene.util.TestRuleMarkFailure$1.evaluate(TestRuleMarkFailure.java:47)
	at org.apache.lucene.util.TestRuleIgnoreAfterMaxFailures$1.evaluate(TestRuleIgnoreAfterMaxFailures.java:64)
	at org.apache.lucene.util.TestRuleIgnoreTestSuites$1.evaluate(TestRuleIgnoreTestSuites.java:54)
	at com.carrotsearch.randomizedtesting.rules.StatementAdapter.evaluate(StatementAdapter.java:36)
	at com.carrotsearch.randomizedtesting.ThreadLeakControl$StatementRunner.run(ThreadLeakControl.java:368)
	at java.lang.Thread.run(Thread.java:748)




Build Log:
[...truncated 12427 lines...]
   [junit4] Suite: org.apache.solr.cloud.LeaderTragicEventTest
   [junit4]   2> 321441 INFO  (SUITE-LeaderTragicEventTest-seed#[3BF8F71365D99989]-worker) [    ] o.a.s.SolrTestCaseJ4 SecureRandom sanity checks: test.solr.allowed.securerandom=null & java.security.egd=file:/dev/./urandom
   [junit4]   2> Creating dataDir: C:\Users\jenkins\workspace\Lucene-Solr-7.x-Windows\solr\build\solr-core\test\J0\temp\solr.cloud.LeaderTragicEventTest_3BF8F71365D99989-001\init-core-data-001
   [junit4]   2> 321443 INFO  (SUITE-LeaderTragicEventTest-seed#[3BF8F71365D99989]-worker) [    ] o.a.s.SolrTestCaseJ4 Using TrieFields (NUMERIC_POINTS_SYSPROP=false) w/NUMERIC_DOCVALUES_SYSPROP=true
   [junit4]   2> 321443 INFO  (SUITE-LeaderTragicEventTest-seed#[3BF8F71365D99989]-worker) [    ] o.a.s.SolrTestCaseJ4 Randomized ssl (true) and clientAuth (false) via: @org.apache.solr.util.RandomizeSSL(reason=, value=NaN, ssl=NaN, clientAuth=NaN)
   [junit4]   2> 321445 INFO  (SUITE-LeaderTragicEventTest-seed#[3BF8F71365D99989]-worker) [    ] o.a.s.c.MiniSolrCloudCluster Starting cluster of 2 servers in C:\Users\jenkins\workspace\Lucene-Solr-7.x-Windows\solr\build\solr-core\test\J0\temp\solr.cloud.LeaderTragicEventTest_3BF8F71365D99989-001\tempDir-001
   [junit4]   2> 321446 INFO  (SUITE-LeaderTragicEventTest-seed#[3BF8F71365D99989]-worker) [    ] o.a.s.c.ZkTestServer STARTING ZK TEST SERVER
   [junit4]   2> 321446 INFO  (Thread-418) [    ] o.a.s.c.ZkTestServer client port:0.0.0.0/0.0.0.0:0
   [junit4]   2> 321446 INFO  (Thread-418) [    ] o.a.s.c.ZkTestServer Starting server
   [junit4]   2> 321450 ERROR (Thread-418) [    ] o.a.z.s.ZooKeeperServer ZKShutdownHandler is not registered, so ZooKeeper server won't take any action on ERROR or SHUTDOWN server state changes
   [junit4]   2> 321547 INFO  (SUITE-LeaderTragicEventTest-seed#[3BF8F71365D99989]-worker) [    ] o.a.s.c.ZkTestServer start zk server on port:57525
   [junit4]   2> 321551 INFO  (zkConnectionManagerCallback-2955-thread-1) [    ] o.a.s.c.c.ConnectionManager zkClient has connected
   [junit4]   2> 321560 INFO  (jetty-launcher-2952-thread-2) [    ] o.e.j.s.Server jetty-9.4.11.v20180605; built: 2018-06-05T18:24:03.829Z; git: d5fc0523cfa96bfebfbda19606cad384d772f04c; jvm 1.8.0_172-b11
   [junit4]   2> 321560 INFO  (jetty-launcher-2952-thread-1) [    ] o.e.j.s.Server jetty-9.4.11.v20180605; built: 2018-06-05T18:24:03.829Z; git: d5fc0523cfa96bfebfbda19606cad384d772f04c; jvm 1.8.0_172-b11
   [junit4]   2> 321561 INFO  (jetty-launcher-2952-thread-2) [    ] o.e.j.s.session DefaultSessionIdManager workerName=node0
   [junit4]   2> 321561 INFO  (jetty-launcher-2952-thread-2) [    ] o.e.j.s.session No SessionScavenger set, using defaults
   [junit4]   2> 321561 INFO  (jetty-launcher-2952-thread-2) [    ] o.e.j.s.session node0 Scavenging every 660000ms
   [junit4]   2> 321561 INFO  (jetty-launcher-2952-thread-1) [    ] o.e.j.s.session DefaultSessionIdManager workerName=node0
   [junit4]   2> 321561 INFO  (jetty-launcher-2952-thread-1) [    ] o.e.j.s.session No SessionScavenger set, using defaults
   [junit4]   2> 321561 INFO  (jetty-launcher-2952-thread-1) [    ] o.e.j.s.session node0 Scavenging every 660000ms
   [junit4]   2> 321561 INFO  (jetty-launcher-2952-thread-2) [    ] o.e.j.s.h.ContextHandler Started o.e.j.s.ServletContextHandler@1de317f{/solr,null,AVAILABLE}
   [junit4]   2> 321561 INFO  (jetty-launcher-2952-thread-1) [    ] o.e.j.s.h.ContextHandler Started o.e.j.s.ServletContextHandler@14f850e{/solr,null,AVAILABLE}
   [junit4]   2> 321565 INFO  (jetty-launcher-2952-thread-2) [    ] o.e.j.s.AbstractConnector Started ServerConnector@c5b8d9{SSL,[ssl, http/1.1]}{127.0.0.1:57533}
   [junit4]   2> 321565 INFO  (jetty-launcher-2952-thread-1) [    ] o.e.j.s.AbstractConnector Started ServerConnector@1d45a78{SSL,[ssl, http/1.1]}{127.0.0.1:57534}
   [junit4]   2> 321565 INFO  (jetty-launcher-2952-thread-1) [    ] o.e.j.s.Server Started @321600ms
   [junit4]   2> 321565 INFO  (jetty-launcher-2952-thread-2) [    ] o.e.j.s.Server Started @321600ms
   [junit4]   2> 321565 INFO  (jetty-launcher-2952-thread-2) [    ] o.a.s.c.s.e.JettySolrRunner Jetty properties: {hostContext=/solr, hostPort=57533}
   [junit4]   2> 321565 INFO  (jetty-launcher-2952-thread-1) [    ] o.a.s.c.s.e.JettySolrRunner Jetty properties: {hostContext=/solr, hostPort=57534}
   [junit4]   2> 321565 ERROR (jetty-launcher-2952-thread-2) [    ] o.a.s.u.StartupLoggingUtils Missing Java Option solr.log.dir. Logging may be missing or incomplete.
   [junit4]   2> 321565 ERROR (jetty-launcher-2952-thread-1) [    ] o.a.s.u.StartupLoggingUtils Missing Java Option solr.log.dir. Logging may be missing or incomplete.
   [junit4]   2> 321565 INFO  (jetty-launcher-2952-thread-2) [    ] o.a.s.s.SolrDispatchFilter Using logger factory org.apache.logging.slf4j.Log4jLoggerFactory
   [junit4]   2> 321565 INFO  (jetty-launcher-2952-thread-1) [    ] o.a.s.s.SolrDispatchFilter Using logger factory org.apache.logging.slf4j.Log4jLoggerFactory
   [junit4]   2> 321565 INFO  (jetty-launcher-2952-thread-1) [    ] o.a.s.s.SolrDispatchFilter  ___      _       Welcome to Apache Solr? version 7.5.0
   [junit4]   2> 321565 INFO  (jetty-launcher-2952-thread-2) [    ] o.a.s.s.SolrDispatchFilter  ___      _       Welcome to Apache Solr? version 7.5.0
   [junit4]   2> 321566 INFO  (jetty-launcher-2952-thread-1) [    ] o.a.s.s.SolrDispatchFilter / __| ___| |_ _   Starting in cloud mode on port null
   [junit4]   2> 321566 INFO  (jetty-launcher-2952-thread-2) [    ] o.a.s.s.SolrDispatchFilter / __| ___| |_ _   Starting in cloud mode on port null
   [junit4]   2> 321566 INFO  (jetty-launcher-2952-thread-1) [    ] o.a.s.s.SolrDispatchFilter \__ \/ _ \ | '_|  Install dir: null
   [junit4]   2> 321566 INFO  (jetty-launcher-2952-thread-2) [    ] o.a.s.s.SolrDispatchFilter \__ \/ _ \ | '_|  Install dir: null
   [junit4]   2> 321566 INFO  (jetty-launcher-2952-thread-1) [    ] o.a.s.s.SolrDispatchFilter |___/\___/_|_|    Start time: 2018-07-12T17:23:06.789Z
   [junit4]   2> 321566 INFO  (jetty-launcher-2952-thread-2) [    ] o.a.s.s.SolrDispatchFilter |___/\___/_|_|    Start time: 2018-07-12T17:23:06.789Z
   [junit4]   2> 321574 INFO  (zkConnectionManagerCallback-2957-thread-1) [    ] o.a.s.c.c.ConnectionManager zkClient has connected
   [junit4]   2> 321574 INFO  (zkConnectionManagerCallback-2959-thread-1) [    ] o.a.s.c.c.ConnectionManager zkClient has connected
   [junit4]   2> 321575 INFO  (jetty-launcher-2952-thread-1) [    ] o.a.s.s.SolrDispatchFilter solr.xml found in ZooKeeper. Loading...
   [junit4]   2> 321575 INFO  (jetty-launcher-2952-thread-2) [    ] o.a.s.s.SolrDispatchFilter solr.xml found in ZooKeeper. Loading...
   [junit4]   2> 321587 WARN  (NIOServerCxn.Factory:0.0.0.0/0.0.0.0:0) [    ] o.a.z.s.NIOServerCnxn Unable to read additional data from client sessionid 0x100097f0f950001, likely client has closed socket
   [junit4]   2> 321587 WARN  (NIOServerCxn.Factory:0.0.0.0/0.0.0.0:0) [    ] o.a.z.s.NIOServerCnxn Unable to read additional data from client sessionid 0x100097f0f950002, likely client has closed socket
   [junit4]   2> 321975 INFO  (jetty-launcher-2952-thread-2) [    ] o.a.s.c.ZkContainer Zookeeper client=127.0.0.1:57525/solr
   [junit4]   2> 321977 INFO  (zkConnectionManagerCallback-2963-thread-1) [    ] o.a.s.c.c.ConnectionManager zkClient has connected
   [junit4]   2> 321979 INFO  (zkConnectionManagerCallback-2965-thread-1) [    ] o.a.s.c.c.ConnectionManager zkClient has connected
   [junit4]   2> 322093 INFO  (jetty-launcher-2952-thread-2) [n:127.0.0.1:57533_solr    ] o.a.s.c.Overseer Overseer (id=null) closing
   [junit4]   2> 322094 INFO  (jetty-launcher-2952-thread-2) [n:127.0.0.1:57533_solr    ] o.a.s.c.OverseerElectionContext I am going to be the leader 127.0.0.1:57533_solr
   [junit4]   2> 322095 INFO  (jetty-launcher-2952-thread-2) [n:127.0.0.1:57533_solr    ] o.a.s.c.Overseer Overseer (id=72068035364847620-127.0.0.1:57533_solr-n_0000000000) starting
   [junit4]   2> 322105 INFO  (zkConnectionManagerCallback-2972-thread-1) [    ] o.a.s.c.c.ConnectionManager zkClient has connected
   [junit4]   2> 322109 INFO  (jetty-launcher-2952-thread-2) [n:127.0.0.1:57533_solr    ] o.a.s.c.s.i.ZkClientClusterStateProvider Cluster at 127.0.0.1:57525/solr ready
   [junit4]   2> 322110 INFO  (jetty-launcher-2952-thread-2) [n:127.0.0.1:57533_solr    ] o.a.s.c.ZkController Register node as live in ZooKeeper:/live_nodes/127.0.0.1:57533_solr
   [junit4]   2> 322114 INFO  (OverseerStateUpdate-72068035364847620-127.0.0.1:57533_solr-n_0000000000) [    ] o.a.s.c.c.ZkStateReader Updated live nodes from ZooKeeper... (0) -> (1)
   [junit4]   2> 322122 INFO  (zkCallback-2971-thread-1) [    ] o.a.s.c.c.ZkStateReader Updated live nodes from ZooKeeper... (0) -> (1)
   [junit4]   2> 322186 INFO  (jetty-launcher-2952-thread-2) [n:127.0.0.1:57533_solr    ] o.a.s.h.a.MetricsHistoryHandler No .system collection, keeping metrics history in memory.
   [junit4]   2> 322198 INFO  (jetty-launcher-2952-thread-1) [    ] o.a.s.c.ZkContainer Zookeeper client=127.0.0.1:57525/solr
   [junit4]   2> 322202 INFO  (zkConnectionManagerCallback-2977-thread-1) [    ] o.a.s.c.c.ConnectionManager zkClient has connected
   [junit4]   2> 322210 INFO  (zkConnectionManagerCallback-2979-thread-1) [    ] o.a.s.c.c.ConnectionManager zkClient has connected
   [junit4]   2> 322233 INFO  (jetty-launcher-2952-thread-1) [n:127.0.0.1:57534_solr    ] o.a.s.c.c.ZkStateReader Updated live nodes from ZooKeeper... (0) -> (1)
   [junit4]   2> 322238 INFO  (jetty-launcher-2952-thread-1) [n:127.0.0.1:57534_solr    ] o.a.s.c.Overseer Overseer (id=null) closing
   [junit4]   2> 322242 INFO  (jetty-launcher-2952-thread-1) [n:127.0.0.1:57534_solr    ] o.a.s.c.TransientSolrCoreCacheDefault Allocating transient cache for 2147483647 transient cores
   [junit4]   2> 322242 INFO  (jetty-launcher-2952-thread-1) [n:127.0.0.1:57534_solr    ] o.a.s.c.ZkController Register node as live in ZooKeeper:/live_nodes/127.0.0.1:57534_solr
   [junit4]   2> 322243 INFO  (zkCallback-2971-thread-1) [    ] o.a.s.c.c.ZkStateReader Updated live nodes from ZooKeeper... (1) -> (2)
   [junit4]   2> 322243 INFO  (zkCallback-2964-thread-1) [    ] o.a.s.c.c.ZkStateReader Updated live nodes from ZooKeeper... (1) -> (2)
   [junit4]   2> 322245 INFO  (zkCallback-2978-thread-1) [    ] o.a.s.c.c.ZkStateReader Updated live nodes from ZooKeeper... (1) -> (2)
   [junit4]   2> 322284 INFO  (jetty-launcher-2952-thread-2) [n:127.0.0.1:57533_solr    ] o.a.s.m.r.SolrJmxReporter JMX monitoring for 'solr_57533.solr.node' (registry 'solr.node') enabled at server: com.sun.jmx.mbeanserver.JmxMBeanServer@18acdee
   [junit4]   2> 322291 INFO  (jetty-launcher-2952-thread-2) [n:127.0.0.1:57533_solr    ] o.a.s.m.r.SolrJmxReporter JMX monitoring for 'solr_57533.solr.jvm' (registry 'solr.jvm') enabled at server: com.sun.jmx.mbeanserver.JmxMBeanServer@18acdee
   [junit4]   2> 322291 INFO  (jetty-launcher-2952-thread-2) [n:127.0.0.1:57533_solr    ] o.a.s.m.r.SolrJmxReporter JMX monitoring for 'solr_57533.solr.jetty' (registry 'solr.jetty') enabled at server: com.sun.jmx.mbeanserver.JmxMBeanServer@18acdee
   [junit4]   2> 322293 INFO  (jetty-launcher-2952-thread-2) [n:127.0.0.1:57533_solr    ] o.a.s.c.CorePropertiesLocator Found 0 core definitions underneath C:\Users\jenkins\workspace\Lucene-Solr-7.x-Windows\solr\build\solr-core\test\J0\temp\solr.cloud.LeaderTragicEventTest_3BF8F71365D99989-001\tempDir-001\node2\.
   [junit4]   2> 322348 INFO  (zkConnectionManagerCallback-2986-thread-1) [    ] o.a.s.c.c.ConnectionManager zkClient has connected
   [junit4]   2> 322349 INFO  (jetty-launcher-2952-thread-1) [n:127.0.0.1:57534_solr    ] o.a.s.c.c.ZkStateReader Updated live nodes from ZooKeeper... (0) -> (2)
   [junit4]   2> 322351 INFO  (jetty-launcher-2952-thread-1) [n:127.0.0.1:57534_solr    ] o.a.s.c.s.i.ZkClientClusterStateProvider Cluster at 127.0.0.1:57525/solr ready
   [junit4]   2> 322351 INFO  (jetty-launcher-2952-thread-1) [n:127.0.0.1:57534_solr    ] o.a.s.h.a.MetricsHistoryHandler No .system collection, keeping metrics history in memory.
   [junit4]   2> 322389 INFO  (jetty-launcher-2952-thread-1) [n:127.0.0.1:57534_solr    ] o.a.s.m.r.SolrJmxReporter JMX monitoring for 'solr_57534.solr.node' (registry 'solr.node') enabled at server: com.sun.jmx.mbeanserver.JmxMBeanServer@18acdee
   [junit4]   2> 322397 INFO  (jetty-launcher-2952-thread-1) [n:127.0.0.1:57534_solr    ] o.a.s.m.r.SolrJmxReporter JMX monitoring for 'solr_57534.solr.jvm' (registry 'solr.jvm') enabled at server: com.sun.jmx.mbeanserver.JmxMBeanServer@18acdee
   [junit4]   2> 322397 INFO  (jetty-launcher-2952-thread-1) [n:127.0.0.1:57534_solr    ] o.a.s.m.r.SolrJmxReporter JMX monitoring for 'solr_57534.solr.jetty' (registry 'solr.jetty') enabled at server: com.sun.jmx.mbeanserver.JmxMBeanServer@18acdee
   [junit4]   2> 322399 INFO  (jetty-launcher-2952-thread-1) [n:127.0.0.1:57534_solr    ] o.a.s.c.CorePropertiesLocator Found 0 core definitions underneath C:\Users\jenkins\workspace\Lucene-Solr-7.x-Windows\solr\build\solr-core\test\J0\temp\solr.cloud.LeaderTragicEventTest_3BF8F71365D99989-001\tempDir-001\node1\.
   [junit4]   2> 322440 INFO  (zkConnectionManagerCallback-2989-thread-1) [    ] o.a.s.c.c.ConnectionManager zkClient has connected
   [junit4]   2> 322448 INFO  (zkConnectionManagerCallback-2994-thread-1) [    ] o.a.s.c.c.ConnectionManager zkClient has connected
   [junit4]   2> 322449 INFO  (SUITE-LeaderTragicEventTest-seed#[3BF8F71365D99989]-worker) [    ] o.a.s.c.c.ZkStateReader Updated live nodes from ZooKeeper... (0) -> (2)
   [junit4]   2> 322453 INFO  (SUITE-LeaderTragicEventTest-seed#[3BF8F71365D99989]-worker) [    ] o.a.s.c.s.i.ZkClientClusterStateProvider Cluster at 127.0.0.1:57525/solr ready
   [junit4]   2> 322505 INFO  (TEST-LeaderTragicEventTest.testOtherReplicasAreNotActive-seed#[3BF8F71365D99989]) [    ] o.a.s.SolrTestCaseJ4 ###Starting testOtherReplicasAreNotActive
   [junit4]   2> 322552 INFO  (qtp20270690-4462) [n:127.0.0.1:57533_solr    ] o.a.s.h.a.CollectionsHandler Invoked Collection Action :create with params collection.configName=config&name=collection1&nrtReplicas=2&action=CREATE&numShards=1&wt=javabin&version=2 and sendToOCPQueue=true
   [junit4]   2> 322557 INFO  (OverseerThreadFactory-858-thread-1) [    ] o.a.s.c.a.c.CreateCollectionCmd Create collection collection1
   [junit4]   2> 322702 INFO  (OverseerStateUpdate-72068035364847620-127.0.0.1:57533_solr-n_0000000000) [    ] o.a.s.c.o.SliceMutator createReplica() {
   [junit4]   2>   "operation":"ADDREPLICA",
   [junit4]   2>   "collection":"collection1",
   [junit4]   2>   "shard":"shard1",
   [junit4]   2>   "core":"collection1_shard1_replica_n1",
   [junit4]   2>   "state":"down",
   [junit4]   2>   "base_url":"https://127.0.0.1:57533/solr",
   [junit4]   2>   "type":"NRT",
   [junit4]   2>   "waitForFinalState":"false"} 
   [junit4]   2> 322703 INFO  (OverseerStateUpdate-72068035364847620-127.0.0.1:57533_solr-n_0000000000) [    ] o.a.s.c.o.SliceMutator createReplica() {
   [junit4]   2>   "operation":"ADDREPLICA",
   [junit4]   2>   "collection":"collection1",
   [junit4]   2>   "shard":"shard1",
   [junit4]   2>   "core":"collection1_shard1_replica_n2",
   [junit4]   2>   "state":"down",
   [junit4]   2>   "base_url":"https://127.0.0.1:57534/solr",
   [junit4]   2>   "type":"NRT",
   [junit4]   2>   "waitForFinalState":"false"} 
   [junit4]   2> 322906 INFO  (qtp20270690-4468) [n:127.0.0.1:57533_solr    x:collection1_shard1_replica_n1] o.a.s.h.a.CoreAdminOperation core create command qt=/admin/cores&coreNodeName=core_node3&collection.configName=config&newCollection=true&name=collection1_shard1_replica_n1&action=CREATE&numShards=1&collection=collection1&shard=shard1&wt=javabin&version=2&replicaType=NRT
   [junit4]   2> 322909 INFO  (qtp20270690-4468) [n:127.0.0.1:57533_solr    x:collection1_shard1_replica_n1] o.a.s.c.TransientSolrCoreCacheDefault Allocating transient cache for 2147483647 transient cores
   [junit4]   2> 322938 INFO  (qtp20639904-4466) [n:127.0.0.1:57534_solr    x:collection1_shard1_replica_n2] o.a.s.h.a.CoreAdminOperation core create command qt=/admin/cores&coreNodeName=core_node4&collection.configName=config&newCollection=true&name=collection1_shard1_replica_n2&action=CREATE&numShards=1&collection=collection1&shard=shard1&wt=javabin&version=2&replicaType=NRT
   [junit4]   2> 323937 INFO  (qtp20270690-4468) [n:127.0.0.1:57533_solr c:collection1 s:shard1 r:core_node3 x:collection1_shard1_replica_n1] o.a.s.c.SolrConfig Using Lucene MatchVersion: 7.5.0
   [junit4]   2> 323943 INFO  (qtp20270690-4468) [n:127.0.0.1:57533_solr c:collection1 s:shard1 r:core_node3 x:collection1_shard1_replica_n1] o.a.s.s.IndexSchema [collection1_shard1_replica_n1] Schema name=minimal
   [junit4]   2> 323957 INFO  (qtp20270690-4468) [n:127.0.0.1:57533_solr c:collection1 s:shard1 r:core_node3 x:collection1_shard1_replica_n1] o.a.s.s.IndexSchema Loaded schema minimal/1.1 with uniqueid field id
   [junit4]   2> 323957 INFO  (qtp20270690-4468) [n:127.0.0.1:57533_solr c:collection1 s:shard1 r:core_node3 x:collection1_shard1_replica_n1] o.a.s.c.CoreContainer Creating SolrCore 'collection1_shard1_replica_n1' using configuration from collection collection1, trusted=true
   [junit4]   2> 323960 INFO  (qtp20270690-4468) [n:127.0.0.1:57533_solr c:collection1 s:shard1 r:core_node3 x:collection1_shard1_replica_n1] o.a.s.m.r.SolrJmxReporter JMX monitoring for 'solr_57533.solr.core.collection1.shard1.replica_n1' (registry 'solr.core.collection1.shard1.replica_n1') enabled at server: com.sun.jmx.mbeanserver.JmxMBeanServer@18acdee
   [junit4]   2> 323960 INFO  (qtp20270690-4468) [n:127.0.0.1:57533_solr c:collection1 s:shard1 r:core_node3 x:collection1_shard1_replica_n1] o.a.s.c.SolrCore solr.RecoveryStrategy.Builder
   [junit4]   2> 323960 INFO  (qtp20270690-4468) [n:127.0.0.1:57533_solr c:collection1 s:shard1 r:core_node3 x:collection1_shard1_replica_n1] o.a.s.c.SolrCore [[collection1_shard1_replica_n1] ] Opening new SolrCore at [C:\Users\jenkins\workspace\Lucene-Solr-7.x-Windows\solr\build\solr-core\test\J0\temp\solr.cloud.LeaderTragicEventTest_3BF8F71365D99989-001\tempDir-001\node2\collection1_shard1_replica_n1], dataDir=[C:\Users\jenkins\workspace\Lucene-Solr-7.x-Windows\solr\build\solr-core\test\J0\temp\solr.cloud.LeaderTragicEventTest_3BF8F71365D99989-001\tempDir-001\node2\.\collection1_shard1_replica_n1\data\]
   [junit4]   2> 323962 INFO  (qtp20639904-4466) [n:127.0.0.1:57534_solr c:collection1 s:shard1 r:core_node4 x:collection1_shard1_replica_n2] o.a.s.c.SolrConfig Using Lucene MatchVersion: 7.5.0
   [junit4]   2> 323969 INFO  (qtp20639904-4466) [n:127.0.0.1:57534_solr c:collection1 s:shard1 r:core_node4 x:collection1_shard1_replica_n2] o.a.s.s.IndexSchema [collection1_shard1_replica_n2] Schema name=minimal
   [junit4]   2> 323970 INFO  (qtp20639904-4466) [n:127.0.0.1:57534_solr c:collection1 s:shard1 r:core_node4 x:collection1_shard1_replica_n2] o.a.s.s.IndexSchema Loaded schema minimal/1.1 with uniqueid field id
   [junit4]   2> 323970 INFO  (qtp20639904-4466) [n:127.0.0.1:57534_solr c:collection1 s:shard1 r:core_node4 x:collection1_shard1_replica_n2] o.a.s.c.CoreContainer Creating SolrCore 'collection1_shard1_replica_n2' using configuration from collection collection1, trusted=true
   [junit4]   2> 323971 INFO  (qtp20639904-4466) [n:127.0.0.1:57534_solr c:collection1 s:shard1 r:core_node4 x:collection1_shard1_replica_n2] o.a.s.m.r.SolrJmxReporter JMX monitoring for 'solr_57534.solr.core.collection1.shard1.replica_n2' (registry 'solr.core.collection1.shard1.replica_n2') enabled at server: com.sun.jmx.mbeanserver.JmxMBeanServer@18acdee
   [junit4]   2> 323971 INFO  (qtp20639904-4466) [n:127.0.0.1:57534_solr c:collection1 s:shard1 r:core_node4 x:collection1_shard1_replica_n2] o.a.s.c.SolrCore solr.RecoveryStrategy.Builder
   [junit4]   2> 323971 INFO  (qtp20639904-4466) [n:127.0.0.1:57534_solr c:collection1 s:shard1 r:core_node4 x:collection1_shard1_replica_n2] o.a.s.c.SolrCore [[collection1_shard1_replica_n2] ] Opening new SolrCore at [C:\Users\jenkins\workspace\Lucene-Solr-7.x-Windows\solr\build\solr-core\test\J0\temp\solr.cloud.LeaderTragicEventTest_3BF8F71365D99989-001\tempDir-001\node1\collection1_shard1_replica_n2], dataDir=[C:\Users\jenkins\workspace\Lucene-Solr-7.x-Windows\solr\build\solr-core\test\J0\temp\solr.cloud.LeaderTragicEventTest_3BF8F71365D99989-001\tempDir-001\node1\.\collection1_shard1_replica_n2\data\]
   [junit4]   2> 324105 INFO  (qtp20270690-4468) [n:127.0.0.1:57533_solr c:collection1 s:shard1 r:core_node3 x:collection1_shard1_replica_n1] o.a.s.u.UpdateHandler Using UpdateLog implementation: org.apache.solr.update.UpdateLog
   [junit4]   2> 324105 INFO  (qtp20270690-4468) [n:127.0.0.1:57533_solr c:collection1 s:shard1 r:core_node3 x:collection1_shard1_replica_n1] o.a.s.u.UpdateLog Initializing UpdateLog: dataDir=null defaultSyncLevel=FLUSH numRecordsToKeep=100 maxNumLogsToKeep=10 numVersionBuckets=65536
   [junit4]   2> 324106 INFO  (qtp20639904-4466) [n:127.0.0.1:57534_solr c:collection1 s:shard1 r:core_node4 x:collection1_shard1_replica_n2] o.a.s.u.UpdateHandler Using UpdateLog implementation: org.apache.solr.update.UpdateLog
   [junit4]   2> 324106 INFO  (qtp20639904-4466) [n:127.0.0.1:57534_solr c:collection1 s:shard1 r:core_node4 x:collection1_shard1_replica_n2] o.a.s.u.UpdateLog Initializing UpdateLog: dataDir=null defaultSyncLevel=FLUSH numRecordsToKeep=100 maxNumLogsToKeep=10 numVersionBuckets=65536
   [junit4]   2> 324109 INFO  (qtp20270690-4468) [n:127.0.0.1:57533_solr c:collection1 s:shard1 r:core_node3 x:collection1_shard1_replica_n1] o.a.s.u.CommitTracker Hard AutoCommit: disabled
   [junit4]   2> 324109 INFO  (qtp20639904-4466) [n:127.0.0.1:57534_solr c:collection1 s:shard1 r:core_node4 x:collection1_shard1_replica_n2] o.a.s.u.CommitTracker Hard AutoCommit: disabled
   [junit4]   2> 324109 INFO  (qtp20270690-4468) [n:127.0.0.1:57533_solr c:collection1 s:shard1 r:core_node3 x:collection1_shard1_replica_n1] o.a.s.u.CommitTracker Soft AutoCommit: disabled
   [junit4]   2> 324109 INFO  (qtp20639904-4466) [n:127.0.0.1:57534_solr c:collection1 s:shard1 r:core_node4 x:collection1_shard1_replica_n2] o.a.s.u.CommitTracker Soft AutoCommit: disabled
   [junit4]   2> 324111 INFO  (qtp20639904-4466) [n:127.0.0.1:57534_solr c:collection1 s:shard1 r:core_node4 x:collection1_shard1_replica_n2] o.a.s.s.SolrIndexSearcher Opening [Searcher@14fef8a[collection1_shard1_replica_n2] main]
   [junit4]   2> 324111 INFO  (qtp20270690-4468) [n:127.0.0.1:57533_solr c:collection1 s:shard1 r:core_node3 x:collection1_shard1_replica_n1] o.a.s.s.SolrIndexSearcher Opening [Searcher@1fc6696[collection1_shard1_replica_n1] main]
   [junit4]   2> 324112 INFO  (qtp20639904-4466) [n:127.0.0.1:57534_solr c:collection1 s:shard1 r:core_node4 x:collection1_shard1_replica_n2] o.a.s.r.ManagedResourceStorage Configured ZooKeeperStorageIO with znodeBase: /configs/config
   [junit4]   2> 324112 INFO  (qtp20270690-4468) [n:127.0.0.1:57533_solr c:collection1 s:shard1 r:core_node3 x:collection1_shard1_replica_n1] o.a.s.r.ManagedResourceStorage Configured ZooKeeperStorageIO with znodeBase: /configs/config
   [junit4]   2> 324112 INFO  (qtp20270690-4468) [n:127.0.0.1:57533_solr c:collection1 s:shard1 r:core_node3 x:collection1_shard1_replica_n1] o.a.s.r.ManagedResourceStorage Loaded null at path _rest_managed.json using ZooKeeperStorageIO:path=/configs/config
   [junit4]   2> 324112 INFO  (qtp20639904-4466) [n:127.0.0.1:57534_solr c:collection1 s:shard1 r:core_node4 x:collection1_shard1_replica_n2] o.a.s.r.ManagedResourceStorage Loaded null at path _rest_managed.json using ZooKeeperStorageIO:path=/configs/config
   [junit4]   2> 324113 INFO  (qtp20639904-4466) [n:127.0.0.1:57534_solr c:collection1 s:shard1 r:core_node4 x:collection1_shard1_replica_n2] o.a.s.h.ReplicationHandler Commits will be reserved for 10000ms.
   [junit4]   2> 324113 INFO  (qtp20270690-4468) [n:127.0.0.1:57533_solr c:collection1 s:shard1 r:core_node3 x:collection1_shard1_replica_n1] o.a.s.h.ReplicationHandler Commits will be reserved for 10000ms.
   [junit4]   2> 324113 INFO  (qtp20639904-4466) [n:127.0.0.1:57534_solr c:collection1 s:shard1 r:core_node4 x:collection1_shard1_replica_n2] o.a.s.u.UpdateLog Could not find max version in index or recent updates, using new clock 1605806262149185536
   [junit4]   2> 324114 INFO  (qtp20270690-4468) [n:127.0.0.1:57533_solr c:collection1 s:shard1 r:core_node3 x:collection1_shard1_replica_n1] o.a.s.u.UpdateLog Could not find max version in index or recent updates, using new clock 1605806262150234112
   [junit4]   2> 324116 INFO  (searcherExecutor-870-thread-1-processing-n:127.0.0.1:57533_solr x:collection1_shard1_replica_n1 c:collection1 s:shard1 r:core_node3) [n:127.0.0.1:57533_solr c:collection1 s:shard1 r:core_node3 x:collection1_shard1_replica_n1] o.a.s.c.SolrCore [collection1_shard1_replica_n1] Registered new searcher Searcher@1fc6696[collection1_shard1_replica_n1] main{ExitableDirectoryReader(UninvertingDirectoryReader())}
   [junit4]   2> 324116 INFO  (searcherExecutor-871-thread-1-processing-n:127.0.0.1:57534_solr x:collection1_shard1_replica_n2 c:collection1 s:shard1 r:core_node4) [n:127.0.0.1:57534_solr c:collection1 s:shard1 r:core_node4 x:collection1_shard1_replica_n2] o.a.s.c.SolrCore [collection1_shard1_replica_n2] Registered new searcher Searcher@14fef8a[collection1_shard1_replica_n2] main{ExitableDirectoryReader(UninvertingDirectoryReader())}
   [junit4]   2> 324121 INFO  (qtp20639904-4466) [n:127.0.0.1:57534_solr c:collection1 s:shard1 r:core_node4 x:collection1_shard1_replica_n2] o.a.s.c.ZkShardTerms Successful update of terms at /collections/collection1/terms/shard1 to Terms{values={core_node4=0}, version=0}
   [junit4]   2> 324121 INFO  (qtp20270690-4468) [n:127.0.0.1:57533_solr c:collection1 s:shard1 r:core_node3 x:collection1_shard1_replica_n1] o.a.s.c.ZkShardTerms Failed to save terms, version is not a match, retrying
   [junit4]   2> 324122 INFO  (qtp20270690-4468) [n:127.0.0.1:57533_solr c:collection1 s:shard1 r:core_node3 x:collection1_shard1_replica_n1] o.a.s.c.ZkShardTerms Successful update of terms at /collections/collection1/terms/shard1 to Terms{values={core_node3=0, core_node4=0}, version=1}
   [junit4]   2> 324126 INFO  (qtp20639904-4466) [n:127.0.0.1:57534_solr c:collection1 s:shard1 r:core_node4 x:collection1_shard1_replica_n2] o.a.s.c.ShardLeaderElectionContext Enough replicas found to continue.
   [junit4]   2> 324126 INFO  (qtp20639904-4466) [n:127.0.0.1:57534_solr c:collection1 s:shard1 r:core_node4 x:collection1_shard1_replica_n2] o.a.s.c.ShardLeaderElectionContext I may be the new leader - try and sync
   [junit4]   2> 324126 INFO  (qtp20639904-4466) [n:127.0.0.1:57534_solr c:collection1 s:shard1 r:core_node4 x:collection1_shard1_replica_n2] o.a.s.c.SyncStrategy Sync replicas to https://127.0.0.1:57534/solr/collection1_shard1_replica_n2/
   [junit4]   2> 324127 INFO  (qtp20639904-4466) [n:127.0.0.1:57534_solr c:collection1 s:shard1 r:core_node4 x:collection1_shard1_replica_n2] o.a.s.u.PeerSync PeerSync: core=collection1_shard1_replica_n2 url=https://127.0.0.1:57534/solr START replicas=[https://127.0.0.1:57533/solr/collection1_shard1_replica_n1/] nUpdates=100
   [junit4]   2> 324127 INFO  (qtp20639904-4466) [n:127.0.0.1:57534_solr c:collection1 s:shard1 r:core_node4 x:collection1_shard1_replica_n2] o.a.s.u.PeerSync PeerSync: core=collection1_shard1_replica_n2 url=https://127.0.0.1:57534/solr DONE.  We have no versions.  sync failed.
   [junit4]   2> 324132 INFO  (qtp20270690-4464) [n:127.0.0.1:57533_solr c:collection1 s:shard1 r:core_node3 x:collection1_shard1_replica_n1] o.a.s.c.S.Request [collection1_shard1_replica_n1]  webapp=/solr path=/get params={distrib=false&qt=/get&fingerprint=false&getVersions=100&wt=javabin&version=2} status=0 QTime=0
   [junit4]   2> 324132 INFO  (qtp20639904-4466) [n:127.0.0.1:57534_solr c:collection1 s:shard1 r:core_node4 x:collection1_shard1_replica_n2] o.a.s.c.SyncStrategy Leader's attempt to sync with shard failed, moving to the next candidate
   [junit4]   2> 324132 INFO  (qtp20639904-4466) [n:127.0.0.1:57534_solr c:collection1 s:shard1 r:core_node4 x:collection1_shard1_replica_n2] o.a.s.c.ShardLeaderElectionContext We failed sync, but we have no versions - we can't sync in that case - we were active before, so become leader anyway
   [junit4]   2> 324132 INFO  (qtp20639904-4466) [n:127.0.0.1:57534_solr c:collection1 s:shard1 r:core_node4 x:collection1_shard1_replica_n2] o.a.s.c.ShardLeaderElectionContext Found all replicas participating in election, clear LIR
   [junit4]   2> 324137 INFO  (qtp20639904-4466) [n:127.0.0.1:57534_solr c:collection1 s:shard1 r:core_node4 x:collection1_shard1_replica_n2] o.a.s.c.ShardLeaderElectionContext I am the new leader: https://127.0.0.1:57534/solr/collection1_shard1_replica_n2/ shard1
   [junit4]   2> 324289 INFO  (qtp20639904-4466) [n:127.0.0.1:57534_solr c:collection1 s:shard1 r:core_node4 x:collection1_shard1_replica_n2] o.a.s.c.ZkController I am the leader, no recovery necessary
   [junit4]   2> 324293 INFO  (qtp20639904-4466) [n:127.0.0.1:57534_solr c:collection1 s:shard1 r:core_node4 x:collection1_shard1_replica_n2] o.a.s.s.HttpSolrCall [admin] webapp=null path=/admin/cores params={qt=/admin/cores&coreNodeName=core_node4&collection.configName=config&newCollection=true&name=collection1_shard1_replica_n2&action=CREATE&numShards=1&collection=collection1&shard=shard1&wt=javabin&version=2&replicaType=NRT} status=0 QTime=1355
   [junit4]   2> 324391 INFO  (zkCallback-2978-thread-1) [    ] o.a.s.c.c.ZkStateReader A cluster state change: [WatchedEvent state:SyncConnected type:NodeDataChanged path:/collections/collection1/state.json] for collection [collection1] has occurred - updating... (live nodes size: [2])
   [junit4]   2> 325132 INFO  (qtp20270690-4468) [n:127.0.0.1:57533_solr c:collection1 s:shard1 r:core_node3 x:collection1_shard1_replica_n1] o.a.s.s.HttpSolrCall [admin] webapp=null path=/admin/cores params={qt=/admin/cores&coreNodeName=core_node3&collection.configName=config&newCollection=true&name=collection1_shard1_replica_n1&action=CREATE&numShards=1&collection=collection1&shard=shard1&wt=javabin&version=2&replicaType=NRT} status=0 QTime=2225
   [junit4]   2> 325136 INFO  (qtp20270690-4462) [n:127.0.0.1:57533_solr    ] o.a.s.h.a.CollectionsHandler Wait for new collection to be active for at most 30 seconds. Check all shard replicas
   [junit4]   2> 325231 INFO  (zkCallback-2978-thread-1) [    ] o.a.s.c.c.ZkStateReader A cluster state change: [WatchedEvent state:SyncConnected type:NodeDataChanged path:/collections/collection1/state.json] for collection [collection1] has occurred - updating... (live nodes size: [2])
   [junit4]   2> 325231 INFO  (zkCallback-2964-thread-1) [    ] o.a.s.c.c.ZkStateReader A cluster state change: [WatchedEvent state:SyncConnected type:NodeDataChanged path:/collections/collection1/state.json] for collection [collection1] has occurred - updating... (live nodes size: [2])
   [junit4]   2> 326137 INFO  (qtp20270690-4462) [n:127.0.0.1:57533_solr    ] o.a.s.s.HttpSolrCall [admin] webapp=null path=/admin/collections params={collection.configName=config&name=collection1&nrtReplicas=2&action=CREATE&numShards=1&wt=javabin&version=2} status=0 QTime=3584
   [junit4]   2> 326145 INFO  (TEST-LeaderTragicEventTest.testOtherReplicasAreNotActive-seed#[3BF8F71365D99989]) [    ] o.e.j.s.AbstractConnector Stopped ServerConnector@c5b8d9{SSL,[ssl, http/1.1]}{127.0.0.1:0}
   [junit4]   2> 326146 INFO  (TEST-LeaderTragicEventTest.testOtherReplicasAreNotActive-seed#[3BF8F71365D99989]) [    ] o.a.s.c.CoreContainer Shutting down CoreContainer instance=4433521
   [junit4]   2> 326146 INFO  (TEST-LeaderTragicEventTest.testOtherReplicasAreNotActive-seed#[3BF8F71365D99989]) [    ] o.a.s.m.SolrMetricManager Closing metric reporters for registry=solr.node, tag=null
   [junit4]   2> 326146 INFO  (TEST-LeaderTragicEventTest.testOtherReplicasAreNotActive-seed#[3BF8F71365D99989]) [    ] o.a.s.m.r.SolrJmxReporter Closing reporter [org.apache.solr.metrics.reporters.SolrJmxReporter@d88991: rootName = solr_57533, domain = solr.node, service url = null, agent id = null] for registry solr.node / com.codahale.metrics.MetricRegistry@c2c51c
   [junit4]   2> 326154 INFO  (TEST-LeaderTragicEventTest.testOtherReplicasAreNotActive-seed#[3BF8F71365D99989]) [    ] o.a.s.m.SolrMetricManager Closing metric reporters for registry=solr.jvm, tag=null
   [junit4]   2> 326154 INFO  (TEST-LeaderTragicEventTest.testOtherReplicasAreNotActive-seed#[3BF8F71365D99989]) [    ] o.a.s.m.r.SolrJmxReporter Closing reporter [org.apache.solr.metrics.reporters.SolrJmxReporter@70ccbe: rootName = solr_57533, domain = solr.jvm, service url = null, agent id = null] for registry solr.jvm / com.codahale.metrics.MetricRegistry@3cf12
   [junit4]   2> 326158 INFO  (TEST-LeaderTragicEventTest.testOtherReplicasAreNotActive-seed#[3BF8F71365D99989]) [    ] o.a.s.m.SolrMetricManager Closing metric reporters for registry=solr.jetty, tag=null
   [junit4]   2> 326158 INFO  (TEST-LeaderTragicEventTest.testOtherReplicasAreNotActive-seed#[3BF8F71365D99989]) [    ] o.a.s.m.r.SolrJmxReporter Closing reporter [org.apache.solr.metrics.reporters.SolrJmxReporter@1ab566f: rootName = solr_57533, domain = solr.jetty, service url = null, agent id = null] for registry solr.jetty / com.codahale.metrics.MetricRegistry@c241ce
   [junit4]   2> 326161 INFO  (TEST-LeaderTragicEventTest.testOtherReplicasAreNotActive-seed#[3BF8F71365D99989]) [    ] o.a.s.c.ZkController Remove node as live in ZooKeeper:/live_nodes/127.0.0.1:57533_solr
   [junit4]   2> 326162 INFO  (TEST-LeaderTragicEventTest.testOtherReplicasAreNotActive-seed#[3BF8F71365D99989]) [    ] o.a.s.m.SolrMetricManager Closing metric reporters for registry=solr.cluster, tag=null
   [junit4]   2> 326163 INFO  (zkCallback-2993-thread-1) [    ] o.a.s.c.c.ZkStateReader Updated live nodes from ZooKeeper... (2) -> (1)
   [junit4]   2> 326163 INFO  (zkCallback-2985-thread-1) [    ] o.a.s.c.c.ZkStateReader Updated live nodes from ZooKeeper... (2) -> (1)
   [junit4]   2> 326163 INFO  (zkCallback-2971-thread-1) [    ] o.a.s.c.c.ZkStateReader Updated live nodes from ZooKeeper... (2) -> (1)
   [junit4]   2> 326163 INFO  (zkCallback-2964-thread-2) [    ] o.a.s.c.c.ZkStateReader Updated live nodes from ZooKeeper... (2) -> (1)
   [junit4]   2> 326163 INFO  (zkCallback-2978-thread-1) [    ] o.a.s.c.c.ZkStateReader Updated live nodes from ZooKeeper... (2) -> (1)
   [junit4]   2> 326164 INFO  (coreCloseExecutor-880-thread-1) [n:127.0.0.1:57533_solr c:collection1 s:shard1 r:core_node3 x:collection1_shard1_replica_n1] o.a.s.c.SolrCore [collection1_shard1_replica_n1]  CLOSING SolrCore org.apache.solr.core.SolrCore@81b736
   [junit4]   2> 326164 INFO  (coreCloseExecutor-880-thread-1) [n:127.0.0.1:57533_solr c:collection1 s:shard1 r:core_node3 x:collection1_shard1_replica_n1] o.a.s.m.SolrMetricManager Closing metric reporters for registry=solr.core.collection1.shard1.replica_n1, tag=81b736
   [junit4]   2> 326165 INFO  (coreCloseExecutor-880-thread-1) [n:127.0.0.1:57533_solr c:collection1 s:shard1 r:core_node3 x:collection1_shard1_replica_n1] o.a.s.m.r.SolrJmxReporter Closing reporter [org.apache.solr.metrics.reporters.SolrJmxReporter@1756ae6: rootName = solr_57533, domain = solr.core.collection1.shard1.replica_n1, service url = null, agent id = null] for registry solr.core.collection1.shard1.replica_n1 / com.codahale.metrics.MetricRegistry@1770dc9
   [junit4]   2> 326171 INFO  (coreCloseExecutor-880-thread-1) [n:127.0.0.1:57533_solr c:collection1 s:shard1 r:core_node3 x:collection1_shard1_replica_n1] o.a.s.m.SolrMetricManager Closing metric reporters for registry=solr.collection.collection1.shard1.leader, tag=81b736
   [junit4]   2> 326176 INFO  (TEST-LeaderTragicEventTest.testOtherReplicasAreNotActive-seed#[3BF8F71365D99989]) [    ] o.a.s.c.Overseer Overseer (id=72068035364847620-127.0.0.1:57533_solr-n_0000000000) closing
   [junit4]   2> 326176 INFO  (OverseerStateUpdate-72068035364847620-127.0.0.1:57533_solr-n_0000000000) [    ] o.a.s.c.Overseer Overseer Loop exiting : 127.0.0.1:57533_solr
   [junit4]   2> 326177 WARN  (OverseerAutoScalingTriggerThread-72068035364847620-127.0.0.1:57533_solr-n_0000000000) [    ] o.a.s.c.a.OverseerTriggerThread OverseerTriggerThread woken up but we are closed, exiting.
   [junit4]   2> 326178 WARN  (NIOServerCxn.Factory:0.0.0.0/0.0.0.0:0) [    ] o.a.z.s.NIOServerCnxn Unable to read additional data from client sessionid 0x100097f0f950005, likely client has closed socket
   [junit4]   2> 326180 WARN  (NIOServerCxn.Factory:0.0.0.0/0.0.0.0:0) [    ] o.a.z.s.NIOServerCnxn Unable to read additional data from client sessionid 0x100097f0f950004, likely client has closed socket
   [junit4]   2> 326182 INFO  (TEST-LeaderTragicEventTest.testOtherReplicasAreNotActive-seed#[3BF8F71365D99989]) [    ] o.e.j.s.h.ContextHandler Stopped o.e.j.s.ServletContextHandler@1de317f{/solr,null,UNAVAILABLE}
   [junit4]   2> 326182 INFO  (TEST-LeaderTragicEventTest.testOtherReplicasAreNotActive-seed#[3BF8F71365D99989]) [    ] o.e.j.s.session node0 Stopped scavenging
   [junit4]   2> 326183 INFO  (zkCallback-2978-thread-1) [    ] o.a.s.c.OverseerElectionContext I am going to be the leader 127.0.0.1:57534_solr
   [junit4]   2> 326185 INFO  (zkCallback-2978-thread-1) [    ] o.a.s.c.Overseer Overseer (id=72068035364847623-127.0.0.1:57534_solr-n_0000000001) starting
   [junit4]   2> 326197 INFO  (zkCallback-2993-thread-1) [    ] o.a.s.c.c.ZkStateReader A cluster state change: [WatchedEvent state:SyncConnected type:NodeDataChanged path:/collections/collection1/state.json] for collection [collection1] has occurred - updating... (live nodes size: [1])
   [junit4]   2> 326197 INFO  (zkCallback-2978-thread-1) [    ] o.a.s.c.c.ZkStateReader A cluster state change: [WatchedEvent state:SyncConnected type:NodeDataChanged path:/collections/collection1/state.json] for collection [collection1] has occurred - updating... (live nodes size: [1])
   [junit4]   2> 326199 INFO  (TEST-LeaderTragicEventTest.testOtherReplicasAreNotActive-seed#[3BF8F71365D99989]) [    ] o.a.s.SolrTestCaseJ4 ###Ending testOtherReplicasAreNotActive
   [junit4]   2> NOTE: reproduce with: ant test  -Dtestcase=LeaderTragicEventTest -Dtests.method=testOtherReplicasAreNotActive -Dtests.seed=3BF8F71365D99989 -Dtests.slow=true -Dtests.locale=mt-MT -Dtests.timezone=Europe/Ulyanovsk -Dtests.asserts=true -Dtests.file.encoding=ISO-8859-1
   [junit4] ERROR   3.74s J0 | LeaderTragicEventTest.testOtherReplicasAreNotActive <<<
   [junit4]    > Throwable #1: java.lang.IllegalStateException: Jetty Connector is not open: -2
   [junit4]    > 	at __randomizedtesting.SeedInfo.seed([3BF8F71365D99989:BE4CDB6459262011]:0)
   [junit4]    > 	at org.apache.solr.client.solrj.embedded.JettySolrRunner.getBaseUrl(JettySolrRunner.java:499)
   [junit4]    > 	at org.apache.solr.cloud.MiniSolrCloudCluster.getReplicaJetty(MiniSolrCloudCluster.java:539)
   [junit4]    > 	at org.apache.solr.cloud.LeaderTragicEventTest.corruptLeader(LeaderTragicEventTest.java:100)
   [junit4]    > 	at org.apache.solr.cloud.LeaderTragicEventTest.testOtherReplicasAreNotActive(LeaderTragicEventTest.java:150)
   [junit4]    > 	at java.lang.Thread.run(Thread.java:748)
   [junit4]   2> 326222 INFO  (TEST-LeaderTragicEventTest.test-seed#[3BF8F71365D99989]) [    ] o.a.s.SolrTestCaseJ4 ###Starting test
   [junit4]   2> 326226 INFO  (qtp20639904-4473) [n:127.0.0.1:57534_solr    ] o.a.s.h.a.CollectionsHandler Invoked Collection Action :create with params collection.configName=config&name=collection1&nrtReplicas=2&action=CREATE&numShards=1&wt=javabin&version=2 and sendToOCPQueue=true
   [junit4]   2> 326230 INFO  (OverseerThreadFactory-885-thread-1) [    ] o.a.s.c.a.c.CreateCollectionCmd Create collection collection1
   [junit4]   2> 326231 ERROR (OverseerThreadFactory-885-thread-1) [    ] o.a.s.c.a.c.OverseerCollectionMessageHandler Collection: collection1 operation: create failed:org.apache.solr.common.SolrException: collection already exists: collection1
   [junit4]   2> 	at org.apache.solr.cloud.api.collections.CreateCollectionCmd.call(CreateCollectionCmd.java:106)
   [junit4]   2> 	at org.apache.solr.cloud.api.collections.OverseerCollectionMessageHandler.processMessage(OverseerCollectionMessageHandler.java:255)
   [junit4]   2> 	at org.apache.solr.cloud.OverseerTaskProcessor$Runner.run(OverseerTaskProcessor.java:469)
   [junit4]   2> 	at org.apache.solr.common.util.ExecutorUtil$MDCAwareThreadPoolExecutor.lambda$execute$0(ExecutorUtil.java:209)
   [junit4]   2> 	at java.util.concurrent.ThreadPoolExecutor.runWorker(ThreadPoolExecutor.java:1149)
   [junit4]   2> 	at java.util.concurrent.ThreadPoolExecutor$Worker.run(ThreadPoolExecutor.java:624)
   [junit4]   2> 	at java.lang.Thread.run(Thread.java:748)
   [junit4]   2> 
   [junit4]   2> 326233 INFO  (qtp20639904-4473) [n:127.0.0.1:57534_solr    ] o.a.s.s.HttpSolrCall [admin] webapp=null path=/admin/collections params={collection.configName=config&name=collection1&nrtReplicas=2&action=CREATE&numShards=1&wt=javabin&version=2} status=400 QTime=8
   [junit4]   2> 326233 INFO  (TEST-LeaderTragicEventTest.test-seed#[3BF8F71365D99989]) [    ] o.a.s.SolrTestCaseJ4 ###Ending test
   [junit4]   2> NOTE: reproduce with: ant test  -Dtestcase=LeaderTragicEventTest -Dtests.method=test -Dtests.seed=3BF8F71365D99989 -Dtests.slow=true -Dtests.locale=mt-MT -Dtests.timezone=Europe/Ulyanovsk -Dtests.asserts=true -Dtests.file.encoding=ISO-8859-1
   [junit4] ERROR   0.03s J0 | LeaderTragicEventTest.test <<<
   [junit4]    > Throwable #1: org.apache.solr.client.solrj.impl.HttpSolrClient$RemoteSolrException: Error from server at https://127.0.0.1:57534/solr: collection already exists: collection1
   [junit4]    > 	at __randomizedtesting.SeedInfo.seed([3BF8F71365D99989:B3ACC8C9CB25F471]:0)
   [junit4]    > 	at org.apache.solr.client.solrj.impl.HttpSolrClient.executeMethod(HttpSolrClient.java:643)
   [junit4]    > 	at org.apache.solr.client.solrj.impl.HttpSolrClient.request(HttpSolrClient.java:255)
   [junit4]    > 	at org.apache.solr.client.solrj.impl.HttpSolrClient.request(HttpSolrClient.java:244)
   [junit4]    > 	at org.apache.solr.client.solrj.impl.LBHttpSolrClient.doRequest(LBHttpSolrClient.java:483)
   [junit4]    > 	at org.apache.solr.client.solrj.impl.LBHttpSolrClient.request(LBHttpSolrClient.java:413)
   [junit4]    > 	at org.apache.solr.client.solrj.impl.CloudSolrClient.sendRequest(CloudSolrClient.java:1106)
   [junit4]    > 	at org.apache.solr.client.solrj.impl.CloudSolrClient.requestWithRetryOnStaleState(CloudSolrClient.java:886)
   [junit4]    > 	at org.apache.solr.client.solrj.impl.CloudSolrClient.request(CloudSolrClient.java:819)
   [junit4]    > 	at org.apache.solr.client.solrj.SolrRequest.process(SolrRequest.java:194)
   [junit4]    > 	at org.apache.solr.client.solrj.SolrRequest.process(SolrRequest.java:211)
   [junit4]    > 	at org.apache.solr.cloud.LeaderTragicEventTest.test(LeaderTragicEventTest.java:70)
   [junit4]    > 	at java.lang.Thread.run(Thread.java:748)
   [junit4]   2> 326249 WARN  (NIOServerCxn.Factory:0.0.0.0/0.0.0.0:0) [    ] o.a.z.s.NIOServerCnxn Unable to read additional data from client sessionid 0x100097f0f95000a, likely client has closed socket
   [junit4]   2> 326253 INFO  (jetty-closer-2953-thread-2) [    ] o.e.j.s.AbstractConnector Stopped ServerConnector@1d45a78{SSL,[ssl, http/1.1]}{127.0.0.1:0}
   [junit4]   2> 326254 INFO  (jetty-closer-2953-thread-2) [    ] o.a.s.c.CoreContainer Shutting down CoreContainer instance=11527860
   [junit4]   2> 326255 INFO  (jetty-closer-2953-thread-2) [    ] o.a.s.m.SolrMetricManager Closing metric reporters for registry=solr.node, tag=null
   [junit4]   2> 326256 INFO  (jetty-closer-2953-thread-2) [    ] o.a.s.m.r.SolrJmxReporter Closing reporter [org.apache.solr.metrics.reporters.SolrJmxReporter@d0f26c: rootName = solr_57534, domain = solr.node, service url = null, agent id = null] for registry solr.node / com.codahale.metrics.MetricRegistry@184f81
   [junit4]   2> 326257 INFO  (jetty-closer-2953-thread-2) [    ] o.a.s.m.SolrMetricManager Closing metric reporters for registry=solr.jvm, tag=null
   [junit4]   2> 326257 INFO  (jetty-closer-2953-thread-2) [    ] o.a.s.m.r.SolrJmxReporter Closing reporter [org.apache.solr.metrics.reporters.SolrJmxReporter@9ab8a8: rootName = solr_57534, domain = solr.jvm, service url = null, agent id = null] for registry solr.jvm / com.codahale.metrics.MetricRegistry@3cf12
   [junit4]   2> 326277 INFO  (jetty-closer-2953-thread-2) [    ] o.a.s.m.SolrMetricManager Closing metric reporters for registry=solr.jetty, tag=null
   [junit4]   2> 326277 INFO  (jetty-closer-2953-thread-2) [    ] o.a.s.m.r.SolrJmxReporter Closing reporter [org.apache.solr.metrics.reporters.SolrJmxReporter@88f7c0: rootName = solr_57534, domain = solr.jetty, service url = null, agent id = null] for registry solr.jetty / com.codahale.metrics.MetricRegistry@c241ce
   [junit4]   2> 326279 INFO  (jetty-closer-2953-thread-2) [    ] o.a.s.c.ZkController Remove node as live in ZooKeeper:/live_nodes/127.0.0.1:57534_solr
   [junit4]   2> 326283 INFO  (jetty-closer-2953-thread-2) [    ] o.a.s.m.SolrMetricManager Closing metric reporters for registry=solr.cluster, tag=null
   [junit4]   2> 326285 INFO  (zkCallback-2985-thread-1) [    ] o.a.s.c.c.ZkStateReader Updated live nodes from ZooKeeper... (1) -> (0)
   [junit4]   2> 326285 INFO  (zkCallback-2978-thread-2) [    ] o.a.s.c.c.ZkStateReader Updated live nodes from ZooKeeper... (1) -> (0)
   [junit4]   2> 326287 INFO  (coreCloseExecutor-886-thread-1) [n:127.0.0.1:57534_solr c:collection1 s:shard1 r:core_node4 x:collection1_shard1_replica_n2] o.a.s.c.SolrCore [collection1_shard1_replica_n2]  CLOSING SolrCore org.apache.solr.core.SolrCore@1e658f9
   [junit4]   2> 326287 INFO  (coreCloseExecutor-886-thread-1) [n:127.0.0.1:57534_solr c:collection1 s:shard1 r:core_node4 x:collection1_shard1_replica_n2] o.a.s.m.SolrMetricManager Closing metric reporters for registry=solr.core.collection1.shard1.replica_n2, tag=1e658f9
   [junit4]   2> 326287 INFO  (coreCloseExecutor-886-thread-1) [n:127.0.0.1:57534_solr c:collection1 s:shard1 r:core_node4 x:collection1_shard1_replica_n2] o.a.s.m.r.SolrJmxReporter Closing reporter [org.apache.solr.metrics.reporters.SolrJmxReporter@450c97: rootName = solr_57534, domain = solr.core.collection1.shard1.replica_n2, service url = null, agent id = null] for registry solr.core.collection1.shard1.replica_n2 / com.codahale.metrics.MetricRegistry@75abb9
   [junit4]   2> 326293 INFO  (coreCloseExecutor-886-thread-1) [n:127.0.0.1:57534_solr c:collection1 s:shard1 r:core_node4 x:collection1_shard1_replica_n2] o.a.s.m.SolrMetricManager Closing metric reporters for registry=solr.collection.collection1.shard1.leader, tag=1e658f9
   [junit4]   2> 326297 INFO  (jetty-closer-2953-thread-2) [    ] o.a.s.c.Overseer Overseer (id=72068035364847623-127.0.0.1:57534_solr-n_0000000001) closing
   [junit4]   2> 326297 INFO  (OverseerStateUpdate-72068035364847623-127.0.0.1:57534_solr-n_0000000001) [    ] o.a.s.c.Overseer Overseer Loop exiting : 127.0.0.1:57534_solr
   [junit4]   2> 326298 WARN  (OverseerAutoScalingTriggerThread-72068035364847623-127.0.0.1:57534_solr-n_0000000001) [    ] o.a.s.c.a.OverseerTriggerThread OverseerTriggerThread woken up but we are closed, exiting.
   [junit4]   2> 326304 INFO  (jetty-closer-2953-thread-2) [    ] o.e.j.s.h.ContextHandler Stopped o.e.j.s.ServletContextHandler@14f850e{/solr,null,UNAVAILABLE}
   [junit4]   2> 326304 INFO  (jetty-closer-2953-thread-2) [    ] o.e.j.s.session node0 Stopped scavenging
   [junit4]   2> 326305 ERROR (SUITE-LeaderTragicEventTest-seed#[3BF8F71365D99989]-worker) [    ] o.a.z.s.ZooKeeperServer ZKShutdownHandler is not registered, so ZooKeeper server won't take any action on ERROR or SHUTDOWN server state changes
   [junit4]   2> 326306 INFO  (SUITE-LeaderTragicEventTest-seed#[3BF8F71365D99989]-worker) [    ] o.a.s.c.ZkTestServer connecting to 127.0.0.1:57525 57525
   [junit4]   2> 326307 INFO  (Thread-418) [    ] o.a.s.c.ZkTestServer connecting to 127.0.0.1:57525 57525
   [junit4]   2> 326308 WARN  (Thread-418) [    ] o.a.s.c.ZkTestServer Watch limit violations: 
   [junit4]   2> Maximum concurrent create/delete watches above limit:
   [junit4]   2> 
   [junit4]   2> 	6	/solr/collections/collection1/terms/shard1
   [junit4]   2> 	5	/solr/aliases.json
   [junit4]   2> 	2	/solr/security.json
   [junit4]   2> 	2	/solr/configs/config
   [junit4]   2> 
   [junit4]   2> Maximum concurrent data watches above limit:
   [junit4]   2> 
   [junit4]   2> 	5	/solr/clusterstate.json
   [junit4]   2> 	5	/solr/clusterprops.json
   [junit4]   2> 	3	/solr/collections/collection1/state.json
   [junit4]   2> 	2	/solr/autoscaling.json
   [junit4]   2> 
   [junit4]   2> Maximum concurrent children watches above limit:
   [junit4]   2> 
   [junit4]   2> 	5	/solr/live_nodes
   [junit4]   2> 	5	/solr/collections
   [junit4]   2> 	2	/solr/overseer/queue
   [junit4]   2> 	2	/solr/autoscaling/events/.scheduled_maintenance
   [junit4]   2> 	2	/solr/autoscaling/events/.auto_add_replicas
   [junit4]   2> 	2	/solr/overseer/collection-queue-work
   [junit4]   2> 	2	/solr/overseer/queue-work
   [junit4]   2> 
   [junit4]   2> NOTE: leaving temporary files on disk at: C:\Users\jenkins\workspace\Lucene-Solr-7.x-Windows\solr\build\solr-core\test\J0\temp\solr.cloud.LeaderTragicEventTest_3BF8F71365D99989-001
   [junit4]   2> Jul 12, 2018 5:23:11 PM com.carrotsearch.randomizedtesting.ThreadLeakControl checkThreadLeaks
   [junit4]   2> WARNING: Will linger awaiting termination of 4 leaked thread(s).
   [junit4]   2> NOTE: test params are: codec=Asserting(Lucene70): {}, docValues:{}, maxPointsInLeafNode=1936, maxMBSortInHeap=5.142057689065065, sim=RandomSimilarity(queryNorm=false): {}, locale=mt-MT, timezone=Europe/Ulyanovsk
   [junit4]   2> NOTE: Windows 10 10.0 x86/Oracle Corporation 1.8.0_172 (32-bit)/cpus=3,threads=1,free=79883904,total=165339136
   [junit4]   2> NOTE: All tests run in this JVM: [ParsingFieldUpdateProcessorsTest, TestConfigOverlay, TestLeaderElectionWithEmptyReplica, DistributedDebugComponentTest, TestInPlaceUpdatesStandalone, PeerSyncReplicationTest, TestExactStatsCache, TestStressInPlaceUpdates, TestImpersonationWithHadoopAuth, LIRRollingUpdatesTest, TestSQLHandler, TestReplicationHandler, DistanceFunctionTest, ActionThrottleTest, TestGraphTermsQParserPlugin, FileUtilsTest, TestCoreAdminApis, TestSmileRequest, TestSolrDeletionPolicy1, TestUnifiedSolrHighlighter, DeleteLastCustomShardedReplicaTest, TestSimDistributedQueue, IgnoreCommitOptimizeUpdateProcessorFactoryTest, TestFieldCacheVsDocValues, TestRequestStatusCollectionAPI, TestCloudSearcherWarming, TestComponentsName, TestSha256AuthenticationProvider, SynonymTokenizerTest, TestZkAclsWithHadoopAuth, LeaderTragicEventTest]
   [junit4] Completed [52/823 (1!)] on J0 in 5.13s, 2 tests, 2 errors <<< FAILURES!

[...truncated 47125 lines...]
[repro] Jenkins log URL: https://jenkins.thetaphi.de/job/Lucene-Solr-7.x-Windows/686/consoleText

[repro] Revision: f4c5380137b498079f203c865c6611a99f5765d0

[repro] Ant options: "-Dargs=-server -XX:+UseSerialGC"

[repro] ant clean

[...truncated 6 lines...]
[repro] Test suites by module:
[repro]    solr\core
[repro]       LeaderTragicEventTest
[repro] ant compile-test

[...truncated 3339 lines...]
[repro] ant test-nocompile -Dtests.dups=5 -Dtests.maxfailures=5 -Dtests.class="*.LeaderTragicEventTest" -Dtests.showOutput=onerror "-Dargs=-server -XX:+UseSerialGC" -Dtests.seed=3BF8F71365D99989 -Dtests.slow=true -Dtests.locale=mt-MT -Dtests.timezone=Europe/Ulyanovsk -Dtests.asserts=true -Dtests.file.encoding=ISO-8859-1

[...truncated 32 lines...]
   [junit4] Suite: org.apache.solr.cloud.LeaderTragicEventTest
   [junit4]   2> 10319 INFO  (SUITE-LeaderTragicEventTest-seed#[3BF8F71365D99989]-worker) [    ] o.a.s.SolrTestCaseJ4 SecureRandom sanity checks: test.solr.allowed.securerandom=null & java.security.egd=file:/dev/./urandom
   [junit4]   2> Creating dataDir: C:\Users\jenkins\workspace\Lucene-Solr-7.x-Windows\solr\build\solr-core\test\J0\temp\solr.cloud.LeaderTragicEventTest_3BF8F71365D99989-001\init-core-data-001
   [junit4]   2> 10601 INFO  (SUITE-LeaderTragicEventTest-seed#[3BF8F71365D99989]-worker) [    ] o.a.s.SolrTestCaseJ4 Using TrieFields (NUMERIC_POINTS_SYSPROP=false) w/NUMERIC_DOCVALUES_SYSPROP=true
   [junit4]   2> 10737 INFO  (SUITE-LeaderTragicEventTest-seed#[3BF8F71365D99989]-worker) [    ] o.e.j.u.log Logging initialized @10761ms to org.eclipse.jetty.util.log.Slf4jLog
   [junit4]   2> 10754 INFO  (SUITE-LeaderTragicEventTest-seed#[3BF8F71365D99989]-worker) [    ] o.a.s.SolrTestCaseJ4 Randomized ssl (true) and clientAuth (false) via: @org.apache.solr.util.RandomizeSSL(reason=, value=NaN, ssl=NaN, clientAuth=NaN)
   [junit4]   2> 11066 INFO  (SUITE-LeaderTragicEventTest-seed#[3BF8F71365D99989]-worker) [    ] o.a.s.c.MiniSolrCloudCluster Starting cluster of 2 servers in C:\Users\jenkins\workspace\Lucene-Solr-7.x-Windows\solr\build\solr-core\test\J0\temp\solr.cloud.LeaderTragicEventTest_3BF8F71365D99989-001\tempDir-001
   [junit4]   2> 11087 INFO  (SUITE-LeaderTragicEventTest-seed#[3BF8F71365D99989]-worker) [    ] o.a.s.c.ZkTestServer STARTING ZK TEST SERVER
   [junit4]   2> 11091 INFO  (Thread-1) [    ] o.a.s.c.ZkTestServer client port:0.0.0.0/0.0.0.0:0
   [junit4]   2> 11091 INFO  (Thread-1) [    ] o.a.s.c.ZkTestServer Starting server
   [junit4]   2> 11291 INFO  (SUITE-LeaderTragicEventTest-seed#[3BF8F71365D99989]-worker) [    ] o.a.s.c.ZkTestServer start zk server on port:55630
   [junit4]   2> 11469 ERROR (Thread-1) [    ] o.a.z.s.ZooKeeperServer ZKShutdownHandler is not registered, so ZooKeeper server won't take any action on ERROR or SHUTDOWN server state changes
   [junit4]   2> 11616 INFO  (zkConnectionManagerCallback-4-thread-1) [    ] o.a.s.c.c.ConnectionManager zkClient has connected
   [junit4]   2> 12356 INFO  (jetty-launcher-1-thread-2) [    ] o.e.j.s.Server jetty-9.4.11.v20180605; built: 2018-06-05T18:24:03.829Z; git: d5fc0523cfa96bfebfbda19606cad384d772f04c; jvm 1.8.0_172-b11
   [junit4]   2> 12356 INFO  (jetty-launcher-1-thread-1) [    ] o.e.j.s.Server jetty-9.4.11.v20180605; built: 2018-06-05T18:24:03.829Z; git: d5fc0523cfa96bfebfbda19606cad384d772f04c; jvm 1.8.0_172-b11
   [junit4]   2> 12403 INFO  (jetty-launcher-1-thread-1) [    ] o.e.j.s.session DefaultSessionIdManager workerName=node0
   [junit4]   2> 12403 INFO  (jetty-launcher-1-thread-1) [    ] o.e.j.s.session No SessionScavenger set, using defaults
   [junit4]   2> 12403 INFO  (jetty-launcher-1-thread-2) [    ] o.e.j.s.session DefaultSessionIdManager workerName=node0
   [junit4]   2> 12403 INFO  (jetty-launcher-1-thread-2) [    ] o.e.j.s.session No SessionScavenger set, using defaults
   [junit4]   2> 12414 INFO  (jetty-launcher-1-thread-1) [    ] o.e.j.s.session node0 Scavenging every 600000ms
   [junit4]   2> 12416 INFO  (jetty-launcher-1-thread-2) [    ] o.e.j.s.session node0 Scavenging every 600000ms
   [junit4]   2> 12484 INFO  (jetty-launcher-1-thread-1) [    ] o.e.j.s.h.ContextHandler Started o.e.j.s.ServletContextHandler@e96d95{/solr,null,AVAILABLE}
   [junit4]   2> 12484 INFO  (jetty-launcher-1-thread-2) [    ] o.e.j.s.h.ContextHandler Started o.e.j.s.ServletContextHandler@ae9330{/solr,null,AVAILABLE}
   [junit4]   2> 12543 INFO  (jetty-launcher-1-thread-1) [    ] o.e.j.s.AbstractConnector Started ServerConnector@8583f2{SSL,[ssl, http/1.1]}{127.0.0.1:55642}
   [junit4]   2> 12543 INFO  (jetty-launcher-1-thread-1) [    ] o.e.j.s.Server Started @12575ms
   [junit4]   2> 12543 INFO  (jetty-launcher-1-thread-1) [    ] o.a.s.c.s.e.JettySolrRunner Jetty properties: {hostContext=/solr, hostPort=55642}
   [junit4]   2> 12544 INFO  (jetty-launcher-1-thread-2) [    ] o.e.j.s.AbstractConnector Started ServerConnector@16ac25a{SSL,[ssl, http/1.1]}{127.0.0.1:55641}
   [junit4]   2> 12544 INFO  (jetty-launcher-1-thread-2) [    ] o.e.j.s.Server Started @12577ms
   [junit4]   2> 12544 INFO  (jetty-launcher-1-thread-2) [    ] o.a.s.c.s.e.JettySolrRunner Jetty properties: {hostContext=/solr, hostPort=55641}
   [junit4]   2> 12700 INFO  (jetty-launcher-1-thread-2) [    ] o.a.s.u.c.SSLCredentialProviderFactory Processing SSL Credential Provider chain: env;sysprop
   [junit4]   2> 12821 ERROR (jetty-launcher-1-thread-2) [    ] o.a.s.u.StartupLoggingUtils Missing Java Option solr.log.dir. Logging may be missing or incomplete.
   [junit4]   2> 12821 ERROR (jetty-launcher-1-thread-1) [    ] o.a.s.u.StartupLoggingUtils Missing Java Option solr.log.dir. Logging may be missing or incomplete.
   [junit4]   2> 12821 INFO  (jetty-launcher-1-thread-1) [    ] o.a.s.s.SolrDispatchFilter Using logger factory org.apache.logging.slf4j.Log4jLoggerFactory
   [junit4]   2> 12821 INFO  (jetty-launcher-1-thread-2) [    ] o.a.s.s.SolrDispatchFilter Using logger factory org.apache.logging.slf4j.Log4jLoggerFactory
   [junit4]   2> 12822 INFO  (jetty-launcher-1-thread-1) [    ] o.a.s.s.SolrDispatchFilter  ___      _       Welcome to Apache Solr? version 7.5.0
   [junit4]   2> 12822 INFO  (jetty-launcher-1-thread-2) [    ] o.a.s.s.SolrDispatchFilter  ___      _       Welcome to Apache Solr? version 7.5.0
   [junit4]   2> 12828 INFO  (jetty-launcher-1-thread-1) [    ] o.a.s.s.SolrDispatchFilter / __| ___| |_ _   Starting in cloud mode on port null
   [junit4]   2> 12828 INFO  (jetty-launcher-1-thread-2) [    ] o.a.s.s.SolrDispatchFilter / __| ___| |_ _   Starting in cloud mode on port null
   [junit4]   2> 12828 INFO  (jetty-launcher-1-thread-2) [    ] o.a.s.s.SolrDispatchFilter \__ \/ _ \ | '_|  Install dir: null
   [junit4]   2> 12828 INFO  (jetty-launcher-1-thread-1) [    ] o.a.s.s.SolrDispatchFilter \__ \/ _ \ | '_|  Install dir: null
   [junit4]   2> 12828 INFO  (jetty-launcher-1-thread-2) [    ] o.a.s.s.SolrDispatchFilter |___/\___/_|_|    Start time: 2018-07-12T18:50:28.233Z
   [junit4]   2> 12829 INFO  (jetty-launcher-1-thread-1) [    ] o.a.s.s.SolrDispatchFilter |___/\___/_|_|    Start time: 2018-07-12T18:50:28.233Z
   [junit4]   2> 12909 INFO  (jetty-launcher-1-thread-2) [    ] o.a.s.c.SolrResourceLoader solr home defaulted to 'solr/' (could not find system property or JNDI)
   [junit4]   2> 12909 INFO  (jetty-launcher-1-thread-1) [    ] o.a.s.c.SolrResourceLoader solr home defaulted to 'solr/' (could not find system property or JNDI)
   [junit4]   2> 12917 INFO  (zkConnectionManagerCallback-6-thread-1) [    ] o.a.s.c.c.ConnectionManager zkClient has connected
   [junit4]   2> 12917 INFO  (zkConnectionManagerCallback-8-thread-1) [    ] o.a.s.c.c.ConnectionManager zkClient has connected
   [junit4]   2> 12919 INFO  (jetty-launcher-1-thread-1) [    ] o.a.s.s.SolrDispatchFilter solr.xml found in ZooKeeper. Loading...
   [junit4]   2> 12924 INFO  (jetty-launcher-1-thread-2) [    ] o.a.s.s.SolrDispatchFilter solr.xml found in ZooKeeper. Loading...
   [junit4]   2> 15482 INFO  (jetty-launcher-1-thread-1) [    ] o.a.s.c.ZkContainer Zookeeper client=127.0.0.1:55630/solr
   [junit4]   2> 15487 INFO  (jetty-launcher-1-thread-2) [    ] o.a.s.c.ZkContainer Zookeeper client=127.0.0.1:55630/solr
   [junit4]   2> 15596 INFO  (zkConnectionManagerCallback-15-thread-1) [    ] o.a.s.c.c.ConnectionManager zkClient has connected
   [junit4]   2> 15603 WARN  (NIOServerCxn.Factory:0.0.0.0/0.0.0.0:0) [    ] o.a.z.s.NIOServerCnxn Unable to read additional data from client sessionid 0x10009cf04650003, likely client has closed socket
   [junit4]   2> 15606 INFO  (zkConnectionManagerCallback-16-thread-1) [    ] o.a.s.c.c.ConnectionManager zkClient has connected
   [junit4]   2> 15631 INFO  (zkConnectionManagerCallback-20-thread-1) [    ] o.a.s.c.c.ConnectionManager zkClient has connected
   [junit4]   2> 15632 INFO  (zkConnectionManagerCallback-19-thread-1) [    ] o.a.s.c.c.ConnectionManager zkClient has connected
   [junit4]   2> 16482 INFO  (jetty-launcher-1-thread-1) [n:127.0.0.1:55642_solr    ] o.a.s.c.Overseer Overseer (id=null) closing
   [junit4]   2> 16482 INFO  (jetty-launcher-1-thread-2) [n:127.0.0.1:55641_solr    ] o.a.s.c.Overseer Overseer (id=null) closing
   [junit4]   2> 16485 INFO  (jetty-launcher-1-thread-2) [n:127.0.0.1:55641_solr    ] o.a.s.c.OverseerElectionContext I am going to be the leader 127.0.0.1:55641_solr
   [junit4]   2> 16489 INFO  (jetty-launcher-1-thread-1) [n:127.0.0.1:55642_solr    ] o.a.s.c.ZkController Register node as live in ZooKeeper:/live_nodes/127.0.0.1:55642_solr
   [junit4]   2> 16520 INFO  (jetty-launcher-1-thread-2) [n:127.0.0.1:55641_solr    ] o.a.s.c.Overseer Overseer (id=72068378774536198-127.0.0.1:55641_solr-n_0000000000) starting
   [junit4]   2> 16796 INFO  (zkCallback-18-thread-1) [    ] o.a.s.c.c.ZkStateReader Updated live nodes from ZooKeeper... (0) -> (1)
   [junit4]   2> 16808 INFO  (zkCallback-17-thread-1) [    ] o.a.s.c.c.ZkStateReader Updated live nodes from ZooKeeper... (0) -> (1)
   [junit4]   2> 17313 INFO  (zkConnectionManagerCallback-29-thread-1) [    ] o.a.s.c.c.ConnectionManager zkClient has connected
   [junit4]   2> 17322 INFO  (jetty-launcher-1-thread-2) [n:127.0.0.1:55641_solr    ] o.a.s.c.c.ZkStateReader Updated live nodes from ZooKeeper... (0) -> (1)
   [junit4]   2> 17324 INFO  (jetty-launcher-1-thread-2) [n:127.0.0.1:55641_solr    ] o.a.s.c.s.i.ZkClientClusterStateProvider Cluster at 127.0.0.1:55630/solr ready
   [junit4]   2> 18460 INFO  (jetty-launcher-1-thread-2) [n:127.0.0.1:55641_solr    ] o.a.s.c.TransientSolrCoreCacheDefault Allocating transient cache for 2147483647 transient cores
   [junit4]   2> 18472 INFO  (jetty-launcher-1-thread-2) [n:127.0.0.1:55641_solr    ] o.a.s.c.ZkController Register node as live in ZooKeeper:/live_nodes/127.0.0.1:55641_solr
   [junit4]   2> 18477 INFO  (zkCallback-17-thread-1) [    ] o.a.s.c.c.ZkStateReader Updated live nodes from ZooKeeper... (1) -> (2)
   [junit4]   2> 18477 INFO  (zkCallback-18-thread-1) [    ] o.a.s.c.c.ZkStateReader Updated live nodes from ZooKeeper... (1) -> (2)
   [junit4]   2> 18490 INFO  (zkCallback-28-thread-1) [    ] o.a.s.c.c.ZkStateReader Updated live nodes from ZooKeeper... (1) -> (2)
   [junit4]   2> 18847 INFO  (jetty-launcher-1-thread-2) [n:127.0.0.1:55641_solr    ] o.a.s.h.a.MetricsHistoryHandler No .system collection, keeping metrics history in memory.
   [junit4]   2> 18945 INFO  (zkConnectionManagerCallback-34-thread-1) [    ] o.a.s.c.c.ConnectionManager zkClient has connected
   [junit4]   2> 18953 INFO  (jetty-launcher-1-thread-1) [n:127.0.0.1:55642_solr    ] o.a.s.c.c.ZkStateReader Updated live nodes from ZooKeeper... (0) -> (2)
   [junit4]   2> 18959 INFO  (jetty-launcher-1-thread-1) [n:127.0.0.1:55642_solr    ] o.a.s.c.s.i.ZkClientClusterStateProvider Cluster at 127.0.0.1:55630/solr ready
   [junit4]   2> 18960 INFO  (jetty-launcher-1-thread-1) [n:127.0.0.1:55642_solr    ] o.a.s.h.a.MetricsHistoryHandler No .system collection, keeping metrics history in memory.
   [junit4]   2> 19815 INFO  (jetty-launcher-1-thread-1) [n:127.0.0.1:55642_solr    ] o.a.s.m.r.SolrJmxReporter JMX monitoring for 'solr_55642.solr.node' (registry 'solr.node') enabled at server: com.sun.jmx.mbeanserver.JmxMBeanServer@b13415
   [junit4]   2> 19821 INFO  (jetty-launcher-1-thread-1) [n:127.0.0.1:55642_solr    ] o.a.s.m.r.SolrJmxReporter JMX monitoring for 'solr_55642.solr.jvm' (registry 'solr.jvm') enabled at server: com.sun.jmx.mbeanserver.JmxMBeanServer@b13415
   [junit4]   2> 19822 INFO  (jetty-launcher-1-thread-1) [n:127.0.0.1:55642_solr    ] o.a.s.m.r.SolrJmxReporter JMX monitoring for 'solr_55642.solr.jetty' (registry 'solr.jetty') enabled at server: com.sun.jmx.mbeanserver.JmxMBeanServer@b13415
   [junit4]   2> 19908 INFO  (jetty-launcher-1-thread-1) [n:127.0.0.1:55642_solr    ] o.a.s.c.CorePropertiesLocator Found 0 core definitions underneath C:\Users\jenkins\workspace\Lucene-Solr-7.x-Windows\solr\build\solr-core\test\J0\temp\solr.cloud.LeaderTragicEventTest_3BF8F71365D99989-001\tempDir-001\node2\.
   [junit4]   2> 19991 INFO  (jetty-launcher-1-thread-2) [n:127.0.0.1:55641_solr    ] o.a.s.m.r.SolrJmxReporter JMX monitoring for 'solr_55641.solr.node' (registry 'solr.node') enabled at server: com.sun.jmx.mbeanserver.JmxMBeanServer@b13415
   [junit4]   2> 19998 INFO  (jetty-launcher-1-thread-2) [n:127.0.0.1:55641_solr    ] o.a.s.m.r.SolrJmxReporter JMX monitoring for 'solr_55641.solr.jvm' (registry 'solr.jvm') enabled at server: com.sun.jmx.mbeanserver.JmxMBeanServer@b13415
   [junit4]   2> 19999 INFO  (jetty-launcher-1-thread-2) [n:127.0.0.1:55641_solr    ] o.a.s.m.r.SolrJmxReporter JMX monitoring for 'solr_55641.solr.jetty' (registry 'solr.jetty') enabled at server: com.sun.jmx.mbeanserver.JmxMBeanServer@b13415
   [junit4]   2> 20002 INFO  (jetty-launcher-1-thread-2) [n:127.0.0.1:55641_solr    ] o.a.s.c.CorePropertiesLocator Found 0 core definitions underneath C:\Users\jenkins\workspace\Lucene-Solr-7.x-Windows\solr\build\solr-core\test\J0\temp\solr.cloud.LeaderTragicEventTest_3BF8F71365D99989-001\tempDir-001\node1\.
   [junit4]   2> 21063 INFO  (zkConnectionManagerCallback-38-thread-1) [    ] o.a.s.c.c.ConnectionManager zkClient has connected
   [junit4]   2> 21111 INFO  (zkConnectionManagerCallback-43-thread-1) [    ] o.a.s.c.c.ConnectionManager zkClient has connected
   [junit4]   2> 21136 INFO  (SUITE-LeaderTragicEventTest-seed#[3BF8F71365D99989]-worker) [    ] o.a.s.c.c.ZkStateReader Updated live nodes from ZooKeeper... (0) -> (2)
   [junit4]   2> 21146 INFO  (SUITE-LeaderTragicEventTest-seed#[3BF8F71365D99989]-worker) [    ] o.a.s.c.s.i.ZkClientClusterStateProvider Cluster at 127.0.0.1:55630/solr ready
   [junit4]   2> 21249 INFO  (TEST-LeaderTragicEventTest.testOtherReplicasAreNotActive-seed#[3BF8F71365D99989]) [    ] o.a.s.SolrTestCaseJ4 ###Starting testOtherReplicasAreNotActive
   [junit4]   2> 24246 INFO  (qtp14659826-65) [n:127.0.0.1:55641_solr    ] o.a.s.h.a.CollectionsHandler Invoked Collection Action :create with params collection.configName=config&name=collection1&nrtReplicas=2&action=CREATE&numShards=1&wt=javabin&version=2 and sendToOCPQueue=true
   [junit4]   2> 24383 INFO  (OverseerThreadFactory-15-thread-1) [    ] o.a.s.c.a.c.CreateCollectionCmd Create collection collection1
   [junit4]   2> 24722 INFO  (OverseerStateUpdate-72068378774536198-127.0.0.1:55641_solr-n_0000000000) [    ] o.a.s.c.o.SliceMutator createReplica() {
   [junit4]   2>   "operation":"ADDREPLICA",
   [junit4]   2>   "collection":"collection1",
   [junit4]   2>   "shard":"shard1",
   [junit4]   2>   "core":"collection1_shard1_replica_n1",
   [junit4]   2>   "state":"down",
   [junit4]   2>   "base_url":"https://127.0.0.1:55642/solr",
   [junit4]   2>   "type":"NRT",
   [junit4]   2>   "waitForFinalState":"false"} 
   [junit4]   2> 24748 INFO  (OverseerStateUpdate-72068378774536198-127.0.0.1:55641_solr-n_0000000000) [    ] o.a.s.c.o.SliceMutator createReplica() {
   [junit4]   2>   "operation":"ADDREPLICA",
   [junit4]   2>   "collection":"collection1",
   [junit4]   2>   "shard":"shard1",
   [junit4]   2>   "core":"collection1_shard1_replica_n2",
   [junit4]   2>   "state":"down",
   [junit4]   2>   "base_url":"https://127.0.0.1:55641/solr",
   [junit4]   2>   "type":"NRT",
   [junit4]   2>   "waitForFinalState":"false"} 
   [junit4]   2> 25027 INFO  (qtp14659826-59) [n:127.0.0.1:55641_solr    x:collection1_shard1_replica_n2] o.a.s.h.a.CoreAdminOperation core create command qt=/admin/cores&coreNodeName=core_node4&collection.configName=config&newCollection=true&name=collection1_shard1_replica_n2&action=CREATE&numShards=1&collection=collection1&shard=shard1&wt=javabin&version=2&replicaType=NRT
   [junit4]   2> 25045 INFO  (qtp13435961-60) [n:127.0.0.1:55642_solr    x:collection1_shard1_replica_n1] o.a.s.h.a.CoreAdminOperation core create command qt=/admin/cores&coreNodeName=core_node3&collection.configName=config&newCollection=true&name=collection1_shard1_replica_n1&action=CREATE&numShards=1&collection=collection1&shard=shard1&wt=javabin&version=2&replicaType=NRT
   [junit4]   2> 25047 INFO  (qtp13435961-60) [n:127.0.0.1:55642_solr    x:collection1_shard1_replica_n1] o.a.s.c.TransientSolrCoreCacheDefault Allocating transient cache for 2147483647 transient cores
   [junit4]   2> 26282 INFO  (qtp13435961-60) [n:127.0.0.1:55642_solr c:collection1 s:shard1 r:core_node3 x:collection1_shard1_replica_n1] o.a.s.c.SolrConfig Using Lucene MatchVersion: 7.5.0
   [junit4]   2> 26296 INFO  (qtp14659826-59) [n:127.0.0.1:55641_solr c:collection1 s:shard1 r:core_node4 x:collection1_shard1_replica_n2] o.a.s.c.SolrConfig Using Lucene MatchVersion: 7.5.0
   [junit4]   2> 26459 INFO  (qtp13435961-60) [n:127.0.0.1:55642_solr c:collection1 s:shard1 r:core_node3 x:collection1_shard1_replica_n1] o.a.s.s.IndexSchema [collection1_shard1_replica_n1] Schema name=minimal
   [junit4]   2> 26472 INFO  (qtp14659826-59) [n:127.0.0.1:55641_solr c:collection1 s:shard1 r:core_node4 x:collection1_shard1_replica_n2] o.a.s.s.IndexSchema [collection1_shard1_replica_n2] Schema name=minimal
   [junit4]   2> 26663 WARN  (qtp14659826-59) [n:127.0.0.1:55641_solr c:collection1 s:shard1 r:core_node4 x:collection1_shard1_replica_n2] o.a.s.c.SolrResourceLoader Solr loaded a deprecated plugin/analysis class [solr.TrieIntField]. Please consult documentation how to replace it accordingly.
   [junit4]   2> 26667 WARN  (qtp13435961-60) [n:127.0.0.1:55642_solr c:collection1 s:shard1 r:core_node3 x:collection1_shard1_replica_n1] o.a.s.c.SolrResourceLoader Solr loaded a deprecated plugin/analysis class [solr.TrieIntField]. Please consult documentation how to replace it accordingly.
   [junit4]   2> 26696 WARN  (qtp14659826-59) [n:127.0.0.1:55641_solr c:collection1 s:shard1 r:core_node4 x:collection1_shard1_replica_n2] o.a.s.c.SolrResourceLoader Solr loaded a deprecated plugin/analysis class [solr.TrieLongField]. Please consult documentation how to replace it accordingly.
   [junit4]   2> 26696 WARN  (qtp13435961-60) [n:127.0.0.1:55642_solr c:collection1 s:shard1 r:core_node3 x:collection1_shard1_replica_n1] o.a.s.c.SolrResourceLoader 

[...truncated too long message...]

106)
   [junit4]    > 	at org.apache.solr.client.solrj.impl.CloudSolrClient.requestWithRetryOnStaleState(CloudSolrClient.java:886)
   [junit4]    > 	at org.apache.solr.client.solrj.impl.CloudSolrClient.request(CloudSolrClient.java:819)
   [junit4]    > 	at org.apache.solr.client.solrj.SolrRequest.process(SolrRequest.java:194)
   [junit4]    > 	at org.apache.solr.client.solrj.SolrRequest.process(SolrRequest.java:211)
   [junit4]    > 	at org.apache.solr.cloud.LeaderTragicEventTest.test(LeaderTragicEventTest.java:70)
   [junit4]    > 	at java.lang.Thread.run(Thread.java:748)
   [junit4]   2> 36978 WARN  (NIOServerCxn.Factory:0.0.0.0/0.0.0.0:0) [    ] o.a.z.s.NIOServerCnxn Unable to read additional data from client sessionid 0x10009cf0631000a, likely client has closed socket
   [junit4]   2> 36982 INFO  (jetty-closer-2-thread-2) [    ] o.e.j.s.AbstractConnector Stopped ServerConnector@188b3e2{SSL,[ssl, http/1.1]}{127.0.0.1:0}
   [junit4]   2> 36982 INFO  (jetty-closer-2-thread-2) [    ] o.a.s.c.CoreContainer Shutting down CoreContainer instance=26977244
   [junit4]   2> 36983 INFO  (jetty-closer-2-thread-2) [    ] o.a.s.m.SolrMetricManager Closing metric reporters for registry=solr.node, tag=null
   [junit4]   2> 36983 INFO  (jetty-closer-2-thread-2) [    ] o.a.s.m.r.SolrJmxReporter Closing reporter [org.apache.solr.metrics.reporters.SolrJmxReporter@63b1be: rootName = solr_55653, domain = solr.node, service url = null, agent id = null] for registry solr.node / com.codahale.metrics.MetricRegistry@1149f12
   [junit4]   2> 36993 INFO  (jetty-closer-2-thread-2) [    ] o.a.s.m.SolrMetricManager Closing metric reporters for registry=solr.jvm, tag=null
   [junit4]   2> 36994 INFO  (jetty-closer-2-thread-2) [    ] o.a.s.m.r.SolrJmxReporter Closing reporter [org.apache.solr.metrics.reporters.SolrJmxReporter@b745ce: rootName = solr_55653, domain = solr.jvm, service url = null, agent id = null] for registry solr.jvm / com.codahale.metrics.MetricRegistry@1ac03d2
   [junit4]   2> 37001 INFO  (jetty-closer-2-thread-2) [    ] o.a.s.m.SolrMetricManager Closing metric reporters for registry=solr.jetty, tag=null
   [junit4]   2> 37001 INFO  (jetty-closer-2-thread-2) [    ] o.a.s.m.r.SolrJmxReporter Closing reporter [org.apache.solr.metrics.reporters.SolrJmxReporter@1771e31: rootName = solr_55653, domain = solr.jetty, service url = null, agent id = null] for registry solr.jetty / com.codahale.metrics.MetricRegistry@a2b95b
   [junit4]   2> 37006 INFO  (jetty-closer-2-thread-2) [    ] o.a.s.c.ZkController Remove node as live in ZooKeeper:/live_nodes/127.0.0.1:55653_solr
   [junit4]   2> 37007 INFO  (jetty-closer-2-thread-2) [    ] o.a.s.m.SolrMetricManager Closing metric reporters for registry=solr.cluster, tag=null
   [junit4]   2> 37007 INFO  (zkCallback-28-thread-1) [    ] o.a.s.c.c.ZkStateReader Updated live nodes from ZooKeeper... (1) -> (0)
   [junit4]   2> 37008 INFO  (zkCallback-18-thread-2) [    ] o.a.s.c.c.ZkStateReader Updated live nodes from ZooKeeper... (1) -> (0)
   [junit4]   2> 37008 INFO  (coreCloseExecutor-35-thread-1) [n:127.0.0.1:55653_solr c:collection1 s:shard1 r:core_node4 x:collection1_shard1_replica_n2] o.a.s.c.SolrCore [collection1_shard1_replica_n2]  CLOSING SolrCore org.apache.solr.core.SolrCore@1652c8b
   [junit4]   2> 37008 INFO  (coreCloseExecutor-35-thread-1) [n:127.0.0.1:55653_solr c:collection1 s:shard1 r:core_node4 x:collection1_shard1_replica_n2] o.a.s.m.SolrMetricManager Closing metric reporters for registry=solr.core.collection1.shard1.replica_n2, tag=1652c8b
   [junit4]   2> 37009 INFO  (coreCloseExecutor-35-thread-1) [n:127.0.0.1:55653_solr c:collection1 s:shard1 r:core_node4 x:collection1_shard1_replica_n2] o.a.s.m.r.SolrJmxReporter Closing reporter [org.apache.solr.metrics.reporters.SolrJmxReporter@3315f5: rootName = solr_55653, domain = solr.core.collection1.shard1.replica_n2, service url = null, agent id = null] for registry solr.core.collection1.shard1.replica_n2 / com.codahale.metrics.MetricRegistry@e723ed
   [junit4]   2> 37021 INFO  (coreCloseExecutor-35-thread-1) [n:127.0.0.1:55653_solr c:collection1 s:shard1 r:core_node4 x:collection1_shard1_replica_n2] o.a.s.m.SolrMetricManager Closing metric reporters for registry=solr.collection.collection1.shard1.leader, tag=1652c8b
   [junit4]   2> 37027 INFO  (jetty-closer-2-thread-2) [    ] o.a.s.c.Overseer Overseer (id=72068378804682758-127.0.0.1:55653_solr-n_0000000000) closing
   [junit4]   2> 37028 INFO  (OverseerStateUpdate-72068378804682758-127.0.0.1:55653_solr-n_0000000000) [    ] o.a.s.c.Overseer Overseer Loop exiting : 127.0.0.1:55653_solr
   [junit4]   2> 37028 WARN  (OverseerAutoScalingTriggerThread-72068378804682758-127.0.0.1:55653_solr-n_0000000000) [    ] o.a.s.c.a.OverseerTriggerThread OverseerTriggerThread woken up but we are closed, exiting.
   [junit4]   2> 37029 WARN  (NIOServerCxn.Factory:0.0.0.0/0.0.0.0:0) [    ] o.a.z.s.NIOServerCnxn Unable to read additional data from client sessionid 0x10009cf06310007, likely client has closed socket
   [junit4]   2> 37032 INFO  (jetty-closer-2-thread-2) [    ] o.e.j.s.h.ContextHandler Stopped o.e.j.s.ServletContextHandler@13801d4{/solr,null,UNAVAILABLE}
   [junit4]   2> 37032 INFO  (jetty-closer-2-thread-2) [    ] o.e.j.s.session node0 Stopped scavenging
   [junit4]   2> 37033 ERROR (SUITE-LeaderTragicEventTest-seed#[3BF8F71365D99989]-worker) [    ] o.a.z.s.ZooKeeperServer ZKShutdownHandler is not registered, so ZooKeeper server won't take any action on ERROR or SHUTDOWN server state changes
   [junit4]   2> 37035 INFO  (SUITE-LeaderTragicEventTest-seed#[3BF8F71365D99989]-worker) [    ] o.a.s.c.ZkTestServer connecting to 127.0.0.1:55637 55637
   [junit4]   2> 37037 INFO  (Thread-1) [    ] o.a.s.c.ZkTestServer connecting to 127.0.0.1:55637 55637
   [junit4]   2> 37039 WARN  (Thread-1) [    ] o.a.s.c.ZkTestServer Watch limit violations: 
   [junit4]   2> Maximum concurrent create/delete watches above limit:
   [junit4]   2> 
   [junit4]   2> 	6	/solr/collections/collection1/terms/shard1
   [junit4]   2> 	5	/solr/aliases.json
   [junit4]   2> 	2	/solr/security.json
   [junit4]   2> 	2	/solr/configs/config
   [junit4]   2> 
   [junit4]   2> Maximum concurrent data watches above limit:
   [junit4]   2> 
   [junit4]   2> 	5	/solr/clusterstate.json
   [junit4]   2> 	5	/solr/clusterprops.json
   [junit4]   2> 	3	/solr/collections/collection1/state.json
   [junit4]   2> 
   [junit4]   2> Maximum concurrent children watches above limit:
   [junit4]   2> 
   [junit4]   2> 	5	/solr/live_nodes
   [junit4]   2> 	5	/solr/collections
   [junit4]   2> 
   [junit4]   2> NOTE: leaving temporary files on disk at: C:\Users\jenkins\workspace\Lucene-Solr-7.x-Windows\solr\build\solr-core\test\J1\temp\solr.cloud.LeaderTragicEventTest_3BF8F71365D99989-001
   [junit4]   2> Jul 12, 2018 6:50:52 PM com.carrotsearch.randomizedtesting.ThreadLeakControl checkThreadLeaks
   [junit4]   2> WARNING: Will linger awaiting termination of 3 leaked thread(s).
   [junit4]   2> NOTE: test params are: codec=Asserting(Lucene70): {}, docValues:{}, maxPointsInLeafNode=1936, maxMBSortInHeap=5.142057689065065, sim=RandomSimilarity(queryNorm=false): {}, locale=mt-MT, timezone=Europe/Ulyanovsk
   [junit4]   2> NOTE: Windows 10 10.0 x86/Oracle Corporation 1.8.0_172 (32-bit)/cpus=3,threads=1,free=25681360,total=65142784
   [junit4]   2> NOTE: All tests run in this JVM: [LeaderTragicEventTest]
   [junit4] Completed [2/5 (2!)] on J1 in 35.82s, 2 tests, 2 errors <<< FAILURES!

[...truncated 29 lines...]
BUILD FAILED
C:\Users\jenkins\workspace\Lucene-Solr-7.x-Windows\lucene\common-build.xml:1568: The following error occurred while executing this line:
C:\Users\jenkins\workspace\Lucene-Solr-7.x-Windows\lucene\common-build.xml:1092: There were test failures: 5 suites, 10 tests, 4 errors [seed: 3BF8F71365D99989]

Total time: 1 minute 48 seconds

[repro] Setting last failure code to 1

[repro] Failures:
[repro]   2/5 failed: org.apache.solr.cloud.LeaderTragicEventTest
[repro] Exiting with code 1

C:\Users\jenkins\workspace\Lucene-Solr-7.x-Windows>IF EXIST lucene\build move /y lucene\build lucene\build.repro 
        1 dir(s) moved.

C:\Users\jenkins\workspace\Lucene-Solr-7.x-Windows>IF EXIST solr\build move /y solr\build solr\build.repro 
        1 dir(s) moved.

C:\Users\jenkins\workspace\Lucene-Solr-7.x-Windows>IF EXIST lucene\build.orig move /y lucene\build.orig lucene\build 
        1 dir(s) moved.

C:\Users\jenkins\workspace\Lucene-Solr-7.x-Windows>IF EXIST solr\build.orig move /y solr\build.orig solr\build 
        1 dir(s) moved.

C:\Users\jenkins\workspace\Lucene-Solr-7.x-Windows>exit 0 
Archiving artifacts
Setting ANT_1_8_2_HOME=C:\Users\jenkins\tools\hudson.tasks.Ant_AntInstallation\ANT_1.8.2
[WARNINGS] Parsing warnings in console log with parser Java Compiler (javac)
Setting ANT_1_8_2_HOME=C:\Users\jenkins\tools\hudson.tasks.Ant_AntInstallation\ANT_1.8.2
Setting ANT_1_8_2_HOME=C:\Users\jenkins\tools\hudson.tasks.Ant_AntInstallation\ANT_1.8.2
<Git Blamer> Using GitBlamer to create author and commit information for all warnings.
<Git Blamer> GIT_COMMIT=f4c5380137b498079f203c865c6611a99f5765d0, workspace=C:\Users\jenkins\workspace\Lucene-Solr-7.x-Windows
[WARNINGS] Computing warning deltas based on reference build #685
Recording test results
Setting ANT_1_8_2_HOME=C:\Users\jenkins\tools\hudson.tasks.Ant_AntInstallation\ANT_1.8.2
Build step 'Publish JUnit test result report' changed build result to UNSTABLE
Email was triggered for: Unstable (Test Failures)
Sending email for trigger: Unstable (Test Failures)
Setting ANT_1_8_2_HOME=C:\Users\jenkins\tools\hudson.tasks.Ant_AntInstallation\ANT_1.8.2
Setting ANT_1_8_2_HOME=C:\Users\jenkins\tools\hudson.tasks.Ant_AntInstallation\ANT_1.8.2
Setting ANT_1_8_2_HOME=C:\Users\jenkins\tools\hudson.tasks.Ant_AntInstallation\ANT_1.8.2
Setting ANT_1_8_2_HOME=C:\Users\jenkins\tools\hudson.tasks.Ant_AntInstallation\ANT_1.8.2

Mime
View raw message