lucene-dev mailing list archives

Site index · List index
Message view « Date » · « Thread »
Top « Date » · « Thread »
From Policeman Jenkins Server <jenk...@thetaphi.de>
Subject [JENKINS] Lucene-Solr-7.x-Linux (64bit/jdk1.8.0_172) - Build # 2329 - Still Unstable!
Date Mon, 16 Jul 2018 09:12:29 GMT
Build: https://jenkins.thetaphi.de/job/Lucene-Solr-7.x-Linux/2329/
Java: 64bit/jdk1.8.0_172 -XX:+UseCompressedOops -XX:+UseG1GC

1 tests failed.
FAILED:  org.apache.solr.handler.component.InfixSuggestersTest.testShutdownDuringBuild

Error Message:
junit.framework.AssertionFailedError: Unexpected wrapped exception type, expected CoreIsClosedException

Stack Trace:
java.util.concurrent.ExecutionException: junit.framework.AssertionFailedError: Unexpected wrapped exception type, expected CoreIsClosedException
	at __randomizedtesting.SeedInfo.seed([DC08979674FE7D0B:385F5294A972869]:0)
	at java.util.concurrent.FutureTask.report(FutureTask.java:122)
	at java.util.concurrent.FutureTask.get(FutureTask.java:192)
	at org.apache.solr.handler.component.InfixSuggestersTest.testShutdownDuringBuild(InfixSuggestersTest.java:130)
	at sun.reflect.NativeMethodAccessorImpl.invoke0(Native Method)
	at sun.reflect.NativeMethodAccessorImpl.invoke(NativeMethodAccessorImpl.java:62)
	at sun.reflect.DelegatingMethodAccessorImpl.invoke(DelegatingMethodAccessorImpl.java:43)
	at java.lang.reflect.Method.invoke(Method.java:498)
	at com.carrotsearch.randomizedtesting.RandomizedRunner.invoke(RandomizedRunner.java:1737)
	at com.carrotsearch.randomizedtesting.RandomizedRunner$8.evaluate(RandomizedRunner.java:934)
	at com.carrotsearch.randomizedtesting.RandomizedRunner$9.evaluate(RandomizedRunner.java:970)
	at com.carrotsearch.randomizedtesting.RandomizedRunner$10.evaluate(RandomizedRunner.java:984)
	at com.carrotsearch.randomizedtesting.rules.SystemPropertiesRestoreRule$1.evaluate(SystemPropertiesRestoreRule.java:57)
	at org.apache.lucene.util.TestRuleSetupTeardownChained$1.evaluate(TestRuleSetupTeardownChained.java:49)
	at org.apache.lucene.util.AbstractBeforeAfterRule$1.evaluate(AbstractBeforeAfterRule.java:45)
	at org.apache.lucene.util.TestRuleThreadAndTestName$1.evaluate(TestRuleThreadAndTestName.java:48)
	at org.apache.lucene.util.TestRuleIgnoreAfterMaxFailures$1.evaluate(TestRuleIgnoreAfterMaxFailures.java:64)
	at org.apache.lucene.util.TestRuleMarkFailure$1.evaluate(TestRuleMarkFailure.java:47)
	at com.carrotsearch.randomizedtesting.rules.StatementAdapter.evaluate(StatementAdapter.java:36)
	at com.carrotsearch.randomizedtesting.ThreadLeakControl$StatementRunner.run(ThreadLeakControl.java:368)
	at com.carrotsearch.randomizedtesting.ThreadLeakControl.forkTimeoutingTask(ThreadLeakControl.java:817)
	at com.carrotsearch.randomizedtesting.ThreadLeakControl$3.evaluate(ThreadLeakControl.java:468)
	at com.carrotsearch.randomizedtesting.RandomizedRunner.runSingleTest(RandomizedRunner.java:943)
	at com.carrotsearch.randomizedtesting.RandomizedRunner$5.evaluate(RandomizedRunner.java:829)
	at com.carrotsearch.randomizedtesting.RandomizedRunner$6.evaluate(RandomizedRunner.java:879)
	at com.carrotsearch.randomizedtesting.RandomizedRunner$7.evaluate(RandomizedRunner.java:890)
	at com.carrotsearch.randomizedtesting.rules.StatementAdapter.evaluate(StatementAdapter.java:36)
	at com.carrotsearch.randomizedtesting.rules.SystemPropertiesRestoreRule$1.evaluate(SystemPropertiesRestoreRule.java:57)
	at org.apache.lucene.util.AbstractBeforeAfterRule$1.evaluate(AbstractBeforeAfterRule.java:45)
	at com.carrotsearch.randomizedtesting.rules.StatementAdapter.evaluate(StatementAdapter.java:36)
	at org.apache.lucene.util.TestRuleStoreClassName$1.evaluate(TestRuleStoreClassName.java:41)
	at com.carrotsearch.randomizedtesting.rules.NoShadowingOrOverridesOnMethodsRule$1.evaluate(NoShadowingOrOverridesOnMethodsRule.java:40)
	at com.carrotsearch.randomizedtesting.rules.NoShadowingOrOverridesOnMethodsRule$1.evaluate(NoShadowingOrOverridesOnMethodsRule.java:40)
	at com.carrotsearch.randomizedtesting.rules.StatementAdapter.evaluate(StatementAdapter.java:36)
	at com.carrotsearch.randomizedtesting.rules.StatementAdapter.evaluate(StatementAdapter.java:36)
	at com.carrotsearch.randomizedtesting.rules.StatementAdapter.evaluate(StatementAdapter.java:36)
	at org.apache.lucene.util.TestRuleAssertionsRequired$1.evaluate(TestRuleAssertionsRequired.java:53)
	at org.apache.lucene.util.TestRuleMarkFailure$1.evaluate(TestRuleMarkFailure.java:47)
	at org.apache.lucene.util.TestRuleIgnoreAfterMaxFailures$1.evaluate(TestRuleIgnoreAfterMaxFailures.java:64)
	at org.apache.lucene.util.TestRuleIgnoreTestSuites$1.evaluate(TestRuleIgnoreTestSuites.java:54)
	at com.carrotsearch.randomizedtesting.rules.StatementAdapter.evaluate(StatementAdapter.java:36)
	at com.carrotsearch.randomizedtesting.ThreadLeakControl$StatementRunner.run(ThreadLeakControl.java:368)
	at java.lang.Thread.run(Thread.java:748)
Caused by: junit.framework.AssertionFailedError: Unexpected wrapped exception type, expected CoreIsClosedException
	at org.apache.lucene.util.LuceneTestCase.expectThrows(LuceneTestCase.java:2704)
	at org.apache.solr.handler.component.InfixSuggestersTest.lambda$testShutdownDuringBuild$3(InfixSuggestersTest.java:121)
	at java.util.concurrent.FutureTask.run(FutureTask.java:266)
	at org.apache.solr.common.util.ExecutorUtil$MDCAwareThreadPoolExecutor.lambda$execute$0(ExecutorUtil.java:209)
	at java.util.concurrent.ThreadPoolExecutor.runWorker(ThreadPoolExecutor.java:1149)
	at java.util.concurrent.ThreadPoolExecutor$Worker.run(ThreadPoolExecutor.java:624)
	... 1 more
Caused by: java.lang.RuntimeException: Exception during query
	at org.apache.solr.SolrTestCaseJ4.assertQ(SolrTestCaseJ4.java:917)
	at org.apache.solr.SolrTestCaseJ4.assertQ(SolrTestCaseJ4.java:877)
	at org.apache.solr.handler.component.InfixSuggestersTest.lambda$null$2(InfixSuggestersTest.java:122)
	at org.apache.lucene.util.LuceneTestCase.expectThrows(LuceneTestCase.java:2696)
	... 6 more
Caused by: org.apache.solr.common.SolrException: SolrCoreState already closed.
	at org.apache.solr.update.DefaultSolrCoreState.lock(DefaultSolrCoreState.java:186)
	at org.apache.solr.update.DefaultSolrCoreState.getIndexWriter(DefaultSolrCoreState.java:121)
	at org.apache.solr.update.SolrCoreState.getTragicException(SolrCoreState.java:198)
	at org.apache.solr.core.CoreContainer.checkTragicException(CoreContainer.java:1805)
	at org.apache.solr.handler.RequestHandlerBase.handleRequest(RequestHandlerBase.java:212)
	at org.apache.solr.core.SolrCore.execute(SolrCore.java:2541)
	at org.apache.solr.util.TestHarness.query(TestHarness.java:337)
	at org.apache.solr.util.TestHarness.query(TestHarness.java:319)
	at org.apache.solr.SolrTestCaseJ4.assertQ(SolrTestCaseJ4.java:891)
	... 9 more




Build Log:
[...truncated 14448 lines...]
   [junit4] Suite: org.apache.solr.handler.component.InfixSuggestersTest
   [junit4]   2> 2137027 INFO  (SUITE-InfixSuggestersTest-seed#[DC08979674FE7D0B]-worker) [    ] o.a.s.SolrTestCaseJ4 SecureRandom sanity checks: test.solr.allowed.securerandom=null & java.security.egd=file:/dev/./urandom
   [junit4]   2> Creating dataDir: /home/jenkins/workspace/Lucene-Solr-7.x-Linux/solr/build/solr-core/test/J0/temp/solr.handler.component.InfixSuggestersTest_DC08979674FE7D0B-001/init-core-data-001
   [junit4]   2> 2137027 WARN  (SUITE-InfixSuggestersTest-seed#[DC08979674FE7D0B]-worker) [    ] o.a.s.SolrTestCaseJ4 startTrackingSearchers: numOpens=14 numCloses=14
   [junit4]   2> 2137027 INFO  (SUITE-InfixSuggestersTest-seed#[DC08979674FE7D0B]-worker) [    ] o.a.s.SolrTestCaseJ4 Using TrieFields (NUMERIC_POINTS_SYSPROP=false) w/NUMERIC_DOCVALUES_SYSPROP=true
   [junit4]   2> 2137029 INFO  (SUITE-InfixSuggestersTest-seed#[DC08979674FE7D0B]-worker) [    ] o.a.s.SolrTestCaseJ4 Randomized ssl (false) and clientAuth (true) via: @org.apache.solr.util.RandomizeSSL(reason=, ssl=NaN, value=NaN, clientAuth=NaN)
   [junit4]   2> 2137029 INFO  (SUITE-InfixSuggestersTest-seed#[DC08979674FE7D0B]-worker) [    ] o.a.s.SolrTestCaseJ4 ####initCore
   [junit4]   2> 2137029 INFO  (SUITE-InfixSuggestersTest-seed#[DC08979674FE7D0B]-worker) [    ] o.a.s.c.SolrResourceLoader [null] Added 2 libs to classloader, from paths: [/home/jenkins/workspace/Lucene-Solr-7.x-Linux/solr/core/src/test-files/solr/collection1/lib, /home/jenkins/workspace/Lucene-Solr-7.x-Linux/solr/core/src/test-files/solr/collection1/lib/classes]
   [junit4]   2> 2137060 INFO  (SUITE-InfixSuggestersTest-seed#[DC08979674FE7D0B]-worker) [    ] o.a.s.c.SolrConfig Using Lucene MatchVersion: 7.5.0
   [junit4]   2> 2137067 INFO  (SUITE-InfixSuggestersTest-seed#[DC08979674FE7D0B]-worker) [    ] o.a.s.s.IndexSchema [null] Schema name=test
   [junit4]   2> 2137128 INFO  (SUITE-InfixSuggestersTest-seed#[DC08979674FE7D0B]-worker) [    ] o.a.s.s.IndexSchema Loaded schema test/1.0 with uniqueid field id
   [junit4]   2> 2137242 INFO  (SUITE-InfixSuggestersTest-seed#[DC08979674FE7D0B]-worker) [    ] o.a.s.c.TransientSolrCoreCacheDefault Allocating transient cache for 2147483647 transient cores
   [junit4]   2> 2137242 INFO  (SUITE-InfixSuggestersTest-seed#[DC08979674FE7D0B]-worker) [    ] o.a.s.h.a.MetricsHistoryHandler No .system collection, keeping metrics history in memory.
   [junit4]   2> 2137250 INFO  (SUITE-InfixSuggestersTest-seed#[DC08979674FE7D0B]-worker) [    ] o.a.s.m.r.SolrJmxReporter JMX monitoring for 'solr.node' (registry 'solr.node') enabled at server: com.sun.jmx.mbeanserver.JmxMBeanServer@561c6429
   [junit4]   2> 2137254 INFO  (SUITE-InfixSuggestersTest-seed#[DC08979674FE7D0B]-worker) [    ] o.a.s.m.r.SolrJmxReporter JMX monitoring for 'solr.jvm' (registry 'solr.jvm') enabled at server: com.sun.jmx.mbeanserver.JmxMBeanServer@561c6429
   [junit4]   2> 2137254 INFO  (SUITE-InfixSuggestersTest-seed#[DC08979674FE7D0B]-worker) [    ] o.a.s.m.r.SolrJmxReporter JMX monitoring for 'solr.jetty' (registry 'solr.jetty') enabled at server: com.sun.jmx.mbeanserver.JmxMBeanServer@561c6429
   [junit4]   2> 2137255 INFO  (coreLoadExecutor-9782-thread-1) [    x:collection1] o.a.s.c.SolrResourceLoader [null] Added 2 libs to classloader, from paths: [/home/jenkins/workspace/Lucene-Solr-7.x-Linux/solr/core/src/test-files/solr/collection1/lib, /home/jenkins/workspace/Lucene-Solr-7.x-Linux/solr/core/src/test-files/solr/collection1/lib/classes]
   [junit4]   2> 2137269 INFO  (coreLoadExecutor-9782-thread-1) [    x:collection1] o.a.s.c.SolrConfig Using Lucene MatchVersion: 7.5.0
   [junit4]   2> 2137275 INFO  (coreLoadExecutor-9782-thread-1) [    x:collection1] o.a.s.s.IndexSchema [collection1] Schema name=test
   [junit4]   2> 2137339 INFO  (coreLoadExecutor-9782-thread-1) [    x:collection1] o.a.s.s.IndexSchema Loaded schema test/1.0 with uniqueid field id
   [junit4]   2> 2137343 INFO  (coreLoadExecutor-9782-thread-1) [    x:collection1] o.a.s.c.CoreContainer Creating SolrCore 'collection1' using configuration from instancedir /home/jenkins/workspace/Lucene-Solr-7.x-Linux/solr/core/src/test-files/solr/collection1, trusted=true
   [junit4]   2> 2137343 INFO  (coreLoadExecutor-9782-thread-1) [    x:collection1] o.a.s.m.r.SolrJmxReporter JMX monitoring for 'solr.core.collection1' (registry 'solr.core.collection1') enabled at server: com.sun.jmx.mbeanserver.JmxMBeanServer@561c6429
   [junit4]   2> 2137343 INFO  (coreLoadExecutor-9782-thread-1) [    x:collection1] o.a.s.c.SolrCore solr.RecoveryStrategy.Builder
   [junit4]   2> 2137343 INFO  (coreLoadExecutor-9782-thread-1) [    x:collection1] o.a.s.c.SolrCore [[collection1] ] Opening new SolrCore at [/home/jenkins/workspace/Lucene-Solr-7.x-Linux/solr/core/src/test-files/solr/collection1], dataDir=[/home/jenkins/workspace/Lucene-Solr-7.x-Linux/solr/build/solr-core/test/J0/temp/solr.handler.component.InfixSuggestersTest_DC08979674FE7D0B-001/init-core-data-001/]
   [junit4]   2> 2137345 INFO  (coreLoadExecutor-9782-thread-1) [    x:collection1] o.a.s.u.RandomMergePolicy RandomMergePolicy wrapping class org.apache.lucene.index.AlcoholicMergePolicy: [AlcoholicMergePolicy: minMergeSize=0, mergeFactor=10, maxMergeSize=803781771, maxMergeSizeForForcedMerge=9223372036854775807, calibrateSizeByDeletes=true, maxMergeDocs=2147483647, maxCFSSegmentSizeMB=8.796093022207999E12, noCFSRatio=0.1]
   [junit4]   2> 2137440 INFO  (coreLoadExecutor-9782-thread-1) [    x:collection1] o.a.s.u.CommitTracker Hard AutoCommit: disabled
   [junit4]   2> 2137440 INFO  (coreLoadExecutor-9782-thread-1) [    x:collection1] o.a.s.u.CommitTracker Soft AutoCommit: disabled
   [junit4]   2> 2137441 INFO  (coreLoadExecutor-9782-thread-1) [    x:collection1] o.a.s.u.RandomMergePolicy RandomMergePolicy wrapping class org.apache.lucene.index.LogByteSizeMergePolicy: [LogByteSizeMergePolicy: minMergeSize=1677721, mergeFactor=19, maxMergeSize=2147483648, maxMergeSizeForForcedMerge=9223372036854775807, calibrateSizeByDeletes=true, maxMergeDocs=2147483647, maxCFSSegmentSizeMB=8.796093022207999E12, noCFSRatio=1.0]
   [junit4]   2> 2137441 INFO  (coreLoadExecutor-9782-thread-1) [    x:collection1] o.a.s.s.SolrIndexSearcher Opening [Searcher@a3db786[collection1] main]
   [junit4]   2> 2137441 WARN  (coreLoadExecutor-9782-thread-1) [    x:collection1] o.a.s.r.ManagedResourceStorage Cannot write to config directory /home/jenkins/workspace/Lucene-Solr-7.x-Linux/solr/core/src/test-files/solr/collection1/conf; switching to use InMemory storage instead.
   [junit4]   2> 2137441 INFO  (coreLoadExecutor-9782-thread-1) [    x:collection1] o.a.s.h.c.SuggestComponent Initializing SuggestComponent
   [junit4]   2> 2137441 INFO  (coreLoadExecutor-9782-thread-1) [    x:collection1] o.a.s.s.s.SolrSuggester init: {name=shortRandomAnalyzingInfixSuggester,lookupImpl=AnalyzingInfixLookupFactory,dictionaryImpl=RandomTestDictionaryFactory,randDictMaxItems=100,indexPath=short_random_analyzing_infix_suggester,suggestAnalyzerFieldType=text,buildOnCommit=false,buildOnStartup=false}
   [junit4]   2> 2137453 INFO  (coreLoadExecutor-9782-thread-1) [    x:collection1] o.a.s.s.s.SolrSuggester Dictionary loaded with params: {name=shortRandomAnalyzingInfixSuggester,lookupImpl=AnalyzingInfixLookupFactory,dictionaryImpl=RandomTestDictionaryFactory,randDictMaxItems=100,indexPath=short_random_analyzing_infix_suggester,suggestAnalyzerFieldType=text,buildOnCommit=false,buildOnStartup=false}
   [junit4]   2> 2137453 INFO  (coreLoadExecutor-9782-thread-1) [    x:collection1] o.a.s.h.c.SuggestComponent Initializing SuggestComponent
   [junit4]   2> 2137453 INFO  (coreLoadExecutor-9782-thread-1) [    x:collection1] o.a.s.s.s.SolrSuggester init: {name=longRandomAnalyzingInfixSuggester,lookupImpl=AnalyzingInfixLookupFactory,dictionaryImpl=RandomTestDictionaryFactory,randDictMaxItems=100000,indexPath=long_random_analyzing_infix_suggester,suggestAnalyzerFieldType=text,buildOnCommit=false,buildOnStartup=false}
   [junit4]   2> 2137453 INFO  (coreLoadExecutor-9782-thread-1) [    x:collection1] o.a.s.s.s.SolrSuggester Dictionary loaded with params: {name=longRandomAnalyzingInfixSuggester,lookupImpl=AnalyzingInfixLookupFactory,dictionaryImpl=RandomTestDictionaryFactory,randDictMaxItems=100000,indexPath=long_random_analyzing_infix_suggester,suggestAnalyzerFieldType=text,buildOnCommit=false,buildOnStartup=false}
   [junit4]   2> 2137453 INFO  (coreLoadExecutor-9782-thread-1) [    x:collection1] o.a.s.h.c.SuggestComponent Initializing SuggestComponent
   [junit4]   2> 2137453 INFO  (coreLoadExecutor-9782-thread-1) [    x:collection1] o.a.s.s.s.SolrSuggester init: {name=shortRandomBlendedInfixSuggester,lookupImpl=BlendedInfixLookupFactory,dictionaryImpl=RandomTestDictionaryFactory,randDictMaxItems=100,blenderType=position_linear,suggestAnalyzerFieldType=text,indexPath=short_random_blended_infix_suggester,highlight=true,buildOnStartup=false,buildOnCommit=false}
   [junit4]   2> 2137453 INFO  (coreLoadExecutor-9782-thread-1) [    x:collection1] o.a.s.s.s.SolrSuggester Dictionary loaded with params: {name=shortRandomBlendedInfixSuggester,lookupImpl=BlendedInfixLookupFactory,dictionaryImpl=RandomTestDictionaryFactory,randDictMaxItems=100,blenderType=position_linear,suggestAnalyzerFieldType=text,indexPath=short_random_blended_infix_suggester,highlight=true,buildOnStartup=false,buildOnCommit=false}
   [junit4]   2> 2137453 INFO  (coreLoadExecutor-9782-thread-1) [    x:collection1] o.a.s.h.ReplicationHandler Commits will be reserved for 10000ms.
   [junit4]   2> 2137454 INFO  (searcherExecutor-9783-thread-1-processing-x:collection1) [    x:collection1] o.a.s.c.SolrCore [collection1] Registered new searcher Searcher@a3db786[collection1] main{ExitableDirectoryReader(UninvertingDirectoryReader())}
   [junit4]   2> 2137454 INFO  (SUITE-InfixSuggestersTest-seed#[DC08979674FE7D0B]-worker) [    ] o.a.s.SolrTestCaseJ4 ####initCore end
   [junit4]   2> 2137457 INFO  (TEST-InfixSuggestersTest.testBuildThen2xReload-seed#[DC08979674FE7D0B]) [    ] o.a.s.SolrTestCaseJ4 ###Starting testBuildThen2xReload
   [junit4]   2> 2137457 INFO  (TEST-InfixSuggestersTest.testBuildThen2xReload-seed#[DC08979674FE7D0B]) [    ] o.a.s.h.c.SuggestComponent SuggestComponent prepare with : qt=/suggest_analyzing_infix_short_dictionary&suggest=true&suggest.buildAll=true&wt=xml&indent=off
   [junit4]   2> 2137457 INFO  (TEST-InfixSuggestersTest.testBuildThen2xReload-seed#[DC08979674FE7D0B]) [    ] o.a.s.s.s.SolrSuggester SolrSuggester.build(shortRandomAnalyzingInfixSuggester)
   [junit4]   2> 2137470 INFO  (TEST-InfixSuggestersTest.testBuildThen2xReload-seed#[DC08979674FE7D0B]) [    ] o.a.s.s.s.RandomTestDictionaryFactory org.apache.solr.spelling.suggest.RandomTestDictionaryFactory$RandomTestDictionary.enabled.shortRandomAnalyzingInfixSuggester disabled after emitting 100 items.
   [junit4]   2> 2137709 INFO  (TEST-InfixSuggestersTest.testBuildThen2xReload-seed#[DC08979674FE7D0B]) [    ] o.a.s.h.c.SuggestComponent SuggestComponent process with : qt=/suggest_analyzing_infix_short_dictionary&suggest=true&suggest.buildAll=true&wt=xml&indent=off
   [junit4]   2> 2137709 INFO  (TEST-InfixSuggestersTest.testBuildThen2xReload-seed#[DC08979674FE7D0B]) [    ] o.a.s.c.S.Request [collection1]  webapp=null path=null params={qt=/suggest_analyzing_infix_short_dictionary&suggest.buildAll=true&wt=xml} status=0 QTime=252
   [junit4]   2> 2137711 ERROR (TEST-InfixSuggestersTest.testBuildThen2xReload-seed#[DC08979674FE7D0B]) [    ] o.a.s.c.CorePropertiesLocator Couldn't load core descriptor from /home/jenkins/workspace/Lucene-Solr-7.x-Linux/solr/core/src/test-files/solr/collection1/core.properties:java.nio.file.NoSuchFileException: /home/jenkins/workspace/Lucene-Solr-7.x-Linux/solr/core/src/test-files/solr/collection1/core.properties
   [junit4]   2> 2137711 INFO  (TEST-InfixSuggestersTest.testBuildThen2xReload-seed#[DC08979674FE7D0B]) [    ] o.a.s.c.SolrResourceLoader [null] Added 2 libs to classloader, from paths: [/home/jenkins/workspace/Lucene-Solr-7.x-Linux/solr/core/src/test-files/solr/collection1/lib, /home/jenkins/workspace/Lucene-Solr-7.x-Linux/solr/core/src/test-files/solr/collection1/lib/classes]
   [junit4]   2> 2137725 INFO  (TEST-InfixSuggestersTest.testBuildThen2xReload-seed#[DC08979674FE7D0B]) [    ] o.a.s.c.SolrConfig Using Lucene MatchVersion: 7.5.0
   [junit4]   2> 2137731 INFO  (TEST-InfixSuggestersTest.testBuildThen2xReload-seed#[DC08979674FE7D0B]) [    ] o.a.s.s.IndexSchema [collection1] Schema name=test
   [junit4]   2> 2137796 INFO  (TEST-InfixSuggestersTest.testBuildThen2xReload-seed#[DC08979674FE7D0B]) [    ] o.a.s.s.IndexSchema Loaded schema test/1.0 with uniqueid field id
   [junit4]   2> 2137801 INFO  (TEST-InfixSuggestersTest.testBuildThen2xReload-seed#[DC08979674FE7D0B]) [    ] o.a.s.c.CoreContainer Reloading SolrCore 'collection1' using configuration from instancedir /home/jenkins/workspace/Lucene-Solr-7.x-Linux/solr/core/src/test-files/solr/collection1
   [junit4]   2> 2137819 INFO  (TEST-InfixSuggestersTest.testBuildThen2xReload-seed#[DC08979674FE7D0B]) [    x:collection1] o.a.s.m.r.SolrJmxReporter JMX monitoring for 'solr.core.collection1' (registry 'solr.core.collection1') enabled at server: com.sun.jmx.mbeanserver.JmxMBeanServer@561c6429
   [junit4]   2> 2137819 INFO  (TEST-InfixSuggestersTest.testBuildThen2xReload-seed#[DC08979674FE7D0B]) [    x:collection1] o.a.s.c.SolrCore [[collection1] ] Opening new SolrCore at [/home/jenkins/workspace/Lucene-Solr-7.x-Linux/solr/core/src/test-files/solr/collection1], dataDir=[/home/jenkins/workspace/Lucene-Solr-7.x-Linux/solr/build/solr-core/test/J0/temp/solr.handler.component.InfixSuggestersTest_DC08979674FE7D0B-001/init-core-data-001/]
   [junit4]   2> 2137849 INFO  (TEST-InfixSuggestersTest.testBuildThen2xReload-seed#[DC08979674FE7D0B]) [    x:collection1] o.a.s.u.CommitTracker Hard AutoCommit: disabled
   [junit4]   2> 2137849 INFO  (TEST-InfixSuggestersTest.testBuildThen2xReload-seed#[DC08979674FE7D0B]) [    x:collection1] o.a.s.u.CommitTracker Soft AutoCommit: disabled
   [junit4]   2> 2137851 INFO  (TEST-InfixSuggestersTest.testBuildThen2xReload-seed#[DC08979674FE7D0B]) [    x:collection1] o.a.s.s.SolrIndexSearcher Opening [Searcher@6099e060[collection1] main]
   [junit4]   2> 2137851 WARN  (TEST-InfixSuggestersTest.testBuildThen2xReload-seed#[DC08979674FE7D0B]) [    x:collection1] o.a.s.r.ManagedResourceStorage Cannot write to config directory /home/jenkins/workspace/Lucene-Solr-7.x-Linux/solr/core/src/test-files/solr/collection1/conf; switching to use InMemory storage instead.
   [junit4]   2> 2137851 INFO  (TEST-InfixSuggestersTest.testBuildThen2xReload-seed#[DC08979674FE7D0B]) [    x:collection1] o.a.s.h.c.SuggestComponent Initializing SuggestComponent
   [junit4]   2> 2137851 INFO  (TEST-InfixSuggestersTest.testBuildThen2xReload-seed#[DC08979674FE7D0B]) [    x:collection1] o.a.s.s.s.SolrSuggester init: {name=shortRandomAnalyzingInfixSuggester,lookupImpl=AnalyzingInfixLookupFactory,dictionaryImpl=RandomTestDictionaryFactory,randDictMaxItems=100,indexPath=short_random_analyzing_infix_suggester,suggestAnalyzerFieldType=text,buildOnCommit=false,buildOnStartup=false}
   [junit4]   2> 2137852 INFO  (TEST-InfixSuggestersTest.testBuildThen2xReload-seed#[DC08979674FE7D0B]) [    x:collection1] o.a.s.s.s.SolrSuggester Dictionary loaded with params: {name=shortRandomAnalyzingInfixSuggester,lookupImpl=AnalyzingInfixLookupFactory,dictionaryImpl=RandomTestDictionaryFactory,randDictMaxItems=100,indexPath=short_random_analyzing_infix_suggester,suggestAnalyzerFieldType=text,buildOnCommit=false,buildOnStartup=false}
   [junit4]   2> 2137852 INFO  (TEST-InfixSuggestersTest.testBuildThen2xReload-seed#[DC08979674FE7D0B]) [    x:collection1] o.a.s.h.c.SuggestComponent Initializing SuggestComponent
   [junit4]   2> 2137852 INFO  (TEST-InfixSuggestersTest.testBuildThen2xReload-seed#[DC08979674FE7D0B]) [    x:collection1] o.a.s.s.s.SolrSuggester init: {name=longRandomAnalyzingInfixSuggester,lookupImpl=AnalyzingInfixLookupFactory,dictionaryImpl=RandomTestDictionaryFactory,randDictMaxItems=100000,indexPath=long_random_analyzing_infix_suggester,suggestAnalyzerFieldType=text,buildOnCommit=false,buildOnStartup=false}
   [junit4]   2> 2137852 INFO  (TEST-InfixSuggestersTest.testBuildThen2xReload-seed#[DC08979674FE7D0B]) [    x:collection1] o.a.s.s.s.SolrSuggester Dictionary loaded with params: {name=longRandomAnalyzingInfixSuggester,lookupImpl=AnalyzingInfixLookupFactory,dictionaryImpl=RandomTestDictionaryFactory,randDictMaxItems=100000,indexPath=long_random_analyzing_infix_suggester,suggestAnalyzerFieldType=text,buildOnCommit=false,buildOnStartup=false}
   [junit4]   2> 2137852 INFO  (TEST-InfixSuggestersTest.testBuildThen2xReload-seed#[DC08979674FE7D0B]) [    x:collection1] o.a.s.h.c.SuggestComponent Initializing SuggestComponent
   [junit4]   2> 2137852 INFO  (TEST-InfixSuggestersTest.testBuildThen2xReload-seed#[DC08979674FE7D0B]) [    x:collection1] o.a.s.s.s.SolrSuggester init: {name=shortRandomBlendedInfixSuggester,lookupImpl=BlendedInfixLookupFactory,dictionaryImpl=RandomTestDictionaryFactory,randDictMaxItems=100,blenderType=position_linear,suggestAnalyzerFieldType=text,indexPath=short_random_blended_infix_suggester,highlight=true,buildOnStartup=false,buildOnCommit=false}
   [junit4]   2> 2137852 INFO  (TEST-InfixSuggestersTest.testBuildThen2xReload-seed#[DC08979674FE7D0B]) [    x:collection1] o.a.s.s.s.SolrSuggester Dictionary loaded with params: {name=shortRandomBlendedInfixSuggester,lookupImpl=BlendedInfixLookupFactory,dictionaryImpl=RandomTestDictionaryFactory,randDictMaxItems=100,blenderType=position_linear,suggestAnalyzerFieldType=text,indexPath=short_random_blended_infix_suggester,highlight=true,buildOnStartup=false,buildOnCommit=false}
   [junit4]   2> 2137852 INFO  (TEST-InfixSuggestersTest.testBuildThen2xReload-seed#[DC08979674FE7D0B]) [    x:collection1] o.a.s.h.ReplicationHandler Commits will be reserved for 10000ms.
   [junit4]   2> 2137853 INFO  (searcherExecutor-9787-thread-1-processing-x:collection1) [    x:collection1] o.a.s.c.SolrCore [collection1] Registered new searcher Searcher@6099e060[collection1] main{ExitableDirectoryReader(UninvertingDirectoryReader())}
   [junit4]   2> 2137854 INFO  (TEST-InfixSuggestersTest.testBuildThen2xReload-seed#[DC08979674FE7D0B]) [    x:collection1] o.a.s.u.RandomMergePolicy RandomMergePolicy wrapping class org.apache.lucene.index.TieredMergePolicy: [TieredMergePolicy: maxMergeAtOnce=24, maxMergeAtOnceExplicit=22, maxMergedSegmentMB=18.6279296875, floorSegmentMB=1.13671875, forceMergeDeletesPctAllowed=17.063525743757474, segmentsPerTier=32.0, maxCFSSegmentSizeMB=8.796093022207999E12, noCFSRatio=1.0, reclaimDeletesWeight=3.277898065951239
   [junit4]   2> 2137854 INFO  (TEST-InfixSuggestersTest.testBuildThen2xReload-seed#[DC08979674FE7D0B]) [    x:collection1] o.a.s.u.DefaultSolrCoreState New IndexWriter is ready to be used.
   [junit4]   2> 2137854 INFO  (TEST-InfixSuggestersTest.testBuildThen2xReload-seed#[DC08979674FE7D0B]) [    x:collection1] o.a.s.s.SolrIndexSearcher Opening [Searcher@7fa0f971[collection1] main]
   [junit4]   2> 2137854 INFO  (TEST-InfixSuggestersTest.testBuildThen2xReload-seed#[DC08979674FE7D0B]) [    x:collection1] o.a.s.c.SolrCore [collection1]  CLOSING SolrCore org.apache.solr.core.SolrCore@44b2281c
   [junit4]   2> 2137854 INFO  (TEST-InfixSuggestersTest.testBuildThen2xReload-seed#[DC08979674FE7D0B]) [    x:collection1] o.a.s.m.SolrMetricManager Closing metric reporters for registry=solr.core.collection1, tag=44b2281c
   [junit4]   2> 2137854 INFO  (TEST-InfixSuggestersTest.testBuildThen2xReload-seed#[DC08979674FE7D0B]) [    x:collection1] o.a.s.m.r.SolrJmxReporter Closing reporter [org.apache.solr.metrics.reporters.SolrJmxReporter@575123d0: rootName = null, domain = solr.core.collection1, service url = null, agent id = null] for registry solr.core.collection1 / com.codahale.metrics.MetricRegistry@7bf9fb97
   [junit4]   2> 2137855 INFO  (searcherExecutor-9787-thread-1-processing-x:collection1) [    x:collection1] o.a.s.c.SolrCore [collection1] Registered new searcher Searcher@7fa0f971[collection1] main{ExitableDirectoryReader(UninvertingDirectoryReader())}
   [junit4]   2> 2137860 ERROR (TEST-InfixSuggestersTest.testBuildThen2xReload-seed#[DC08979674FE7D0B]) [    x:collection1] o.a.s.c.CorePropertiesLocator Couldn't load core descriptor from /home/jenkins/workspace/Lucene-Solr-7.x-Linux/solr/core/src/test-files/solr/collection1/core.properties:java.nio.file.NoSuchFileException: /home/jenkins/workspace/Lucene-Solr-7.x-Linux/solr/core/src/test-files/solr/collection1/core.properties
   [junit4]   2> 2137861 INFO  (TEST-InfixSuggestersTest.testBuildThen2xReload-seed#[DC08979674FE7D0B]) [    x:collection1] o.a.s.c.SolrResourceLoader [null] Added 2 libs to classloader, from paths: [/home/jenkins/workspace/Lucene-Solr-7.x-Linux/solr/core/src/test-files/solr/collection1/lib, /home/jenkins/workspace/Lucene-Solr-7.x-Linux/solr/core/src/test-files/solr/collection1/lib/classes]
   [junit4]   2> 2137875 INFO  (TEST-InfixSuggestersTest.testBuildThen2xReload-seed#[DC08979674FE7D0B]) [    x:collection1] o.a.s.c.SolrConfig Using Lucene MatchVersion: 7.5.0
   [junit4]   2> 2137881 INFO  (TEST-InfixSuggestersTest.testBuildThen2xReload-seed#[DC08979674FE7D0B]) [    x:collection1] o.a.s.s.IndexSchema [collection1] Schema name=test
   [junit4]   2> 2137939 INFO  (TEST-InfixSuggestersTest.testBuildThen2xReload-seed#[DC08979674FE7D0B]) [    x:collection1] o.a.s.s.IndexSchema Loaded schema test/1.0 with uniqueid field id
   [junit4]   2> 2137944 INFO  (TEST-InfixSuggestersTest.testBuildThen2xReload-seed#[DC08979674FE7D0B]) [    x:collection1] o.a.s.c.CoreContainer Reloading SolrCore 'collection1' using configuration from instancedir /home/jenkins/workspace/Lucene-Solr-7.x-Linux/solr/core/src/test-files/solr/collection1
   [junit4]   2> 2137962 INFO  (TEST-InfixSuggestersTest.testBuildThen2xReload-seed#[DC08979674FE7D0B]) [    x:collection1] o.a.s.m.r.SolrJmxReporter JMX monitoring for 'solr.core.collection1' (registry 'solr.core.collection1') enabled at server: com.sun.jmx.mbeanserver.JmxMBeanServer@561c6429
   [junit4]   2> 2137962 INFO  (TEST-InfixSuggestersTest.testBuildThen2xReload-seed#[DC08979674FE7D0B]) [    x:collection1] o.a.s.c.SolrCore [[collection1] ] Opening new SolrCore at [/home/jenkins/workspace/Lucene-Solr-7.x-Linux/solr/core/src/test-files/solr/collection1], dataDir=[/home/jenkins/workspace/Lucene-Solr-7.x-Linux/solr/build/solr-core/test/J0/temp/solr.handler.component.InfixSuggestersTest_DC08979674FE7D0B-001/init-core-data-001/]
   [junit4]   2> 2137993 INFO  (TEST-InfixSuggestersTest.testBuildThen2xReload-seed#[DC08979674FE7D0B]) [    x:collection1] o.a.s.u.CommitTracker Hard AutoCommit: disabled
   [junit4]   2> 2137993 INFO  (TEST-InfixSuggestersTest.testBuildThen2xReload-seed#[DC08979674FE7D0B]) [    x:collection1] o.a.s.u.CommitTracker Soft AutoCommit: disabled
   [junit4]   2> 2137994 INFO  (TEST-InfixSuggestersTest.testBuildThen2xReload-seed#[DC08979674FE7D0B]) [    x:collection1] o.a.s.s.SolrIndexSearcher Opening [Searcher@6624162d[collection1] main]
   [junit4]   2> 2137994 WARN  (TEST-InfixSuggestersTest.testBuildThen2xReload-seed#[DC08979674FE7D0B]) [    x:collection1] o.a.s.r.ManagedResourceStorage Cannot write to config directory /home/jenkins/workspace/Lucene-Solr-7.x-Linux/solr/core/src/test-files/solr/collection1/conf; switching to use InMemory storage instead.
   [junit4]   2> 2137994 INFO  (TEST-InfixSuggestersTest.testBuildThen2xReload-seed#[DC08979674FE7D0B]) [    x:collection1] o.a.s.h.c.SuggestComponent Initializing SuggestComponent
   [junit4]   2> 2137994 INFO  (TEST-InfixSuggestersTest.testBuildThen2xReload-seed#[DC08979674FE7D0B]) [    x:collection1] o.a.s.s.s.SolrSuggester init: {name=shortRandomAnalyzingInfixSuggester,lookupImpl=AnalyzingInfixLookupFactory,dictionaryImpl=RandomTestDictionaryFactory,randDictMaxItems=100,indexPath=short_random_analyzing_infix_suggester,suggestAnalyzerFieldType=text,buildOnCommit=false,buildOnStartup=false}
   [junit4]   2> 2137995 INFO  (TEST-InfixSuggestersTest.testBuildThen2xReload-seed#[DC08979674FE7D0B]) [    x:collection1] o.a.s.s.s.SolrSuggester Dictionary loaded with params: {name=shortRandomAnalyzingInfixSuggester,lookupImpl=AnalyzingInfixLookupFactory,dictionaryImpl=RandomTestDictionaryFactory,randDictMaxItems=100,indexPath=short_random_analyzing_infix_suggester,suggestAnalyzerFieldType=text,buildOnCommit=false,buildOnStartup=false}
   [junit4]   2> 2137995 INFO  (TEST-InfixSuggestersTest.testBuildThen2xReload-seed#[DC08979674FE7D0B]) [    x:collection1] o.a.s.h.c.SuggestComponent Initializing SuggestComponent
   [junit4]   2> 2137995 INFO  (TEST-InfixSuggestersTest.testBuildThen2xReload-seed#[DC08979674FE7D0B]) [    x:collection1] o.a.s.s.s.SolrSuggester init: {name=longRandomAnalyzingInfixSuggester,lookupImpl=AnalyzingInfixLookupFactory,dictionaryImpl=RandomTestDictionaryFactory,randDictMaxItems=100000,indexPath=long_random_analyzing_infix_suggester,suggestAnalyzerFieldType=text,buildOnCommit=false,buildOnStartup=false}
   [junit4]   2> 2137995 INFO  (TEST-InfixSuggestersTest.testBuildThen2xReload-seed#[DC08979674FE7D0B]) [    x:collection1] o.a.s.s.s.SolrSuggester Dictionary loaded with params: {name=longRandomAnalyzingInfixSuggester,lookupImpl=AnalyzingInfixLookupFactory,dictionaryImpl=RandomTestDictionaryFactory,randDictMaxItems=100000,indexPath=long_random_analyzing_infix_suggester,suggestAnalyzerFieldType=text,buildOnCommit=false,buildOnStartup=false}
   [junit4]   2> 2137995 INFO  (TEST-InfixSuggestersTest.testBuildThen2xReload-seed#[DC08979674FE7D0B]) [    x:collection1] o.a.s.h.c.SuggestComponent Initializing SuggestComponent
   [junit4]   2> 2137995 INFO  (TEST-InfixSuggestersTest.testBuildThen2xReload-seed#[DC08979674FE7D0B]) [    x:collection1] o.a.s.s.s.SolrSuggester init: {name=shortRandomBlendedInfixSuggester,lookupImpl=BlendedInfixLookupFactory,dictionaryImpl=RandomTestDictionaryFactory,randDictMaxItems=100,blenderType=position_linear,suggestAnalyzerFieldType=text,indexPath=short_random_blended_infix_suggester,highlight=true,buildOnStartup=false,buildOnCommit=false}
   [junit4]   2> 2137995 INFO  (TEST-InfixSuggestersTest.testBuildThen2xReload-seed#[DC08979674FE7D0B]) [    x:collection1] o.a.s.s.s.SolrSuggester Dictionary loaded with params: {name=shortRandomBlendedInfixSuggester,lookupImpl=BlendedInfixLookupFactory,dictionaryImpl=RandomTestDictionaryFactory,randDictMaxItems=100,blenderType=position_linear,suggestAnalyzerFieldType=text,indexPath=short_random_blended_infix_suggester,highlight=true,buildOnStartup=false,buildOnCommit=false}
   [junit4]   2> 2137995 INFO  (TEST-InfixSuggestersTest.testBuildThen2xReload-seed#[DC08979674FE7D0B]) [    x:collection1] o.a.s.h.ReplicationHandler Commits will be reserved for 10000ms.
   [junit4]   2> 2137996 INFO  (searcherExecutor-9791-thread-1-processing-x:collection1) [    x:collection1] o.a.s.c.SolrCore [collection1] Registered new searcher Searcher@6624162d[collection1] main{ExitableDirectoryReader(UninvertingDirectoryReader())}
   [junit4]   2> 2137996 INFO  (TEST-InfixSuggestersTest.testBuildThen2xReload-seed#[DC08979674FE7D0B]) [    x:collection1] o.a.s.u.RandomMergePolicy RandomMergePolicy wrapping class org.apache.lucene.index.LogDocMergePolicy: [LogDocMergePolicy: minMergeSize=1000, mergeFactor=43, maxMergeSize=9223372036854775807, maxMergeSizeForForcedMerge=9223372036854775807, calibrateSizeByDeletes=true, maxMergeDocs=2147483647, maxCFSSegmentSizeMB=8.796093022207999E12, noCFSRatio=0.0]
   [junit4]   2> 2137997 INFO  (TEST-InfixSuggestersTest.testBuildThen2xReload-seed#[DC08979674FE7D0B]) [    x:collection1] o.a.s.u.DefaultSolrCoreState New IndexWriter is ready to be used.
   [junit4]   2> 2137997 INFO  (TEST-InfixSuggestersTest.testBuildThen2xReload-seed#[DC08979674FE7D0B]) [    x:collection1] o.a.s.s.SolrIndexSearcher Opening [Searcher@74edd6f8[collection1] main]
   [junit4]   2> 2137997 INFO  (TEST-InfixSuggestersTest.testBuildThen2xReload-seed#[DC08979674FE7D0B]) [    x:collection1] o.a.s.c.SolrCore [collection1]  CLOSING SolrCore org.apache.solr.core.SolrCore@2f584acd
   [junit4]   2> 2137997 INFO  (TEST-InfixSuggestersTest.testBuildThen2xReload-seed#[DC08979674FE7D0B]) [    x:collection1] o.a.s.m.SolrMetricManager Closing metric reporters for registry=solr.core.collection1, tag=2f584acd
   [junit4]   2> 2137997 INFO  (TEST-InfixSuggestersTest.testBuildThen2xReload-seed#[DC08979674FE7D0B]) [    x:collection1] o.a.s.m.r.SolrJmxReporter Closing reporter [org.apache.solr.metrics.reporters.SolrJmxReporter@67b769e0: rootName = null, domain = solr.core.collection1, service url = null, agent id = null] for registry solr.core.collection1 / com.codahale.metrics.MetricRegistry@7bf9fb97
   [junit4]   2> 2137997 INFO  (searcherExecutor-9791-thread-1-processing-x:collection1) [    x:collection1] o.a.s.c.SolrCore [collection1] Registered new searcher Searcher@74edd6f8[collection1] main{ExitableDirectoryReader(UninvertingDirectoryReader())}
   [junit4]   2> 2138003 INFO  (TEST-InfixSuggestersTest.testBuildThen2xReload-seed#[DC08979674FE7D0B]) [    x:collection1] o.a.s.SolrTestCaseJ4 ###Ending testBuildThen2xReload
   [junit4]   2> 2138005 INFO  (TEST-InfixSuggestersTest.testShutdownDuringBuild-seed#[DC08979674FE7D0B]) [    x:collection1] o.a.s.SolrTestCaseJ4 ###Starting testShutdownDuringBuild
   [junit4]   2> 2138006 INFO  (AnalyzingInfixSuggesterTest-6209-thread-1-processing-x:collection1) [    x:collection1] o.a.s.h.c.SuggestComponent SuggestComponent prepare with : qt=/suggest_analyzing_infix_long_dictionary&suggest=true&suggest.buildAll=true&wt=xml&indent=off
   [junit4]   2> 2138006 INFO  (AnalyzingInfixSuggesterTest-6209-thread-1-processing-x:collection1) [    x:collection1] o.a.s.s.s.SolrSuggester SolrSuggester.build(longRandomAnalyzingInfixSuggester)
   [junit4]   2> 2138044 INFO  (AnalyzingInfixSuggesterTest-6209-thread-1-processing-x:collection1) [    x:collection1] o.a.s.s.s.RandomTestDictionaryFactory org.apache.solr.spelling.suggest.RandomTestDictionaryFactory$RandomTestDictionary.enabled.longRandomAnalyzingInfixSuggester emitted 1000 items.
   [junit4]   2> 2138087 INFO  (AnalyzingInfixSuggesterTest-6209-thread-1-processing-x:collection1) [    x:collection1] o.a.s.s.s.RandomTestDictionaryFactory org.apache.solr.spelling.suggest.RandomTestDictionaryFactory$RandomTestDictionary.enabled.longRandomAnalyzingInfixSuggester emitted 2000 items.
   [junit4]   2> 2138106 INFO  (TEST-InfixSuggestersTest.testShutdownDuringBuild-seed#[DC08979674FE7D0B]) [    x:collection1] o.a.s.c.CoreContainer Shutting down CoreContainer instance=942762877
   [junit4]   2> 2138106 INFO  (TEST-InfixSuggestersTest.testShutdownDuringBuild-seed#[DC08979674FE7D0B]) [    x:collection1] o.a.s.m.SolrMetricManager Closing metric reporters for registry=solr.node, tag=null
   [junit4]   2> 2138106 INFO  (TEST-InfixSuggestersTest.testShutdownDuringBuild-seed#[DC08979674FE7D0B]) [    x:collection1] o.a.s.m.r.SolrJmxReporter Closing reporter [org.apache.solr.metrics.reporters.SolrJmxReporter@69d20ddc: rootName = null, domain = solr.node, service url = null, agent id = null] for registry solr.node / com.codahale.metrics.MetricRegistry@2c9ccfdb
   [junit4]   2> 2138109 INFO  (TEST-InfixSuggestersTest.testShutdownDuringBuild-seed#[DC08979674FE7D0B]) [    x:collection1] o.a.s.m.SolrMetricManager Closing metric reporters for registry=solr.jvm, tag=null
   [junit4]   2> 2138109 INFO  (TEST-InfixSuggestersTest.testShutdownDuringBuild-seed#[DC08979674FE7D0B]) [    x:collection1] o.a.s.m.r.SolrJmxReporter Closing reporter [org.apache.solr.metrics.reporters.SolrJmxReporter@5aec3296: rootName = null, domain = solr.jvm, service url = null, agent id = null] for registry solr.jvm / com.codahale.metrics.MetricRegistry@7b15b30
   [junit4]   2> 2138111 INFO  (TEST-InfixSuggestersTest.testShutdownDuringBuild-seed#[DC08979674FE7D0B]) [    x:collection1] o.a.s.m.SolrMetricManager Closing metric reporters for registry=solr.jetty, tag=null
   [junit4]   2> 2138111 INFO  (TEST-InfixSuggestersTest.testShutdownDuringBuild-seed#[DC08979674FE7D0B]) [    x:collection1] o.a.s.m.r.SolrJmxReporter Closing reporter [org.apache.solr.metrics.reporters.SolrJmxReporter@32a23409: rootName = null, domain = solr.jetty, service url = null, agent id = null] for registry solr.jetty / com.codahale.metrics.MetricRegistry@186c6a9a
   [junit4]   2> 2138111 INFO  (coreCloseExecutor-9795-thread-1-processing-x:collection1) [    x:collection1] o.a.s.c.SolrCore [collection1]  CLOSING SolrCore org.apache.solr.core.SolrCore@5985fce5
   [junit4]   2> 2138112 INFO  (coreCloseExecutor-9795-thread-1-processing-x:collection1) [    x:collection1] o.a.s.m.SolrMetricManager Closing metric reporters for registry=solr.core.collection1, tag=5985fce5
   [junit4]   2> 2138112 INFO  (coreCloseExecutor-9795-thread-1-processing-x:collection1) [    x:collection1] o.a.s.m.r.SolrJmxReporter Closing reporter [org.apache.solr.metrics.reporters.SolrJmxReporter@21b896e3: rootName = null, domain = solr.core.collection1, service url = null, agent id = null] for registry solr.core.collection1 / com.codahale.metrics.MetricRegistry@7bf9fb97
   [junit4]   2> 2138423 ERROR (AnalyzingInfixSuggesterTest-6209-thread-1-processing-x:collection1) [    x:collection1] o.a.s.SolrTestCaseJ4 REQUEST FAILED: qt=/suggest_analyzing_infix_long_dictionary&suggest.buildAll=true&wt=xml:org.apache.solr.common.SolrException: SolrCoreState already closed.
   [junit4]   2> 	at org.apache.solr.update.DefaultSolrCoreState.lock(DefaultSolrCoreState.java:186)
   [junit4]   2> 	at org.apache.solr.update.DefaultSolrCoreState.getIndexWriter(DefaultSolrCoreState.java:121)
   [junit4]   2> 	at org.apache.solr.update.SolrCoreState.getTragicException(SolrCoreState.java:198)
   [junit4]   2> 	at org.apache.solr.core.CoreContainer.checkTragicException(CoreContainer.java:1805)
   [junit4]   2> 	at org.apache.solr.handler.RequestHandlerBase.handleRequest(RequestHandlerBase.java:212)
   [junit4]   2> 	at org.apache.solr.core.SolrCore.execute(SolrCore.java:2541)
   [junit4]   2> 	at org.apache.solr.util.TestHarness.query(TestHarness.java:337)
   [junit4]   2> 	at org.apache.solr.util.TestHarness.query(TestHarness.java:319)
   [junit4]   2> 	at org.apache.solr.SolrTestCaseJ4.assertQ(SolrTestCaseJ4.java:891)
   [junit4]   2> 	at org.apache.solr.SolrTestCaseJ4.assertQ(SolrTestCaseJ4.java:877)
   [junit4]   2> 	at org.apache.solr.handler.component.InfixSuggestersTest.lambda$null$2(InfixSuggestersTest.java:122)
   [junit4]   2> 	at org.apache.lucene.util.LuceneTestCase.expectThrows(LuceneTestCase.java:2696)
   [junit4]   2> 	at org.apache.solr.handler.component.InfixSuggestersTest.lambda$testShutdownDuringBuild$3(InfixSuggestersTest.java:121)
   [junit4]   2> 	at java.util.concurrent.FutureTask.run(FutureTask.java:266)
   [junit4]   2> 	at org.apache.solr.common.util.ExecutorUtil$MDCAwareThreadPoolExecutor.lambda$execute$0(ExecutorUtil.java:209)
   [junit4]   2> 	at java.util.concurrent.ThreadPoolExecutor.runWorker(ThreadPoolExecutor.java:1149)
   [junit4]   2> 	at java.util.concurrent.ThreadPoolExecutor$Worker.run(ThreadPoolExecutor.java:624)
   [junit4]   2> 	at java.lang.Thread.run(Thread.java:748)
   [junit4]   2> 
   [junit4]   2> 2138425 INFO  (TEST-InfixSuggestersTest.testShutdownDuringBuild-seed#[DC08979674FE7D0B]) [    x:collection1] o.a.s.SolrTestCaseJ4 ####initCore
   [junit4]   2> 2138425 INFO  (TEST-InfixSuggestersTest.testShutdownDuringBuild-seed#[DC08979674FE7D0B]) [    x:collection1] o.a.s.c.SolrResourceLoader [null] Added 2 libs to classloader, from paths: [/home/jenkins/workspace/Lucene-Solr-7.x-Linux/solr/core/src/test-files/solr/collection1/lib, /home/jenkins/workspace/Lucene-Solr-7.x-Linux/solr/core/src/test-files/solr/collection1/lib/classes]
   [junit4]   2> 2138438 INFO  (TEST-InfixSuggestersTest.testShutdownDuringBuild-seed#[DC08979674FE7D0B]) [    x:collection1] o.a.s.c.SolrConfig Using Lucene MatchVersion: 7.5.0
   [junit4]   2> 2138444 INFO  (TEST-InfixSuggestersTest.testShutdownDuringBuild-seed#[DC08979674FE7D0B]) [    x:collection1] o.a.s.s.IndexSchema [null] Schema name=test
   [junit4]   2> 2138504 INFO  (TEST-InfixSuggestersTest.testShutdownDuringBuild-seed#[DC08979674FE7D0B]) [    x:collection1] o.a.s.s.IndexSchema Loaded schema test/1.0 with uniqueid field id
   [junit4]   2> 2138640 INFO  (TEST-InfixSuggestersTest.testShutdownDuringBuild-seed#[DC08979674FE7D0B]) [    x:collection1] o.a.s.c.TransientSolrCoreCacheDefault Allocating transient cache for 2147483647 transient cores
   [junit4]   2> 2138640 INFO  (TEST-InfixSuggestersTest.testShutdownDuringBuild-seed#[DC08979674FE7D0B]) [    x:collection1] o.a.s.h.a.MetricsHistoryHandler No .system collection, keeping metrics history in memory.
   [junit4]   2> 2138649 INFO  (TEST-InfixSuggestersTest.testShutdownDuringBuild-seed#[DC08979674FE7D0B]) [    x:collection1] o.a.s.m.r.SolrJmxReporter JMX monitoring for 'solr.node' (registry 'solr.node') enabled at server: com.sun.jmx.mbeanserver.JmxMBeanServer@561c6429
   [junit4]   2> 2138654 INFO  (TEST-InfixSuggestersTest.testShutdownDuringBuild-seed#[DC08979674FE7D0B]) [    x:collection1] o.a.s.m.r.SolrJmxReporter JMX monitoring for 'solr.jvm' (registry 'solr.jvm') enabled at server: com.sun.jmx.mbeanserver.JmxMBeanServer@561c6429
   [junit4]   2> 2138654 INFO  (TEST-InfixSuggestersTest.testShutdownDuringBuild-seed#[DC08979674FE7D0B]) [    x:collection1] o.a.s.m.r.SolrJmxReporter JMX monitoring for 'solr.jetty' (registry 'solr.jetty') enabled at server: com.sun.jmx.mbeanserver.JmxMBeanServer@561c6429
   [junit4]   2> 2138656 INFO  (coreLoadExecutor-9805-thread-1-processing-x:collection1) [    x:collection1] o.a.s.c.SolrResourceLoader [null] Added 2 libs to classloader, from paths: [/home/jenkins/workspace/Lucene-Solr-7.x-Linux/solr/core/src/test-files/solr/collection1/lib, /home/jenkins/workspace/Lucene-Solr-7.x-Linux/solr/core/src/test-files/solr/collection1/lib/classes]
   [junit4]   2> 2138686 INFO  (coreLoadExecutor-9805-thread-1-processing-x:collection1) [    x:collection1] o.a.s.c.SolrConfig Using Lucene MatchVersion: 7.5.0
   [junit4]   2> 2138694 INFO  (coreLoadExecutor-9805-thread-1-processing-x:collection1) [    x:collection1] o.a.s.s.IndexSchema [collection1] Schema name=test
   [junit4]   2> 2138774 INFO  (coreLoadExecutor-9805-thread-1-processing-x:collection1) [    x:collection1] o.a.s.s.IndexSchema Loaded schema test/1.0 with uniqueid field id
   [junit4]   2> 2138783 INFO  (coreLoadExecutor-9805-thread-1-processing-x:collection1) [    x:collection1] o.a.s.c.CoreContainer Creating SolrCore 'collection1' using configuration from instancedir /home/jenkins/workspace/Lucene-Solr-7.x-Linux/solr/core/src/test-files/solr/collection1, trusted=true
   [junit4]   2> 2138783 INFO  (coreLoadExecutor-9805-thread-1-processing-x:collection1) [    x:collection1] o.a.s.m.r.SolrJmxReporter JMX monitoring for 'solr.core.collection1' (registry 'solr.core.collection1') enabled at server: com.sun.jmx.mbeanserver.JmxMBeanServer@561c6429
   [junit4]   2> 2138783 INFO  (coreLoadExecutor-9805-thread-1-processing-x:collection1) [    x:collection1] o.a.s.c.SolrCore solr.RecoveryStrategy.Builder
   [junit4]   2> 2138783 INFO  (coreLoadExecutor-9805-thread-1-processing-x:collection1) [    x:collection1] o.a.s.c.SolrCore [[collection1] ] Opening new SolrCore at [/home/jenkins/workspace/Lucene-Solr-7.x-Linux/solr/core/src/test-files/solr/collection1], dataDir=[/home/jenkins/workspace/Lucene-Solr-7.x-Linux/solr/build/solr-core/test/J0/temp/solr.handler.component.InfixSuggestersTest_DC08979674FE7D0B-001/init-core-data-001/]
   [junit4]   2> 2138816 INFO  (coreLoadExecutor-9805-thread-1-processing-x:collection1) [    x:collection1] o.a.s.u.CommitTracker Hard AutoCommit: disabled
   [junit4]   2> 2138816 INFO  (coreLoadExecutor-9805-thread-1-processing-x:collection1) [    x:collection1] o.a.s.u.CommitTracker Soft AutoCommit: disabled
   [junit4]   2> 2138818 INFO  (coreLoadExecutor-9805-thread-1-processing-x:collection1) [    x:collection1] o.a.s.u.RandomMergePolicy RandomMergePolicy wrapping class org.apache.lucene.index.AlcoholicMergePolicy: [AlcoholicMergePolicy: minMergeSize=0, mergeFactor=10, maxMergeSize=803781771, maxMergeSizeForForcedMerge=9223372036854775807, calibrateSizeByDeletes=true, maxMergeDocs=2147483647, maxCFSSegmentSizeMB=8.796093022207999E12, noCFSRatio=0.1]
   [junit4]   2> 2138818 INFO  (coreLoadExecutor-9805-thread-1-processing-x:collection1) [    x:collection1] o.a.s.s.SolrIndexSearcher Opening [Searcher@5663987c[collection1] main]
   [junit4]   2> 2138818 WARN  (coreLoadExecutor-9805-thread-1-processing-x:collection1) [    x:collection1] o.a.s.r.ManagedResourceStorage Cannot write to config directory /home/jenkins/workspace/Lucene-Solr-7.x-Linux/solr/core/src/test-files/solr/collection1/conf; switching to use InMemory storage instead.
   [junit4]   2> 2138819 INFO  (coreLoadExecutor-9805-thread-1-processing-x:collection1) [    x:collection1] o.a.s.h.c.SuggestComponent Initializing SuggestComponent
   [junit4]   2> 2138819 INFO  (coreLoadExecutor-9805-thread-1-processing-x:collection1) [    x:collection1] o.a.s.s.s.SolrSuggester init: {name=shortRandomAnalyzingInfixSuggester,lookupImpl=AnalyzingInfixLookupFactory,dictionaryImpl=RandomTestDictionaryFactory,randDictMaxItems=100,indexPath=short_random_analyzing_infix_suggester,suggestAnalyzerFieldType=text,buildOnCommit=false,buildOnStartup=false}
   [junit4]   2> 2138820 INFO  (coreLoadExecutor-9805-thread-1-processing-x:collection1) [    x:collection1] o.a.s.s.s.SolrSuggester Dictionary loaded with params: {name=shortRandomAnalyzingInfixSuggester,lookupImpl=AnalyzingInfixLookupFactory,dictionaryImpl=RandomTestDictionaryFactory,randDictMaxItems=100,indexPath=short_random_analyzing_infix_suggester,suggestAnalyzerFieldType=text,buildOnCommit=false,buildOnStartup=false}
   [junit4]   2> 2138820 INFO  (coreLoadExecutor-9805-thread-1-processing-x:collection1) [    x:collection1] o.a.s.h.c.SuggestComponent Initializing SuggestComponent
   [junit4]   2> 2138820 INFO  (coreLoadExecutor-9805-thread-1-processing-x:collection1) [    x:collection1] o.a.s.s.s.SolrSuggester init: {name=longRandomAnalyzingInfixSuggester,lookupImpl=AnalyzingInfixLookupFactory,dictionaryImpl=RandomTestDictionaryFactory,randDictMaxItems=100000,indexPath=long_random_analyzing_infix_suggester,suggestAnalyzerFieldType=text,buildOnCommit=false,buildOnStartup=false}
   [junit4]   2> 2138820 INFO  (coreLoadExecutor-9805-thread-1-processing-x:collection1) [    x:collection1] o.a.s.s.s.SolrSuggester Dictionary loaded with params: {name=longRandomAnalyzingInfixSuggester,lookupImpl=AnalyzingInfixLookupFactory,dictionaryImpl=RandomTestDictionaryFactory,randDictMaxItems=100000,indexPath=long_random_analyzing_infix_suggester,suggestAnalyzerFieldType=text,buildOnCommit=false,buildOnStartup=false}
   [junit4]   2> 2138820 INFO  (coreLoadExecutor-9805-thread-1-processing-x:collection1) [    x:collection1] o.a.s.h.c.SuggestComponent Initializing SuggestComponent
   [junit4]   2> 2138820 INFO  (coreLoadExecutor-9805-thread-1-processing-x:collection1) [    x:collection1] o.a.s.s.s.SolrSuggester init: {name=shortRandomBlendedInfixSuggester,lookupImpl=BlendedInfixLookupFactory,dictionaryImpl=RandomTestDictionaryFactory,randDictMaxItems=100,blenderType=position_linear,suggestAnalyzerFieldType=text,indexPath=short_random_blended_infix_suggester,highlight=true,buildOnStartup=false,buildOnCommit=false}
   [junit4]   2> 2138821 INFO  (coreLoadExecutor-9805-thread-1-processing-x:collection1) [    x:collection1] o.a.s.s.s.SolrSuggester Dictionary loaded with params: {name=shortRandomBlendedInfixSuggester,lookupImpl=BlendedInfixLookupFactory,dictionaryImpl=RandomTestDictionaryFactory,randDictMaxItems=100,blenderType=position_linear,suggestAnalyzerFieldType=text,indexPath=short_random_blended_infix_suggester,highlight=true,buildOnStartup=false,buildOnCommit=false}
   [junit4]   2> 2138821 INFO  (coreLoadExecutor-9805-thread-1-processing-x:collection1) [    x:collection1] o.a.s.h.ReplicationHandler Commits will be reserved for 10000ms.
   [junit4]   2> 2138821 INFO  (searcherExecutor-9806-thread-1-processing-x:collection1) [    x:collection1] o.a.s.c.SolrCore [collection1] Registered new searcher Searcher@5663987c[collection1] main{ExitableDirectoryReader(UninvertingDirectoryReader())}
   [junit4]   2> 2138822 INFO  (TEST-InfixSuggestersTest.testShutdownDuringBuild-seed#[DC08979674FE7D0B]) [    x:collection1] o.a.s.SolrTestCaseJ4 ####initCore end
   [junit4]   2> 2138822 INFO  (TEST-InfixSuggestersTest.testShutdownDuringBuild-seed#[DC08979674FE7D0B]) [    x:collection1] o.a.s.SolrTestCaseJ4 ###Ending testShutdownDuringBuild
   [junit4]   2> NOTE: reproduce with: ant test  -Dtestcase=InfixSuggestersTest -Dtests.method=testShutdownDuringBuild -Dtests.seed=DC08979674FE7D0B -Dtests.multiplier=3 -Dtests.slow=true -Dtests.locale=ar-DZ -Dtests.timezone=Australia/Eucla -Dtests.asserts=true -Dtests.file.encoding=UTF-8
   [junit4] ERROR   0.82s J0 | InfixSuggestersTest.testShutdownDuringBuild <<<
   [junit4]    > Throwable #1: java.util.concurrent.ExecutionException: junit.framework.AssertionFailedError: Unexpected wrapped exception type, expected CoreIsClosedException
   [junit4]    > 	at __randomizedtesting.SeedInfo.seed([DC08979674FE7D0B:385F5294A972869]:0)
   [junit4]    > 	at java.util.concurrent.FutureTask.report(FutureTask.java:122)
   [junit4]    > 	at java.util.concurrent.FutureTask.get(FutureTask.java:192)
   [junit4]    > 	at org.apache.solr.handler.component.InfixSuggestersTest.testShutdownDuringBuild(InfixSuggestersTest.java:130)
   [junit4]    > 	at java.lang.Thread.run(Thread.java:748)
   [junit4]    > Caused by: junit.framework.AssertionFailedError: Unexpected wrapped exception type, expected CoreIsClosedException
   [junit4]    > 	at org.apache.lucene.util.LuceneTestCase.expectThrows(LuceneTestCase.java:2704)
   [junit4]    > 	at org.apache.solr.handler.component.InfixSuggestersTest.lambda$testShutdownDuringBuild$3(InfixSuggestersTest.java:121)
   [junit4]    > 	at java.util.concurrent.FutureTask.run(FutureTask.java:266)
   [junit4]    > 	at org.apache.solr.common.util.ExecutorUtil$MDCAwareThreadPoolExecutor.lambda$execute$0(ExecutorUtil.java:209)
   [junit4]    > 	at java.util.concurrent.ThreadPoolExecutor.runWorker(ThreadPoolExecutor.java:1149)
   [junit4]    > 	at java.util.concurrent.ThreadPoolExecutor$Worker.run(ThreadPoolExecutor.java:624)
   [junit4]    > 	... 1 more
   [junit4]    > Caused by: java.lang.RuntimeException: Exception during query
   [junit4]    > 	at org.apache.solr.SolrTestCaseJ4.assertQ(SolrTestCaseJ4.java:917)
   [junit4]    > 	at org.apache.solr.SolrTestCaseJ4.assertQ(SolrTestCaseJ4.java:877)
   [junit4]    > 	at org.apache.solr.handler.component.InfixSuggestersTest.lambda$null$2(InfixSuggestersTest.java:122)
   [junit4]    > 	at org.apache.lucene.util.LuceneTestCase.expectThrows(LuceneTestCase.java:2696)
   [junit4]    > 	... 6 more
   [junit4]    > Caused by: org.apache.solr.common.SolrException: SolrCoreState already closed.
   [junit4]    > 	at org.apache.solr.update.DefaultSolrCoreState.lock(DefaultSolrCoreState.java:186)
   [junit4]    > 	at org.apache.solr.update.DefaultSolrCoreState.getIndexWriter(DefaultSolrCoreState.java:121)
   [junit4]    > 	at org.apache.solr.update.SolrCoreState.getTragicException(SolrCoreState.java:198)
   [junit4]    > 	at org.apache.solr.core.CoreContainer.checkTragicException(CoreContainer.java:1805)
   [junit4]    > 	at org.apache.solr.handler.RequestHandlerBase.handleRequest(RequestHandlerBase.java:212)
   [junit4]    > 	at org.apache.solr.core.SolrCore.execute(SolrCore.java:2541)
   [junit4]    > 	at org.apache.solr.util.TestHarness.query(TestHarness.java:337)
   [junit4]    > 	at org.apache.solr.util.TestHarness.query(TestHarness.java:319)
   [junit4]    > 	at org.apache.solr.SolrTestCaseJ4.assertQ(SolrTestCaseJ4.java:891)
   [junit4]    > 	... 9 more
   [junit4]   2> 2138826 INFO  (TEST-InfixSuggestersTest.testReloadDuringBuild-seed#[DC08979674FE7D0B]) [    x:collection1] o.a.s.SolrTestCaseJ4 ###Starting testReloadDuringBuild
   [junit4]   2> 2138827 ERROR (TEST-InfixSuggestersTest.testReloadDuringBuild-seed#[DC08979674FE7D0B]) [    x:collection1] o.a.s.c.CorePropertiesLocator Couldn't load core descriptor from /home/jenkins/workspace/Lucene-Solr-7.x-Linux/solr/core/src/test-files/solr/collection1/core.properties:java.nio.file.NoSuchFileException: /home/jenkins/workspace/Lucene-Solr-7.x-Linux/solr/core/src/test-files/solr/collection1/core.properties
   [junit4]   2> 2138827 INFO  (AnalyzingInfixSuggesterTest-6212-thread-1-processing-x:collection1) [    x:collection1] o.a.s.h.c.SuggestComponent SuggestComponent prepare with : qt=/suggest_analyzing_infix_long_dictionary&suggest=true&suggest.buildAll=true&wt=xml&indent=off
   [junit4]   2> 2138827 INFO  (AnalyzingInfixSuggesterTest-6212-thread-1-processing-x:collection1) [    x:collection1] o.a.s.s.s.SolrSuggester SolrSuggester.build(longRandomAnalyzingInfixSuggester)
   [junit4]   2> 2138827 INFO  (TEST-InfixSuggestersTest.testReloadDuringBuild-seed#[DC08979674FE7D0B]) [    x:collection1] o.a.s.c.SolrResourceLoader [null] Added 2 libs to classloader, from paths: [/home/jenkins/workspace/Lucene-Solr-7.x-Linux/solr/core/src/test-files/solr/collection1/lib, /home/jenkins/workspace/Lucene-Solr-7.x-Linux/solr/core/src/test-files/solr/collection1/lib/classes]
   [junit4]   2> 2138849 INFO  (TEST-InfixSuggestersTest.testReloadDuringBuild-seed#[DC08979674FE7D0B]) [    x:collection1] o.a.s.c.SolrConfig Using Lucene MatchVersion: 7.5.0
   [junit4]   2> 2138859 INFO  (TEST-InfixSuggestersTest.testReloadDuringBuild-seed#[DC08979674FE7D0B]) [    x:collection1] o.a.s.s.IndexSchema [collection1] Schema name=test
   [junit4]   2> 2138862 INFO  (AnalyzingInfixSuggesterTest-6212-thread-1-processing-x:collection1) [    x:collection1] o.a.s.s.s.RandomTestDictionaryFactory org.apache.solr.spelling.suggest.RandomTestDictionaryFactory$RandomTestDictionary.enabled.longRandomAnalyzingInfixSuggester emitted 1000 items.
   [junit4]   2> 2138905 INFO  (AnalyzingInfixSuggesterTest-6212-thread-1-processing-x:collection1) [    x:collection1] o.a.s.s.s.RandomTestDictionaryFactory org.apache.solr.spelling.suggest.RandomTestDictionaryFactory$RandomTestDictionary.enabled.longRandomAnalyzingInfixSuggester emitted 2000 items.
   [junit4]   2> 2138934 INFO  (TEST-InfixSuggestersTest.testReloadDuringBuild-seed#[DC08979674FE7D0B]) [    x:collection1] o.a.s.s.IndexSchema Loaded schema test/1.0 with uniqueid field id
   [junit4]   2> 2138939 INFO  (TEST-InfixSuggestersTest.testReloadDuringBuild-seed#[DC08979674FE7D0B]) [    x:collection1] o.a.s.c.CoreContainer Reloading SolrCore 'collection1' using configuration from instancedir /home/jenkins/workspace/Lucene-Solr-7.x-Linux/solr/core/src/test-files/solr/collection1
   [junit4]   2> 2138943 INFO  (AnalyzingInfixSuggesterTest-6212-thread-1-processing-x:collection1) [    x:collection1] o.a.s.s.s.RandomTestDictionaryFactory org.apache.solr.spelling.suggest.RandomTestDictionaryFactory$RandomTestDictionary.enabled.longRandomAnalyzingInfixSuggester emitted 3000 items.
   [junit4]   2> 2138958 INFO  (TEST-InfixSuggestersTest.testReloadDuringBuild-seed#[DC08979674FE7D0B]) [    x:collection1] o.a.s.m.r.SolrJmxReporter JMX monitoring for 'solr.core.collection1' (registry 'solr.core.collection1') enabled at server: com.sun.jmx.mbeanserver.JmxMBeanServer@561c6429
   [junit4]   2> 2138958 INFO  (TEST-InfixSuggestersTest.testReloadDuringBuild-seed#[DC08979674FE7D0B]) [    x:collection1] o.a.s.c.SolrCore [[collection1] ] Opening new SolrCore at [/home/jenkins/workspace/Lucene-Solr-7.x-Linux/solr/core/src/test-files/solr/collection1], dataDir=[/home/jenkins/workspace/Lucene-Solr-7.x-Linux/solr/build/solr-core/test/J0/temp/solr.handler.component.InfixSuggestersTest_DC08979674FE7D0B-001/init-core-data-001/]
   [junit4]   2> 2138978 INFO  (AnalyzingInfixSuggesterTest-6212-thread-1-processing-x:collection1) [    x:collection1] o.a.s.s.s.RandomTestDictionaryFactory org.apache.solr.spelling.suggest.RandomTestDictionaryFactory$RandomTestDictionary.enabled.longRandomAnalyzingInfixSuggester emitted 4000 items.
   [junit4]   2> 2138993 INFO  (TEST-InfixSuggestersTest.testReloadDuringBuild-seed#[DC08979674FE7D0B]) [    x:collection1] o.a.s.u.CommitTracker Hard AutoCommit: disabled
   [junit4]   2> 2138993 INFO  (TEST-InfixSuggestersTest.testReloadDuringBuild-seed#[DC08979674FE7D0B]) [    x:collection1] o.a.s.u.CommitTracker Soft AutoCommit: disabled
   [junit4]   2> 2138994 INFO  (TEST-InfixSuggestersTest.testReloadDuringBuild-seed#[DC08979674FE7D0B]) [    x:collection1] o.a.s.s.SolrIndexSearcher Opening [Searcher@3aa4b506[collection1] main]
   [junit4]   2> 2138994 WARN  (TEST-InfixSuggestersTest.testReloadDuringBuild-seed#[DC08979674FE7D0B]) [    x:collection1] o.a.s.r.ManagedResourceStorage Cannot write to config directory /home/jenkins/workspace/Lucene-Solr-7.x-Linux/solr/core/src/test-files/solr/collection1/conf; switching to use InMemory storage instead.
   [junit4]   2> 2138994 INFO  (TEST-InfixSuggestersTest.testReloadDuringBuild-seed#[DC08979674FE7D0B]) [    x:collection1] o.a.s.h.c.SuggestComponent Initializing SuggestComponent
   [junit4]   2> 2138994 INFO  (TEST-InfixSuggestersTest.testReloadDuringBuild-seed#[DC08979674FE7D0B]) [    x:collection1] o.a.s.s.s.SolrSuggester init: {name=shortRandomAnalyzingInfixSuggester,lookupImpl=AnalyzingInfixLookupFactory,dictionaryImpl=RandomTestDictionaryFactory,randDictMaxItems=100,indexPath=short_random_analyzing_infix_suggester,suggestAnalyzerFieldType=text,buildOnCommit=false,buildOnStartup=false}
   [junit4]   2> 2138995 INFO  (TEST-InfixSuggestersTest.testReloadDuringBuild-seed#[DC08979674FE7D0B]) [    x:collection1] o.a.s.s.s.SolrSuggester Dictionary loaded with params: {name=shortRandomAnalyzingInfixSuggester,lookupImpl=AnalyzingInfixLookupFactory,dictionaryImpl=RandomTestDictionaryFactory,randDictMaxItems=100,indexPath=short_random_analyzing_infix_suggester,suggestAnalyzerFieldType=text,buildOnCommit=false,buildOnStartup=false}
   [junit4]   2> 2138995 INFO  (TEST-InfixSuggestersTest.testReloadDuringBuild-seed#[DC08979674FE7D0B]) [    x:collection1] o.a.s.h.c.SuggestComponent Initializing SuggestComponent
   [junit4]   2> 2138995 INFO  (TEST-InfixSuggestersTest.testReloadDuringBuild-seed#[DC08979674FE7D0B]) [    x:collection1] o.a.s.s.s.SolrSuggester init: {name=longRandomAnalyzingInfixSuggester,lookupImpl=AnalyzingInfixLookupFactory,dictionaryImpl=RandomTestDictionaryFactory,randDictMaxItems=100000,indexPath=long_random_analyzing_infix_suggester,suggestAnalyzerFieldType=text,buildOnCommit=false,buildOnStartup=false}
   [junit4]   2> 2138996 INFO  (TEST-InfixSuggestersTest.testReloadDuringBuild-seed#[DC08979674FE7D0B]) [    x:collection1] o.a.s.s.s.SolrSuggester Dictionary loaded with params: {name=longRandomAnalyzingInfixSuggester,lookupImpl=AnalyzingInfixLookupFactory,dictionaryImpl=RandomTestDictionaryFactory,randDictMaxItems=100000,indexPath=long_random_analyzing_infix_suggester,suggestAnalyzerFieldType=text,buildOnCommit=false,buildOnStartup=false}
   [junit4]   2> 2138996 INFO  (TEST-InfixSuggestersTest.testReloadDuringBuild-seed#[DC08979674FE7D0B]) [    x:collection1] o.a.s.h.c.SuggestComponent Initializing SuggestComponent
   [junit4]   2> 2138996 INFO  (TEST-InfixSuggestersTest.testReloadDuringBuild-seed#[DC08979674FE7D0B]) [    x:collection1] o.a.s.s.s.SolrSuggester init: {name=shortRandomBlendedInfixSuggester,lookupImpl=BlendedInfixLookupFactory,dictionaryImpl=RandomTestDictionaryFactory,randDictMaxItems=100,blenderType=position_linear,suggestAnalyzerFieldType=text,indexPath=short_random_blended_infix_suggester,highlight=true,buildOnStartup=false,buildOnCommit=false}
   [junit4]   2> 2138996 INFO  (TEST-InfixSuggestersTest.testReloadDuringBuild-seed#[DC08979674FE7D0B]) [    x:collection1] o.a.s.s.s.SolrSuggester Dictionary loaded with params: {name=shortRandomBlendedInfixSuggester,lookupImpl=BlendedInfixLookupFactory,dictionaryImpl=RandomTestDictionaryFactory,randDictMaxItems=100,blenderType=position_linear,suggestAnalyzerFieldType=text,indexPath=short_random_blended_infix_suggester,highlight=true,buildOnStartup=false,buildOnCommit=false}
   [junit4]   2> 2138996 INFO  (TEST-InfixSuggestersTest.testReloadDuringBuild-seed#[DC08979674FE7D0B]) [    x:collection1] o.a.s.h.ReplicationHandler Commits will be reserved for 10000ms.
   [junit4]   2> 2138998 INFO  (searcherExecutor-9810-thread-1-processing-x:collection1) [    x:collection1] o.a.s.c.SolrCore [collection1] Registered new searcher Searcher@3aa4b506[collection1] main{ExitableDirectoryReader(UninvertingDirectoryReader())}
   [junit4]   2> 2138998 INFO  (TEST-InfixSuggestersTest.testReloadDuringBuild-seed#[DC08979674FE7D0B]) [    x:collection1] o.a.s.u.RandomMergePolicy RandomMergePolicy wrapping class org.apache.lucene.index.TieredMergePolicy: [TieredMergePolicy: maxMergeAtOnce=34, maxMergeAtOnceExplicit=18, maxMergedSegmentMB=1.447265625, floorSegmentMB=0.951171875, forceMergeDeletesPctAllowed=19.04327204381544, segmentsPerTier=37.0, maxCFSSegmentSizeMB=8.796093022207999E12, noCFSRatio=1.0, reclaimDeletesWeight=0.5283148630978411
   [junit4]   2> 2138998 INFO  (TEST-InfixSuggestersTest.testReloadDuringBuild-seed#[DC08979674FE7D0B]) [    x:collection1] o.a.s.u.DefaultSolrCoreState New IndexWriter is ready to be used.
   [junit4]   2> 2138998 INFO  (TEST-InfixSuggestersTest.testReloadDuringBuild-seed#[DC08979674FE7D0B]) [    x:collection1] o.a.s.s.SolrIndexSearcher Opening [Searcher@7559110e[collection1] main]
   [junit4]   2> 2138999 INFO  (TEST-InfixSuggestersTest.testReloadDuringBuild-seed#[DC08979674FE7D0B]) [    x:collection1] o.a.s.c.SolrCore [collection1]  CLOSING SolrCore org.apache.solr.core.SolrCore@3d7d06cf
   [junit4]   2> 2138999 INFO  (TEST-InfixSuggestersTest.testReloadDuringBuild-seed#[DC08979674FE7D0B]) [    x:collection1] o.a.s.m.SolrMetricManager Closing metric reporters for registry=solr.core.collection1, tag=3d7d06cf
   [junit4]   2> 2138999 INFO  (TEST-InfixSuggestersTest.testReloadDuringBuild-seed#[DC08979674FE7D0B]) [    x:collection1] o.a.s.m.r.SolrJmxReporter Closing reporter [org.apache.solr.metrics.reporters.SolrJmxReporter@5426731e: rootName = null, domain = solr.core.collection1, service url = null, agent id = null] for registry solr.core.collection1 / com.codahale.metrics.MetricRegistry@3806f25d
   [junit4]   2> 2138999 INFO  (searcherExecutor-9810-thread-1-processing-x:collection1) [    x:collection1] o.a.s.c.SolrCore [collection1] Registered new searcher Searcher@7559110e[collection1] main{ExitableDirectoryReader(UninvertingDirectoryReader())}
   [junit4]   2> 2139135 ERROR (AnalyzingInfixSuggesterTest-6212-thread-1-processing-x:collection1) [    x:collection1] o.a.s.h.RequestHandlerBase org.apache.solr.update.SolrCoreState$CoreIsClosedException: Suggester build has been interrupted by a core reload or shutdown.
   [junit4]   2> 	at org.apache.solr.spelling.suggest.SolrSuggester.build(SolrSuggester.java:183)
   [junit4]   2> 	at org.apache.solr.handler.component.SuggestComponent.prepare(SuggestComponent.java:185)
   [junit4]   2> 	at org.apache.solr.handler.component.SearchHandler.handleRequestBody(SearchHandler.java:272)
   [junit4]   2> 	at org.apache.solr.handler.RequestHandlerBase.handleRequest(RequestHandlerBase.java:199)
   [junit4]   2> 	at org.apache.solr.core.SolrCore.execute(SolrCore.java:2541)
   [junit4]   2> 	at org.apache.solr.util.TestHarness.query(TestHarness.java:337)
   [junit4]   2> 	at org.apache.solr.util.TestHarness.query(TestHarness.java:319)
   [junit4]   2> 	at org.apache.solr.SolrTestCaseJ4.assertQ(SolrTestCaseJ4.java:891)
   [junit4]   2> 	at org.apache.solr.SolrTestCaseJ4.assertQ(SolrTestCaseJ4.java:877)
   [junit4]   2> 	at org.apache.solr.handler.component.InfixSuggestersTest.lambda$null$0(InfixSuggestersTest.java:102)
   [junit4]   2> 	at org.apache.lucene.util.LuceneTestCase.expectThrows(LuceneTestCase.java:2696)
   [junit4]   2> 	at org.apache.solr.handler.component.InfixSuggestersTest.lambda$testReloadDuringBuild$1(InfixSuggestersTest.java:101)
   [junit4]   2> 	at java.util.concurrent.FutureTask.run(FutureTask.java:266)
   [junit4]   2> 	at org.apache.solr.common.util.ExecutorUtil$MDCAwareThreadPoolExecutor.lambda$execute$0(ExecutorUtil.java:209)
   [junit4]   2> 	at java.util.concurrent.ThreadPoolExecutor.runWorker(ThreadPoolExecutor.java:1149)
   [junit4]   2> 	at java.util.concurrent.ThreadPoolExecutor$Worker.run(ThreadPoolExecutor.java:624)
   [junit4]   2> 	at java.lang.Thread.run(Thread.java:748)
   [junit4]   2> Caused by: org.apache.lucene.store.AlreadyClosedException: this IndexWriter is closed
   [junit4]   2> 	at org.apache.lucene.index.IndexWriter.ensureOpen(IndexWriter.java:671)
   [junit4]   2> 	at org.apache.lucene.index.IndexWriter.ensureOpen(IndexWriter.java:685)
   [junit4]   2> 	at org.apache.lucene.index.IndexWriter.updateDocument(IndexWriter.java:1600)
   [junit4]   2> 	at org.apache.lucene.index.IndexWriter.addDocument(IndexWriter.java:1222)
   [junit4]   2> 	at org.apache.lucene.search.suggest.analyzing.AnalyzingInfixSuggester.add(AnalyzingInfixSuggester.java:396)
   [junit4]   2> 	at org.apache.lucene.search.suggest.analyzing.AnalyzingInfixSuggester.build(AnalyzingInfixSuggester.java:310)
   [junit4]   2> 	at org.apache.lucene.search.suggest.Lookup.build(Lookup.java:190)
   [junit4]   2> 	at org.apache.solr.spelling.suggest.SolrSuggester.build(SolrSuggester.java:181)
   [junit4]   2> 	... 16 more
   [junit4]   2> 
   [junit4]   2> 2139135 INFO  (AnalyzingInfixSuggesterTest-6212-thread-1-processing-x:collection1) [    x:collection1] o.a.s.c.S.Request [collection1]  webapp=null path=null params={qt=/suggest_analyzing_infix_long_dictionary&suggest.buildAll=true&wt=xml} status=500 QTime=307
   [junit4]   2> 2139135 ERROR (AnalyzingInfixSuggesterTest-6212-thread-1-processing-x:collection1) [    x:collection1] o.a.s.SolrTestCaseJ4 REQUEST FAILED: qt=/suggest_analyzing_infix_long_dictionary&suggest.buildAll=true&wt=xml:org.apache.solr.update.SolrCoreState$CoreIsClosedException: Suggester build has been interrupted by a core reload or shutdown.
   [junit4]   2> 	at org.apache.solr.spelling.suggest.SolrSuggester.build(SolrSuggester.java:183)
   [junit4]   2> 	at org.apache.solr.handler.component.SuggestComponent.prepare(SuggestComponent.java:185)
   [junit4]   2> 	at org.apache.solr.handler.component.SearchHandler.handleRequestBody(SearchHandler.java:272)
   [junit4]   2> 	at org.apache.solr.handler.RequestHandlerBase.handleRequest(RequestHandlerBase.java:199)
   [junit4]   2> 	at org.apache.solr.core.SolrCore.execute(SolrCore.java:2541)
   [junit4]   2> 	at org.apache.solr.util.TestHarness.query(TestHarness.java:337)
   [junit4]   2> 	at org.apache.solr.util.TestHarness.query(TestHarness.java:319)
   [junit4]   2> 	at org.apache.solr.SolrTestCaseJ4.assertQ(SolrTestCaseJ4.java:891)
   [junit4]   2> 	at org.apache.solr.SolrTestCaseJ4.assertQ(SolrTestCaseJ4.java:877)
   [junit4]   2> 	at org.apache.solr.handler.component.InfixSuggestersTest.lambda$null$0(InfixSuggestersTest.java:102)
   [junit4]   2> 	at org.apache.lucene.util.LuceneTestCase.expectThrows(LuceneTestCase.java:2696)
   [junit4]   2> 	at org.apache.solr.handler.component.InfixSuggestersTest.lambda$testReloadDuringBuild$1(InfixSuggestersTest.java:101)
   [junit4]   2> 	at java.util.concurrent.FutureTask.run(FutureTask.java:266)
   [junit4]   2> 	at org.apache.solr.common.util.ExecutorUtil$MDCAwareThreadPoolExecutor.lambda$execute$0(ExecutorUtil.java:209)
   [junit4]   2> 	at java.util.concurrent.ThreadPoolExecutor.runWorker(ThreadPoolExecutor.java:1149)
   [junit4]   2> 	at java.util.concurrent.ThreadPoolExecutor$Worker.run(ThreadPoolExecutor.java:624)
   [junit4]   2> 	at java.lang.Thread.run(Thread.java:748)
   [junit4]   2> Caused by: org.apache.lucene.store.AlreadyClosedException: this IndexWriter is closed
   [junit4]   2> 	at org.apache.lucene.index.IndexWriter.ensureOpen(IndexWriter.java:671)
   [junit4]   2> 	at org.apache.lucene.index.IndexWriter.ensureOpen(IndexWriter.java:685)
   [junit4]   2> 	at org.apache.lucene.index.IndexWriter.updateDocument(IndexWriter.java:1600)
   [junit4]   2> 	at org.apache.lucene.index.IndexWriter.addDocument(IndexWriter.java:1222)
   [junit4]   2> 	at org.apache.lucene.search.suggest.analyzing.AnalyzingInfixSuggester.add(AnalyzingInfixSuggester.java:396)
   [junit4]   2> 	at org.apache.lucene.search.suggest.analyzing.AnalyzingInfixSuggester.build(AnalyzingInfixSuggester.java:310)
   [junit4]   2> 	at org.apache.lucene.search.suggest.Lookup.build(Lookup.java:190)
   [junit4]   2> 	at org.apache.solr.spelling.suggest.SolrSuggester.build(SolrSuggester.java:181)
   [junit4]   2> 	... 16 more
   [junit4]   2> 
   [junit4]   2> 2139135 INFO  (TEST-InfixSuggestersTest.testReloadDuringBuild-seed#[DC08979674FE7D0B]) [    x:collection1] o.a.s.SolrTestCaseJ4 ###Ending testReloadDuringBuild
   [junit4]   2> 2139138 INFO  (TEST-InfixSuggestersTest.testTwoSuggestersBuildThenReload-seed#[DC08979674FE7D0B]) [    x:collection1] o.a.s.SolrTestCaseJ4 ###Starting testTwoSuggestersBuildThenReload
   [junit4]   2> 2139138 INFO  (TEST-InfixSuggestersTest.testTwoSuggestersBuildThenReload-seed#[DC08979674FE7D0B]) [    x:collection1] o.a.s.h.c.SuggestComponent SuggestComponent prepare with : qt=/suggest_analyzing_infix_short_dictionary&suggest=true&suggest.buildAll=true&wt=xml&indent=off
   [junit4]   2> 2139138 INFO  (TEST-InfixSuggestersTest.testTwoSuggestersBuildThenReload-seed#[DC08979674FE7D0B]) [    x:collection1] o.a.s.s.s.SolrSuggester SolrSuggester.build(shortRandomAnalyzingInfixSuggester)
   [junit4]   2> 2139142 INFO  (TEST-InfixSuggestersTest.testTwoSuggestersBuildThenReload-seed#[DC08979674FE7D0B]) [    x:collection1] o.a.s.s.s.RandomTestDictionaryFactory org.apache.solr.spelling.suggest.RandomTestDictionaryFactory$RandomTestDictionary.enabled.shortRandomAnalyzingInfixSuggester disabled after emitting 100 items.
   [junit4]   2> 2139178 INFO  (TEST-InfixSuggestersTest.testTwoSuggestersBuildThenReload-seed#[DC08979674FE7D0B]) [    x:collection1] o.a.s.h.c.SuggestComponent SuggestComponent process with : qt=/suggest_analyzing_infix_short_dictionary&suggest=true&suggest.buildAll=true&wt=xml&indent=off
   [junit4]   2> 2139178 INFO  (TEST-InfixSuggestersTest.testTwoSuggestersBuildThenReload-seed#[DC08979674FE7D0B]) [    x:collection1] o.a.s.c.S.Request [collection1]  webapp=null path=null params={qt=/suggest_analyzing_infix_short_dictionary&suggest.buildAll=true&wt=xml} status=0 QTime=40
   [junit4]   2> 2139179 ERROR (TEST-InfixSuggestersTest.testTwoSuggestersBuildThenReload-seed#[DC08979674FE7D0B]) [    x:collection1] o.a.s.c.CorePropertiesLocator Couldn't load core descriptor from /home/jenkins/workspace/Lucene-Solr-7.x-Linux/solr/core/src/test-files/solr/collection1/core.properties:java.nio.file.NoSuchFileException: /home/jenkins/workspace/Lucene-Solr-7.x-Linux/solr/core/src/test-files/solr/collection1/core.properties
   [junit4]   2> 2139179 INFO  (TEST-InfixSuggestersTest.testTwoSuggestersBuildThenReload-seed#[DC08979674FE7D0B]) [    x:collection1] o.a.s.c.SolrResourceLoader [null] Added 2 libs to classloader, from paths: [/home/jenkins/workspace/Lucene-Solr-7.x-Linux/solr/core/src/test-files/solr/collection1/lib, /home/jenkins/workspace/Lucene-Solr-7.x-Linux/solr/core/src/test-files/solr/collection1/lib/classes]
   [junit4]   2> 2139197 INFO  (TEST-InfixSuggestersTest.testTwoSuggestersBuildThenReload-seed#[DC08979674FE7D0B]) [    x:collection1] o.a.s.c.SolrConfig Using Lucene MatchVersion: 7.5.0
   [junit4]   2> 2139204 INFO  (TEST-InfixSuggestersTest.testTwoSuggestersBuildThenReload-seed#[DC08979674FE7D0B]) [    x:collection1] o.a.s.s.IndexSchema [collection1] Schema name=test
   [junit4]   2> 2139287 INFO  (TEST-InfixSuggestersTest.testTwoSuggestersBuildThenReload-seed#[DC08979674FE7D0B]) [    x:collection1] o.a.s.s.IndexSchema Loaded schema test/1.0 with uniqueid field id
   [junit4]   2> 2139292 INFO  (TEST-InfixSuggestersTest.testTwoSuggestersBuildThenReload-seed#[DC08979674FE7D0B]) [    x:collection1] o.a.s.c.CoreContainer Reloading SolrCore 'collection1' using configuration from instancedir /home/jenkins/workspace/Lucene-Solr-7.x-Linux/solr/core/src/test-files/solr/collection1
   [junit4]   2> 2139310 INFO  (TEST-InfixSuggestersTest.testTwoSuggestersBuildThenReload-seed#[DC08979674FE7D0B]) [    x:collection1] o.a.s.m.r.SolrJmxReporter JMX monitoring for 'solr.core.collection1' (registry 'solr.core.collection1') enabled at server: com.sun.jmx.mbeanserver.JmxMBeanServer@561c6429
   [junit4]   2> 2139310 INFO  (TEST-InfixSuggestersTest.testTwoSuggestersBuildThenReload-seed#[DC08979674FE7D0B]) [    x:collection1] o.a.s.c.SolrCore [[collection1] ] Opening new SolrCore at [/home/jenkins/workspace/Lucene-Solr-7.x-Linux/solr/core/src/test-files/solr/collection1], dataDir=[/home/jenkins/workspace/Lucene-Solr-7.x-Linux/solr/build/solr-core/test/J0/temp/solr.handler.component.InfixSuggestersTest_DC08979674FE7D0B-001/init-core-data-001/]
   [junit4]   2> 2139341 INFO  (TEST-InfixSuggestersTest.testTwoSuggestersBuildThenReload-seed#[DC08979674FE7D0B]) [    x:collection1] o.a.s.u.CommitTracker Hard AutoCommit: disabled
   [junit4]   2> 2139341 INFO  (TEST-InfixSuggestersTest.testTwoSuggestersBuildThenReload-seed#[DC08979674FE7D0B]) [    x:collection1] o.a.s.u.CommitTracker Soft AutoCommit: disabled
   [junit4]   2> 2139342 INFO  (TEST-InfixSuggestersTest.testTwoSuggestersBuildThenReload-seed#[DC08979674FE7D0B]) [    x:collection1] o.a.s.s.SolrIndexSearcher Opening [Searcher@5a946ff[collection1] main]
   [junit4]   2> 2139342 WARN  (TEST-InfixSuggestersTest.testTwoSuggestersBuildThenReload-seed#[DC08979674FE7D0B]) [    x:collection1] o.a.s.r.ManagedResourceStorage Cannot write to config directory /home/jenkins/workspace/Lucene-Solr-7.x-Linux/solr/core/src/test-files/solr/collection1/conf; switching to use InMemory storage instead.
   [junit4]   2> 2139343 INFO  (TEST-InfixSuggestersTest.testTwoSuggestersBuildThenReload-seed#[DC08979674FE7D0B]) [    x:collection1] o.a.s.h.c.SuggestComponent Initializing SuggestComponent
   [junit4]   2> 2139343 INFO  (TEST-InfixSuggestersTest.testTwoSuggestersBuildThenReload-seed#[DC08979674FE7D0B]) [    x:collection1] o.a.s.s.s.SolrSuggester init: {name=shortRandomAnalyzingInfixSuggester,lookupImpl=AnalyzingInfixLookupFactory,dictionaryImpl=RandomTestDictionaryFactory,randDictMaxItems=100,indexPath=short_random_analyzing_infix_suggester,suggestAnalyzerFieldType=text,buildOnCommit=false,buildOnStartup=false}
   [junit4]   2> 2139344 INFO  (TEST-InfixSuggestersTest.testTwoSuggestersBuildThenReload-seed#[DC08979674FE7D0B]) [    x:collection1] o.a.s.s.s.SolrSuggester Dictionary loaded with params: {name=shortRandomAnalyzingInfixSuggester,lookupImpl=AnalyzingInfixLookupFactory,dictionaryImpl=RandomTestDictionaryFactory,randDictMaxItems=100,indexPath=short_random_analyzing_infix_suggester,suggestAnalyzerFieldType=text,buildOnCommit=false,buildOnStartup=false}
   [junit4]   2> 2139344 INFO  (TEST-InfixSuggestersTest.testTwoSuggestersBuildThenReload-seed#[DC08979674FE7D0B]) [    x:collection1] o.a.s.h.c.SuggestComponent Initializing SuggestComponent
   [junit4]   2> 2139344 INFO  (TEST-InfixSuggestersTest.testTwoSuggestersBuildThenReload-seed#[DC08979674FE7D0B]) [    x:collection1] o.a.s.s.s.SolrSuggester init: {name=longRandomAnalyzingInfixSuggester,lookupImpl=AnalyzingInfixLookupFactory,dictionaryImpl=RandomTestDictionaryFactory,randDictMaxItems=100000,indexPath=long_random_analyzing_infix_suggester,suggestAnalyzerFieldType=text,buildOnCommit=false,buildOnStartup=false}
   [junit4]   2> 2139344 INFO  (TEST-InfixSuggestersTest.testTwoSuggestersBuildThenReload-seed#[DC08979674FE7D0B]) [    x:collection1] o.a.s.s.s.SolrSuggester Dictionary loaded with params: {name=longRandomAnalyzingInfixSuggester,lookupImpl=AnalyzingInfixLookupFactory,dictionaryImpl=RandomTestDictionaryFactory,randDictMaxItems=100000,indexPath=long_random_analyzing_infix_suggester,suggestAnalyzerFieldType=text,buildOnCommit=false,buildOnStartup=false}
   [junit4]   2> 2139344 INFO  (TEST-InfixSuggestersTest.testTwoSuggestersBuildThenReload-seed#[DC08979674FE7D0B]) [    x:collection1] o.a.s.h.c.SuggestComponent Initializing SuggestComponent
   [junit4]   2> 2139344 INFO  (TEST-InfixSuggestersTest.testTwoSuggestersBuildThenReload-seed#[DC08979674FE7D0B]) [    x:collection1] o.a.s.s.s.SolrSuggester init: {name=shortRandomBlendedInfixSuggester,lookupImpl=BlendedInfixLookupFactory,dictionaryImpl=RandomTestDictionaryFactory,randDictMaxItems=100,blenderType=position_linear,suggestAnalyzerFieldType=text,indexPath=short_random_blended_infix_suggester,highlight=true,buildOnStartup=false,buildOnCommit=false}
   [junit4]   2> 2139345 INFO  (TEST-InfixSuggestersTest.testTwoSuggestersBuildThenReload-seed#[DC08979674FE7D0B]) [    x:collection1] o.a.s.s.s.SolrSuggester Dictionary loaded with params: {name=shortRandomBlendedInfixSuggester,lookupImpl=BlendedInfixLookupFactory,dictionaryImpl=RandomTestDictionaryFactory,randDictMaxItems=100,blenderType=position_linear,suggestAnalyzerFieldType=text,indexPath=short_random_blended_infix_suggester,highlight=true,buildOnStartup=false,buildOnCommit=false}
   [junit4]   2> 2139345 INFO  (TEST-InfixSuggestersTest.testTwoSuggestersBuildThenReload-seed#[DC08979674FE7D0B]) [    x:collection1] o.a.s.h.ReplicationHandler Commits will be reserved for 10000ms.
   [junit4]   2> 2139346 INFO  (searcherExecutor-9814-thread-1-processing-x:collection1) [    x:collection1] o.a.s.c.SolrCore [collection1] Registered new searcher Searcher@5a946ff[collection1] main{ExitableDirectoryReader(UninvertingDirectoryReader())}
   [junit4]   2> 2139347 INFO  (TEST-InfixSuggestersTest.testTwoSuggestersBuildThenReload-seed#[DC08979674FE7D0B]) [    x:collection1] o.a.s.u.RandomMergePolicy RandomMergePolicy wrapping class org.apache.lucene.index.TieredMergePolicy: [TieredMergePolicy: maxMergeAtOnce=18, maxMergeAtOnceExplicit=47, maxMergedSegmentMB=69.2080078125, floorSegmentMB=0.8349609375, forceMergeDeletesPctAllowed=2.060969778176559, segmentsPerTier=25.0, maxCFSSegmentSizeMB=8.796093022207999E12, noCFSRatio=0.8945010746583205, reclaimDeletesWeight=2.6441323264008836
   [junit4]   2> 2139347 INFO  (TEST-InfixSuggestersTest.testTwoSuggestersBuildThenReload-seed#[DC08979674FE7D0B]) [    x:collection1] o.a.s.u.DefaultSolrCoreState New IndexWriter is ready to be used.
   [junit4]   2> 2139347 INFO  (TEST-InfixSuggestersTest.testTwoSuggestersBuildThenReload-seed#[DC08979674FE7D0B]) [    x:collection1] o.a.s.s.SolrIndexSearcher Opening [Searcher@300b0f42[collection1] main]
   [junit4]   2> 2139347 INFO  (TEST-InfixSuggestersTest.testTwoSuggestersBuildThenReload-seed#[DC08979674FE7D0B]) [    x:collection1] o.a.s.c.SolrCore [collection1]  CLOSING SolrCore org.apache.solr.core.SolrCore@3da24b78
   [junit4]   2> 2139347 INFO  (TEST-InfixSuggestersTest.testTwoSuggestersBuildThenReload-seed#[DC08979674FE7D0B]) [    x:collection1] o.a.s.m.SolrMetricManager Closing metric reporters for registry=solr.core.collection1, tag=3da24b78
   [junit4]   2> 2139347 INFO  (TEST-InfixSuggestersTest.testTwoSuggestersBuildThenReload-seed#[DC08979674FE7D0B]) [    x:collection1] o.a.s.m.r.SolrJmxReporter Closing reporter [org.apache.solr.metrics.reporters.SolrJmxReporter@65607774: rootName = null, domain = solr.core.collection1, service url = null, agent id = null] for registry solr.core.collection1 / com.codahale.metrics.MetricRegistry@3806f25d
   [junit4]   2> 2139348 INFO  (searcherExecutor-9814-thread-1-processing-x:collection1) [    x:collection1] o.a.s.c.SolrCore [collection1] Registered new searcher Searcher@300b0f42[collection1] main{ExitableDirectoryReader(UninvertingDirectoryReader())}
   [junit4]   2> 2139354 INFO  (TEST-InfixSuggestersTest.testTwoSuggestersBuildThenReload-seed#[DC08979674FE7D0B]) [    x:collection1] o.a.s.h.c.SuggestComponent SuggestComponent prepare with : qt=/suggest_blended_infix_short_dictionary&suggest.onlyMorePopular=true&indent=off&suggest.count=10&suggest=true&suggest.collate=true&suggest.buildAll=true&suggest.dictionary=shortRandomBlendedInfixSuggester&wt=xml
   [junit4]   2> 2139354 INFO  (TEST-InfixSuggestersTest.testTwoSuggestersBuildThenReload-seed#[DC08979674FE7D0B]) [    x:collection1] o.a.s.s.s.SolrSuggester SolrSuggester.build(shortRandomBlendedInfixSuggester)
   [junit4]   2> 2139372 INFO  (TEST-InfixSuggestersTest.testTwoSuggestersBuildThenReload-seed#[DC08979674FE7D0B]) [    x:collection1] o.a.s.s.s.RandomTestDictionaryFactory org.apache.solr.spelling.suggest.RandomTestDictionaryFactory$RandomTestDictionary.enabled.shortRandomBlendedInfixSuggester disabled after emitting 100 items.
   [junit4]   2> 2139422 INFO  (TEST-InfixSuggestersTest.testTwoSuggestersBuildThenReload-seed#[DC08979674FE7D0B]) [    x:collection1] o.a.s.h.c.SuggestComponent SuggestComponent process with : qt=/suggest_blended_infix_short_dictionary&suggest.onlyMorePopular=true&indent=off&suggest.count=10&suggest=true&suggest.collate=true&suggest.buildAll=true&suggest.dictionary=shortRandomBlendedInfixSuggester&wt=xml
   [junit4]   2> 2139422 INFO  (TEST-InfixSuggestersTest.testTwoSuggestersBuildThenReload-seed#[DC08979674FE7D0B]) [    x:collection1] o.a.s.c.S.Request [collection1]  webapp=null path=null params={qt=/suggest_blended_infix_short_dictionary&suggest.buildAll=true&wt=xml} status=0 QTime=68
   [junit4]   2> 2139423 ERROR (TEST-InfixSuggestersTest.testTwoSuggestersBuildThenReload-seed#[DC08979674FE7D0B]) [    x:collection1] o.a.s.c.CorePropertiesLocator Couldn't load core descriptor from /home/jenkins/workspace/Lucene-Solr-7.x-Linux/solr/core/src/test-files/solr/collection1/core.properties:java.nio.file.NoSuchFileException: /home/jenkins/workspace/Lucene-Solr-7.x-Linux/solr/core/src/test-files/solr/collection1/core.properties
   [junit4]   2> 2139423 INFO  (TEST-InfixSuggestersTest.testTwoSuggestersBuildThenReload-seed#[DC08979674FE7D0B]) [    x:collection1] o.a.s.c.SolrResourceLoader [null] Added 2 libs to classloader, from paths: [/home/jenkins/workspace/Lucene-Solr-7.x-Linux/solr/core/src/test-files/solr/collection1/lib, /home/jenkins/workspace/Lucene-Solr-7.x-Linux/solr/core/src/test-files/solr/collection1/lib/classes]
   [junit4]   2> 2139450 INFO  (TEST-InfixSuggestersTest.testTwoSuggestersBuildThenReload-seed#[DC08979674FE7D0B]) [    x:collection1] o.a.s.c.SolrConfig Using Lucene MatchVersion: 7.5.0
   [junit4]   2> 2139459 INFO  (TEST-InfixSuggestersTest.testTwoSuggestersBuildThenReload-seed#[DC08979674FE7D0B]) [    x:collection1] o.a.s.s.IndexSchema [collection1] Schema name=test
   [junit4]   2> 2139568 INFO  (TEST-InfixSuggestersTest.testTwoSuggestersBuildThenReload-seed#[DC08979674FE7D0B]) [    x:collection1] o.a.s.s.IndexSchema Loaded schema test/1.0 with uniqueid field id
   [junit4]   2> 2139572 INFO  (TEST-InfixSuggestersTest.testTwoSuggestersBuildThenReload-seed#[DC08979674FE7D0B]) [    x:collection1] o.a.s.c.CoreContainer Reloading SolrCore 'collection1' using configuration from instancedir /home/jenkins/workspace/Lucene-Solr-7.x-Linux/solr/core/src/test-files/solr/collection1
   [junit4]   2> 2139590 INFO  (TEST-InfixSuggestersTest.testTwoSuggestersBuildThenReload-seed#[DC08979674FE7D0B]) [    x:collection1] o.a.s.m.r.SolrJmxReporter JMX monitoring for 'solr.core.collection1' (registry 'solr.core.collection1') enabled at server: com.sun.jmx.mbeanserver.JmxMBeanServer@561c6429
   [junit4]   2> 2139590 INFO  (TEST-InfixSuggestersTest.testTwoSuggestersBuildThenReload-seed#[DC08979674FE7D0B]) [    x:collection1] o.a.s.c.SolrCore [[collection1] ] Opening new SolrCore at [/home/jenkins/workspace/Lucene-Solr-7.x-Linux/solr/core/src/test-files/solr/collection1], dataDir=[/home/jenkins/workspace/Lucene-Solr-7.x-Linux/solr/build/solr-core/test/J0/temp/solr.handler.component.InfixSuggestersTest_DC08979674FE7D0B-001/init-core-data-001/]
   [junit4]   2> 2139623 INFO  (TEST-InfixSuggestersTest.testTwoSuggestersBuildThenReload-seed#[DC08979674FE7D0B]) [    x:collection1] o.a.s.u.CommitTracker Hard AutoCommit: disabled
   [junit4]   2> 2139623 INFO  (TEST-InfixSuggestersTest.testTwoSuggestersBuildThenReload-seed#[DC08979674FE7D0B]) [    x:collection1] o.a.s.u.CommitTracker Soft AutoCommit: disabled
   [junit4]   2> 2139625 INFO  (TEST-InfixSuggestersTest.testTwoSuggestersBuildThenReload-seed#[DC08979674FE7D0B]) [    x:collection1] o.a.s.s.SolrIndexSearcher Opening [Searcher@5e390c2d[collection1] main]
   [junit4]   2> 2139626 WARN  (TEST-InfixSuggestersTest.testTwoSuggestersBuildThenReload-seed#[DC08979674FE7D0B]) [    x:collection1] o.a.s.r.ManagedResourceStorage Cannot write to config directory /home/jenkins/workspace/Lucene-Solr-7.x-Linux/solr/core/src/test-files/solr/collection1/conf; switching to use InMemory storage instead.
   [junit4]   2> 2139626 INFO  (TEST-InfixSuggestersTest.testTwoSuggestersBuildThenReload-seed#[DC08979674FE7D0B]) [    x:collection1] o.a.s.h.c.SuggestComponent Initializing SuggestComponent
   [junit4]   2> 2139626 INFO  (TEST-InfixSuggestersTest.testTwoSuggestersBuildThenReload-seed#[DC08979674FE7D0B]) [    x:collection1] o.a.s.s.s.SolrSuggester init: {name=shortRandomAnalyzingInfixSuggester,lookupImpl=AnalyzingInfixLookupFactory,dictionaryImpl=RandomTestDictionaryFactory,randDictMaxItems=100,indexPath=short_random_analyzing_infix_suggester,suggestAnalyzerFieldType=text,buildOnCommit=false,buildOnStartup=false}
   [junit4]   2> 2139627 INFO  (TEST-InfixSuggestersTest.testTwoSuggestersBuildThenReload-seed#[DC08979674FE7D0B]) [    x:collection1] o.a.s.s.s.SolrSuggester Dictionary loaded with params: {name=shortRandomAnalyzingInfixSuggester,lookupImpl=AnalyzingInfixLookupFactory,dictionaryImpl=RandomTestDictionaryFactory,randDictMaxItems=100,indexPath=short_random_analyzing_infix_suggester,suggestAnalyzerFieldType=text,buildOnCommit=false,buildOnStartup=false}
   [junit4]   2> 2139627 INFO  (TEST-InfixSuggestersTest.testTwoSuggestersBuildThenReload-seed#[DC08979674FE7D0B]) [    x:collection1] o.a.s.h.c.SuggestComponent Initializing SuggestComponent
   [junit4]   2> 2139627 INFO  (TEST-InfixSuggestersTest.testTwoSuggestersBuildThenReload-seed#[DC08979674FE7D0B]) [    x:collection1] o.a.s.s.s.SolrSuggester init: {name=longRandomAnalyzingInfixSuggester,lookupImpl=AnalyzingInfixLookupFactory,dictionaryImpl=RandomTestDictionaryFactory,randDictMaxItems=100000,indexPath=long_random_analyzing_infix_suggester,suggestAnalyzerFieldType=text,buildOnCommit=false,buildOnStartup=false}
   [junit4]   2> 2139628 INFO  (TEST-InfixSuggestersTest.testTwoSuggestersBuildThenReload-seed#[DC08979674FE7D0B]) [    x:collection1] o.a.s.s.s.SolrSuggester Dictionary loaded with params: {name=longRandomAnalyzingInfixSuggester,lookupImpl=AnalyzingInfixLookupFactory,dictionaryImpl=RandomTestDictionaryFactory,randDictMaxItems=100000,indexPath=long_random_analyzing_infix_suggester,suggestAnalyzerFieldType=text,buildOnCommit=false,buildOnStartup=false}
   [junit4]   2> 2139628 INFO  (TEST-InfixSuggestersTest.testTwoSuggestersBuildThenReload-seed#[DC08979674FE7D0B]) [    x:collection1] o.a.s.h.c.Sugge

[...truncated too long message...]

0 INFO  (TEST-InfixSuggestersTest.testAnalyzingInfixSuggesterBuildThenReload-seed#[DC08979674FE7D0B]) [    x:collection1] o.a.s.m.SolrMetricManager Closing metric reporters for registry=solr.core.collection1, tag=7e87709c
   [junit4]   2> 20390 INFO  (TEST-InfixSuggestersTest.testAnalyzingInfixSuggesterBuildThenReload-seed#[DC08979674FE7D0B]) [    x:collection1] o.a.s.m.r.SolrJmxReporter Closing reporter [org.apache.solr.metrics.reporters.SolrJmxReporter@250c388c: rootName = null, domain = solr.core.collection1, service url = null, agent id = null] for registry solr.core.collection1 / com.codahale.metrics.MetricRegistry@17b9d2d9
   [junit4]   2> 20391 INFO  (searcherExecutor-61-thread-1-processing-x:collection1) [    x:collection1] o.a.s.c.SolrCore [collection1] Registered new searcher Searcher@69214a8f[collection1] main{ExitableDirectoryReader(UninvertingDirectoryReader())}
   [junit4]   2> 20435 INFO  (TEST-InfixSuggestersTest.testAnalyzingInfixSuggesterBuildThenReload-seed#[DC08979674FE7D0B]) [    x:collection1] o.a.s.SolrTestCaseJ4 ###Ending testAnalyzingInfixSuggesterBuildThenReload
   [junit4] OK      0.70s J0 | InfixSuggestersTest.testAnalyzingInfixSuggesterBuildThenReload
   [junit4]   2> 20435 INFO  (SUITE-InfixSuggestersTest-seed#[DC08979674FE7D0B]-worker) [    x:collection1] o.a.s.SolrTestCaseJ4 ###deleteCore
   [junit4]   2> 20435 INFO  (SUITE-InfixSuggestersTest-seed#[DC08979674FE7D0B]-worker) [    x:collection1] o.a.s.c.CoreContainer Shutting down CoreContainer instance=941881520
   [junit4]   2> 20435 INFO  (SUITE-InfixSuggestersTest-seed#[DC08979674FE7D0B]-worker) [    x:collection1] o.a.s.m.SolrMetricManager Closing metric reporters for registry=solr.node, tag=null
   [junit4]   2> 20436 INFO  (SUITE-InfixSuggestersTest-seed#[DC08979674FE7D0B]-worker) [    x:collection1] o.a.s.m.r.SolrJmxReporter Closing reporter [org.apache.solr.metrics.reporters.SolrJmxReporter@31eb57c8: rootName = null, domain = solr.node, service url = null, agent id = null] for registry solr.node / com.codahale.metrics.MetricRegistry@70cdb3df
   [junit4]   2> 20456 INFO  (SUITE-InfixSuggestersTest-seed#[DC08979674FE7D0B]-worker) [    x:collection1] o.a.s.m.SolrMetricManager Closing metric reporters for registry=solr.jvm, tag=null
   [junit4]   2> 20456 INFO  (SUITE-InfixSuggestersTest-seed#[DC08979674FE7D0B]-worker) [    x:collection1] o.a.s.m.r.SolrJmxReporter Closing reporter [org.apache.solr.metrics.reporters.SolrJmxReporter@6f9ef288: rootName = null, domain = solr.jvm, service url = null, agent id = null] for registry solr.jvm / com.codahale.metrics.MetricRegistry@41353bd0
   [junit4]   2> 20456 INFO  (SUITE-InfixSuggestersTest-seed#[DC08979674FE7D0B]-worker) [    x:collection1] o.a.s.m.SolrMetricManager Closing metric reporters for registry=solr.jetty, tag=null
   [junit4]   2> 20456 INFO  (SUITE-InfixSuggestersTest-seed#[DC08979674FE7D0B]-worker) [    x:collection1] o.a.s.m.r.SolrJmxReporter Closing reporter [org.apache.solr.metrics.reporters.SolrJmxReporter@7c3749d0: rootName = null, domain = solr.jetty, service url = null, agent id = null] for registry solr.jetty / com.codahale.metrics.MetricRegistry@188e38d7
   [junit4]   2> 20470 INFO  (coreCloseExecutor-65-thread-1-processing-x:collection1) [    x:collection1] o.a.s.c.SolrCore [collection1]  CLOSING SolrCore org.apache.solr.core.SolrCore@26f46408
   [junit4]   2> 20470 INFO  (coreCloseExecutor-65-thread-1-processing-x:collection1) [    x:collection1] o.a.s.m.SolrMetricManager Closing metric reporters for registry=solr.core.collection1, tag=26f46408
   [junit4]   2> 20472 INFO  (coreCloseExecutor-65-thread-1-processing-x:collection1) [    x:collection1] o.a.s.m.r.SolrJmxReporter Closing reporter [org.apache.solr.metrics.reporters.SolrJmxReporter@74088c28: rootName = null, domain = solr.core.collection1, service url = null, agent id = null] for registry solr.core.collection1 / com.codahale.metrics.MetricRegistry@17b9d2d9
   [junit4]   2> NOTE: leaving temporary files on disk at: /home/jenkins/workspace/Lucene-Solr-7.x-Linux/solr/build/solr-core/test/J0/temp/solr.handler.component.InfixSuggestersTest_DC08979674FE7D0B-001
   [junit4]   2> NOTE: test params are: codec=Asserting(Lucene70), sim=RandomSimilarity(queryNorm=true): {}, locale=ar-DZ, timezone=Australia/Eucla
   [junit4]   2> NOTE: Linux 4.15.0-24-generic amd64/Oracle Corporation 1.8.0_172 (64-bit)/cpus=8,threads=1,free=215349216,total=536870912
   [junit4]   2> NOTE: All tests run in this JVM: [InfixSuggestersTest]
   [junit4] Completed [1/5 (1!)] on J0 in 19.54s, 7 tests, 1 error <<< FAILURES!
   [junit4] 
   [junit4] Suite: org.apache.solr.handler.component.InfixSuggestersTest
   [junit4] OK      2.66s J2 | InfixSuggestersTest.testBuildThen2xReload
   [junit4] OK      2.11s J2 | InfixSuggestersTest.testShutdownDuringBuild
   [junit4] OK      1.34s J2 | InfixSuggestersTest.testReloadDuringBuild
   [junit4] OK      1.84s J2 | InfixSuggestersTest.testTwoSuggestersBuildThenReload
   [junit4] OK      3.18s J2 | InfixSuggestersTest.test2xBuildReload
   [junit4] OK      0.83s J2 | InfixSuggestersTest.testBlendedInfixSuggesterBuildThenReload
   [junit4] OK      0.56s J2 | InfixSuggestersTest.testAnalyzingInfixSuggesterBuildThenReload
   [junit4] Completed [2/5 (1!)] on J2 in 20.41s, 7 tests
   [junit4] 
   [junit4] Duplicate suite name used with XML reports: org.apache.solr.handler.component.InfixSuggestersTest. This may confuse tools that process XML reports. Set 'ignoreDuplicateSuites' to true to skip this message.
   [junit4] Suite: org.apache.solr.handler.component.InfixSuggestersTest
   [junit4] OK      2.61s J1 | InfixSuggestersTest.testBuildThen2xReload
   [junit4] OK      2.05s J1 | InfixSuggestersTest.testShutdownDuringBuild
   [junit4] OK      1.62s J1 | InfixSuggestersTest.testReloadDuringBuild
   [junit4] OK      1.73s J1 | InfixSuggestersTest.testTwoSuggestersBuildThenReload
   [junit4] OK      2.78s J1 | InfixSuggestersTest.test2xBuildReload
   [junit4] OK      1.04s J1 | InfixSuggestersTest.testBlendedInfixSuggesterBuildThenReload
   [junit4] OK      0.81s J1 | InfixSuggestersTest.testAnalyzingInfixSuggesterBuildThenReload
   [junit4] Completed [3/5 (1!)] on J1 in 20.69s, 7 tests
   [junit4] 
   [junit4] Suite: org.apache.solr.handler.component.InfixSuggestersTest
   [junit4] OK      1.07s J0 | InfixSuggestersTest.testBuildThen2xReload
   [junit4] OK      1.20s J0 | InfixSuggestersTest.testShutdownDuringBuild
   [junit4] OK      0.75s J0 | InfixSuggestersTest.testReloadDuringBuild
   [junit4] OK      0.82s J0 | InfixSuggestersTest.testTwoSuggestersBuildThenReload
   [junit4] OK      0.80s J0 | InfixSuggestersTest.test2xBuildReload
   [junit4] OK      1.01s J0 | InfixSuggestersTest.testBlendedInfixSuggesterBuildThenReload
   [junit4] OK      0.33s J0 | InfixSuggestersTest.testAnalyzingInfixSuggesterBuildThenReload
   [junit4] Completed [4/5 (1!)] on J0 in 7.34s, 7 tests
   [junit4] 
   [junit4] Suite: org.apache.solr.handler.component.InfixSuggestersTest
   [junit4] OK      0.86s J2 | InfixSuggestersTest.testBuildThen2xReload
   [junit4] OK      1.35s J2 | InfixSuggestersTest.testShutdownDuringBuild
   [junit4] OK      0.90s J2 | InfixSuggestersTest.testReloadDuringBuild
   [junit4] OK      0.79s J2 | InfixSuggestersTest.testTwoSuggestersBuildThenReload
   [junit4] OK      1.37s J2 | InfixSuggestersTest.test2xBuildReload
   [junit4] OK      0.38s J2 | InfixSuggestersTest.testBlendedInfixSuggesterBuildThenReload
   [junit4] OK      0.22s J2 | InfixSuggestersTest.testAnalyzingInfixSuggesterBuildThenReload
   [junit4] Completed [5/5 (1!)] on J2 in 6.96s, 7 tests
   [junit4] 
   [junit4] 
   [junit4] Tests with failures [seed: DC08979674FE7D0B]:
   [junit4]   - org.apache.solr.handler.component.InfixSuggestersTest.testShutdownDuringBuild
   [junit4] 
   [junit4] 
   [junit4] JVM J0:     0.67 ..    28.86 =    28.19s
   [junit4] JVM J1:     0.52 ..    22.44 =    21.92s
   [junit4] JVM J2:     0.69 ..    29.41 =    28.72s
   [junit4] Execution time total: 29 seconds
   [junit4] Tests summary: 5 suites, 35 tests, 1 error

BUILD FAILED
/home/jenkins/workspace/Lucene-Solr-7.x-Linux/lucene/common-build.xml:1568: The following error occurred while executing this line:
/home/jenkins/workspace/Lucene-Solr-7.x-Linux/lucene/common-build.xml:1092: There were test failures: 5 suites, 35 tests, 1 error [seed: DC08979674FE7D0B]

Total time: 31 seconds

[repro] Setting last failure code to 256

[repro] Failures:
[repro]   1/5 failed: org.apache.solr.handler.component.InfixSuggestersTest
[repro] Exiting with code 256
+ mv lucene/build lucene/build.repro
+ mv solr/build solr/build.repro
+ mv lucene/build.orig lucene/build
+ mv solr/build.orig solr/build
Archiving artifacts
Setting ANT_1_8_2_HOME=/var/lib/jenkins/tools/hudson.tasks.Ant_AntInstallation/ANT_1.8.2
[WARNINGS] Parsing warnings in console log with parser Java Compiler (javac)
Setting ANT_1_8_2_HOME=/var/lib/jenkins/tools/hudson.tasks.Ant_AntInstallation/ANT_1.8.2
Setting ANT_1_8_2_HOME=/var/lib/jenkins/tools/hudson.tasks.Ant_AntInstallation/ANT_1.8.2
<Git Blamer> Using GitBlamer to create author and commit information for all warnings.
<Git Blamer> GIT_COMMIT=30eca8a87bf54330f87abf0eed197dcc10fb8409, workspace=/var/lib/jenkins/workspace/Lucene-Solr-7.x-Linux
[WARNINGS] Computing warning deltas based on reference build #2328
Recording test results
Setting ANT_1_8_2_HOME=/var/lib/jenkins/tools/hudson.tasks.Ant_AntInstallation/ANT_1.8.2
Build step 'Publish JUnit test result report' changed build result to UNSTABLE
Email was triggered for: Unstable (Test Failures)
Sending email for trigger: Unstable (Test Failures)
Setting ANT_1_8_2_HOME=/var/lib/jenkins/tools/hudson.tasks.Ant_AntInstallation/ANT_1.8.2
Setting ANT_1_8_2_HOME=/var/lib/jenkins/tools/hudson.tasks.Ant_AntInstallation/ANT_1.8.2
Setting ANT_1_8_2_HOME=/var/lib/jenkins/tools/hudson.tasks.Ant_AntInstallation/ANT_1.8.2
Setting ANT_1_8_2_HOME=/var/lib/jenkins/tools/hudson.tasks.Ant_AntInstallation/ANT_1.8.2

Mime
View raw message