lucene-dev mailing list archives

Site index · List index
Message view « Date » · « Thread »
Top « Date » · « Thread »
From Apache Jenkins Server <jenk...@builds.apache.org>
Subject [JENKINS] Solr-reference-guide-7.4 - Build # 27 - Still Failing
Date Thu, 05 Jul 2018 16:31:14 GMT
Build: https://builds.apache.org/job/Solr-reference-guide-7.4/27/

Log: 
Started by timer
[EnvInject] - Loading node environment variables.
Building remotely on websites1 (git-websites svn-websites) in workspace /home/jenkins/jenkins-slave/workspace/Solr-reference-guide-7.4
 > git rev-parse --is-inside-work-tree # timeout=10
Fetching changes from the remote Git repository
 > git config remote.origin.url git://git.apache.org/lucene-solr.git # timeout=10
Cleaning workspace
 > git rev-parse --verify HEAD # timeout=10
Resetting working tree
 > git reset --hard # timeout=10
 > git clean -fdx # timeout=10
Fetching upstream changes from git://git.apache.org/lucene-solr.git
 > git --version # timeout=10
 > git fetch --tags --progress git://git.apache.org/lucene-solr.git +refs/heads/*:refs/remotes/origin/*
ERROR: Error fetching remote repo 'origin'
hudson.plugins.git.GitException: Failed to fetch from git://git.apache.org/lucene-solr.git
	at hudson.plugins.git.GitSCM.fetchFrom(GitSCM.java:888)
	at hudson.plugins.git.GitSCM.retrieveChanges(GitSCM.java:1155)
	at hudson.plugins.git.GitSCM.checkout(GitSCM.java:1186)
	at hudson.scm.SCM.checkout(SCM.java:504)
	at hudson.model.AbstractProject.checkout(AbstractProject.java:1208)
	at hudson.model.AbstractBuild$AbstractBuildExecution.defaultCheckout(AbstractBuild.java:574)
	at jenkins.scm.SCMCheckoutStrategy.checkout(SCMCheckoutStrategy.java:86)
	at hudson.model.AbstractBuild$AbstractBuildExecution.run(AbstractBuild.java:499)
	at hudson.model.Run.execute(Run.java:1794)
	at hudson.model.FreeStyleBuild.run(FreeStyleBuild.java:43)
	at hudson.model.ResourceController.execute(ResourceController.java:97)
	at hudson.model.Executor.run(Executor.java:429)
Caused by: hudson.plugins.git.GitException: Command "git fetch --tags --progress git://git.apache.org/lucene-solr.git
+refs/heads/*:refs/remotes/origin/*" returned status code 128:
stdout: 
stderr: fatal: unable to connect to git.apache.org:
git.apache.org[0: 54.84.58.65]: errno=Connection refused


	at org.jenkinsci.plugins.gitclient.CliGitAPIImpl.launchCommandIn(CliGitAPIImpl.java:2002)
	at org.jenkinsci.plugins.gitclient.CliGitAPIImpl.launchCommandWithCredentials(CliGitAPIImpl.java:1721)
	at org.jenkinsci.plugins.gitclient.CliGitAPIImpl.access$300(CliGitAPIImpl.java:72)
	at org.jenkinsci.plugins.gitclient.CliGitAPIImpl$1.execute(CliGitAPIImpl.java:405)
	at org.jenkinsci.plugins.gitclient.RemoteGitImpl$CommandInvocationHandler$1.call(RemoteGitImpl.java:153)
	at org.jenkinsci.plugins.gitclient.RemoteGitImpl$CommandInvocationHandler$1.call(RemoteGitImpl.java:146)
	at hudson.remoting.UserRequest.perform(UserRequest.java:207)
	at hudson.remoting.UserRequest.perform(UserRequest.java:53)
	at hudson.remoting.Request$2.run(Request.java:358)
	at hudson.remoting.InterceptingExecutorService$1.call(InterceptingExecutorService.java:72)
	at java.util.concurrent.FutureTask.run(FutureTask.java:266)
	at java.util.concurrent.ThreadPoolExecutor.runWorker(ThreadPoolExecutor.java:1149)
	at java.util.concurrent.ThreadPoolExecutor$Worker.run(ThreadPoolExecutor.java:624)
	at hudson.remoting.Engine$1$1.run(Engine.java:98)
	at java.lang.Thread.run(Thread.java:748)
	Suppressed: hudson.remoting.Channel$CallSiteStackTrace: Remote call to JNLP4-connect connection
from 37.48.69.226/37.48.69.226:40566
		at hudson.remoting.Channel.attachCallSiteStackTrace(Channel.java:1741)
		at hudson.remoting.UserResponse.retrieve(UserRequest.java:389)
		at hudson.remoting.Channel.call(Channel.java:955)
		at org.jenkinsci.plugins.gitclient.RemoteGitImpl$CommandInvocationHandler.execute(RemoteGitImpl.java:146)
		at sun.reflect.GeneratedMethodAccessor815.invoke(Unknown Source)
		at sun.reflect.DelegatingMethodAccessorImpl.invoke(DelegatingMethodAccessorImpl.java:43)
		at java.lang.reflect.Method.invoke(Method.java:498)
		at org.jenkinsci.plugins.gitclient.RemoteGitImpl$CommandInvocationHandler.invoke(RemoteGitImpl.java:132)
		at com.sun.proxy.$Proxy113.execute(Unknown Source)
		at hudson.plugins.git.GitSCM.fetchFrom(GitSCM.java:886)
		at hudson.plugins.git.GitSCM.retrieveChanges(GitSCM.java:1155)
		at hudson.plugins.git.GitSCM.checkout(GitSCM.java:1186)
		at hudson.scm.SCM.checkout(SCM.java:504)
		at hudson.model.AbstractProject.checkout(AbstractProject.java:1208)
		at hudson.model.AbstractBuild$AbstractBuildExecution.defaultCheckout(AbstractBuild.java:574)
		at jenkins.scm.SCMCheckoutStrategy.checkout(SCMCheckoutStrategy.java:86)
		at hudson.model.AbstractBuild$AbstractBuildExecution.run(AbstractBuild.java:499)
		at hudson.model.Run.execute(Run.java:1794)
		at hudson.model.FreeStyleBuild.run(FreeStyleBuild.java:43)
		at hudson.model.ResourceController.execute(ResourceController.java:97)
		at hudson.model.Executor.run(Executor.java:429)
ERROR: Error fetching remote repo 'origin'
Retrying after 10 seconds
 > git rev-parse --is-inside-work-tree # timeout=10
Fetching changes from the remote Git repository
 > git config remote.origin.url git://git.apache.org/lucene-solr.git # timeout=10
Cleaning workspace
 > git rev-parse --verify HEAD # timeout=10
Resetting working tree
 > git reset --hard # timeout=10
 > git clean -fdx # timeout=10
Fetching upstream changes from git://git.apache.org/lucene-solr.git
 > git --version # timeout=10
 > git fetch --tags --progress git://git.apache.org/lucene-solr.git +refs/heads/*:refs/remotes/origin/*
 > git rev-parse refs/remotes/origin/branch_7_4^{commit} # timeout=10
 > git rev-parse refs/remotes/origin/origin/branch_7_4^{commit} # timeout=10
Checking out Revision c4f3c27998b7ae5f3247e81ea1b0a940cc3e834f (refs/remotes/origin/branch_7_4)
 > git config core.sparsecheckout # timeout=10
 > git checkout -f c4f3c27998b7ae5f3247e81ea1b0a940cc3e834f
Commit message: "LUCENE-8384: Fix missing advance DVGen in PendingSoftDeletes"
 > git rev-list --no-walk ebc1b17c2188dfe4f2f13730f536bc968b6c3689 # timeout=10
No emails were triggered.
[Solr-reference-guide-7.4] $ /bin/bash -xe /tmp/jenkins3017724173317053786.sh
+ set -x
+ set -e
+ RVM_PATH=/home/jenkins/.rvm
+ RUBY_VERSION=ruby-2.3.3
+ GEMSET=solr-refguide-gemset
+ curl -sSL https://get.rvm.io
+ bash -s -- --ignore-dotfiles stable
Turning on ignore dotfiles mode.
Downloading https://github.com/rvm/rvm/archive/1.29.4.tar.gz
Downloading https://github.com/rvm/rvm/releases/download/1.29.4/1.29.4.tar.gz.asc
gpg: Signature made Sun 01 Jul 2018 07:41:26 PM UTC using RSA key ID BF04FF17
gpg: Good signature from "Michal Papis (RVM signing) <mpapis@gmail.com>"
gpg:                 aka "Michal Papis <michal.papis@toptal.com>"
gpg:                 aka "[jpeg image of size 5015]"
gpg: WARNING: This key is not certified with a trusted signature!
gpg:          There is no indication that the signature belongs to the owner.
Primary key fingerprint: 409B 6B17 96C2 7546 2A17  0311 3804 BB82 D39D C0E3
     Subkey fingerprint: 62C9 E5F4 DA30 0D94 AC36  166B E206 C29F BF04 FF17
GPG verified '/home/jenkins/shared/.rvm/archives/rvm-1.29.4.tgz'
Upgrading the RVM installation in /home/jenkins/shared/.rvm/
Upgrade of RVM in /home/jenkins/shared/.rvm/ is complete.
  * It looks like some old stuff is laying around RVM, you can cleanup with: <code>rvm
cleanup all</code>

  * No new notes to display.

+ set +x
Running 'source /home/jenkins/.rvm/scripts/rvm'
Running 'rvm autolibs disable'
Running 'rvm install ruby-2.3.3'
Already installed ruby-2.3.3.
To reinstall use:

    rvm reinstall ruby-2.3.3

Running 'rvm gemset create solr-refguide-gemset'
ruby-2.3.3 - #gemset created /home/jenkins/shared/.rvm/gems/ruby-2.3.3@solr-refguide-gemset
ruby-2.3.3 - #generating solr-refguide-gemset wrappers|/-\|/-\|.-\|/-\|/-.|/-\|/-\|.-\|/-\|/-.|/-\|/-\|.-\|/-\|/-.|/-\|/-\.
Running 'rvm ruby-2.3.3@solr-refguide-gemset'
Using /home/jenkins/shared/.rvm/gems/ruby-2.3.3 with gemset solr-refguide-gemset
Running 'gem install --force --version 3.5.0 jekyll'
Successfully installed jekyll-3.5.0
Parsing documentation for jekyll-3.5.0
Done installing documentation for jekyll after 1 seconds
1 gem installed
Running 'gem install --force --version 2.1.0 jekyll-asciidoc'
Successfully installed jekyll-asciidoc-2.1.0
Parsing documentation for jekyll-asciidoc-2.1.0
Done installing documentation for jekyll-asciidoc after 0 seconds
1 gem installed
Running 'gem install --force --version 1.1.2 pygments.rb'
Successfully installed pygments.rb-1.1.2
Parsing documentation for pygments.rb-1.1.2
Done installing documentation for pygments.rb after 0 seconds
1 gem installed
+ ant clean build-site build-pdf
Buildfile: /home/jenkins/jenkins-slave/workspace/Solr-reference-guide-7.4/solr/solr-ref-guide/build.xml

clean:

build-init:
    [mkdir] Created dir: /home/jenkins/jenkins-slave/workspace/Solr-reference-guide-7.4/solr/build/solr-ref-guide/content
     [echo] Copying all non template files from src ...
     [copy] Copying 400 files to /home/jenkins/jenkins-slave/workspace/Solr-reference-guide-7.4/solr/build/solr-ref-guide/content
     [echo] Copy (w/prop replacement) any template files from src...
     [copy] Copying 1 file to /home/jenkins/jenkins-slave/workspace/Solr-reference-guide-7.4/solr/build/solr-ref-guide/content

ivy-availability-check:
[loadresource] Do not set property disallowed.ivy.jars.list as its length is 0.

-ivy-fail-disallowed-ivy-version:

ivy-fail:

ivy-configure:
[ivy:configure] :: Apache Ivy 2.4.0 - 20141213170938 :: http://ant.apache.org/ivy/ ::
[ivy:configure] :: loading settings :: file = /home/jenkins/jenkins-slave/workspace/Solr-reference-guide-7.4/lucene/top-level-ivy-settings.xml

resolve:

build-tools-jar:
    [mkdir] Created dir: /home/jenkins/jenkins-slave/workspace/Solr-reference-guide-7.4/solr/build/solr-ref-guide/classes
    [javac] Compiling 4 source files to /home/jenkins/jenkins-slave/workspace/Solr-reference-guide-7.4/solr/build/solr-ref-guide/classes
     [copy] Copying 1 file to /home/jenkins/jenkins-slave/workspace/Solr-reference-guide-7.4/solr/build/solr-ref-guide/classes
      [jar] Building jar: /home/jenkins/jenkins-slave/workspace/Solr-reference-guide-7.4/solr/build/solr-ref-guide/solr-ref-guide-tools.jar

build-nav-data-files:
     [java] Building up tree of all known pages
     [java] Creating /home/jenkins/jenkins-slave/workspace/Solr-reference-guide-7.4/solr/build/solr-ref-guide/content/_data/pdf-main-body.adoc
     [java] Creating /home/jenkins/jenkins-slave/workspace/Solr-reference-guide-7.4/solr/build/solr-ref-guide/content/_data/scrollnav.json
     [java] Creating /home/jenkins/jenkins-slave/workspace/Solr-reference-guide-7.4/solr/build/solr-ref-guide/content/_data/sidebar.json

-build-site:
     [echo] Running Jekyll...
     [exec] Configuration file: /home/jenkins/jenkins-slave/workspace/Solr-reference-guide-7.4/solr/build/solr-ref-guide/content/_config.yml
     [exec]             Source: /home/jenkins/jenkins-slave/workspace/Solr-reference-guide-7.4/solr/build/solr-ref-guide/content
     [exec]        Destination: ../html-site
     [exec]  Incremental build: disabled. Enable with --incremental       Deprecation:
The 'gems' configuration option has been renamed to 'plugins'. Please update your config file
accordingly.
     [exec] 
     [exec]       Generating... 
     [exec] asciidoctor: WARNING: json-facet-api.adoc: line 46: invalid empty role detected
in style attribute
     [exec] asciidoctor: WARNING: json-facet-api.adoc: line 46: invalid empty role detected
in style attribute
     [exec] asciidoctor: WARNING: json-facet-api.adoc: line 46: invalid empty role detected
in style attribute
     [exec]                     done in 14.172 seconds.
     [exec]  Auto-regeneration: disabled. Use --watch to enable.

build-site:
     [java] Relative link points at id that doesn't exist in dest: the-standard-query-parser.html#differences-between-lucene-s-classic-query-parser-and-solr-s-standard-query-parser
     [java]  ... source: file:/home/jenkins/jenkins-slave/workspace/Solr-reference-guide-7.4/solr/build/solr-ref-guide/html-site/common-query-parameters.html
     [java] Relative link points at id that doesn't exist in dest: setting-up-an-external-zookeeper-ensemble.html#updating-solr-s-include-files
     [java]  ... source: file:/home/jenkins/jenkins-slave/workspace/Solr-reference-guide-7.4/solr/build/solr-ref-guide/html-site/solr-tutorial.html
     [java] Relative link points at id that doesn't exist in dest: setting-up-an-external-zookeeper-ensemble.html#updating-solr-s-include-files
     [java]  ... source: file:/home/jenkins/jenkins-slave/workspace/Solr-reference-guide-7.4/solr/build/solr-ref-guide/html-site/kerberos-authentication-plugin.html
     [java] Relative link points at id that doesn't exist in dest: setting-up-an-external-zookeeper-ensemble.html#updating-solr-s-include-files
     [java]  ... source: file:/home/jenkins/jenkins-slave/workspace/Solr-reference-guide-7.4/solr/build/solr-ref-guide/html-site/solr-control-script-reference.html
     [java] Relative link points at id that doesn't exist in dest: setting-up-an-external-zookeeper-ensemble.html#updating-solr-s-include-files
     [java]  ... source: file:/home/jenkins/jenkins-slave/workspace/Solr-reference-guide-7.4/solr/build/solr-ref-guide/html-site/solr-control-script-reference.html
     [java] Relative link points at id that doesn't exist in dest: metrics-reporting.html#the-metrics-reporters-element
     [java]  ... source: file:/home/jenkins/jenkins-slave/workspace/Solr-reference-guide-7.4/solr/build/solr-ref-guide/html-site/major-changes-in-solr-7.html
     [java] Relative link points at id that doesn't exist in dest: setting-up-an-external-zookeeper-ensemble.html#updating-solr-s-include-files
     [java]  ... source: file:/home/jenkins/jenkins-slave/workspace/Solr-reference-guide-7.4/solr/build/solr-ref-guide/html-site/using-zookeeper-to-manage-configuration-files.html
     [java] Relative link points at id that doesn't exist in dest: setting-up-an-external-zookeeper-ensemble.html#updating-solr-s-include-files
     [java]  ... source: file:/home/jenkins/jenkins-slave/workspace/Solr-reference-guide-7.4/solr/build/solr-ref-guide/html-site/enabling-ssl.html
     [java] Relative link points at id that doesn't exist in dest: setting-up-an-external-zookeeper-ensemble.html#updating-solr-s-include-files
     [java]  ... source: file:/home/jenkins/jenkins-slave/workspace/Solr-reference-guide-7.4/solr/build/solr-ref-guide/html-site/basic-authentication-plugin.html
     [java] Processed 2228 links (1554 relative) to 2994 anchors in 230 files
     [java] Total of 9 problems found

BUILD FAILED
/home/jenkins/jenkins-slave/workspace/Solr-reference-guide-7.4/solr/solr-ref-guide/build.xml:289:
Java returned: 255

Total time: 23 seconds
Build step 'Execute shell' marked build as failure
Archiving artifacts
Publishing Javadoc
Email was triggered for: Failure - Any
Sending email for trigger: Failure - Any

Mime
View raw message