lucene-dev mailing list archives

Site index · List index
Message view « Date » · « Thread »
Top « Date » · « Thread »
From Policeman Jenkins Server <jenk...@thetaphi.de>
Subject [JENKINS] Lucene-Solr-7.x-Linux (32bit/jdk1.8.0_172) - Build # 2322 - Still unstable!
Date Sun, 15 Jul 2018 07:32:18 GMT
Build: https://jenkins.thetaphi.de/job/Lucene-Solr-7.x-Linux/2322/
Java: 32bit/jdk1.8.0_172 -client -XX:+UseConcMarkSweepGC

4 tests failed.
FAILED:  org.apache.lucene.document.TestLatLonShapeQueries.testRandomMedium

Error Message:
wrong hit (first of possibly more):  FAIL: id=26133 should match but did not   query=LatLonShapeBoundingBoxQuery:
field=shape:Rectangle(lat=-1.0303716827183962 TO 0.0 lon=8.381903171539307E-8 TO 54.85824029892683)
docID=25757   polygon=[-4.190951585769653E-8, 0.0] [89.99999995809048, 0.0] [89.99999995809048,
179.99999991618097] [-4.190951585769653E-8, 0.0]    deleted?=false  rect=Rectangle(-1.0303716827183962
TO 0.0 lon=8.381903171539307E-8 TO 54.85824029892683)

Stack Trace:
java.lang.AssertionError: wrong hit (first of possibly more):

FAIL: id=26133 should match but did not
  query=LatLonShapeBoundingBoxQuery: field=shape:Rectangle(lat=-1.0303716827183962 TO 0.0
lon=8.381903171539307E-8 TO 54.85824029892683) docID=25757
  polygon=[-4.190951585769653E-8, 0.0] [89.99999995809048, 0.0] [89.99999995809048, 179.99999991618097]
[-4.190951585769653E-8, 0.0] 
  deleted?=false  rect=Rectangle(-1.0303716827183962 TO 0.0 lon=8.381903171539307E-8 TO 54.85824029892683)
	at __randomizedtesting.SeedInfo.seed([23CA4D991FEDCDE6:9E147A315E88AE80]:0)
	at org.junit.Assert.fail(Assert.java:93)
	at org.apache.lucene.document.TestLatLonShapeQueries.verifyRandomBBoxes(TestLatLonShapeQueries.java:262)
	at org.apache.lucene.document.TestLatLonShapeQueries.verify(TestLatLonShapeQueries.java:133)
	at org.apache.lucene.document.TestLatLonShapeQueries.doTestRandom(TestLatLonShapeQueries.java:129)
	at org.apache.lucene.document.TestLatLonShapeQueries.testRandomMedium(TestLatLonShapeQueries.java:101)
	at sun.reflect.NativeMethodAccessorImpl.invoke0(Native Method)
	at sun.reflect.NativeMethodAccessorImpl.invoke(NativeMethodAccessorImpl.java:62)
	at sun.reflect.DelegatingMethodAccessorImpl.invoke(DelegatingMethodAccessorImpl.java:43)
	at java.lang.reflect.Method.invoke(Method.java:498)
	at com.carrotsearch.randomizedtesting.RandomizedRunner.invoke(RandomizedRunner.java:1737)
	at com.carrotsearch.randomizedtesting.RandomizedRunner$8.evaluate(RandomizedRunner.java:934)
	at com.carrotsearch.randomizedtesting.RandomizedRunner$9.evaluate(RandomizedRunner.java:970)
	at com.carrotsearch.randomizedtesting.RandomizedRunner$10.evaluate(RandomizedRunner.java:984)
	at org.apache.lucene.util.TestRuleSetupTeardownChained$1.evaluate(TestRuleSetupTeardownChained.java:49)
	at org.apache.lucene.util.AbstractBeforeAfterRule$1.evaluate(AbstractBeforeAfterRule.java:45)
	at org.apache.lucene.util.TestRuleThreadAndTestName$1.evaluate(TestRuleThreadAndTestName.java:48)
	at org.apache.lucene.util.TestRuleIgnoreAfterMaxFailures$1.evaluate(TestRuleIgnoreAfterMaxFailures.java:64)
	at org.apache.lucene.util.TestRuleMarkFailure$1.evaluate(TestRuleMarkFailure.java:47)
	at com.carrotsearch.randomizedtesting.rules.StatementAdapter.evaluate(StatementAdapter.java:36)
	at com.carrotsearch.randomizedtesting.ThreadLeakControl$StatementRunner.run(ThreadLeakControl.java:368)
	at com.carrotsearch.randomizedtesting.ThreadLeakControl.forkTimeoutingTask(ThreadLeakControl.java:817)
	at com.carrotsearch.randomizedtesting.ThreadLeakControl$3.evaluate(ThreadLeakControl.java:468)
	at com.carrotsearch.randomizedtesting.RandomizedRunner.runSingleTest(RandomizedRunner.java:943)
	at com.carrotsearch.randomizedtesting.RandomizedRunner$5.evaluate(RandomizedRunner.java:829)
	at com.carrotsearch.randomizedtesting.RandomizedRunner$6.evaluate(RandomizedRunner.java:879)
	at com.carrotsearch.randomizedtesting.RandomizedRunner$7.evaluate(RandomizedRunner.java:890)
	at org.apache.lucene.util.AbstractBeforeAfterRule$1.evaluate(AbstractBeforeAfterRule.java:45)
	at com.carrotsearch.randomizedtesting.rules.StatementAdapter.evaluate(StatementAdapter.java:36)
	at org.apache.lucene.util.TestRuleStoreClassName$1.evaluate(TestRuleStoreClassName.java:41)
	at com.carrotsearch.randomizedtesting.rules.NoShadowingOrOverridesOnMethodsRule$1.evaluate(NoShadowingOrOverridesOnMethodsRule.java:40)
	at com.carrotsearch.randomizedtesting.rules.NoShadowingOrOverridesOnMethodsRule$1.evaluate(NoShadowingOrOverridesOnMethodsRule.java:40)
	at com.carrotsearch.randomizedtesting.rules.StatementAdapter.evaluate(StatementAdapter.java:36)
	at com.carrotsearch.randomizedtesting.rules.StatementAdapter.evaluate(StatementAdapter.java:36)
	at com.carrotsearch.randomizedtesting.rules.StatementAdapter.evaluate(StatementAdapter.java:36)
	at org.apache.lucene.util.TestRuleAssertionsRequired$1.evaluate(TestRuleAssertionsRequired.java:53)
	at org.apache.lucene.util.TestRuleMarkFailure$1.evaluate(TestRuleMarkFailure.java:47)
	at org.apache.lucene.util.TestRuleIgnoreAfterMaxFailures$1.evaluate(TestRuleIgnoreAfterMaxFailures.java:64)
	at org.apache.lucene.util.TestRuleIgnoreTestSuites$1.evaluate(TestRuleIgnoreTestSuites.java:54)
	at com.carrotsearch.randomizedtesting.rules.StatementAdapter.evaluate(StatementAdapter.java:36)
	at com.carrotsearch.randomizedtesting.ThreadLeakControl$StatementRunner.run(ThreadLeakControl.java:368)
	at java.lang.Thread.run(Thread.java:748)


FAILED:  org.apache.lucene.document.TestLatLonShapeQueries.testRandomMedium

Error Message:
wrong hit (first of possibly more):  FAIL: id=26133 should match but did not   query=LatLonShapeBoundingBoxQuery:
field=shape:Rectangle(lat=-1.0303716827183962 TO 0.0 lon=8.381903171539307E-8 TO 54.85824029892683)
docID=25757   polygon=[-4.190951585769653E-8, 0.0] [89.99999995809048, 0.0] [89.99999995809048,
179.99999991618097] [-4.190951585769653E-8, 0.0]    deleted?=false  rect=Rectangle(-1.0303716827183962
TO 0.0 lon=8.381903171539307E-8 TO 54.85824029892683)

Stack Trace:
java.lang.AssertionError: wrong hit (first of possibly more):

FAIL: id=26133 should match but did not
  query=LatLonShapeBoundingBoxQuery: field=shape:Rectangle(lat=-1.0303716827183962 TO 0.0
lon=8.381903171539307E-8 TO 54.85824029892683) docID=25757
  polygon=[-4.190951585769653E-8, 0.0] [89.99999995809048, 0.0] [89.99999995809048, 179.99999991618097]
[-4.190951585769653E-8, 0.0] 
  deleted?=false  rect=Rectangle(-1.0303716827183962 TO 0.0 lon=8.381903171539307E-8 TO 54.85824029892683)
	at __randomizedtesting.SeedInfo.seed([23CA4D991FEDCDE6:9E147A315E88AE80]:0)
	at org.junit.Assert.fail(Assert.java:93)
	at org.apache.lucene.document.TestLatLonShapeQueries.verifyRandomBBoxes(TestLatLonShapeQueries.java:262)
	at org.apache.lucene.document.TestLatLonShapeQueries.verify(TestLatLonShapeQueries.java:133)
	at org.apache.lucene.document.TestLatLonShapeQueries.doTestRandom(TestLatLonShapeQueries.java:129)
	at org.apache.lucene.document.TestLatLonShapeQueries.testRandomMedium(TestLatLonShapeQueries.java:101)
	at sun.reflect.NativeMethodAccessorImpl.invoke0(Native Method)
	at sun.reflect.NativeMethodAccessorImpl.invoke(NativeMethodAccessorImpl.java:62)
	at sun.reflect.DelegatingMethodAccessorImpl.invoke(DelegatingMethodAccessorImpl.java:43)
	at java.lang.reflect.Method.invoke(Method.java:498)
	at com.carrotsearch.randomizedtesting.RandomizedRunner.invoke(RandomizedRunner.java:1737)
	at com.carrotsearch.randomizedtesting.RandomizedRunner$8.evaluate(RandomizedRunner.java:934)
	at com.carrotsearch.randomizedtesting.RandomizedRunner$9.evaluate(RandomizedRunner.java:970)
	at com.carrotsearch.randomizedtesting.RandomizedRunner$10.evaluate(RandomizedRunner.java:984)
	at org.apache.lucene.util.TestRuleSetupTeardownChained$1.evaluate(TestRuleSetupTeardownChained.java:49)
	at org.apache.lucene.util.AbstractBeforeAfterRule$1.evaluate(AbstractBeforeAfterRule.java:45)
	at org.apache.lucene.util.TestRuleThreadAndTestName$1.evaluate(TestRuleThreadAndTestName.java:48)
	at org.apache.lucene.util.TestRuleIgnoreAfterMaxFailures$1.evaluate(TestRuleIgnoreAfterMaxFailures.java:64)
	at org.apache.lucene.util.TestRuleMarkFailure$1.evaluate(TestRuleMarkFailure.java:47)
	at com.carrotsearch.randomizedtesting.rules.StatementAdapter.evaluate(StatementAdapter.java:36)
	at com.carrotsearch.randomizedtesting.ThreadLeakControl$StatementRunner.run(ThreadLeakControl.java:368)
	at com.carrotsearch.randomizedtesting.ThreadLeakControl.forkTimeoutingTask(ThreadLeakControl.java:817)
	at com.carrotsearch.randomizedtesting.ThreadLeakControl$3.evaluate(ThreadLeakControl.java:468)
	at com.carrotsearch.randomizedtesting.RandomizedRunner.runSingleTest(RandomizedRunner.java:943)
	at com.carrotsearch.randomizedtesting.RandomizedRunner$5.evaluate(RandomizedRunner.java:829)
	at com.carrotsearch.randomizedtesting.RandomizedRunner$6.evaluate(RandomizedRunner.java:879)
	at com.carrotsearch.randomizedtesting.RandomizedRunner$7.evaluate(RandomizedRunner.java:890)
	at org.apache.lucene.util.AbstractBeforeAfterRule$1.evaluate(AbstractBeforeAfterRule.java:45)
	at com.carrotsearch.randomizedtesting.rules.StatementAdapter.evaluate(StatementAdapter.java:36)
	at org.apache.lucene.util.TestRuleStoreClassName$1.evaluate(TestRuleStoreClassName.java:41)
	at com.carrotsearch.randomizedtesting.rules.NoShadowingOrOverridesOnMethodsRule$1.evaluate(NoShadowingOrOverridesOnMethodsRule.java:40)
	at com.carrotsearch.randomizedtesting.rules.NoShadowingOrOverridesOnMethodsRule$1.evaluate(NoShadowingOrOverridesOnMethodsRule.java:40)
	at com.carrotsearch.randomizedtesting.rules.StatementAdapter.evaluate(StatementAdapter.java:36)
	at com.carrotsearch.randomizedtesting.rules.StatementAdapter.evaluate(StatementAdapter.java:36)
	at com.carrotsearch.randomizedtesting.rules.StatementAdapter.evaluate(StatementAdapter.java:36)
	at org.apache.lucene.util.TestRuleAssertionsRequired$1.evaluate(TestRuleAssertionsRequired.java:53)
	at org.apache.lucene.util.TestRuleMarkFailure$1.evaluate(TestRuleMarkFailure.java:47)
	at org.apache.lucene.util.TestRuleIgnoreAfterMaxFailures$1.evaluate(TestRuleIgnoreAfterMaxFailures.java:64)
	at org.apache.lucene.util.TestRuleIgnoreTestSuites$1.evaluate(TestRuleIgnoreTestSuites.java:54)
	at com.carrotsearch.randomizedtesting.rules.StatementAdapter.evaluate(StatementAdapter.java:36)
	at com.carrotsearch.randomizedtesting.ThreadLeakControl$StatementRunner.run(ThreadLeakControl.java:368)
	at java.lang.Thread.run(Thread.java:748)


FAILED:  org.apache.lucene.document.TestLatLonShapeQueries.testRandomMedium

Error Message:
wrong hit (first of possibly more):  FAIL: id=26133 should match but did not   query=LatLonShapeBoundingBoxQuery:
field=shape:Rectangle(lat=-1.0303716827183962 TO 0.0 lon=8.381903171539307E-8 TO 54.85824029892683)
docID=25757   polygon=[-4.190951585769653E-8, 0.0] [89.99999995809048, 0.0] [89.99999995809048,
179.99999991618097] [-4.190951585769653E-8, 0.0]    deleted?=false  rect=Rectangle(-1.0303716827183962
TO 0.0 lon=8.381903171539307E-8 TO 54.85824029892683)

Stack Trace:
java.lang.AssertionError: wrong hit (first of possibly more):

FAIL: id=26133 should match but did not
  query=LatLonShapeBoundingBoxQuery: field=shape:Rectangle(lat=-1.0303716827183962 TO 0.0
lon=8.381903171539307E-8 TO 54.85824029892683) docID=25757
  polygon=[-4.190951585769653E-8, 0.0] [89.99999995809048, 0.0] [89.99999995809048, 179.99999991618097]
[-4.190951585769653E-8, 0.0] 
  deleted?=false  rect=Rectangle(-1.0303716827183962 TO 0.0 lon=8.381903171539307E-8 TO 54.85824029892683)
	at __randomizedtesting.SeedInfo.seed([23CA4D991FEDCDE6:9E147A315E88AE80]:0)
	at org.junit.Assert.fail(Assert.java:93)
	at org.apache.lucene.document.TestLatLonShapeQueries.verifyRandomBBoxes(TestLatLonShapeQueries.java:262)
	at org.apache.lucene.document.TestLatLonShapeQueries.verify(TestLatLonShapeQueries.java:133)
	at org.apache.lucene.document.TestLatLonShapeQueries.doTestRandom(TestLatLonShapeQueries.java:129)
	at org.apache.lucene.document.TestLatLonShapeQueries.testRandomMedium(TestLatLonShapeQueries.java:101)
	at sun.reflect.NativeMethodAccessorImpl.invoke0(Native Method)
	at sun.reflect.NativeMethodAccessorImpl.invoke(NativeMethodAccessorImpl.java:62)
	at sun.reflect.DelegatingMethodAccessorImpl.invoke(DelegatingMethodAccessorImpl.java:43)
	at java.lang.reflect.Method.invoke(Method.java:498)
	at com.carrotsearch.randomizedtesting.RandomizedRunner.invoke(RandomizedRunner.java:1737)
	at com.carrotsearch.randomizedtesting.RandomizedRunner$8.evaluate(RandomizedRunner.java:934)
	at com.carrotsearch.randomizedtesting.RandomizedRunner$9.evaluate(RandomizedRunner.java:970)
	at com.carrotsearch.randomizedtesting.RandomizedRunner$10.evaluate(RandomizedRunner.java:984)
	at org.apache.lucene.util.TestRuleSetupTeardownChained$1.evaluate(TestRuleSetupTeardownChained.java:49)
	at org.apache.lucene.util.AbstractBeforeAfterRule$1.evaluate(AbstractBeforeAfterRule.java:45)
	at org.apache.lucene.util.TestRuleThreadAndTestName$1.evaluate(TestRuleThreadAndTestName.java:48)
	at org.apache.lucene.util.TestRuleIgnoreAfterMaxFailures$1.evaluate(TestRuleIgnoreAfterMaxFailures.java:64)
	at org.apache.lucene.util.TestRuleMarkFailure$1.evaluate(TestRuleMarkFailure.java:47)
	at com.carrotsearch.randomizedtesting.rules.StatementAdapter.evaluate(StatementAdapter.java:36)
	at com.carrotsearch.randomizedtesting.ThreadLeakControl$StatementRunner.run(ThreadLeakControl.java:368)
	at com.carrotsearch.randomizedtesting.ThreadLeakControl.forkTimeoutingTask(ThreadLeakControl.java:817)
	at com.carrotsearch.randomizedtesting.ThreadLeakControl$3.evaluate(ThreadLeakControl.java:468)
	at com.carrotsearch.randomizedtesting.RandomizedRunner.runSingleTest(RandomizedRunner.java:943)
	at com.carrotsearch.randomizedtesting.RandomizedRunner$5.evaluate(RandomizedRunner.java:829)
	at com.carrotsearch.randomizedtesting.RandomizedRunner$6.evaluate(RandomizedRunner.java:879)
	at com.carrotsearch.randomizedtesting.RandomizedRunner$7.evaluate(RandomizedRunner.java:890)
	at org.apache.lucene.util.AbstractBeforeAfterRule$1.evaluate(AbstractBeforeAfterRule.java:45)
	at com.carrotsearch.randomizedtesting.rules.StatementAdapter.evaluate(StatementAdapter.java:36)
	at org.apache.lucene.util.TestRuleStoreClassName$1.evaluate(TestRuleStoreClassName.java:41)
	at com.carrotsearch.randomizedtesting.rules.NoShadowingOrOverridesOnMethodsRule$1.evaluate(NoShadowingOrOverridesOnMethodsRule.java:40)
	at com.carrotsearch.randomizedtesting.rules.NoShadowingOrOverridesOnMethodsRule$1.evaluate(NoShadowingOrOverridesOnMethodsRule.java:40)
	at com.carrotsearch.randomizedtesting.rules.StatementAdapter.evaluate(StatementAdapter.java:36)
	at com.carrotsearch.randomizedtesting.rules.StatementAdapter.evaluate(StatementAdapter.java:36)
	at com.carrotsearch.randomizedtesting.rules.StatementAdapter.evaluate(StatementAdapter.java:36)
	at org.apache.lucene.util.TestRuleAssertionsRequired$1.evaluate(TestRuleAssertionsRequired.java:53)
	at org.apache.lucene.util.TestRuleMarkFailure$1.evaluate(TestRuleMarkFailure.java:47)
	at org.apache.lucene.util.TestRuleIgnoreAfterMaxFailures$1.evaluate(TestRuleIgnoreAfterMaxFailures.java:64)
	at org.apache.lucene.util.TestRuleIgnoreTestSuites$1.evaluate(TestRuleIgnoreTestSuites.java:54)
	at com.carrotsearch.randomizedtesting.rules.StatementAdapter.evaluate(StatementAdapter.java:36)
	at com.carrotsearch.randomizedtesting.ThreadLeakControl$StatementRunner.run(ThreadLeakControl.java:368)
	at java.lang.Thread.run(Thread.java:748)


FAILED:  org.apache.lucene.document.TestLatLonShapeQueries.testRandomMedium

Error Message:
wrong hit (first of possibly more):  FAIL: id=26133 should match but did not   query=LatLonShapeBoundingBoxQuery:
field=shape:Rectangle(lat=-1.0303716827183962 TO 0.0 lon=8.381903171539307E-8 TO 54.85824029892683)
docID=25757   polygon=[-4.190951585769653E-8, 0.0] [89.99999995809048, 0.0] [89.99999995809048,
179.99999991618097] [-4.190951585769653E-8, 0.0]    deleted?=false  rect=Rectangle(-1.0303716827183962
TO 0.0 lon=8.381903171539307E-8 TO 54.85824029892683)

Stack Trace:
java.lang.AssertionError: wrong hit (first of possibly more):

FAIL: id=26133 should match but did not
  query=LatLonShapeBoundingBoxQuery: field=shape:Rectangle(lat=-1.0303716827183962 TO 0.0
lon=8.381903171539307E-8 TO 54.85824029892683) docID=25757
  polygon=[-4.190951585769653E-8, 0.0] [89.99999995809048, 0.0] [89.99999995809048, 179.99999991618097]
[-4.190951585769653E-8, 0.0] 
  deleted?=false  rect=Rectangle(-1.0303716827183962 TO 0.0 lon=8.381903171539307E-8 TO 54.85824029892683)
	at __randomizedtesting.SeedInfo.seed([23CA4D991FEDCDE6:9E147A315E88AE80]:0)
	at org.junit.Assert.fail(Assert.java:93)
	at org.apache.lucene.document.TestLatLonShapeQueries.verifyRandomBBoxes(TestLatLonShapeQueries.java:262)
	at org.apache.lucene.document.TestLatLonShapeQueries.verify(TestLatLonShapeQueries.java:133)
	at org.apache.lucene.document.TestLatLonShapeQueries.doTestRandom(TestLatLonShapeQueries.java:129)
	at org.apache.lucene.document.TestLatLonShapeQueries.testRandomMedium(TestLatLonShapeQueries.java:101)
	at sun.reflect.NativeMethodAccessorImpl.invoke0(Native Method)
	at sun.reflect.NativeMethodAccessorImpl.invoke(NativeMethodAccessorImpl.java:62)
	at sun.reflect.DelegatingMethodAccessorImpl.invoke(DelegatingMethodAccessorImpl.java:43)
	at java.lang.reflect.Method.invoke(Method.java:498)
	at com.carrotsearch.randomizedtesting.RandomizedRunner.invoke(RandomizedRunner.java:1737)
	at com.carrotsearch.randomizedtesting.RandomizedRunner$8.evaluate(RandomizedRunner.java:934)
	at com.carrotsearch.randomizedtesting.RandomizedRunner$9.evaluate(RandomizedRunner.java:970)
	at com.carrotsearch.randomizedtesting.RandomizedRunner$10.evaluate(RandomizedRunner.java:984)
	at org.apache.lucene.util.TestRuleSetupTeardownChained$1.evaluate(TestRuleSetupTeardownChained.java:49)
	at org.apache.lucene.util.AbstractBeforeAfterRule$1.evaluate(AbstractBeforeAfterRule.java:45)
	at org.apache.lucene.util.TestRuleThreadAndTestName$1.evaluate(TestRuleThreadAndTestName.java:48)
	at org.apache.lucene.util.TestRuleIgnoreAfterMaxFailures$1.evaluate(TestRuleIgnoreAfterMaxFailures.java:64)
	at org.apache.lucene.util.TestRuleMarkFailure$1.evaluate(TestRuleMarkFailure.java:47)
	at com.carrotsearch.randomizedtesting.rules.StatementAdapter.evaluate(StatementAdapter.java:36)
	at com.carrotsearch.randomizedtesting.ThreadLeakControl$StatementRunner.run(ThreadLeakControl.java:368)
	at com.carrotsearch.randomizedtesting.ThreadLeakControl.forkTimeoutingTask(ThreadLeakControl.java:817)
	at com.carrotsearch.randomizedtesting.ThreadLeakControl$3.evaluate(ThreadLeakControl.java:468)
	at com.carrotsearch.randomizedtesting.RandomizedRunner.runSingleTest(RandomizedRunner.java:943)
	at com.carrotsearch.randomizedtesting.RandomizedRunner$5.evaluate(RandomizedRunner.java:829)
	at com.carrotsearch.randomizedtesting.RandomizedRunner$6.evaluate(RandomizedRunner.java:879)
	at com.carrotsearch.randomizedtesting.RandomizedRunner$7.evaluate(RandomizedRunner.java:890)
	at org.apache.lucene.util.AbstractBeforeAfterRule$1.evaluate(AbstractBeforeAfterRule.java:45)
	at com.carrotsearch.randomizedtesting.rules.StatementAdapter.evaluate(StatementAdapter.java:36)
	at org.apache.lucene.util.TestRuleStoreClassName$1.evaluate(TestRuleStoreClassName.java:41)
	at com.carrotsearch.randomizedtesting.rules.NoShadowingOrOverridesOnMethodsRule$1.evaluate(NoShadowingOrOverridesOnMethodsRule.java:40)
	at com.carrotsearch.randomizedtesting.rules.NoShadowingOrOverridesOnMethodsRule$1.evaluate(NoShadowingOrOverridesOnMethodsRule.java:40)
	at com.carrotsearch.randomizedtesting.rules.StatementAdapter.evaluate(StatementAdapter.java:36)
	at com.carrotsearch.randomizedtesting.rules.StatementAdapter.evaluate(StatementAdapter.java:36)
	at com.carrotsearch.randomizedtesting.rules.StatementAdapter.evaluate(StatementAdapter.java:36)
	at org.apache.lucene.util.TestRuleAssertionsRequired$1.evaluate(TestRuleAssertionsRequired.java:53)
	at org.apache.lucene.util.TestRuleMarkFailure$1.evaluate(TestRuleMarkFailure.java:47)
	at org.apache.lucene.util.TestRuleIgnoreAfterMaxFailures$1.evaluate(TestRuleIgnoreAfterMaxFailures.java:64)
	at org.apache.lucene.util.TestRuleIgnoreTestSuites$1.evaluate(TestRuleIgnoreTestSuites.java:54)
	at com.carrotsearch.randomizedtesting.rules.StatementAdapter.evaluate(StatementAdapter.java:36)
	at com.carrotsearch.randomizedtesting.ThreadLeakControl$StatementRunner.run(ThreadLeakControl.java:368)
	at java.lang.Thread.run(Thread.java:748)




Build Log:
[...truncated 9579 lines...]
   [junit4] Suite: org.apache.lucene.document.TestLatLonShapeQueries
   [junit4]   2> NOTE: reproduce with: ant test  -Dtestcase=TestLatLonShapeQueries -Dtests.method=testRandomMedium
-Dtests.seed=23CA4D991FEDCDE6 -Dtests.multiplier=3 -Dtests.slow=true -Dtests.locale=es-CR
-Dtests.timezone=AET -Dtests.asserts=true -Dtests.file.encoding=US-ASCII
   [junit4] FAILURE 42.4s J0 | TestLatLonShapeQueries.testRandomMedium <<<
   [junit4]    > Throwable #1: java.lang.AssertionError: wrong hit (first of possibly more):
   [junit4]    > FAIL: id=26133 should match but did not
   [junit4]    >   query=LatLonShapeBoundingBoxQuery: field=shape:Rectangle(lat=-1.0303716827183962
TO 0.0 lon=8.381903171539307E-8 TO 54.85824029892683) docID=25757
   [junit4]    >   polygon=[-4.190951585769653E-8, 0.0] [89.99999995809048, 0.0] [89.99999995809048,
179.99999991618097] [-4.190951585769653E-8, 0.0] 
   [junit4]    >   deleted?=false  rect=Rectangle(-1.0303716827183962 TO 0.0 lon=8.381903171539307E-8
TO 54.85824029892683)
   [junit4]    > 	at __randomizedtesting.SeedInfo.seed([23CA4D991FEDCDE6:9E147A315E88AE80]:0)
   [junit4]    > 	at org.apache.lucene.document.TestLatLonShapeQueries.verifyRandomBBoxes(TestLatLonShapeQueries.java:262)
   [junit4]    > 	at org.apache.lucene.document.TestLatLonShapeQueries.verify(TestLatLonShapeQueries.java:133)
   [junit4]    > 	at org.apache.lucene.document.TestLatLonShapeQueries.doTestRandom(TestLatLonShapeQueries.java:129)
   [junit4]    > 	at org.apache.lucene.document.TestLatLonShapeQueries.testRandomMedium(TestLatLonShapeQueries.java:101)
   [junit4]    > 	at java.lang.Thread.run(Thread.java:748)
   [junit4] IGNOR/A 0.00s J0 | TestLatLonShapeQueries.testRandomBig
   [junit4]    > Assumption #1: 'nightly' test group is disabled (@Nightly())
   [junit4]   2> NOTE: leaving temporary files on disk at: /home/jenkins/workspace/Lucene-Solr-7.x-Linux/lucene/build/sandbox/test/J0/temp/lucene.document.TestLatLonShapeQueries_23CA4D991FEDCDE6-001
   [junit4]   2> NOTE: test params are: codec=Lucene70, sim=RandomSimilarity(queryNorm=true):
{}, locale=es-CR, timezone=AET
   [junit4]   2> NOTE: Linux 4.15.0-24-generic i386/Oracle Corporation 1.8.0_172 (32-bit)/cpus=8,threads=1,free=178827344,total=338067456
   [junit4]   2> NOTE: All tests run in this JVM: [TestPayloadSpanUtil, TestLatLonPoint,
TestLatLonShapeQueries]
   [junit4] Completed [7/24 (1!)] on J0 in 42.52s, 3 tests, 1 failure, 1 skipped <<<
FAILURES!

[...truncated 49940 lines...]
[repro] Jenkins log URL: https://jenkins.thetaphi.de/job/Lucene-Solr-7.x-Linux/2322/consoleText

[repro] Revision: 1b20e6bec3f971cba5833e8d51cbf5c235dddb8f

[repro] Ant options: "-Dargs=-client -XX:+UseConcMarkSweepGC"
[repro] Repro line:  ant test  -Dtestcase=TestLatLonShapeQueries -Dtests.method=testRandomMedium
-Dtests.seed=23CA4D991FEDCDE6 -Dtests.multiplier=3 -Dtests.slow=true -Dtests.locale=es-CR
-Dtests.timezone=AET -Dtests.asserts=true -Dtests.file.encoding=US-ASCII

[repro] ant clean

[...truncated 6 lines...]
[repro] Test suites by module:
[repro]    lucene/sandbox
[repro]       TestLatLonShapeQueries
[repro] ant compile-test

[...truncated 165 lines...]
[repro] ant test-nocompile -Dtests.dups=5 -Dtests.maxfailures=5 -Dtests.class="*.TestLatLonShapeQueries"
-Dtests.showOutput=onerror "-Dargs=-client -XX:+UseConcMarkSweepGC" -Dtests.seed=23CA4D991FEDCDE6
-Dtests.multiplier=3 -Dtests.slow=true -Dtests.locale=es-CR -Dtests.timezone=AET -Dtests.asserts=true
-Dtests.file.encoding=US-ASCII

[...truncated 32 lines...]
   [junit4] Suite: org.apache.lucene.document.TestLatLonShapeQueries
   [junit4]   2> NOTE: reproduce with: ant test  -Dtestcase=TestLatLonShapeQueries -Dtests.method=testRandomMedium
-Dtests.seed=23CA4D991FEDCDE6 -Dtests.multiplier=3 -Dtests.slow=true -Dtests.badapples=true
-Dtests.locale=es-CR -Dtests.timezone=AET -Dtests.asserts=true -Dtests.file.encoding=US-ASCII
   [junit4] FAILURE 49.9s J1 | TestLatLonShapeQueries.testRandomMedium <<<
   [junit4]    > Throwable #1: java.lang.AssertionError: wrong hit (first of possibly more):
   [junit4]    > FAIL: id=26133 should match but did not
   [junit4]    >   query=LatLonShapeBoundingBoxQuery: field=shape:Rectangle(lat=-1.0303716827183962
TO 0.0 lon=8.381903171539307E-8 TO 54.85824029892683) docID=25757
   [junit4]    >   polygon=[-4.190951585769653E-8, 0.0] [89.99999995809048, 0.0] [89.99999995809048,
179.99999991618097] [-4.190951585769653E-8, 0.0] 
   [junit4]    >   deleted?=false  rect=Rectangle(-1.0303716827183962 TO 0.0 lon=8.381903171539307E-8
TO 54.85824029892683)
   [junit4]    > 	at __randomizedtesting.SeedInfo.seed([23CA4D991FEDCDE6:9E147A315E88AE80]:0)
   [junit4]    > 	at org.apache.lucene.document.TestLatLonShapeQueries.verifyRandomBBoxes(TestLatLonShapeQueries.java:262)
   [junit4]    > 	at org.apache.lucene.document.TestLatLonShapeQueries.verify(TestLatLonShapeQueries.java:133)
   [junit4]    > 	at org.apache.lucene.document.TestLatLonShapeQueries.doTestRandom(TestLatLonShapeQueries.java:129)
   [junit4]    > 	at org.apache.lucene.document.TestLatLonShapeQueries.testRandomMedium(TestLatLonShapeQueries.java:101)
   [junit4]    > 	at java.lang.Thread.run(Thread.java:748)
   [junit4] IGNOR/A 0.00s J1 | TestLatLonShapeQueries.testRandomBig
   [junit4]    > Assumption #1: 'nightly' test group is disabled (@Nightly())
   [junit4] OK      0.14s J1 | TestLatLonShapeQueries.testRandomTiny
   [junit4]   2> NOTE: leaving temporary files on disk at: /home/jenkins/workspace/Lucene-Solr-7.x-Linux/lucene/build/sandbox/test/J1/temp/lucene.document.TestLatLonShapeQueries_23CA4D991FEDCDE6-001
   [junit4]   2> NOTE: test params are: codec=Lucene70, sim=RandomSimilarity(queryNorm=true):
{}, locale=es-CR, timezone=AET
   [junit4]   2> NOTE: Linux 4.15.0-24-generic i386/Oracle Corporation 1.8.0_172 (32-bit)/cpus=8,threads=1,free=53685080,total=251363328
   [junit4]   2> NOTE: All tests run in this JVM: [TestLatLonShapeQueries]
   [junit4] Completed [1/5 (1!)] on J1 in 50.41s, 3 tests, 1 failure, 1 skipped <<<
FAILURES!

[...truncated 1 lines...]
   [junit4] Suite: org.apache.lucene.document.TestLatLonShapeQueries
   [junit4]   2> NOTE: reproduce with: ant test  -Dtestcase=TestLatLonShapeQueries -Dtests.method=testRandomMedium
-Dtests.seed=23CA4D991FEDCDE6 -Dtests.multiplier=3 -Dtests.slow=true -Dtests.badapples=true
-Dtests.locale=es-CR -Dtests.timezone=AET -Dtests.asserts=true -Dtests.file.encoding=US-ASCII
   [junit4] FAILURE 50.3s J2 | TestLatLonShapeQueries.testRandomMedium <<<
   [junit4]    > Throwable #1: java.lang.AssertionError: wrong hit (first of possibly more):
   [junit4]    > FAIL: id=26133 should match but did not
   [junit4]    >   query=LatLonShapeBoundingBoxQuery: field=shape:Rectangle(lat=-1.0303716827183962
TO 0.0 lon=8.381903171539307E-8 TO 54.85824029892683) docID=25757
   [junit4]    >   polygon=[-4.190951585769653E-8, 0.0] [89.99999995809048, 0.0] [89.99999995809048,
179.99999991618097] [-4.190951585769653E-8, 0.0] 
   [junit4]    >   deleted?=false  rect=Rectangle(-1.0303716827183962 TO 0.0 lon=8.381903171539307E-8
TO 54.85824029892683)
   [junit4]    > 	at __randomizedtesting.SeedInfo.seed([23CA4D991FEDCDE6:9E147A315E88AE80]:0)
   [junit4]    > 	at org.apache.lucene.document.TestLatLonShapeQueries.verifyRandomBBoxes(TestLatLonShapeQueries.java:262)
   [junit4]    > 	at org.apache.lucene.document.TestLatLonShapeQueries.verify(TestLatLonShapeQueries.java:133)
   [junit4]    > 	at org.apache.lucene.document.TestLatLonShapeQueries.doTestRandom(TestLatLonShapeQueries.java:129)
   [junit4]    > 	at org.apache.lucene.document.TestLatLonShapeQueries.testRandomMedium(TestLatLonShapeQueries.java:101)
   [junit4]    > 	at java.lang.Thread.run(Thread.java:748)
   [junit4] IGNOR/A 0.00s J2 | TestLatLonShapeQueries.testRandomBig
   [junit4]    > Assumption #1: 'nightly' test group is disabled (@Nightly())
   [junit4] OK      0.23s J2 | TestLatLonShapeQueries.testRandomTiny
   [junit4]   2> NOTE: leaving temporary files on disk at: /home/jenkins/workspace/Lucene-Solr-7.x-Linux/lucene/build/sandbox/test/J2/temp/lucene.document.TestLatLonShapeQueries_23CA4D991FEDCDE6-001
   [junit4]   2> NOTE: test params are: codec=Lucene70, sim=RandomSimilarity(queryNorm=true):
{}, locale=es-CR, timezone=AET
   [junit4]   2> NOTE: Linux 4.15.0-24-generic i386/Oracle Corporation 1.8.0_172 (32-bit)/cpus=8,threads=1,free=43062672,total=215715840
   [junit4]   2> NOTE: All tests run in this JVM: [TestLatLonShapeQueries]
   [junit4] Completed [2/5 (2!)] on J2 in 50.84s, 3 tests, 1 failure, 1 skipped <<<
FAILURES!

[...truncated 2 lines...]
   [junit4] Suite: org.apache.lucene.document.TestLatLonShapeQueries
   [junit4]   2> NOTE: reproduce with: ant test  -Dtestcase=TestLatLonShapeQueries -Dtests.method=testRandomMedium
-Dtests.seed=23CA4D991FEDCDE6 -Dtests.multiplier=3 -Dtests.slow=true -Dtests.badapples=true
-Dtests.locale=es-CR -Dtests.timezone=AET -Dtests.asserts=true -Dtests.file.encoding=US-ASCII
   [junit4] FAILURE 50.8s J0 | TestLatLonShapeQueries.testRandomMedium <<<
   [junit4]    > Throwable #1: java.lang.AssertionError: wrong hit (first of possibly more):
   [junit4]    > FAIL: id=26133 should match but did not
   [junit4]    >   query=LatLonShapeBoundingBoxQuery: field=shape:Rectangle(lat=-1.0303716827183962
TO 0.0 lon=8.381903171539307E-8 TO 54.85824029892683) docID=25757
   [junit4]    >   polygon=[-4.190951585769653E-8, 0.0] [89.99999995809048, 0.0] [89.99999995809048,
179.99999991618097] [-4.190951585769653E-8, 0.0] 
   [junit4]    >   deleted?=false  rect=Rectangle(-1.0303716827183962 TO 0.0 lon=8.381903171539307E-8
TO 54.85824029892683)
   [junit4]    > 	at __randomizedtesting.SeedInfo.seed([23CA4D991FEDCDE6:9E147A315E88AE80]:0)
   [junit4]    > 	at org.apache.lucene.document.TestLatLonShapeQueries.verifyRandomBBoxes(TestLatLonShapeQueries.java:262)
   [junit4]    > 	at org.apache.lucene.document.TestLatLonShapeQueries.verify(TestLatLonShapeQueries.java:133)
   [junit4]    > 	at org.apache.lucene.document.TestLatLonShapeQueries.doTestRandom(TestLatLonShapeQueries.java:129)
   [junit4]    > 	at org.apache.lucene.document.TestLatLonShapeQueries.testRandomMedium(TestLatLonShapeQueries.java:101)
   [junit4]    > 	at java.lang.Thread.run(Thread.java:748)
   [junit4] IGNOR/A 0.00s J0 | TestLatLonShapeQueries.testRandomBig
   [junit4]    > Assumption #1: 'nightly' test group is disabled (@Nightly())
   [junit4] OK      0.21s J0 | TestLatLonShapeQueries.testRandomTiny
   [junit4]   2> NOTE: leaving temporary files on disk at: /home/jenkins/workspace/Lucene-Solr-7.x-Linux/lucene/build/sandbox/test/J0/temp/lucene.document.TestLatLonShapeQueries_23CA4D991FEDCDE6-001
   [junit4]   2> NOTE: test params are: codec=Lucene70, sim=RandomSimilarity(queryNorm=true):
{}, locale=es-CR, timezone=AET
   [junit4]   2> NOTE: Linux 4.15.0-24-generic i386/Oracle Corporation 1.8.0_172 (32-bit)/cpus=8,threads=1,free=40807520,total=249798656
   [junit4]   2> NOTE: All tests run in this JVM: [TestLatLonShapeQueries]
   [junit4] Completed [3/5 (3!)] on J0 in 51.39s, 3 tests, 1 failure, 1 skipped <<<
FAILURES!

[...truncated 1 lines...]
   [junit4] Suite: org.apache.lucene.document.TestLatLonShapeQueries
   [junit4]   2> NOTE: reproduce with: ant test  -Dtestcase=TestLatLonShapeQueries -Dtests.method=testRandomMedium
-Dtests.seed=23CA4D991FEDCDE6 -Dtests.multiplier=3 -Dtests.slow=true -Dtests.badapples=true
-Dtests.locale=es-CR -Dtests.timezone=AET -Dtests.asserts=true -Dtests.file.encoding=US-ASCII
   [junit4] FAILURE 37.9s J1 | TestLatLonShapeQueries.testRandomMedium <<<
   [junit4]    > Throwable #1: java.lang.AssertionError: wrong hit (first of possibly more):
   [junit4]    > FAIL: id=26133 should match but did not
   [junit4]    >   query=LatLonShapeBoundingBoxQuery: field=shape:Rectangle(lat=-1.0303716827183962
TO 0.0 lon=8.381903171539307E-8 TO 54.85824029892683) docID=25757
   [junit4]    >   polygon=[-4.190951585769653E-8, 0.0] [89.99999995809048, 0.0] [89.99999995809048,
179.99999991618097] [-4.190951585769653E-8, 0.0] 
   [junit4]    >   deleted?=false  rect=Rectangle(-1.0303716827183962 TO 0.0 lon=8.381903171539307E-8
TO 54.85824029892683)
   [junit4]    > 	at __randomizedtesting.SeedInfo.seed([23CA4D991FEDCDE6:9E147A315E88AE80]:0)
   [junit4]    > 	at org.apache.lucene.document.TestLatLonShapeQueries.verifyRandomBBoxes(TestLatLonShapeQueries.java:262)
   [junit4]    > 	at org.apache.lucene.document.TestLatLonShapeQueries.verify(TestLatLonShapeQueries.java:133)
   [junit4]    > 	at org.apache.lucene.document.TestLatLonShapeQueries.doTestRandom(TestLatLonShapeQueries.java:129)
   [junit4]    > 	at org.apache.lucene.document.TestLatLonShapeQueries.testRandomMedium(TestLatLonShapeQueries.java:101)
   [junit4]    > 	at java.lang.Thread.run(Thread.java:748)
   [junit4] IGNOR/A 0.00s J1 | TestLatLonShapeQueries.testRandomBig
   [junit4]    > Assumption #1: 'nightly' test group is disabled (@Nightly())
   [junit4] OK      0.11s J1 | TestLatLonShapeQueries.testRandomTiny
   [junit4]   2> NOTE: leaving temporary files on disk at: /home/jenkins/workspace/Lucene-Solr-7.x-Linux/lucene/build/sandbox/test/J1/temp/lucene.document.TestLatLonShapeQueries_23CA4D991FEDCDE6-002
   [junit4]   2> NOTE: test params are: codec=Lucene70, sim=RandomSimilarity(queryNorm=true):
{}, locale=es-CR, timezone=AET
   [junit4]   2> NOTE: Linux 4.15.0-24-generic i386/Oracle Corporation 1.8.0_172 (32-bit)/cpus=8,threads=1,free=57277632,total=251363328
   [junit4]   2> NOTE: All tests run in this JVM: [TestLatLonShapeQueries, TestLatLonShapeQueries]
   [junit4] Completed [4/5 (4!)] on J1 in 38.04s, 3 tests, 1 failure, 1 skipped <<<
FAILURES!

[...truncated 1 lines...]
   [junit4] Suite: org.apache.lucene.document.TestLatLonShapeQueries
   [junit4]   2> NOTE: reproduce with: ant test  -Dtestcase=TestLatLonShapeQueries -Dtests.method=testRandomMedium
-Dtests.seed=23CA4D991FEDCDE6 -Dtests.multiplier=3 -Dtests.slow=true -Dtests.badapples=true
-Dtests.locale=es-CR -Dtests.timezone=AET -Dtests.asserts=true -Dtests.file.encoding=US-ASCII
   [junit4] FAILURE 38.5s J2 | TestLatLonShapeQueries.testRandomMedium <<<
   [junit4]    > Throwable #1: java.lang.AssertionError: wrong hit (first of possibly more):
   [junit4]    > FAIL: id=26133 should match but did not
   [junit4]    >   query=LatLonShapeBoundingBoxQuery: field=shape:Rectangle(lat=-1.0303716827183962
TO 0.0 lon=8.381903171539307E-8 TO 54.85824029892683) docID=25757
   [junit4]    >   polygon=[-4.190951585769653E-8, 0.0] [89.99999995809048, 0.0] [89.99999995809048,
179.99999991618097] [-4.190951585769653E-8, 0.0] 
   [junit4]    >   deleted?=false  rect=Rectangle(-1.0303716827183962 TO 0.0 lon=8.381903171539307E-8
TO 54.85824029892683)
   [junit4]    > 	at __randomizedtesting.SeedInfo.seed([23CA4D991FEDCDE6:9E147A315E88AE80]:0)
   [junit4]    > 	at org.apache.lucene.document.TestLatLonShapeQueries.verifyRandomBBoxes(TestLatLonShapeQueries.java:262)
   [junit4]    > 	at org.apache.lucene.document.TestLatLonShapeQueries.verify(TestLatLonShapeQueries.java:133)
   [junit4]    > 	at org.apache.lucene.document.TestLatLonShapeQueries.doTestRandom(TestLatLonShapeQueries.java:129)
   [junit4]    > 	at org.apache.lucene.document.TestLatLonShapeQueries.testRandomMedium(TestLatLonShapeQueries.java:101)
   [junit4]    > 	at java.lang.Thread.run(Thread.java:748)
   [junit4] IGNOR/A 0.00s J2 | TestLatLonShapeQueries.testRandomBig
   [junit4]    > Assumption #1: 'nightly' test group is disabled (@Nightly())
   [junit4] OK      0.12s J2 | TestLatLonShapeQueries.testRandomTiny
   [junit4]   2> NOTE: leaving temporary files on disk at: /home/jenkins/workspace/Lucene-Solr-7.x-Linux/lucene/build/sandbox/test/J2/temp/lucene.document.TestLatLonShapeQueries_23CA4D991FEDCDE6-002
   [junit4]   2> NOTE: test params are: codec=Lucene70, sim=RandomSimilarity(queryNorm=true):
{}, locale=es-CR, timezone=AET
   [junit4]   2> NOTE: Linux 4.15.0-24-generic i386/Oracle Corporation 1.8.0_172 (32-bit)/cpus=8,threads=1,free=110560376,total=271847424
   [junit4]   2> NOTE: All tests run in this JVM: [TestLatLonShapeQueries, TestLatLonShapeQueries]
   [junit4] Completed [5/5 (5!)] on J2 in 38.67s, 3 tests, 1 failure, 1 skipped <<<
FAILURES!

[...truncated 15 lines...]
BUILD FAILED
/home/jenkins/workspace/Lucene-Solr-7.x-Linux/lucene/common-build.xml:1568: The following
error occurred while executing this line:
/home/jenkins/workspace/Lucene-Solr-7.x-Linux/lucene/common-build.xml:1092: There were test
failures: 5 suites, 15 tests, 5 failures, 5 ignored (5 assumptions) [seed: 23CA4D991FEDCDE6]

Total time: 1 minute 32 seconds

[repro] Setting last failure code to 256

[repro] Failures:
[repro]   5/5 failed: org.apache.lucene.document.TestLatLonShapeQueries
[repro] Exiting with code 256
+ mv lucene/build lucene/build.repro
+ mv solr/build solr/build.repro
mv: cannot stat 'solr/build': No such file or directory
+ true
+ mv lucene/build.orig lucene/build
+ mv solr/build.orig solr/build
Archiving artifacts
Setting ANT_1_8_2_HOME=/var/lib/jenkins/tools/hudson.tasks.Ant_AntInstallation/ANT_1.8.2
[WARNINGS] Parsing warnings in console log with parser Java Compiler (javac)
Setting ANT_1_8_2_HOME=/var/lib/jenkins/tools/hudson.tasks.Ant_AntInstallation/ANT_1.8.2
Setting ANT_1_8_2_HOME=/var/lib/jenkins/tools/hudson.tasks.Ant_AntInstallation/ANT_1.8.2
<Git Blamer> Using GitBlamer to create author and commit information for all warnings.
<Git Blamer> GIT_COMMIT=1b20e6bec3f971cba5833e8d51cbf5c235dddb8f, workspace=/var/lib/jenkins/workspace/Lucene-Solr-7.x-Linux
[WARNINGS] Computing warning deltas based on reference build #2320
Recording test results
Setting ANT_1_8_2_HOME=/var/lib/jenkins/tools/hudson.tasks.Ant_AntInstallation/ANT_1.8.2
Build step 'Publish JUnit test result report' changed build result to UNSTABLE
Email was triggered for: Unstable (Test Failures)
Sending email for trigger: Unstable (Test Failures)
Setting ANT_1_8_2_HOME=/var/lib/jenkins/tools/hudson.tasks.Ant_AntInstallation/ANT_1.8.2
Setting ANT_1_8_2_HOME=/var/lib/jenkins/tools/hudson.tasks.Ant_AntInstallation/ANT_1.8.2
Setting ANT_1_8_2_HOME=/var/lib/jenkins/tools/hudson.tasks.Ant_AntInstallation/ANT_1.8.2
Setting ANT_1_8_2_HOME=/var/lib/jenkins/tools/hudson.tasks.Ant_AntInstallation/ANT_1.8.2

Mime
View raw message