lucene-dev mailing list archives

Site index · List index
Message view « Date » · « Thread »
Top « Date » · « Thread »
From Policeman Jenkins Server <jenk...@thetaphi.de>
Subject [JENKINS-EA] Lucene-Solr-7.x-Linux (64bit/jdk-11-ea+21) - Build # 2276 - Unstable!
Date Sat, 07 Jul 2018 06:16:37 GMT
Build: https://jenkins.thetaphi.de/job/Lucene-Solr-7.x-Linux/2276/
Java: 64bit/jdk-11-ea+21 -XX:+UseCompressedOops -XX:+UseParallelGC

171 tests failed.
FAILED:  junit.framework.TestSuite.org.apache.solr.cloud.DocValuesNotIndexedTest

Error Message:
Collection not found: dv_coll

Stack Trace:
org.apache.solr.common.SolrException: Collection not found: dv_coll
	at __randomizedtesting.SeedInfo.seed([CF23536430898C8]:0)
	at org.apache.solr.client.solrj.impl.CloudSolrClient.requestWithRetryOnStaleState(CloudSolrClient.java:853)
	at org.apache.solr.client.solrj.impl.CloudSolrClient.request(CloudSolrClient.java:819)
	at org.apache.solr.client.solrj.SolrRequest.process(SolrRequest.java:194)
	at org.apache.solr.cloud.DocValuesNotIndexedTest.createCluster(DocValuesNotIndexedTest.java:154)
	at java.base/jdk.internal.reflect.NativeMethodAccessorImpl.invoke0(Native Method)
	at java.base/jdk.internal.reflect.NativeMethodAccessorImpl.invoke(NativeMethodAccessorImpl.java:62)
	at java.base/jdk.internal.reflect.DelegatingMethodAccessorImpl.invoke(DelegatingMethodAccessorImpl.java:43)
	at java.base/java.lang.reflect.Method.invoke(Method.java:566)
	at com.carrotsearch.randomizedtesting.RandomizedRunner.invoke(RandomizedRunner.java:1737)
	at com.carrotsearch.randomizedtesting.RandomizedRunner$6.evaluate(RandomizedRunner.java:874)
	at com.carrotsearch.randomizedtesting.RandomizedRunner$7.evaluate(RandomizedRunner.java:890)
	at com.carrotsearch.randomizedtesting.rules.StatementAdapter.evaluate(StatementAdapter.java:36)
	at com.carrotsearch.randomizedtesting.rules.SystemPropertiesRestoreRule$1.evaluate(SystemPropertiesRestoreRule.java:57)
	at org.apache.lucene.util.AbstractBeforeAfterRule$1.evaluate(AbstractBeforeAfterRule.java:45)
	at com.carrotsearch.randomizedtesting.rules.StatementAdapter.evaluate(StatementAdapter.java:36)
	at org.apache.lucene.util.TestRuleStoreClassName$1.evaluate(TestRuleStoreClassName.java:41)
	at com.carrotsearch.randomizedtesting.rules.NoShadowingOrOverridesOnMethodsRule$1.evaluate(NoShadowingOrOverridesOnMethodsRule.java:40)
	at com.carrotsearch.randomizedtesting.rules.NoShadowingOrOverridesOnMethodsRule$1.evaluate(NoShadowingOrOverridesOnMethodsRule.java:40)
	at com.carrotsearch.randomizedtesting.rules.StatementAdapter.evaluate(StatementAdapter.java:36)
	at com.carrotsearch.randomizedtesting.rules.StatementAdapter.evaluate(StatementAdapter.java:36)
	at org.apache.lucene.util.TestRuleAssertionsRequired$1.evaluate(TestRuleAssertionsRequired.java:53)
	at org.apache.lucene.util.TestRuleMarkFailure$1.evaluate(TestRuleMarkFailure.java:47)
	at org.apache.lucene.util.TestRuleIgnoreAfterMaxFailures$1.evaluate(TestRuleIgnoreAfterMaxFailures.java:64)
	at org.apache.lucene.util.TestRuleIgnoreTestSuites$1.evaluate(TestRuleIgnoreTestSuites.java:54)
	at com.carrotsearch.randomizedtesting.rules.StatementAdapter.evaluate(StatementAdapter.java:36)
	at com.carrotsearch.randomizedtesting.ThreadLeakControl$StatementRunner.run(ThreadLeakControl.java:368)
	at java.base/java.lang.Thread.run(Thread.java:834)


FAILED:  junit.framework.TestSuite.org.apache.solr.cloud.DocValuesNotIndexedTest

Error Message:
Collection not found: dv_coll

Stack Trace:
org.apache.solr.common.SolrException: Collection not found: dv_coll
	at __randomizedtesting.SeedInfo.seed([CF23536430898C8]:0)
	at org.apache.solr.client.solrj.impl.CloudSolrClient.requestWithRetryOnStaleState(CloudSolrClient.java:853)
	at org.apache.solr.client.solrj.impl.CloudSolrClient.request(CloudSolrClient.java:819)
	at org.apache.solr.client.solrj.SolrRequest.process(SolrRequest.java:194)
	at org.apache.solr.cloud.DocValuesNotIndexedTest.createCluster(DocValuesNotIndexedTest.java:154)
	at java.base/jdk.internal.reflect.NativeMethodAccessorImpl.invoke0(Native Method)
	at java.base/jdk.internal.reflect.NativeMethodAccessorImpl.invoke(NativeMethodAccessorImpl.java:62)
	at java.base/jdk.internal.reflect.DelegatingMethodAccessorImpl.invoke(DelegatingMethodAccessorImpl.java:43)
	at java.base/java.lang.reflect.Method.invoke(Method.java:566)
	at com.carrotsearch.randomizedtesting.RandomizedRunner.invoke(RandomizedRunner.java:1737)
	at com.carrotsearch.randomizedtesting.RandomizedRunner$6.evaluate(RandomizedRunner.java:874)
	at com.carrotsearch.randomizedtesting.RandomizedRunner$7.evaluate(RandomizedRunner.java:890)
	at com.carrotsearch.randomizedtesting.rules.StatementAdapter.evaluate(StatementAdapter.java:36)
	at com.carrotsearch.randomizedtesting.rules.SystemPropertiesRestoreRule$1.evaluate(SystemPropertiesRestoreRule.java:57)
	at org.apache.lucene.util.AbstractBeforeAfterRule$1.evaluate(AbstractBeforeAfterRule.java:45)
	at com.carrotsearch.randomizedtesting.rules.StatementAdapter.evaluate(StatementAdapter.java:36)
	at org.apache.lucene.util.TestRuleStoreClassName$1.evaluate(TestRuleStoreClassName.java:41)
	at com.carrotsearch.randomizedtesting.rules.NoShadowingOrOverridesOnMethodsRule$1.evaluate(NoShadowingOrOverridesOnMethodsRule.java:40)
	at com.carrotsearch.randomizedtesting.rules.NoShadowingOrOverridesOnMethodsRule$1.evaluate(NoShadowingOrOverridesOnMethodsRule.java:40)
	at com.carrotsearch.randomizedtesting.rules.StatementAdapter.evaluate(StatementAdapter.java:36)
	at com.carrotsearch.randomizedtesting.rules.StatementAdapter.evaluate(StatementAdapter.java:36)
	at org.apache.lucene.util.TestRuleAssertionsRequired$1.evaluate(TestRuleAssertionsRequired.java:53)
	at org.apache.lucene.util.TestRuleMarkFailure$1.evaluate(TestRuleMarkFailure.java:47)
	at org.apache.lucene.util.TestRuleIgnoreAfterMaxFailures$1.evaluate(TestRuleIgnoreAfterMaxFailures.java:64)
	at org.apache.lucene.util.TestRuleIgnoreTestSuites$1.evaluate(TestRuleIgnoreTestSuites.java:54)
	at com.carrotsearch.randomizedtesting.rules.StatementAdapter.evaluate(StatementAdapter.java:36)
	at com.carrotsearch.randomizedtesting.ThreadLeakControl$StatementRunner.run(ThreadLeakControl.java:368)
	at java.base/java.lang.Thread.run(Thread.java:834)


FAILED:  junit.framework.TestSuite.org.apache.solr.cloud.DocValuesNotIndexedTest

Error Message:
Collection not found: dv_coll

Stack Trace:
org.apache.solr.common.SolrException: Collection not found: dv_coll
	at __randomizedtesting.SeedInfo.seed([CF23536430898C8]:0)
	at org.apache.solr.client.solrj.impl.CloudSolrClient.requestWithRetryOnStaleState(CloudSolrClient.java:853)
	at org.apache.solr.client.solrj.impl.CloudSolrClient.request(CloudSolrClient.java:819)
	at org.apache.solr.client.solrj.SolrRequest.process(SolrRequest.java:194)
	at org.apache.solr.cloud.DocValuesNotIndexedTest.createCluster(DocValuesNotIndexedTest.java:154)
	at java.base/jdk.internal.reflect.NativeMethodAccessorImpl.invoke0(Native Method)
	at java.base/jdk.internal.reflect.NativeMethodAccessorImpl.invoke(NativeMethodAccessorImpl.java:62)
	at java.base/jdk.internal.reflect.DelegatingMethodAccessorImpl.invoke(DelegatingMethodAccessorImpl.java:43)
	at java.base/java.lang.reflect.Method.invoke(Method.java:566)
	at com.carrotsearch.randomizedtesting.RandomizedRunner.invoke(RandomizedRunner.java:1737)
	at com.carrotsearch.randomizedtesting.RandomizedRunner$6.evaluate(RandomizedRunner.java:874)
	at com.carrotsearch.randomizedtesting.RandomizedRunner$7.evaluate(RandomizedRunner.java:890)
	at com.carrotsearch.randomizedtesting.rules.StatementAdapter.evaluate(StatementAdapter.java:36)
	at com.carrotsearch.randomizedtesting.rules.SystemPropertiesRestoreRule$1.evaluate(SystemPropertiesRestoreRule.java:57)
	at org.apache.lucene.util.AbstractBeforeAfterRule$1.evaluate(AbstractBeforeAfterRule.java:45)
	at com.carrotsearch.randomizedtesting.rules.StatementAdapter.evaluate(StatementAdapter.java:36)
	at org.apache.lucene.util.TestRuleStoreClassName$1.evaluate(TestRuleStoreClassName.java:41)
	at com.carrotsearch.randomizedtesting.rules.NoShadowingOrOverridesOnMethodsRule$1.evaluate(NoShadowingOrOverridesOnMethodsRule.java:40)
	at com.carrotsearch.randomizedtesting.rules.NoShadowingOrOverridesOnMethodsRule$1.evaluate(NoShadowingOrOverridesOnMethodsRule.java:40)
	at com.carrotsearch.randomizedtesting.rules.StatementAdapter.evaluate(StatementAdapter.java:36)
	at com.carrotsearch.randomizedtesting.rules.StatementAdapter.evaluate(StatementAdapter.java:36)
	at org.apache.lucene.util.TestRuleAssertionsRequired$1.evaluate(TestRuleAssertionsRequired.java:53)
	at org.apache.lucene.util.TestRuleMarkFailure$1.evaluate(TestRuleMarkFailure.java:47)
	at org.apache.lucene.util.TestRuleIgnoreAfterMaxFailures$1.evaluate(TestRuleIgnoreAfterMaxFailures.java:64)
	at org.apache.lucene.util.TestRuleIgnoreTestSuites$1.evaluate(TestRuleIgnoreTestSuites.java:54)
	at com.carrotsearch.randomizedtesting.rules.StatementAdapter.evaluate(StatementAdapter.java:36)
	at com.carrotsearch.randomizedtesting.ThreadLeakControl$StatementRunner.run(ThreadLeakControl.java:368)
	at java.base/java.lang.Thread.run(Thread.java:834)


FAILED:  junit.framework.TestSuite.org.apache.solr.cloud.DocValuesNotIndexedTest

Error Message:
Collection not found: dv_coll

Stack Trace:
org.apache.solr.common.SolrException: Collection not found: dv_coll
	at __randomizedtesting.SeedInfo.seed([CF23536430898C8]:0)
	at org.apache.solr.client.solrj.impl.CloudSolrClient.requestWithRetryOnStaleState(CloudSolrClient.java:853)
	at org.apache.solr.client.solrj.impl.CloudSolrClient.request(CloudSolrClient.java:819)
	at org.apache.solr.client.solrj.SolrRequest.process(SolrRequest.java:194)
	at org.apache.solr.cloud.DocValuesNotIndexedTest.createCluster(DocValuesNotIndexedTest.java:154)
	at java.base/jdk.internal.reflect.NativeMethodAccessorImpl.invoke0(Native Method)
	at java.base/jdk.internal.reflect.NativeMethodAccessorImpl.invoke(NativeMethodAccessorImpl.java:62)
	at java.base/jdk.internal.reflect.DelegatingMethodAccessorImpl.invoke(DelegatingMethodAccessorImpl.java:43)
	at java.base/java.lang.reflect.Method.invoke(Method.java:566)
	at com.carrotsearch.randomizedtesting.RandomizedRunner.invoke(RandomizedRunner.java:1737)
	at com.carrotsearch.randomizedtesting.RandomizedRunner$6.evaluate(RandomizedRunner.java:874)
	at com.carrotsearch.randomizedtesting.RandomizedRunner$7.evaluate(RandomizedRunner.java:890)
	at com.carrotsearch.randomizedtesting.rules.StatementAdapter.evaluate(StatementAdapter.java:36)
	at com.carrotsearch.randomizedtesting.rules.SystemPropertiesRestoreRule$1.evaluate(SystemPropertiesRestoreRule.java:57)
	at org.apache.lucene.util.AbstractBeforeAfterRule$1.evaluate(AbstractBeforeAfterRule.java:45)
	at com.carrotsearch.randomizedtesting.rules.StatementAdapter.evaluate(StatementAdapter.java:36)
	at org.apache.lucene.util.TestRuleStoreClassName$1.evaluate(TestRuleStoreClassName.java:41)
	at com.carrotsearch.randomizedtesting.rules.NoShadowingOrOverridesOnMethodsRule$1.evaluate(NoShadowingOrOverridesOnMethodsRule.java:40)
	at com.carrotsearch.randomizedtesting.rules.NoShadowingOrOverridesOnMethodsRule$1.evaluate(NoShadowingOrOverridesOnMethodsRule.java:40)
	at com.carrotsearch.randomizedtesting.rules.StatementAdapter.evaluate(StatementAdapter.java:36)
	at com.carrotsearch.randomizedtesting.rules.StatementAdapter.evaluate(StatementAdapter.java:36)
	at org.apache.lucene.util.TestRuleAssertionsRequired$1.evaluate(TestRuleAssertionsRequired.java:53)
	at org.apache.lucene.util.TestRuleMarkFailure$1.evaluate(TestRuleMarkFailure.java:47)
	at org.apache.lucene.util.TestRuleIgnoreAfterMaxFailures$1.evaluate(TestRuleIgnoreAfterMaxFailures.java:64)
	at org.apache.lucene.util.TestRuleIgnoreTestSuites$1.evaluate(TestRuleIgnoreTestSuites.java:54)
	at com.carrotsearch.randomizedtesting.rules.StatementAdapter.evaluate(StatementAdapter.java:36)
	at com.carrotsearch.randomizedtesting.ThreadLeakControl$StatementRunner.run(ThreadLeakControl.java:368)
	at java.base/java.lang.Thread.run(Thread.java:834)


FAILED:  junit.framework.TestSuite.org.apache.solr.core.BlobRepositoryCloudTest

Error Message:


Stack Trace:
java.lang.NullPointerException
	at __randomizedtesting.SeedInfo.seed([CF23536430898C8]:0)
	at java.base/sun.security.ssl.SSLSessionImpl.getLocalPrincipal(SSLSessionImpl.java:661)
	at org.apache.http.impl.client.DefaultUserTokenHandler.getUserToken(DefaultUserTokenHandler.java:84)
	at org.apache.http.impl.execchain.MainClientExec.execute(MainClientExec.java:328)
	at org.apache.http.impl.execchain.ProtocolExec.execute(ProtocolExec.java:185)
	at org.apache.http.impl.execchain.RetryExec.execute(RetryExec.java:89)
	at org.apache.http.impl.execchain.RedirectExec.execute(RedirectExec.java:111)
	at org.apache.http.impl.client.InternalHttpClient.doExecute(InternalHttpClient.java:185)
	at org.apache.http.impl.client.CloseableHttpClient.execute(CloseableHttpClient.java:83)
	at org.apache.http.impl.client.CloseableHttpClient.execute(CloseableHttpClient.java:108)
	at org.apache.http.impl.client.CloseableHttpClient.execute(CloseableHttpClient.java:56)
	at org.apache.solr.handler.TestBlobHandler.postData(TestBlobHandler.java:181)
	at org.apache.solr.core.BlobRepositoryCloudTest.setupCluster(BlobRepositoryCloudTest.java:53)
	at java.base/jdk.internal.reflect.NativeMethodAccessorImpl.invoke0(Native Method)
	at java.base/jdk.internal.reflect.NativeMethodAccessorImpl.invoke(NativeMethodAccessorImpl.java:62)
	at java.base/jdk.internal.reflect.DelegatingMethodAccessorImpl.invoke(DelegatingMethodAccessorImpl.java:43)
	at java.base/java.lang.reflect.Method.invoke(Method.java:566)
	at com.carrotsearch.randomizedtesting.RandomizedRunner.invoke(RandomizedRunner.java:1737)
	at com.carrotsearch.randomizedtesting.RandomizedRunner$6.evaluate(RandomizedRunner.java:874)
	at com.carrotsearch.randomizedtesting.RandomizedRunner$7.evaluate(RandomizedRunner.java:890)
	at com.carrotsearch.randomizedtesting.rules.StatementAdapter.evaluate(StatementAdapter.java:36)
	at com.carrotsearch.randomizedtesting.rules.SystemPropertiesRestoreRule$1.evaluate(SystemPropertiesRestoreRule.java:57)
	at org.apache.lucene.util.AbstractBeforeAfterRule$1.evaluate(AbstractBeforeAfterRule.java:45)
	at com.carrotsearch.randomizedtesting.rules.StatementAdapter.evaluate(StatementAdapter.java:36)
	at org.apache.lucene.util.TestRuleStoreClassName$1.evaluate(TestRuleStoreClassName.java:41)
	at com.carrotsearch.randomizedtesting.rules.NoShadowingOrOverridesOnMethodsRule$1.evaluate(NoShadowingOrOverridesOnMethodsRule.java:40)
	at com.carrotsearch.randomizedtesting.rules.NoShadowingOrOverridesOnMethodsRule$1.evaluate(NoShadowingOrOverridesOnMethodsRule.java:40)
	at com.carrotsearch.randomizedtesting.rules.StatementAdapter.evaluate(StatementAdapter.java:36)
	at com.carrotsearch.randomizedtesting.rules.StatementAdapter.evaluate(StatementAdapter.java:36)
	at org.apache.lucene.util.TestRuleAssertionsRequired$1.evaluate(TestRuleAssertionsRequired.java:53)
	at org.apache.lucene.util.TestRuleMarkFailure$1.evaluate(TestRuleMarkFailure.java:47)
	at org.apache.lucene.util.TestRuleIgnoreAfterMaxFailures$1.evaluate(TestRuleIgnoreAfterMaxFailures.java:64)
	at org.apache.lucene.util.TestRuleIgnoreTestSuites$1.evaluate(TestRuleIgnoreTestSuites.java:54)
	at com.carrotsearch.randomizedtesting.rules.StatementAdapter.evaluate(StatementAdapter.java:36)
	at com.carrotsearch.randomizedtesting.ThreadLeakControl$StatementRunner.run(ThreadLeakControl.java:368)
	at java.base/java.lang.Thread.run(Thread.java:834)


FAILED:  junit.framework.TestSuite.org.apache.solr.core.BlobRepositoryCloudTest

Error Message:


Stack Trace:
java.lang.NullPointerException
	at __randomizedtesting.SeedInfo.seed([CF23536430898C8]:0)
	at java.base/sun.security.ssl.SSLSessionImpl.getLocalPrincipal(SSLSessionImpl.java:661)
	at org.apache.http.impl.client.DefaultUserTokenHandler.getUserToken(DefaultUserTokenHandler.java:84)
	at org.apache.http.impl.execchain.MainClientExec.execute(MainClientExec.java:328)
	at org.apache.http.impl.execchain.ProtocolExec.execute(ProtocolExec.java:185)
	at org.apache.http.impl.execchain.RetryExec.execute(RetryExec.java:89)
	at org.apache.http.impl.execchain.RedirectExec.execute(RedirectExec.java:111)
	at org.apache.http.impl.client.InternalHttpClient.doExecute(InternalHttpClient.java:185)
	at org.apache.http.impl.client.CloseableHttpClient.execute(CloseableHttpClient.java:83)
	at org.apache.http.impl.client.CloseableHttpClient.execute(CloseableHttpClient.java:108)
	at org.apache.http.impl.client.CloseableHttpClient.execute(CloseableHttpClient.java:56)
	at org.apache.solr.handler.TestBlobHandler.postData(TestBlobHandler.java:181)
	at org.apache.solr.core.BlobRepositoryCloudTest.setupCluster(BlobRepositoryCloudTest.java:53)
	at java.base/jdk.internal.reflect.NativeMethodAccessorImpl.invoke0(Native Method)
	at java.base/jdk.internal.reflect.NativeMethodAccessorImpl.invoke(NativeMethodAccessorImpl.java:62)
	at java.base/jdk.internal.reflect.DelegatingMethodAccessorImpl.invoke(DelegatingMethodAccessorImpl.java:43)
	at java.base/java.lang.reflect.Method.invoke(Method.java:566)
	at com.carrotsearch.randomizedtesting.RandomizedRunner.invoke(RandomizedRunner.java:1737)
	at com.carrotsearch.randomizedtesting.RandomizedRunner$6.evaluate(RandomizedRunner.java:874)
	at com.carrotsearch.randomizedtesting.RandomizedRunner$7.evaluate(RandomizedRunner.java:890)
	at com.carrotsearch.randomizedtesting.rules.StatementAdapter.evaluate(StatementAdapter.java:36)
	at com.carrotsearch.randomizedtesting.rules.SystemPropertiesRestoreRule$1.evaluate(SystemPropertiesRestoreRule.java:57)
	at org.apache.lucene.util.AbstractBeforeAfterRule$1.evaluate(AbstractBeforeAfterRule.java:45)
	at com.carrotsearch.randomizedtesting.rules.StatementAdapter.evaluate(StatementAdapter.java:36)
	at org.apache.lucene.util.TestRuleStoreClassName$1.evaluate(TestRuleStoreClassName.java:41)
	at com.carrotsearch.randomizedtesting.rules.NoShadowingOrOverridesOnMethodsRule$1.evaluate(NoShadowingOrOverridesOnMethodsRule.java:40)
	at com.carrotsearch.randomizedtesting.rules.NoShadowingOrOverridesOnMethodsRule$1.evaluate(NoShadowingOrOverridesOnMethodsRule.java:40)
	at com.carrotsearch.randomizedtesting.rules.StatementAdapter.evaluate(StatementAdapter.java:36)
	at com.carrotsearch.randomizedtesting.rules.StatementAdapter.evaluate(StatementAdapter.java:36)
	at org.apache.lucene.util.TestRuleAssertionsRequired$1.evaluate(TestRuleAssertionsRequired.java:53)
	at org.apache.lucene.util.TestRuleMarkFailure$1.evaluate(TestRuleMarkFailure.java:47)
	at org.apache.lucene.util.TestRuleIgnoreAfterMaxFailures$1.evaluate(TestRuleIgnoreAfterMaxFailures.java:64)
	at org.apache.lucene.util.TestRuleIgnoreTestSuites$1.evaluate(TestRuleIgnoreTestSuites.java:54)
	at com.carrotsearch.randomizedtesting.rules.StatementAdapter.evaluate(StatementAdapter.java:36)
	at com.carrotsearch.randomizedtesting.ThreadLeakControl$StatementRunner.run(ThreadLeakControl.java:368)
	at java.base/java.lang.Thread.run(Thread.java:834)


FAILED:  junit.framework.TestSuite.org.apache.solr.core.BlobRepositoryCloudTest

Error Message:


Stack Trace:
java.lang.NullPointerException
	at __randomizedtesting.SeedInfo.seed([CF23536430898C8]:0)
	at java.base/sun.security.ssl.SSLSessionImpl.getLocalPrincipal(SSLSessionImpl.java:661)
	at org.apache.http.impl.client.DefaultUserTokenHandler.getUserToken(DefaultUserTokenHandler.java:84)
	at org.apache.http.impl.execchain.MainClientExec.execute(MainClientExec.java:328)
	at org.apache.http.impl.execchain.ProtocolExec.execute(ProtocolExec.java:185)
	at org.apache.http.impl.execchain.RetryExec.execute(RetryExec.java:89)
	at org.apache.http.impl.execchain.RedirectExec.execute(RedirectExec.java:111)
	at org.apache.http.impl.client.InternalHttpClient.doExecute(InternalHttpClient.java:185)
	at org.apache.http.impl.client.CloseableHttpClient.execute(CloseableHttpClient.java:83)
	at org.apache.http.impl.client.CloseableHttpClient.execute(CloseableHttpClient.java:108)
	at org.apache.http.impl.client.CloseableHttpClient.execute(CloseableHttpClient.java:56)
	at org.apache.solr.handler.TestBlobHandler.postData(TestBlobHandler.java:181)
	at org.apache.solr.core.BlobRepositoryCloudTest.setupCluster(BlobRepositoryCloudTest.java:53)
	at java.base/jdk.internal.reflect.NativeMethodAccessorImpl.invoke0(Native Method)
	at java.base/jdk.internal.reflect.NativeMethodAccessorImpl.invoke(NativeMethodAccessorImpl.java:62)
	at java.base/jdk.internal.reflect.DelegatingMethodAccessorImpl.invoke(DelegatingMethodAccessorImpl.java:43)
	at java.base/java.lang.reflect.Method.invoke(Method.java:566)
	at com.carrotsearch.randomizedtesting.RandomizedRunner.invoke(RandomizedRunner.java:1737)
	at com.carrotsearch.randomizedtesting.RandomizedRunner$6.evaluate(RandomizedRunner.java:874)
	at com.carrotsearch.randomizedtesting.RandomizedRunner$7.evaluate(RandomizedRunner.java:890)
	at com.carrotsearch.randomizedtesting.rules.StatementAdapter.evaluate(StatementAdapter.java:36)
	at com.carrotsearch.randomizedtesting.rules.SystemPropertiesRestoreRule$1.evaluate(SystemPropertiesRestoreRule.java:57)
	at org.apache.lucene.util.AbstractBeforeAfterRule$1.evaluate(AbstractBeforeAfterRule.java:45)
	at com.carrotsearch.randomizedtesting.rules.StatementAdapter.evaluate(StatementAdapter.java:36)
	at org.apache.lucene.util.TestRuleStoreClassName$1.evaluate(TestRuleStoreClassName.java:41)
	at com.carrotsearch.randomizedtesting.rules.NoShadowingOrOverridesOnMethodsRule$1.evaluate(NoShadowingOrOverridesOnMethodsRule.java:40)
	at com.carrotsearch.randomizedtesting.rules.NoShadowingOrOverridesOnMethodsRule$1.evaluate(NoShadowingOrOverridesOnMethodsRule.java:40)
	at com.carrotsearch.randomizedtesting.rules.StatementAdapter.evaluate(StatementAdapter.java:36)
	at com.carrotsearch.randomizedtesting.rules.StatementAdapter.evaluate(StatementAdapter.java:36)
	at org.apache.lucene.util.TestRuleAssertionsRequired$1.evaluate(TestRuleAssertionsRequired.java:53)
	at org.apache.lucene.util.TestRuleMarkFailure$1.evaluate(TestRuleMarkFailure.java:47)
	at org.apache.lucene.util.TestRuleIgnoreAfterMaxFailures$1.evaluate(TestRuleIgnoreAfterMaxFailures.java:64)
	at org.apache.lucene.util.TestRuleIgnoreTestSuites$1.evaluate(TestRuleIgnoreTestSuites.java:54)
	at com.carrotsearch.randomizedtesting.rules.StatementAdapter.evaluate(StatementAdapter.java:36)
	at com.carrotsearch.randomizedtesting.ThreadLeakControl$StatementRunner.run(ThreadLeakControl.java:368)
	at java.base/java.lang.Thread.run(Thread.java:834)


FAILED:  junit.framework.TestSuite.org.apache.solr.core.BlobRepositoryCloudTest

Error Message:


Stack Trace:
java.lang.NullPointerException
	at __randomizedtesting.SeedInfo.seed([CF23536430898C8]:0)
	at java.base/sun.security.ssl.SSLSessionImpl.getLocalPrincipal(SSLSessionImpl.java:661)
	at org.apache.http.impl.client.DefaultUserTokenHandler.getUserToken(DefaultUserTokenHandler.java:84)
	at org.apache.http.impl.execchain.MainClientExec.execute(MainClientExec.java:328)
	at org.apache.http.impl.execchain.ProtocolExec.execute(ProtocolExec.java:185)
	at org.apache.http.impl.execchain.RetryExec.execute(RetryExec.java:89)
	at org.apache.http.impl.execchain.RedirectExec.execute(RedirectExec.java:111)
	at org.apache.http.impl.client.InternalHttpClient.doExecute(InternalHttpClient.java:185)
	at org.apache.http.impl.client.CloseableHttpClient.execute(CloseableHttpClient.java:83)
	at org.apache.http.impl.client.CloseableHttpClient.execute(CloseableHttpClient.java:108)
	at org.apache.http.impl.client.CloseableHttpClient.execute(CloseableHttpClient.java:56)
	at org.apache.solr.handler.TestBlobHandler.postData(TestBlobHandler.java:181)
	at org.apache.solr.core.BlobRepositoryCloudTest.setupCluster(BlobRepositoryCloudTest.java:53)
	at java.base/jdk.internal.reflect.NativeMethodAccessorImpl.invoke0(Native Method)
	at java.base/jdk.internal.reflect.NativeMethodAccessorImpl.invoke(NativeMethodAccessorImpl.java:62)
	at java.base/jdk.internal.reflect.DelegatingMethodAccessorImpl.invoke(DelegatingMethodAccessorImpl.java:43)
	at java.base/java.lang.reflect.Method.invoke(Method.java:566)
	at com.carrotsearch.randomizedtesting.RandomizedRunner.invoke(RandomizedRunner.java:1737)
	at com.carrotsearch.randomizedtesting.RandomizedRunner$6.evaluate(RandomizedRunner.java:874)
	at com.carrotsearch.randomizedtesting.RandomizedRunner$7.evaluate(RandomizedRunner.java:890)
	at com.carrotsearch.randomizedtesting.rules.StatementAdapter.evaluate(StatementAdapter.java:36)
	at com.carrotsearch.randomizedtesting.rules.SystemPropertiesRestoreRule$1.evaluate(SystemPropertiesRestoreRule.java:57)
	at org.apache.lucene.util.AbstractBeforeAfterRule$1.evaluate(AbstractBeforeAfterRule.java:45)
	at com.carrotsearch.randomizedtesting.rules.StatementAdapter.evaluate(StatementAdapter.java:36)
	at org.apache.lucene.util.TestRuleStoreClassName$1.evaluate(TestRuleStoreClassName.java:41)
	at com.carrotsearch.randomizedtesting.rules.NoShadowingOrOverridesOnMethodsRule$1.evaluate(NoShadowingOrOverridesOnMethodsRule.java:40)
	at com.carrotsearch.randomizedtesting.rules.NoShadowingOrOverridesOnMethodsRule$1.evaluate(NoShadowingOrOverridesOnMethodsRule.java:40)
	at com.carrotsearch.randomizedtesting.rules.StatementAdapter.evaluate(StatementAdapter.java:36)
	at com.carrotsearch.randomizedtesting.rules.StatementAdapter.evaluate(StatementAdapter.java:36)
	at org.apache.lucene.util.TestRuleAssertionsRequired$1.evaluate(TestRuleAssertionsRequired.java:53)
	at org.apache.lucene.util.TestRuleMarkFailure$1.evaluate(TestRuleMarkFailure.java:47)
	at org.apache.lucene.util.TestRuleIgnoreAfterMaxFailures$1.evaluate(TestRuleIgnoreAfterMaxFailures.java:64)
	at org.apache.lucene.util.TestRuleIgnoreTestSuites$1.evaluate(TestRuleIgnoreTestSuites.java:54)
	at com.carrotsearch.randomizedtesting.rules.StatementAdapter.evaluate(StatementAdapter.java:36)
	at com.carrotsearch.randomizedtesting.ThreadLeakControl$StatementRunner.run(ThreadLeakControl.java:368)
	at java.base/java.lang.Thread.run(Thread.java:834)


FAILED:  junit.framework.TestSuite.org.apache.solr.core.BlobRepositoryCloudTest

Error Message:


Stack Trace:
java.lang.NullPointerException
	at __randomizedtesting.SeedInfo.seed([CF23536430898C8]:0)
	at java.base/sun.security.ssl.SSLSessionImpl.getLocalPrincipal(SSLSessionImpl.java:661)
	at org.apache.http.impl.client.DefaultUserTokenHandler.getUserToken(DefaultUserTokenHandler.java:84)
	at org.apache.http.impl.execchain.MainClientExec.execute(MainClientExec.java:328)
	at org.apache.http.impl.execchain.ProtocolExec.execute(ProtocolExec.java:185)
	at org.apache.http.impl.execchain.RetryExec.execute(RetryExec.java:89)
	at org.apache.http.impl.execchain.RedirectExec.execute(RedirectExec.java:111)
	at org.apache.http.impl.client.InternalHttpClient.doExecute(InternalHttpClient.java:185)
	at org.apache.http.impl.client.CloseableHttpClient.execute(CloseableHttpClient.java:83)
	at org.apache.http.impl.client.CloseableHttpClient.execute(CloseableHttpClient.java:108)
	at org.apache.http.impl.client.CloseableHttpClient.execute(CloseableHttpClient.java:56)
	at org.apache.solr.handler.TestBlobHandler.postData(TestBlobHandler.java:181)
	at org.apache.solr.core.BlobRepositoryCloudTest.setupCluster(BlobRepositoryCloudTest.java:53)
	at java.base/jdk.internal.reflect.NativeMethodAccessorImpl.invoke0(Native Method)
	at java.base/jdk.internal.reflect.NativeMethodAccessorImpl.invoke(NativeMethodAccessorImpl.java:62)
	at java.base/jdk.internal.reflect.DelegatingMethodAccessorImpl.invoke(DelegatingMethodAccessorImpl.java:43)
	at java.base/java.lang.reflect.Method.invoke(Method.java:566)
	at com.carrotsearch.randomizedtesting.RandomizedRunner.invoke(RandomizedRunner.java:1737)
	at com.carrotsearch.randomizedtesting.RandomizedRunner$6.evaluate(RandomizedRunner.java:874)
	at com.carrotsearch.randomizedtesting.RandomizedRunner$7.evaluate(RandomizedRunner.java:890)
	at com.carrotsearch.randomizedtesting.rules.StatementAdapter.evaluate(StatementAdapter.java:36)
	at com.carrotsearch.randomizedtesting.rules.SystemPropertiesRestoreRule$1.evaluate(SystemPropertiesRestoreRule.java:57)
	at org.apache.lucene.util.AbstractBeforeAfterRule$1.evaluate(AbstractBeforeAfterRule.java:45)
	at com.carrotsearch.randomizedtesting.rules.StatementAdapter.evaluate(StatementAdapter.java:36)
	at org.apache.lucene.util.TestRuleStoreClassName$1.evaluate(TestRuleStoreClassName.java:41)
	at com.carrotsearch.randomizedtesting.rules.NoShadowingOrOverridesOnMethodsRule$1.evaluate(NoShadowingOrOverridesOnMethodsRule.java:40)
	at com.carrotsearch.randomizedtesting.rules.NoShadowingOrOverridesOnMethodsRule$1.evaluate(NoShadowingOrOverridesOnMethodsRule.java:40)
	at com.carrotsearch.randomizedtesting.rules.StatementAdapter.evaluate(StatementAdapter.java:36)
	at com.carrotsearch.randomizedtesting.rules.StatementAdapter.evaluate(StatementAdapter.java:36)
	at org.apache.lucene.util.TestRuleAssertionsRequired$1.evaluate(TestRuleAssertionsRequired.java:53)
	at org.apache.lucene.util.TestRuleMarkFailure$1.evaluate(TestRuleMarkFailure.java:47)
	at org.apache.lucene.util.TestRuleIgnoreAfterMaxFailures$1.evaluate(TestRuleIgnoreAfterMaxFailures.java:64)
	at org.apache.lucene.util.TestRuleIgnoreTestSuites$1.evaluate(TestRuleIgnoreTestSuites.java:54)
	at com.carrotsearch.randomizedtesting.rules.StatementAdapter.evaluate(StatementAdapter.java:36)
	at com.carrotsearch.randomizedtesting.ThreadLeakControl$StatementRunner.run(ThreadLeakControl.java:368)
	at java.base/java.lang.Thread.run(Thread.java:834)


FAILED:  junit.framework.TestSuite.org.apache.solr.core.BlobRepositoryCloudTest

Error Message:


Stack Trace:
java.lang.NullPointerException
	at __randomizedtesting.SeedInfo.seed([CF23536430898C8]:0)
	at java.base/sun.security.ssl.SSLSessionImpl.getLocalPrincipal(SSLSessionImpl.java:661)
	at org.apache.http.impl.client.DefaultUserTokenHandler.getUserToken(DefaultUserTokenHandler.java:84)
	at org.apache.http.impl.execchain.MainClientExec.execute(MainClientExec.java:328)
	at org.apache.http.impl.execchain.ProtocolExec.execute(ProtocolExec.java:185)
	at org.apache.http.impl.execchain.RetryExec.execute(RetryExec.java:89)
	at org.apache.http.impl.execchain.RedirectExec.execute(RedirectExec.java:111)
	at org.apache.http.impl.client.InternalHttpClient.doExecute(InternalHttpClient.java:185)
	at org.apache.http.impl.client.CloseableHttpClient.execute(CloseableHttpClient.java:83)
	at org.apache.http.impl.client.CloseableHttpClient.execute(CloseableHttpClient.java:108)
	at org.apache.http.impl.client.CloseableHttpClient.execute(CloseableHttpClient.java:56)
	at org.apache.solr.handler.TestBlobHandler.postData(TestBlobHandler.java:181)
	at org.apache.solr.core.BlobRepositoryCloudTest.setupCluster(BlobRepositoryCloudTest.java:53)
	at java.base/jdk.internal.reflect.NativeMethodAccessorImpl.invoke0(Native Method)
	at java.base/jdk.internal.reflect.NativeMethodAccessorImpl.invoke(NativeMethodAccessorImpl.java:62)
	at java.base/jdk.internal.reflect.DelegatingMethodAccessorImpl.invoke(DelegatingMethodAccessorImpl.java:43)
	at java.base/java.lang.reflect.Method.invoke(Method.java:566)
	at com.carrotsearch.randomizedtesting.RandomizedRunner.invoke(RandomizedRunner.java:1737)
	at com.carrotsearch.randomizedtesting.RandomizedRunner$6.evaluate(RandomizedRunner.java:874)
	at com.carrotsearch.randomizedtesting.RandomizedRunner$7.evaluate(RandomizedRunner.java:890)
	at com.carrotsearch.randomizedtesting.rules.StatementAdapter.evaluate(StatementAdapter.java:36)
	at com.carrotsearch.randomizedtesting.rules.SystemPropertiesRestoreRule$1.evaluate(SystemPropertiesRestoreRule.java:57)
	at org.apache.lucene.util.AbstractBeforeAfterRule$1.evaluate(AbstractBeforeAfterRule.java:45)
	at com.carrotsearch.randomizedtesting.rules.StatementAdapter.evaluate(StatementAdapter.java:36)
	at org.apache.lucene.util.TestRuleStoreClassName$1.evaluate(TestRuleStoreClassName.java:41)
	at com.carrotsearch.randomizedtesting.rules.NoShadowingOrOverridesOnMethodsRule$1.evaluate(NoShadowingOrOverridesOnMethodsRule.java:40)
	at com.carrotsearch.randomizedtesting.rules.NoShadowingOrOverridesOnMethodsRule$1.evaluate(NoShadowingOrOverridesOnMethodsRule.java:40)
	at com.carrotsearch.randomizedtesting.rules.StatementAdapter.evaluate(StatementAdapter.java:36)
	at com.carrotsearch.randomizedtesting.rules.StatementAdapter.evaluate(StatementAdapter.java:36)
	at org.apache.lucene.util.TestRuleAssertionsRequired$1.evaluate(TestRuleAssertionsRequired.java:53)
	at org.apache.lucene.util.TestRuleMarkFailure$1.evaluate(TestRuleMarkFailure.java:47)
	at org.apache.lucene.util.TestRuleIgnoreAfterMaxFailures$1.evaluate(TestRuleIgnoreAfterMaxFailures.java:64)
	at org.apache.lucene.util.TestRuleIgnoreTestSuites$1.evaluate(TestRuleIgnoreTestSuites.java:54)
	at com.carrotsearch.randomizedtesting.rules.StatementAdapter.evaluate(StatementAdapter.java:36)
	at com.carrotsearch.randomizedtesting.ThreadLeakControl$StatementRunner.run(ThreadLeakControl.java:368)
	at java.base/java.lang.Thread.run(Thread.java:834)


FAILED:  junit.framework.TestSuite.org.apache.solr.handler.TestSQLHandler

Error Message:
1 thread leaked from SUITE scope at org.apache.solr.handler.TestSQLHandler:     1) Thread[id=4017, name=Connection evictor, state=TIMED_WAITING, group=TGRP-TestSQLHandler]         at java.base@11-ea/java.lang.Thread.sleep(Native Method)         at app//org.apache.http.impl.client.IdleConnectionEvictor$1.run(IdleConnectionEvictor.java:66)         at java.base@11-ea/java.lang.Thread.run(Thread.java:834)

Stack Trace:
com.carrotsearch.randomizedtesting.ThreadLeakError: 1 thread leaked from SUITE scope at org.apache.solr.handler.TestSQLHandler: 
   1) Thread[id=4017, name=Connection evictor, state=TIMED_WAITING, group=TGRP-TestSQLHandler]
        at java.base@11-ea/java.lang.Thread.sleep(Native Method)
        at app//org.apache.http.impl.client.IdleConnectionEvictor$1.run(IdleConnectionEvictor.java:66)
        at java.base@11-ea/java.lang.Thread.run(Thread.java:834)
	at __randomizedtesting.SeedInfo.seed([CF23536430898C8]:0)


FAILED:  junit.framework.TestSuite.org.apache.solr.handler.TestSQLHandler

Error Message:
1 thread leaked from SUITE scope at org.apache.solr.handler.TestSQLHandler:     1) Thread[id=5761, name=Connection evictor, state=TIMED_WAITING, group=TGRP-TestSQLHandler]         at java.base@11-ea/java.lang.Thread.sleep(Native Method)         at app//org.apache.http.impl.client.IdleConnectionEvictor$1.run(IdleConnectionEvictor.java:66)         at java.base@11-ea/java.lang.Thread.run(Thread.java:834)

Stack Trace:
com.carrotsearch.randomizedtesting.ThreadLeakError: 1 thread leaked from SUITE scope at org.apache.solr.handler.TestSQLHandler: 
   1) Thread[id=5761, name=Connection evictor, state=TIMED_WAITING, group=TGRP-TestSQLHandler]
        at java.base@11-ea/java.lang.Thread.sleep(Native Method)
        at app//org.apache.http.impl.client.IdleConnectionEvictor$1.run(IdleConnectionEvictor.java:66)
        at java.base@11-ea/java.lang.Thread.run(Thread.java:834)
	at __randomizedtesting.SeedInfo.seed([CF23536430898C8]:0)


FAILED:  junit.framework.TestSuite.org.apache.solr.handler.TestSQLHandler

Error Message:
1 thread leaked from SUITE scope at org.apache.solr.handler.TestSQLHandler:     1) Thread[id=6096, name=Connection evictor, state=TIMED_WAITING, group=TGRP-TestSQLHandler]         at java.base@11-ea/java.lang.Thread.sleep(Native Method)         at app//org.apache.http.impl.client.IdleConnectionEvictor$1.run(IdleConnectionEvictor.java:66)         at java.base@11-ea/java.lang.Thread.run(Thread.java:834)

Stack Trace:
com.carrotsearch.randomizedtesting.ThreadLeakError: 1 thread leaked from SUITE scope at org.apache.solr.handler.TestSQLHandler: 
   1) Thread[id=6096, name=Connection evictor, state=TIMED_WAITING, group=TGRP-TestSQLHandler]
        at java.base@11-ea/java.lang.Thread.sleep(Native Method)
        at app//org.apache.http.impl.client.IdleConnectionEvictor$1.run(IdleConnectionEvictor.java:66)
        at java.base@11-ea/java.lang.Thread.run(Thread.java:834)
	at __randomizedtesting.SeedInfo.seed([CF23536430898C8]:0)


FAILED:  junit.framework.TestSuite.org.apache.solr.handler.TestSQLHandler

Error Message:
1 thread leaked from SUITE scope at org.apache.solr.handler.TestSQLHandler:     1) Thread[id=24900, name=Connection evictor, state=TIMED_WAITING, group=TGRP-TestSQLHandler]         at java.base@11-ea/java.lang.Thread.sleep(Native Method)         at app//org.apache.http.impl.client.IdleConnectionEvictor$1.run(IdleConnectionEvictor.java:66)         at java.base@11-ea/java.lang.Thread.run(Thread.java:834)

Stack Trace:
com.carrotsearch.randomizedtesting.ThreadLeakError: 1 thread leaked from SUITE scope at org.apache.solr.handler.TestSQLHandler: 
   1) Thread[id=24900, name=Connection evictor, state=TIMED_WAITING, group=TGRP-TestSQLHandler]
        at java.base@11-ea/java.lang.Thread.sleep(Native Method)
        at app//org.apache.http.impl.client.IdleConnectionEvictor$1.run(IdleConnectionEvictor.java:66)
        at java.base@11-ea/java.lang.Thread.run(Thread.java:834)
	at __randomizedtesting.SeedInfo.seed([CF23536430898C8]:0)


FAILED:  junit.framework.TestSuite.org.apache.solr.servlet.HttpSolrCallGetCoreTest

Error Message:
Could not find collection:collection1

Stack Trace:
java.lang.AssertionError: Could not find collection:collection1
	at __randomizedtesting.SeedInfo.seed([CF23536430898C8]:0)
	at org.junit.Assert.fail(Assert.java:93)
	at org.junit.Assert.assertTrue(Assert.java:43)
	at org.junit.Assert.assertNotNull(Assert.java:526)
	at org.apache.solr.cloud.AbstractDistribZkTestBase.waitForRecoveriesToFinish(AbstractDistribZkTestBase.java:155)
	at org.apache.solr.servlet.HttpSolrCallGetCoreTest.setupCluster(HttpSolrCallGetCoreTest.java:52)
	at java.base/jdk.internal.reflect.NativeMethodAccessorImpl.invoke0(Native Method)
	at java.base/jdk.internal.reflect.NativeMethodAccessorImpl.invoke(NativeMethodAccessorImpl.java:62)
	at java.base/jdk.internal.reflect.DelegatingMethodAccessorImpl.invoke(DelegatingMethodAccessorImpl.java:43)
	at java.base/java.lang.reflect.Method.invoke(Method.java:566)
	at com.carrotsearch.randomizedtesting.RandomizedRunner.invoke(RandomizedRunner.java:1737)
	at com.carrotsearch.randomizedtesting.RandomizedRunner$6.evaluate(RandomizedRunner.java:874)
	at com.carrotsearch.randomizedtesting.RandomizedRunner$7.evaluate(RandomizedRunner.java:890)
	at com.carrotsearch.randomizedtesting.rules.StatementAdapter.evaluate(StatementAdapter.java:36)
	at com.carrotsearch.randomizedtesting.rules.SystemPropertiesRestoreRule$1.evaluate(SystemPropertiesRestoreRule.java:57)
	at org.apache.lucene.util.AbstractBeforeAfterRule$1.evaluate(AbstractBeforeAfterRule.java:45)
	at com.carrotsearch.randomizedtesting.rules.StatementAdapter.evaluate(StatementAdapter.java:36)
	at org.apache.lucene.util.TestRuleStoreClassName$1.evaluate(TestRuleStoreClassName.java:41)
	at com.carrotsearch.randomizedtesting.rules.NoShadowingOrOverridesOnMethodsRule$1.evaluate(NoShadowingOrOverridesOnMethodsRule.java:40)
	at com.carrotsearch.randomizedtesting.rules.NoShadowingOrOverridesOnMethodsRule$1.evaluate(NoShadowingOrOverridesOnMethodsRule.java:40)
	at com.carrotsearch.randomizedtesting.rules.StatementAdapter.evaluate(StatementAdapter.java:36)
	at com.carrotsearch.randomizedtesting.rules.StatementAdapter.evaluate(StatementAdapter.java:36)
	at org.apache.lucene.util.TestRuleAssertionsRequired$1.evaluate(TestRuleAssertionsRequired.java:53)
	at org.apache.lucene.util.TestRuleMarkFailure$1.evaluate(TestRuleMarkFailure.java:47)
	at org.apache.lucene.util.TestRuleIgnoreAfterMaxFailures$1.evaluate(TestRuleIgnoreAfterMaxFailures.java:64)
	at org.apache.lucene.util.TestRuleIgnoreTestSuites$1.evaluate(TestRuleIgnoreTestSuites.java:54)
	at com.carrotsearch.randomizedtesting.rules.StatementAdapter.evaluate(StatementAdapter.java:36)
	at com.carrotsearch.randomizedtesting.ThreadLeakControl$StatementRunner.run(ThreadLeakControl.java:368)
	at java.base/java.lang.Thread.run(Thread.java:834)


FAILED:  junit.framework.TestSuite.org.apache.solr.servlet.HttpSolrCallGetCoreTest

Error Message:
Could not find collection:collection1

Stack Trace:
java.lang.AssertionError: Could not find collection:collection1
	at __randomizedtesting.SeedInfo.seed([CF23536430898C8]:0)
	at org.junit.Assert.fail(Assert.java:93)
	at org.junit.Assert.assertTrue(Assert.java:43)
	at org.junit.Assert.assertNotNull(Assert.java:526)
	at org.apache.solr.cloud.AbstractDistribZkTestBase.waitForRecoveriesToFinish(AbstractDistribZkTestBase.java:155)
	at org.apache.solr.servlet.HttpSolrCallGetCoreTest.setupCluster(HttpSolrCallGetCoreTest.java:52)
	at java.base/jdk.internal.reflect.NativeMethodAccessorImpl.invoke0(Native Method)
	at java.base/jdk.internal.reflect.NativeMethodAccessorImpl.invoke(NativeMethodAccessorImpl.java:62)
	at java.base/jdk.internal.reflect.DelegatingMethodAccessorImpl.invoke(DelegatingMethodAccessorImpl.java:43)
	at java.base/java.lang.reflect.Method.invoke(Method.java:566)
	at com.carrotsearch.randomizedtesting.RandomizedRunner.invoke(RandomizedRunner.java:1737)
	at com.carrotsearch.randomizedtesting.RandomizedRunner$6.evaluate(RandomizedRunner.java:874)
	at com.carrotsearch.randomizedtesting.RandomizedRunner$7.evaluate(RandomizedRunner.java:890)
	at com.carrotsearch.randomizedtesting.rules.StatementAdapter.evaluate(StatementAdapter.java:36)
	at com.carrotsearch.randomizedtesting.rules.SystemPropertiesRestoreRule$1.evaluate(SystemPropertiesRestoreRule.java:57)
	at org.apache.lucene.util.AbstractBeforeAfterRule$1.evaluate(AbstractBeforeAfterRule.java:45)
	at com.carrotsearch.randomizedtesting.rules.StatementAdapter.evaluate(StatementAdapter.java:36)
	at org.apache.lucene.util.TestRuleStoreClassName$1.evaluate(TestRuleStoreClassName.java:41)
	at com.carrotsearch.randomizedtesting.rules.NoShadowingOrOverridesOnMethodsRule$1.evaluate(NoShadowingOrOverridesOnMethodsRule.java:40)
	at com.carrotsearch.randomizedtesting.rules.NoShadowingOrOverridesOnMethodsRule$1.evaluate(NoShadowingOrOverridesOnMethodsRule.java:40)
	at com.carrotsearch.randomizedtesting.rules.StatementAdapter.evaluate(StatementAdapter.java:36)
	at com.carrotsearch.randomizedtesting.rules.StatementAdapter.evaluate(StatementAdapter.java:36)
	at org.apache.lucene.util.TestRuleAssertionsRequired$1.evaluate(TestRuleAssertionsRequired.java:53)
	at org.apache.lucene.util.TestRuleMarkFailure$1.evaluate(TestRuleMarkFailure.java:47)
	at org.apache.lucene.util.TestRuleIgnoreAfterMaxFailures$1.evaluate(TestRuleIgnoreAfterMaxFailures.java:64)
	at org.apache.lucene.util.TestRuleIgnoreTestSuites$1.evaluate(TestRuleIgnoreTestSuites.java:54)
	at com.carrotsearch.randomizedtesting.rules.StatementAdapter.evaluate(StatementAdapter.java:36)
	at com.carrotsearch.randomizedtesting.ThreadLeakControl$StatementRunner.run(ThreadLeakControl.java:368)
	at java.base/java.lang.Thread.run(Thread.java:834)


FAILED:  junit.framework.TestSuite.org.apache.solr.client.solrj.embedded.LargeVolumeBinaryJettyTest

Error Message:
1 thread leaked from SUITE scope at org.apache.solr.client.solrj.embedded.LargeVolumeBinaryJettyTest:     1) Thread[id=1020, name=Connection evictor, state=TIMED_WAITING, group=TGRP-LargeVolumeBinaryJettyTest]         at java.base@11-ea/java.lang.Thread.sleep(Native Method)         at app//org.apache.http.impl.client.IdleConnectionEvictor$1.run(IdleConnectionEvictor.java:66)         at java.base@11-ea/java.lang.Thread.run(Thread.java:834)

Stack Trace:
com.carrotsearch.randomizedtesting.ThreadLeakError: 1 thread leaked from SUITE scope at org.apache.solr.client.solrj.embedded.LargeVolumeBinaryJettyTest: 
   1) Thread[id=1020, name=Connection evictor, state=TIMED_WAITING, group=TGRP-LargeVolumeBinaryJettyTest]
        at java.base@11-ea/java.lang.Thread.sleep(Native Method)
        at app//org.apache.http.impl.client.IdleConnectionEvictor$1.run(IdleConnectionEvictor.java:66)
        at java.base@11-ea/java.lang.Thread.run(Thread.java:834)
	at __randomizedtesting.SeedInfo.seed([22E959E9246CE75]:0)


FAILED:  junit.framework.TestSuite.org.apache.solr.client.solrj.embedded.LargeVolumeJettyTest

Error Message:
1 thread leaked from SUITE scope at org.apache.solr.client.solrj.embedded.LargeVolumeJettyTest:     1) Thread[id=105, name=Connection evictor, state=TIMED_WAITING, group=TGRP-LargeVolumeJettyTest]         at java.base@11-ea/java.lang.Thread.sleep(Native Method)         at app//org.apache.http.impl.client.IdleConnectionEvictor$1.run(IdleConnectionEvictor.java:66)         at java.base@11-ea/java.lang.Thread.run(Thread.java:834)

Stack Trace:
com.carrotsearch.randomizedtesting.ThreadLeakError: 1 thread leaked from SUITE scope at org.apache.solr.client.solrj.embedded.LargeVolumeJettyTest: 
   1) Thread[id=105, name=Connection evictor, state=TIMED_WAITING, group=TGRP-LargeVolumeJettyTest]
        at java.base@11-ea/java.lang.Thread.sleep(Native Method)
        at app//org.apache.http.impl.client.IdleConnectionEvictor$1.run(IdleConnectionEvictor.java:66)
        at java.base@11-ea/java.lang.Thread.run(Thread.java:834)
	at __randomizedtesting.SeedInfo.seed([22E959E9246CE75]:0)


FAILED:  junit.framework.TestSuite.org.apache.solr.client.solrj.io.graph.GraphExpressionTest

Error Message:
6 threads leaked from SUITE scope at org.apache.solr.client.solrj.io.graph.GraphExpressionTest:     1) Thread[id=566, name=zkConnectionManagerCallback-215-thread-1, state=WAITING, group=TGRP-GraphExpressionTest]         at java.base@11-ea/jdk.internal.misc.Unsafe.park(Native Method)         at java.base@11-ea/java.util.concurrent.locks.LockSupport.park(LockSupport.java:194)         at java.base@11-ea/java.util.concurrent.locks.AbstractQueuedSynchronizer$ConditionObject.await(AbstractQueuedSynchronizer.java:2081)         at java.base@11-ea/java.util.concurrent.LinkedBlockingQueue.take(LinkedBlockingQueue.java:433)         at java.base@11-ea/java.util.concurrent.ThreadPoolExecutor.getTask(ThreadPoolExecutor.java:1054)         at java.base@11-ea/java.util.concurrent.ThreadPoolExecutor.runWorker(ThreadPoolExecutor.java:1114)         at java.base@11-ea/java.util.concurrent.ThreadPoolExecutor$Worker.run(ThreadPoolExecutor.java:628)         at java.base@11-ea/java.lang.Thread.run(Thread.java:834)    2) Thread[id=569, name=Connection evictor, state=TIMED_WAITING, group=TGRP-GraphExpressionTest]         at java.base@11-ea/java.lang.Thread.sleep(Native Method)         at app//org.apache.http.impl.client.IdleConnectionEvictor$1.run(IdleConnectionEvictor.java:66)         at java.base@11-ea/java.lang.Thread.run(Thread.java:834)    3) Thread[id=565, name=ShortestPathStream-210-thread-1-EventThread, state=WAITING, group=TGRP-GraphExpressionTest]         at java.base@11-ea/jdk.internal.misc.Unsafe.park(Native Method)         at java.base@11-ea/java.util.concurrent.locks.LockSupport.park(LockSupport.java:194)         at java.base@11-ea/java.util.concurrent.locks.AbstractQueuedSynchronizer$ConditionObject.await(AbstractQueuedSynchronizer.java:2081)         at java.base@11-ea/java.util.concurrent.LinkedBlockingQueue.take(LinkedBlockingQueue.java:433)         at app//org.apache.zookeeper.ClientCnxn$EventThread.run(ClientCnxn.java:502)    4) Thread[id=570, name=Connection evictor, state=TIMED_WAITING, group=TGRP-GraphExpressionTest]         at java.base@11-ea/java.lang.Thread.sleep(Native Method)         at app//org.apache.http.impl.client.IdleConnectionEvictor$1.run(IdleConnectionEvictor.java:66)         at java.base@11-ea/java.lang.Thread.run(Thread.java:834)    5) Thread[id=563, name=Connection evictor, state=TIMED_WAITING, group=TGRP-GraphExpressionTest]         at java.base@11-ea/java.lang.Thread.sleep(Native Method)         at app//org.apache.http.impl.client.IdleConnectionEvictor$1.run(IdleConnectionEvictor.java:66)         at java.base@11-ea/java.lang.Thread.run(Thread.java:834)    6) Thread[id=564, name=ShortestPathStream-210-thread-1-SendThread(127.0.0.1:46341), state=TIMED_WAITING, group=TGRP-GraphExpressionTest]         at java.base@11-ea/java.lang.Thread.sleep(Native Method)         at app//org.apache.zookeeper.client.StaticHostProvider.next(StaticHostProvider.java:105)         at app//org.apache.zookeeper.ClientCnxn$SendThread.startConnect(ClientCnxn.java:1000)         at app//org.apache.zookeeper.ClientCnxn$SendThread.run(ClientCnxn.java:1063)

Stack Trace:
com.carrotsearch.randomizedtesting.ThreadLeakError: 6 threads leaked from SUITE scope at org.apache.solr.client.solrj.io.graph.GraphExpressionTest: 
   1) Thread[id=566, name=zkConnectionManagerCallback-215-thread-1, state=WAITING, group=TGRP-GraphExpressionTest]
        at java.base@11-ea/jdk.internal.misc.Unsafe.park(Native Method)
        at java.base@11-ea/java.util.concurrent.locks.LockSupport.park(LockSupport.java:194)
        at java.base@11-ea/java.util.concurrent.locks.AbstractQueuedSynchronizer$ConditionObject.await(AbstractQueuedSynchronizer.java:2081)
        at java.base@11-ea/java.util.concurrent.LinkedBlockingQueue.take(LinkedBlockingQueue.java:433)
        at java.base@11-ea/java.util.concurrent.ThreadPoolExecutor.getTask(ThreadPoolExecutor.java:1054)
        at java.base@11-ea/java.util.concurrent.ThreadPoolExecutor.runWorker(ThreadPoolExecutor.java:1114)
        at java.base@11-ea/java.util.concurrent.ThreadPoolExecutor$Worker.run(ThreadPoolExecutor.java:628)
        at java.base@11-ea/java.lang.Thread.run(Thread.java:834)
   2) Thread[id=569, name=Connection evictor, state=TIMED_WAITING, group=TGRP-GraphExpressionTest]
        at java.base@11-ea/java.lang.Thread.sleep(Native Method)
        at app//org.apache.http.impl.client.IdleConnectionEvictor$1.run(IdleConnectionEvictor.java:66)
        at java.base@11-ea/java.lang.Thread.run(Thread.java:834)
   3) Thread[id=565, name=ShortestPathStream-210-thread-1-EventThread, state=WAITING, group=TGRP-GraphExpressionTest]
        at java.base@11-ea/jdk.internal.misc.Unsafe.park(Native Method)
        at java.base@11-ea/java.util.concurrent.locks.LockSupport.park(LockSupport.java:194)
        at java.base@11-ea/java.util.concurrent.locks.AbstractQueuedSynchronizer$ConditionObject.await(AbstractQueuedSynchronizer.java:2081)
        at java.base@11-ea/java.util.concurrent.LinkedBlockingQueue.take(LinkedBlockingQueue.java:433)
        at app//org.apache.zookeeper.ClientCnxn$EventThread.run(ClientCnxn.java:502)
   4) Thread[id=570, name=Connection evictor, state=TIMED_WAITING, group=TGRP-GraphExpressionTest]
        at java.base@11-ea/java.lang.Thread.sleep(Native Method)
        at app//org.apache.http.impl.client.IdleConnectionEvictor$1.run(IdleConnectionEvictor.java:66)
        at java.base@11-ea/java.lang.Thread.run(Thread.java:834)
   5) Thread[id=563, name=Connection evictor, state=TIMED_WAITING, group=TGRP-GraphExpressionTest]
        at java.base@11-ea/java.lang.Thread.sleep(Native Method)
        at app//org.apache.http.impl.client.IdleConnectionEvictor$1.run(IdleConnectionEvictor.java:66)
        at java.base@11-ea/java.lang.Thread.run(Thread.java:834)
   6) Thread[id=564, name=ShortestPathStream-210-thread-1-SendThread(127.0.0.1:46341), state=TIMED_WAITING, group=TGRP-GraphExpressionTest]
        at java.base@11-ea/java.lang.Thread.sleep(Native Method)
        at app//org.apache.zookeeper.client.StaticHostProvider.next(StaticHostProvider.java:105)
        at app//org.apache.zookeeper.ClientCnxn$SendThread.startConnect(ClientCnxn.java:1000)
        at app//org.apache.zookeeper.ClientCnxn$SendThread.run(ClientCnxn.java:1063)
	at __randomizedtesting.SeedInfo.seed([22E959E9246CE75]:0)


FAILED:  junit.framework.TestSuite.org.apache.solr.client.solrj.io.graph.GraphExpressionTest

Error Message:
There are still zombie threads that couldn't be terminated:    1) Thread[id=566, name=zkConnectionManagerCallback-215-thread-1, state=WAITING, group=TGRP-GraphExpressionTest]         at java.base@11-ea/jdk.internal.misc.Unsafe.park(Native Method)         at java.base@11-ea/java.util.concurrent.locks.LockSupport.park(LockSupport.java:194)         at java.base@11-ea/java.util.concurrent.locks.AbstractQueuedSynchronizer$ConditionObject.await(AbstractQueuedSynchronizer.java:2081)         at java.base@11-ea/java.util.concurrent.LinkedBlockingQueue.take(LinkedBlockingQueue.java:433)         at java.base@11-ea/java.util.concurrent.ThreadPoolExecutor.getTask(ThreadPoolExecutor.java:1054)         at java.base@11-ea/java.util.concurrent.ThreadPoolExecutor.runWorker(ThreadPoolExecutor.java:1114)         at java.base@11-ea/java.util.concurrent.ThreadPoolExecutor$Worker.run(ThreadPoolExecutor.java:628)         at java.base@11-ea/java.lang.Thread.run(Thread.java:834)    2) Thread[id=564, name=ShortestPathStream-210-thread-1-SendThread(127.0.0.1:46341), state=TIMED_WAITING, group=TGRP-GraphExpressionTest]         at java.base@11-ea/java.lang.Thread.sleep(Native Method)         at app//org.apache.zookeeper.ClientCnxn$SendThread.run(ClientCnxn.java:1054)

Stack Trace:
com.carrotsearch.randomizedtesting.ThreadLeakError: There are still zombie threads that couldn't be terminated:
   1) Thread[id=566, name=zkConnectionManagerCallback-215-thread-1, state=WAITING, group=TGRP-GraphExpressionTest]
        at java.base@11-ea/jdk.internal.misc.Unsafe.park(Native Method)
        at java.base@11-ea/java.util.concurrent.locks.LockSupport.park(LockSupport.java:194)
        at java.base@11-ea/java.util.concurrent.locks.AbstractQueuedSynchronizer$ConditionObject.await(AbstractQueuedSynchronizer.java:2081)
        at java.base@11-ea/java.util.concurrent.LinkedBlockingQueue.take(LinkedBlockingQueue.java:433)
        at java.base@11-ea/java.util.concurrent.ThreadPoolExecutor.getTask(ThreadPoolExecutor.java:1054)
        at java.base@11-ea/java.util.concurrent.ThreadPoolExecutor.runWorker(ThreadPoolExecutor.java:1114)
        at java.base@11-ea/java.util.concurrent.ThreadPoolExecutor$Worker.run(ThreadPoolExecutor.java:628)
        at java.base@11-ea/java.lang.Thread.run(Thread.java:834)
   2) Thread[id=564, name=ShortestPathStream-210-thread-1-SendThread(127.0.0.1:46341), state=TIMED_WAITING, group=TGRP-GraphExpressionTest]
        at java.base@11-ea/java.lang.Thread.sleep(Native Method)
        at app//org.apache.zookeeper.ClientCnxn$SendThread.run(ClientCnxn.java:1054)
	at __randomizedtesting.SeedInfo.seed([22E959E9246CE75]:0)


FAILED:  junit.framework.TestSuite.org.apache.solr.client.solrj.io.graph.GraphExpressionTest

Error Message:
6 threads leaked from SUITE scope at org.apache.solr.client.solrj.io.graph.GraphExpressionTest:     1) Thread[id=1848, name=ShortestPathStream-471-thread-1-EventThread, state=WAITING, group=TGRP-GraphExpressionTest]         at java.base@11-ea/jdk.internal.misc.Unsafe.park(Native Method)         at java.base@11-ea/java.util.concurrent.locks.LockSupport.park(LockSupport.java:194)         at java.base@11-ea/java.util.concurrent.locks.AbstractQueuedSynchronizer$ConditionObject.await(AbstractQueuedSynchronizer.java:2081)         at java.base@11-ea/java.util.concurrent.LinkedBlockingQueue.take(LinkedBlockingQueue.java:433)         at app//org.apache.zookeeper.ClientCnxn$EventThread.run(ClientCnxn.java:502)    2) Thread[id=1849, name=zkConnectionManagerCallback-476-thread-1, state=WAITING, group=TGRP-GraphExpressionTest]         at java.base@11-ea/jdk.internal.misc.Unsafe.park(Native Method)         at java.base@11-ea/java.util.concurrent.locks.LockSupport.park(LockSupport.java:194)         at java.base@11-ea/java.util.concurrent.locks.AbstractQueuedSynchronizer$ConditionObject.await(AbstractQueuedSynchronizer.java:2081)         at java.base@11-ea/java.util.concurrent.LinkedBlockingQueue.take(LinkedBlockingQueue.java:433)         at java.base@11-ea/java.util.concurrent.ThreadPoolExecutor.getTask(ThreadPoolExecutor.java:1054)         at java.base@11-ea/java.util.concurrent.ThreadPoolExecutor.runWorker(ThreadPoolExecutor.java:1114)         at java.base@11-ea/java.util.concurrent.ThreadPoolExecutor$Worker.run(ThreadPoolExecutor.java:628)         at java.base@11-ea/java.lang.Thread.run(Thread.java:834)    3) Thread[id=1853, name=Connection evictor, state=TIMED_WAITING, group=TGRP-GraphExpressionTest]         at java.base@11-ea/java.lang.Thread.sleep(Native Method)         at app//org.apache.http.impl.client.IdleConnectionEvictor$1.run(IdleConnectionEvictor.java:66)         at java.base@11-ea/java.lang.Thread.run(Thread.java:834)    4) Thread[id=1852, name=Connection evictor, state=TIMED_WAITING, group=TGRP-GraphExpressionTest]         at java.base@11-ea/java.lang.Thread.sleep(Native Method)         at app//org.apache.http.impl.client.IdleConnectionEvictor$1.run(IdleConnectionEvictor.java:66)         at java.base@11-ea/java.lang.Thread.run(Thread.java:834)    5) Thread[id=1847, name=ShortestPathStream-471-thread-1-SendThread(127.0.0.1:35987), state=TIMED_WAITING, group=TGRP-GraphExpressionTest]         at java.base@11-ea/java.lang.Thread.sleep(Native Method)         at app//org.apache.zookeeper.client.StaticHostProvider.next(StaticHostProvider.java:105)         at app//org.apache.zookeeper.ClientCnxn$SendThread.startConnect(ClientCnxn.java:1000)         at app//org.apache.zookeeper.ClientCnxn$SendThread.run(ClientCnxn.java:1063)    6) Thread[id=1846, name=Connection evictor, state=TIMED_WAITING, group=TGRP-GraphExpressionTest]         at java.base@11-ea/java.lang.Thread.sleep(Native Method)         at app//org.apache.http.impl.client.IdleConnectionEvictor$1.run(IdleConnectionEvictor.java:66)         at java.base@11-ea/java.lang.Thread.run(Thread.java:834)

Stack Trace:
com.carrotsearch.randomizedtesting.ThreadLeakError: 6 threads leaked from SUITE scope at org.apache.solr.client.solrj.io.graph.GraphExpressionTest: 
   1) Thread[id=1848, name=ShortestPathStream-471-thread-1-EventThread, state=WAITING, group=TGRP-GraphExpressionTest]
        at java.base@11-ea/jdk.internal.misc.Unsafe.park(Native Method)
        at java.base@11-ea/java.util.concurrent.locks.LockSupport.park(LockSupport.java:194)
        at java.base@11-ea/java.util.concurrent.locks.AbstractQueuedSynchronizer$ConditionObject.await(AbstractQueuedSynchronizer.java:2081)
        at java.base@11-ea/java.util.concurrent.LinkedBlockingQueue.take(LinkedBlockingQueue.java:433)
        at app//org.apache.zookeeper.ClientCnxn$EventThread.run(ClientCnxn.java:502)
   2) Thread[id=1849, name=zkConnectionManagerCallback-476-thread-1, state=WAITING, group=TGRP-GraphExpressionTest]
        at java.base@11-ea/jdk.internal.misc.Unsafe.park(Native Method)
        at java.base@11-ea/java.util.concurrent.locks.LockSupport.park(LockSupport.java:194)
        at java.base@11-ea/java.util.concurrent.locks.AbstractQueuedSynchronizer$ConditionObject.await(AbstractQueuedSynchronizer.java:2081)
        at java.base@11-ea/java.util.concurrent.LinkedBlockingQueue.take(LinkedBlockingQueue.java:433)
        at java.base@11-ea/java.util.concurrent.ThreadPoolExecutor.getTask(ThreadPoolExecutor.java:1054)
        at java.base@11-ea/java.util.concurrent.ThreadPoolExecutor.runWorker(ThreadPoolExecutor.java:1114)
        at java.base@11-ea/java.util.concurrent.ThreadPoolExecutor$Worker.run(ThreadPoolExecutor.java:628)
        at java.base@11-ea/java.lang.Thread.run(Thread.java:834)
   3) Thread[id=1853, name=Connection evictor, state=TIMED_WAITING, group=TGRP-GraphExpressionTest]
        at java.base@11-ea/java.lang.Thread.sleep(Native Method)
        at app//org.apache.http.impl.client.IdleConnectionEvictor$1.run(IdleConnectionEvictor.java:66)
        at java.base@11-ea/java.lang.Thread.run(Thread.java:834)
   4) Thread[id=1852, name=Connection evictor, state=TIMED_WAITING, group=TGRP-GraphExpressionTest]
        at java.base@11-ea/java.lang.Thread.sleep(Native Method)
        at app//org.apache.http.impl.client.IdleConnectionEvictor$1.run(IdleConnectionEvictor.java:66)
        at java.base@11-ea/java.lang.Thread.run(Thread.java:834)
   5) Thread[id=1847, name=ShortestPathStream-471-thread-1-SendThread(127.0.0.1:35987), state=TIMED_WAITING, group=TGRP-GraphExpressionTest]
        at java.base@11-ea/java.lang.Thread.sleep(Native Method)
        at app//org.apache.zookeeper.client.StaticHostProvider.next(StaticHostProvider.java:105)
        at app//org.apache.zookeeper.ClientCnxn$SendThread.startConnect(ClientCnxn.java:1000)
        at app//org.apache.zookeeper.ClientCnxn$SendThread.run(ClientCnxn.java:1063)
   6) Thread[id=1846, name=Connection evictor, state=TIMED_WAITING, group=TGRP-GraphExpressionTest]
        at java.base@11-ea/java.lang.Thread.sleep(Native Method)
        at app//org.apache.http.impl.client.IdleConnectionEvictor$1.run(IdleConnectionEvictor.java:66)
        at java.base@11-ea/java.lang.Thread.run(Thread.java:834)
	at __randomizedtesting.SeedInfo.seed([22E959E9246CE75]:0)


FAILED:  junit.framework.TestSuite.org.apache.solr.client.solrj.io.graph.GraphExpressionTest

Error Message:
There are still zombie threads that couldn't be terminated:    1) Thread[id=1849, name=zkConnectionManagerCallback-476-thread-1, state=WAITING, group=TGRP-GraphExpressionTest]         at java.base@11-ea/jdk.internal.misc.Unsafe.park(Native Method)         at java.base@11-ea/java.util.concurrent.locks.LockSupport.park(LockSupport.java:194)         at java.base@11-ea/java.util.concurrent.locks.AbstractQueuedSynchronizer$ConditionObject.await(AbstractQueuedSynchronizer.java:2081)         at java.base@11-ea/java.util.concurrent.LinkedBlockingQueue.take(LinkedBlockingQueue.java:433)         at java.base@11-ea/java.util.concurrent.ThreadPoolExecutor.getTask(ThreadPoolExecutor.java:1054)         at java.base@11-ea/java.util.concurrent.ThreadPoolExecutor.runWorker(ThreadPoolExecutor.java:1114)         at java.base@11-ea/java.util.concurrent.ThreadPoolExecutor$Worker.run(ThreadPoolExecutor.java:628)         at java.base@11-ea/java.lang.Thread.run(Thread.java:834)    2) Thread[id=1847, name=ShortestPathStream-471-thread-1-SendThread(127.0.0.1:35987), state=TIMED_WAITING, group=TGRP-GraphExpressionTest]         at java.base@11-ea/java.lang.Thread.sleep(Native Method)         at app//org.apache.zookeeper.client.StaticHostProvider.next(StaticHostProvider.java:105)         at app//org.apache.zookeeper.ClientCnxn$SendThread.startConnect(ClientCnxn.java:1000)         at app//org.apache.zookeeper.ClientCnxn$SendThread.run(ClientCnxn.java:1063)

Stack Trace:
com.carrotsearch.randomizedtesting.ThreadLeakError: There are still zombie threads that couldn't be terminated:
   1) Thread[id=1849, name=zkConnectionManagerCallback-476-thread-1, state=WAITING, group=TGRP-GraphExpressionTest]
        at java.base@11-ea/jdk.internal.misc.Unsafe.park(Native Method)
        at java.base@11-ea/java.util.concurrent.locks.LockSupport.park(LockSupport.java:194)
        at java.base@11-ea/java.util.concurrent.locks.AbstractQueuedSynchronizer$ConditionObject.await(AbstractQueuedSynchronizer.java:2081)
        at java.base@11-ea/java.util.concurrent.LinkedBlockingQueue.take(LinkedBlockingQueue.java:433)
        at java.base@11-ea/java.util.concurrent.ThreadPoolExecutor.getTask(ThreadPoolExecutor.java:1054)
        at java.base@11-ea/java.util.concurrent.ThreadPoolExecutor.runWorker(ThreadPoolExecutor.java:1114)
        at java.base@11-ea/java.util.concurrent.ThreadPoolExecutor$Worker.run(ThreadPoolExecutor.java:628)
        at java.base@11-ea/java.lang.Thread.run(Thread.java:834)
   2) Thread[id=1847, name=ShortestPathStream-471-thread-1-SendThread(127.0.0.1:35987), state=TIMED_WAITING, group=TGRP-GraphExpressionTest]
        at java.base@11-ea/java.lang.Thread.sleep(Native Method)
        at app//org.apache.zookeeper.client.StaticHostProvider.next(StaticHostProvider.java:105)
        at app//org.apache.zookeeper.ClientCnxn$SendThread.startConnect(ClientCnxn.java:1000)
        at app//org.apache.zookeeper.ClientCnxn$SendThread.run(ClientCnxn.java:1063)
	at __randomizedtesting.SeedInfo.seed([22E959E9246CE75]:0)


FAILED:  junit.framework.TestSuite.org.apache.solr.client.solrj.io.graph.GraphTest

Error Message:
6 threads leaked from SUITE scope at org.apache.solr.client.solrj.io.graph.GraphTest:     1) Thread[id=751, name=ShortestPathStream-219-thread-1-SendThread(127.0.0.1:37253), state=TIMED_WAITING, group=TGRP-GraphTest]         at java.base@11-ea/java.lang.Thread.sleep(Native Method)         at app//org.apache.zookeeper.client.StaticHostProvider.next(StaticHostProvider.java:105)         at app//org.apache.zookeeper.ClientCnxn$SendThread.startConnect(ClientCnxn.java:1000)         at app//org.apache.zookeeper.ClientCnxn$SendThread.run(ClientCnxn.java:1063)    2) Thread[id=752, name=ShortestPathStream-219-thread-1-EventThread, state=WAITING, group=TGRP-GraphTest]         at java.base@11-ea/jdk.internal.misc.Unsafe.park(Native Method)         at java.base@11-ea/java.util.concurrent.locks.LockSupport.park(LockSupport.java:194)         at java.base@11-ea/java.util.concurrent.locks.AbstractQueuedSynchronizer$ConditionObject.await(AbstractQueuedSynchronizer.java:2081)         at java.base@11-ea/java.util.concurrent.LinkedBlockingQueue.take(LinkedBlockingQueue.java:433)         at app//org.apache.zookeeper.ClientCnxn$EventThread.run(ClientCnxn.java:502)    3) Thread[id=750, name=Connection evictor, state=TIMED_WAITING, group=TGRP-GraphTest]         at java.base@11-ea/java.lang.Thread.sleep(Native Method)         at app//org.apache.http.impl.client.IdleConnectionEvictor$1.run(IdleConnectionEvictor.java:66)         at java.base@11-ea/java.lang.Thread.run(Thread.java:834)    4) Thread[id=756, name=Connection evictor, state=TIMED_WAITING, group=TGRP-GraphTest]         at java.base@11-ea/java.lang.Thread.sleep(Native Method)         at app//org.apache.http.impl.client.IdleConnectionEvictor$1.run(IdleConnectionEvictor.java:66)         at java.base@11-ea/java.lang.Thread.run(Thread.java:834)    5) Thread[id=753, name=zkConnectionManagerCallback-224-thread-1, state=WAITING, group=TGRP-GraphTest]         at java.base@11-ea/jdk.internal.misc.Unsafe.park(Native Method)         at java.base@11-ea/java.util.concurrent.locks.LockSupport.park(LockSupport.java:194)         at java.base@11-ea/java.util.concurrent.locks.AbstractQueuedSynchronizer$ConditionObject.await(AbstractQueuedSynchronizer.java:2081)         at java.base@11-ea/java.util.concurrent.LinkedBlockingQueue.take(LinkedBlockingQueue.java:433)         at java.base@11-ea/java.util.concurrent.ThreadPoolExecutor.getTask(ThreadPoolExecutor.java:1054)         at java.base@11-ea/java.util.concurrent.ThreadPoolExecutor.runWorker(ThreadPoolExecutor.java:1114)         at java.base@11-ea/java.util.concurrent.ThreadPoolExecutor$Worker.run(ThreadPoolExecutor.java:628)         at java.base@11-ea/java.lang.Thread.run(Thread.java:834)    6) Thread[id=757, name=Connection evictor, state=TIMED_WAITING, group=TGRP-GraphTest]         at java.base@11-ea/java.lang.Thread.sleep(Native Method)         at app//org.apache.http.impl.client.IdleConnectionEvictor$1.run(IdleConnectionEvictor.java:66)         at java.base@11-ea/java.lang.Thread.run(Thread.java:834)

Stack Trace:
com.carrotsearch.randomizedtesting.ThreadLeakError: 6 threads leaked from SUITE scope at org.apache.solr.client.solrj.io.graph.GraphTest: 
   1) Thread[id=751, name=ShortestPathStream-219-thread-1-SendThread(127.0.0.1:37253), state=TIMED_WAITING, group=TGRP-GraphTest]
        at java.base@11-ea/java.lang.Thread.sleep(Native Method)
        at app//org.apache.zookeeper.client.StaticHostProvider.next(StaticHostProvider.java:105)
        at app//org.apache.zookeeper.ClientCnxn$SendThread.startConnect(ClientCnxn.java:1000)
        at app//org.apache.zookeeper.ClientCnxn$SendThread.run(ClientCnxn.java:1063)
   2) Thread[id=752, name=ShortestPathStream-219-thread-1-EventThread, state=WAITING, group=TGRP-GraphTest]
        at java.base@11-ea/jdk.internal.misc.Unsafe.park(Native Method)
        at java.base@11-ea/java.util.concurrent.locks.LockSupport.park(LockSupport.java:194)
        at java.base@11-ea/java.util.concurrent.locks.AbstractQueuedSynchronizer$ConditionObject.await(AbstractQueuedSynchronizer.java:2081)
        at java.base@11-ea/java.util.concurrent.LinkedBlockingQueue.take(LinkedBlockingQueue.java:433)
        at app//org.apache.zookeeper.ClientCnxn$EventThread.run(ClientCnxn.java:502)
   3) Thread[id=750, name=Connection evictor, state=TIMED_WAITING, group=TGRP-GraphTest]
        at java.base@11-ea/java.lang.Thread.sleep(Native Method)
        at app//org.apache.http.impl.client.IdleConnectionEvictor$1.run(IdleConnectionEvictor.java:66)
        at java.base@11-ea/java.lang.Thread.run(Thread.java:834)
   4) Thread[id=756, name=Connection evictor, state=TIMED_WAITING, group=TGRP-GraphTest]
        at java.base@11-ea/java.lang.Thread.sleep(Native Method)
        at app//org.apache.http.impl.client.IdleConnectionEvictor$1.run(IdleConnectionEvictor.java:66)
        at java.base@11-ea/java.lang.Thread.run(Thread.java:834)
   5) Thread[id=753, name=zkConnectionManagerCallback-224-thread-1, state=WAITING, group=TGRP-GraphTest]
        at java.base@11-ea/jdk.internal.misc.Unsafe.park(Native Method)
        at java.base@11-ea/java.util.concurrent.locks.LockSupport.park(LockSupport.java:194)
        at java.base@11-ea/java.util.concurrent.locks.AbstractQueuedSynchronizer$ConditionObject.await(AbstractQueuedSynchronizer.java:2081)
        at java.base@11-ea/java.util.concurrent.LinkedBlockingQueue.take(LinkedBlockingQueue.java:433)
        at java.base@11-ea/java.util.concurrent.ThreadPoolExecutor.getTask(ThreadPoolExecutor.java:1054)
        at java.base@11-ea/java.util.concurrent.ThreadPoolExecutor.runWorker(ThreadPoolExecutor.java:1114)
        at java.base@11-ea/java.util.concurrent.ThreadPoolExecutor$Worker.run(ThreadPoolExecutor.java:628)
        at java.base@11-ea/java.lang.Thread.run(Thread.java:834)
   6) Thread[id=757, name=Connection evictor, state=TIMED_WAITING, group=TGRP-GraphTest]
        at java.base@11-ea/java.lang.Thread.sleep(Native Method)
        at app//org.apache.http.impl.client.IdleConnectionEvictor$1.run(IdleConnectionEvictor.java:66)
        at java.base@11-ea/java.lang.Thread.run(Thread.java:834)
	at __randomizedtesting.SeedInfo.seed([22E959E9246CE75]:0)


FAILED:  junit.framework.TestSuite.org.apache.solr.client.solrj.io.graph.GraphTest

Error Message:
There are still zombie threads that couldn't be terminated:    1) Thread[id=751, name=ShortestPathStream-219-thread-1-SendThread(127.0.0.1:37253), state=TIMED_WAITING, group=TGRP-GraphTest]         at java.base@11-ea/java.lang.Thread.sleep(Native Method)         at app//org.apache.zookeeper.client.StaticHostProvider.next(StaticHostProvider.java:105)         at app//org.apache.zookeeper.ClientCnxn$SendThread.startConnect(ClientCnxn.java:1000)         at app//org.apache.zookeeper.ClientCnxn$SendThread.run(ClientCnxn.java:1063)    2) Thread[id=753, name=zkConnectionManagerCallback-224-thread-1, state=WAITING, group=TGRP-GraphTest]         at java.base@11-ea/jdk.internal.misc.Unsafe.park(Native Method)         at java.base@11-ea/java.util.concurrent.locks.LockSupport.park(LockSupport.java:194)         at java.base@11-ea/java.util.concurrent.locks.AbstractQueuedSynchronizer$ConditionObject.await(AbstractQueuedSynchronizer.java:2081)         at java.base@11-ea/java.util.concurrent.LinkedBlockingQueue.take(LinkedBlockingQueue.java:433)         at java.base@11-ea/java.util.concurrent.ThreadPoolExecutor.getTask(ThreadPoolExecutor.java:1054)         at java.base@11-ea/java.util.concurrent.ThreadPoolExecutor.runWorker(ThreadPoolExecutor.java:1114)         at java.base@11-ea/java.util.concurrent.ThreadPoolExecutor$Worker.run(ThreadPoolExecutor.java:628)         at java.base@11-ea/java.lang.Thread.run(Thread.java:834)

Stack Trace:
com.carrotsearch.randomizedtesting.ThreadLeakError: There are still zombie threads that couldn't be terminated:
   1) Thread[id=751, name=ShortestPathStream-219-thread-1-SendThread(127.0.0.1:37253), state=TIMED_WAITING, group=TGRP-GraphTest]
        at java.base@11-ea/java.lang.Thread.sleep(Native Method)
        at app//org.apache.zookeeper.client.StaticHostProvider.next(StaticHostProvider.java:105)
        at app//org.apache.zookeeper.ClientCnxn$SendThread.startConnect(ClientCnxn.java:1000)
        at app//org.apache.zookeeper.ClientCnxn$SendThread.run(ClientCnxn.java:1063)
   2) Thread[id=753, name=zkConnectionManagerCallback-224-thread-1, state=WAITING, group=TGRP-GraphTest]
        at java.base@11-ea/jdk.internal.misc.Unsafe.park(Native Method)
        at java.base@11-ea/java.util.concurrent.locks.LockSupport.park(LockSupport.java:194)
        at java.base@11-ea/java.util.concurrent.locks.AbstractQueuedSynchronizer$ConditionObject.await(AbstractQueuedSynchronizer.java:2081)
        at java.base@11-ea/java.util.concurrent.LinkedBlockingQueue.take(LinkedBlockingQueue.java:433)
        at java.base@11-ea/java.util.concurrent.ThreadPoolExecutor.getTask(ThreadPoolExecutor.java:1054)
        at java.base@11-ea/java.util.concurrent.ThreadPoolExecutor.runWorker(ThreadPoolExecutor.java:1114)
        at java.base@11-ea/java.util.concurrent.ThreadPoolExecutor$Worker.run(ThreadPoolExecutor.java:628)
        at java.base@11-ea/java.lang.Thread.run(Thread.java:834)
	at __randomizedtesting.SeedInfo.seed([22E959E9246CE75]:0)


FAILED:  junit.framework.TestSuite.org.apache.solr.client.solrj.io.graph.GraphTest

Error Message:
6 threads leaked from SUITE scope at org.apache.solr.client.solrj.io.graph.GraphTest:     1) Thread[id=1328, name=Connection evictor, state=TIMED_WAITING, group=TGRP-GraphTest]         at java.base@11-ea/java.lang.Thread.sleep(Native Method)         at app//org.apache.http.impl.client.IdleConnectionEvictor$1.run(IdleConnectionEvictor.java:66)         at java.base@11-ea/java.lang.Thread.run(Thread.java:834)    2) Thread[id=1334, name=Connection evictor, state=TIMED_WAITING, group=TGRP-GraphTest]         at java.base@11-ea/java.lang.Thread.sleep(Native Method)         at app//org.apache.http.impl.client.IdleConnectionEvictor$1.run(IdleConnectionEvictor.java:66)         at java.base@11-ea/java.lang.Thread.run(Thread.java:834)    3) Thread[id=1331, name=zkConnectionManagerCallback-586-thread-1, state=WAITING, group=TGRP-GraphTest]         at java.base@11-ea/jdk.internal.misc.Unsafe.park(Native Method)         at java.base@11-ea/java.util.concurrent.locks.LockSupport.park(LockSupport.java:194)         at java.base@11-ea/java.util.concurrent.locks.AbstractQueuedSynchronizer$ConditionObject.await(AbstractQueuedSynchronizer.java:2081)         at java.base@11-ea/java.util.concurrent.LinkedBlockingQueue.take(LinkedBlockingQueue.java:433)         at java.base@11-ea/java.util.concurrent.ThreadPoolExecutor.getTask(ThreadPoolExecutor.java:1054)         at java.base@11-ea/java.util.concurrent.ThreadPoolExecutor.runWorker(ThreadPoolExecutor.java:1114)         at java.base@11-ea/java.util.concurrent.ThreadPoolExecutor$Worker.run(ThreadPoolExecutor.java:628)         at java.base@11-ea/java.lang.Thread.run(Thread.java:834)    4) Thread[id=1335, name=Connection evictor, state=TIMED_WAITING, group=TGRP-GraphTest]         at java.base@11-ea/java.lang.Thread.sleep(Native Method)         at app//org.apache.http.impl.client.IdleConnectionEvictor$1.run(IdleConnectionEvictor.java:66)         at java.base@11-ea/java.lang.Thread.run(Thread.java:834)    5) Thread[id=1329, name=ShortestPathStream-581-thread-1-SendThread(127.0.0.1:40861), state=TIMED_WAITING, group=TGRP-GraphTest]         at java.base@11-ea/java.lang.Thread.sleep(Native Method)         at app//org.apache.zookeeper.ClientCnxn$SendThread.run(ClientCnxn.java:1054)    6) Thread[id=1330, name=ShortestPathStream-581-thread-1-EventThread, state=WAITING, group=TGRP-GraphTest]         at java.base@11-ea/jdk.internal.misc.Unsafe.park(Native Method)         at java.base@11-ea/java.util.concurrent.locks.LockSupport.park(LockSupport.java:194)         at java.base@11-ea/java.util.concurrent.locks.AbstractQueuedSynchronizer$ConditionObject.await(AbstractQueuedSynchronizer.java:2081)         at java.base@11-ea/java.util.concurrent.LinkedBlockingQueue.take(LinkedBlockingQueue.java:433)         at app//org.apache.zookeeper.ClientCnxn$EventThread.run(ClientCnxn.java:502)

Stack Trace:
com.carrotsearch.randomizedtesting.ThreadLeakError: 6 threads leaked from SUITE scope at org.apache.solr.client.solrj.io.graph.GraphTest: 
   1) Thread[id=1328, name=Connection evictor, state=TIMED_WAITING, group=TGRP-GraphTest]
        at java.base@11-ea/java.lang.Thread.sleep(Native Method)
        at app//org.apache.http.impl.client.IdleConnectionEvictor$1.run(IdleConnectionEvictor.java:66)
        at java.base@11-ea/java.lang.Thread.run(Thread.java:834)
   2) Thread[id=1334, name=Connection evictor, state=TIMED_WAITING, group=TGRP-GraphTest]
        at java.base@11-ea/java.lang.Thread.sleep(Native Method)
        at app//org.apache.http.impl.client.IdleConnectionEvictor$1.run(IdleConnectionEvictor.java:66)
        at java.base@11-ea/java.lang.Thread.run(Thread.java:834)
   3) Thread[id=1331, name=zkConnectionManagerCallback-586-thread-1, state=WAITING, group=TGRP-GraphTest]
        at java.base@11-ea/jdk.internal.misc.Unsafe.park(Native Method)
        at java.base@11-ea/java.util.concurrent.locks.LockSupport.park(LockSupport.java:194)
        at java.base@11-ea/java.util.concurrent.locks.AbstractQueuedSynchronizer$ConditionObject.await(AbstractQueuedSynchronizer.java:2081)
        at java.base@11-ea/java.util.concurrent.LinkedBlockingQueue.take(LinkedBlockingQueue.java:433)
        at java.base@11-ea/java.util.concurrent.ThreadPoolExecutor.getTask(ThreadPoolExecutor.java:1054)
        at java.base@11-ea/java.util.concurrent.ThreadPoolExecutor.runWorker(ThreadPoolExecutor.java:1114)
        at java.base@11-ea/java.util.concurrent.ThreadPoolExecutor$Worker.run(ThreadPoolExecutor.java:628)
        at java.base@11-ea/java.lang.Thread.run(Thread.java:834)
   4) Thread[id=1335, name=Connection evictor, state=TIMED_WAITING, group=TGRP-GraphTest]
        at java.base@11-ea/java.lang.Thread.sleep(Native Method)
        at app//org.apache.http.impl.client.IdleConnectionEvictor$1.run(IdleConnectionEvictor.java:66)
        at java.base@11-ea/java.lang.Thread.run(Thread.java:834)
   5) Thread[id=1329, name=ShortestPathStream-581-thread-1-SendThread(127.0.0.1:40861), state=TIMED_WAITING, group=TGRP-GraphTest]
        at java.base@11-ea/java.lang.Thread.sleep(Native Method)
        at app//org.apache.zookeeper.ClientCnxn$SendThread.run(ClientCnxn.java:1054)
   6) Thread[id=1330, name=ShortestPathStream-581-thread-1-EventThread, state=WAITING, group=TGRP-GraphTest]
        at java.base@11-ea/jdk.internal.misc.Unsafe.park(Native Method)
        at java.base@11-ea/java.util.concurrent.locks.LockSupport.park(LockSupport.java:194)
        at java.base@11-ea/java.util.concurrent.locks.AbstractQueuedSynchronizer$ConditionObject.await(AbstractQueuedSynchronizer.java:2081)
        at java.base@11-ea/java.util.concurrent.LinkedBlockingQueue.take(LinkedBlockingQueue.java:433)
        at app//org.apache.zookeeper.ClientCnxn$EventThread.run(ClientCnxn.java:502)
	at __randomizedtesting.SeedInfo.seed([22E959E9246CE75]:0)


FAILED:  junit.framework.TestSuite.org.apache.solr.client.solrj.io.graph.GraphTest

Error Message:
There are still zombie threads that couldn't be terminated:    1) Thread[id=1331, name=zkConnectionManagerCallback-586-thread-1, state=WAITING, group=TGRP-GraphTest]         at java.base@11-ea/jdk.internal.misc.Unsafe.park(Native Method)         at java.base@11-ea/java.util.concurrent.locks.LockSupport.park(LockSupport.java:194)         at java.base@11-ea/java.util.concurrent.locks.AbstractQueuedSynchronizer$ConditionObject.await(AbstractQueuedSynchronizer.java:2081)         at java.base@11-ea/java.util.concurrent.LinkedBlockingQueue.take(LinkedBlockingQueue.java:433)         at java.base@11-ea/java.util.concurrent.ThreadPoolExecutor.getTask(ThreadPoolExecutor.java:1054)         at java.base@11-ea/java.util.concurrent.ThreadPoolExecutor.runWorker(ThreadPoolExecutor.java:1114)         at java.base@11-ea/java.util.concurrent.ThreadPoolExecutor$Worker.run(ThreadPoolExecutor.java:628)         at java.base@11-ea/java.lang.Thread.run(Thread.java:834)    2) Thread[id=1329, name=ShortestPathStream-581-thread-1-SendThread(127.0.0.1:40861), state=TIMED_WAITING, group=TGRP-GraphTest]         at java.base@11-ea/java.lang.Thread.sleep(Native Method)         at app//org.apache.zookeeper.ClientCnxn$SendThread.run(ClientCnxn.java:1054)

Stack Trace:
com.carrotsearch.randomizedtesting.ThreadLeakError: There are still zombie threads that couldn't be terminated:
   1) Thread[id=1331, name=zkConnectionManagerCallback-586-thread-1, state=WAITING, group=TGRP-GraphTest]
        at java.base@11-ea/jdk.internal.misc.Unsafe.park(Native Method)
        at java.base@11-ea/java.util.concurrent.locks.LockSupport.park(LockSupport.java:194)
        at java.base@11-ea/java.util.concurrent.locks.AbstractQueuedSynchronizer$ConditionObject.await(AbstractQueuedSynchronizer.java:2081)
        at java.base@11-ea/java.util.concurrent.LinkedBlockingQueue.take(LinkedBlockingQueue.java:433)
        at java.base@11-ea/java.util.concurrent.ThreadPoolExecutor.getTask(ThreadPoolExecutor.java:1054)
        at java.base@11-ea/java.util.concurrent.ThreadPoolExecutor.runWorker(ThreadPoolExecutor.java:1114)
        at java.base@11-ea/java.util.concurrent.ThreadPoolExecutor$Worker.run(ThreadPoolExecutor.java:628)
        at java.base@11-ea/java.lang.Thread.run(Thread.java:834)
   2) Thread[id=1329, name=ShortestPathStream-581-thread-1-SendThread(127.0.0.1:40861), state=TIMED_WAITING, group=TGRP-GraphTest]
        at java.base@11-ea/java.lang.Thread.sleep(Native Method)
        at app//org.apache.zookeeper.ClientCnxn$SendThread.run(ClientCnxn.java:1054)
	at __randomizedtesting.SeedInfo.seed([22E959E9246CE75]:0)


FAILED:  junit.framework.TestSuite.org.apache.solr.client.solrj.io.graph.GraphTest

Error Message:
6 threads leaked from SUITE scope at org.apache.solr.client.solrj.io.graph.GraphTest:     1) Thread[id=1148, name=ShortestPathStream-237-thread-1-EventThread, state=WAITING, group=TGRP-GraphTest]         at java.base@11-ea/jdk.internal.misc.Unsafe.park(Native Method)         at java.base@11-ea/java.util.concurrent.locks.LockSupport.park(LockSupport.java:194)         at java.base@11-ea/java.util.concurrent.locks.AbstractQueuedSynchronizer$ConditionObject.await(AbstractQueuedSynchronizer.java:2081)         at java.base@11-ea/java.util.concurrent.LinkedBlockingQueue.take(LinkedBlockingQueue.java:433)         at app//org.apache.zookeeper.ClientCnxn$EventThread.run(ClientCnxn.java:502)    2) Thread[id=1146, name=Connection evictor, state=TIMED_WAITING, group=TGRP-GraphTest]         at java.base@11-ea/java.lang.Thread.sleep(Native Method)         at app//org.apache.http.impl.client.IdleConnectionEvictor$1.run(IdleConnectionEvictor.java:66)         at java.base@11-ea/java.lang.Thread.run(Thread.java:834)    3) Thread[id=1152, name=Connection evictor, state=TIMED_WAITING, group=TGRP-GraphTest]         at java.base@11-ea/java.lang.Thread.sleep(Native Method)         at app//org.apache.http.impl.client.IdleConnectionEvictor$1.run(IdleConnectionEvictor.java:66)         at java.base@11-ea/java.lang.Thread.run(Thread.java:834)    4) Thread[id=1153, name=Connection evictor, state=TIMED_WAITING, group=TGRP-GraphTest]         at java.base@11-ea/java.lang.Thread.sleep(Native Method)         at app//org.apache.http.impl.client.IdleConnectionEvictor$1.run(IdleConnectionEvictor.java:66)         at java.base@11-ea/java.lang.Thread.run(Thread.java:834)    5) Thread[id=1149, name=zkConnectionManagerCallback-242-thread-1, state=WAITING, group=TGRP-GraphTest]         at java.base@11-ea/jdk.internal.misc.Unsafe.park(Native Method)         at java.base@11-ea/java.util.concurrent.locks.LockSupport.park(LockSupport.java:194)         at java.base@11-ea/java.util.concurrent.locks.AbstractQueuedSynchronizer$ConditionObject.await(AbstractQueuedSynchronizer.java:2081)         at java.base@11-ea/java.util.concurrent.LinkedBlockingQueue.take(LinkedBlockingQueue.java:433)         at java.base@11-ea/java.util.concurrent.ThreadPoolExecutor.getTask(ThreadPoolExecutor.java:1054)         at java.base@11-ea/java.util.concurrent.ThreadPoolExecutor.runWorker(ThreadPoolExecutor.java:1114)         at java.base@11-ea/java.util.concurrent.ThreadPoolExecutor$Worker.run(ThreadPoolExecutor.java:628)         at java.base@11-ea/java.lang.Thread.run(Thread.java:834)    6) Thread[id=1147, name=ShortestPathStream-237-thread-1-SendThread(127.0.0.1:42011), state=TIMED_WAITING, group=TGRP-GraphTest]         at java.base@11-ea/java.lang.Thread.sleep(Native Method)         at app//org.apache.zookeeper.ClientCnxn$SendThread.run(ClientCnxn.java:1054)

Stack Trace:
com.carrotsearch.randomizedtesting.ThreadLeakError: 6 threads leaked from SUITE scope at org.apache.solr.client.solrj.io.graph.GraphTest: 
   1) Thread[id=1148, name=ShortestPathStream-237-thread-1-EventThread, state=WAITING, group=TGRP-GraphTest]
        at java.base@11-ea/jdk.internal.misc.Unsafe.park(Native Method)
        at java.base@11-ea/java.util.concurrent.locks.LockSupport.park(LockSupport.java:194)
        at java.base@11-ea/java.util.concurrent.locks.AbstractQueuedSynchronizer$ConditionObject.await(AbstractQueuedSynchronizer.java:2081)
        at java.base@11-ea/java.util.concurrent.LinkedBlockingQueue.take(LinkedBlockingQueue.java:433)
        at app//org.apache.zookeeper.ClientCnxn$EventThread.run(ClientCnxn.java:502)
   2) Thread[id=1146, name=Connection evictor, state=TIMED_WAITING, group=TGRP-GraphTest]
        at java.base@11-ea/java.lang.Thread.sleep(Native Method)
        at app//org.apache.http.impl.client.IdleConnectionEvictor$1.run(IdleConnectionEvictor.java:66)
        at java.base@11-ea/java.lang.Thread.run(Thread.java:834)
   3) Thread[id=1152, name=Connection evictor, state=TIMED_WAITING, group=TGRP-GraphTest]
        at java.base@11-ea/java.lang.Thread.sleep(Native Method)
        at app//org.apache.http.impl.client.IdleConnectionEvictor$1.run(IdleConnectionEvictor.java:66)
        at java.base@11-ea/java.lang.Thread.run(Thread.java:834)
   4) Thread[id=1153, name=Connection evictor, state=TIMED_WAITING, group=TGRP-GraphTest]
        at java.base@11-ea/java.lang.Thread.sleep(Native Method)
        at app//org.apache.http.impl.client.IdleConnectionEvictor$1.run(IdleConnectionEvictor.java:66)
        at java.base@11-ea/java.lang.Thread.run(Thread.java:834)
   5) Thread[id=1149, name=zkConnectionManagerCallback-242-thread-1, state=WAITING, group=TGRP-GraphTest]
        at java.base@11-ea/jdk.internal.misc.Unsafe.park(Native Method)
        at java.base@11-ea/java.util.concurrent.locks.LockSupport.park(LockSupport.java:194)
        at java.base@11-ea/java.util.concurrent.locks.AbstractQueuedSynchronizer$ConditionObject.await(AbstractQueuedSynchronizer.java:2081)
        at java.base@11-ea/java.util.concurrent.LinkedBlockingQueue.take(LinkedBlockingQueue.java:433)
        at java.base@11-ea/java.util.concurrent.ThreadPoolExecutor.getTask(ThreadPoolExecutor.java:1054)
        at java.base@11-ea/java.util.concurrent.ThreadPoolExecutor.runWorker(ThreadPoolExecutor.java:1114)
        at java.base@11-ea/java.util.concurrent.ThreadPoolExecutor$Worker.run(ThreadPoolExecutor.java:628)
        at java.base@11-ea/java.lang.Thread.run(Thread.java:834)
   6) Thread[id=1147, name=ShortestPathStream-237-thread-1-SendThread(127.0.0.1:42011), state=TIMED_WAITING, group=TGRP-GraphTest]
        at java.base@11-ea/java.lang.Thread.sleep(Native Method)
        at app//org.apache.zookeeper.ClientCnxn$SendThread.run(ClientCnxn.java:1054)
	at __randomizedtesting.SeedInfo.seed([22E959E9246CE75]:0)


FAILED:  junit.framework.TestSuite.org.apache.solr.client.solrj.io.graph.GraphTest

Error Message:
There are still zombie threads that couldn't be terminated:    1) Thread[id=1149, name=zkConnectionManagerCallback-242-thread-1, state=WAITING, group=TGRP-GraphTest]         at java.base@11-ea/jdk.internal.misc.Unsafe.park(Native Method)         at java.base@11-ea/java.util.concurrent.locks.LockSupport.park(LockSupport.java:194)         at java.base@11-ea/java.util.concurrent.locks.AbstractQueuedSynchronizer$ConditionObject.await(AbstractQueuedSynchronizer.java:2081)         at java.base@11-ea/java.util.concurrent.LinkedBlockingQueue.take(LinkedBlockingQueue.java:433)         at java.base@11-ea/java.util.concurrent.ThreadPoolExecutor.getTask(ThreadPoolExecutor.java:1054)         at java.base@11-ea/java.util.concurrent.ThreadPoolExecutor.runWorker(ThreadPoolExecutor.java:1114)         at java.base@11-ea/java.util.concurrent.ThreadPoolExecutor$Worker.run(ThreadPoolExecutor.java:628)         at java.base@11-ea/java.lang.Thread.run(Thread.java:834)    2) Thread[id=1147, name=ShortestPathStream-237-thread-1-SendThread(127.0.0.1:42011), state=TIMED_WAITING, group=TGRP-GraphTest]         at java.base@11-ea/java.lang.Thread.sleep(Native Method)         at app//org.apache.zookeeper.client.StaticHostProvider.next(StaticHostProvider.java:105)         at app//org.apache.zookeeper.ClientCnxn$SendThread.startConnect(ClientCnxn.java:1000)         at app//org.apache.zookeeper.ClientCnxn$SendThread.run(ClientCnxn.java:1063)

Stack Trace:
com.carrotsearch.randomizedtesting.ThreadLeakError: There are still zombie threads that couldn't be terminated:
   1) Thread[id=1149, name=zkConnectionManagerCallback-242-thread-1, state=WAITING, group=TGRP-GraphTest]
        at java.base@11-ea/jdk.internal.misc.Unsafe.park(Native Method)
        at java.base@11-ea/java.util.concurrent.locks.LockSupport.park(LockSupport.java:194)
        at java.base@11-ea/java.util.concurrent.locks.AbstractQueuedSynchronizer$ConditionObject.await(AbstractQueuedSynchronizer.java:2081)
        at java.base@11-ea/java.util.concurrent.LinkedBlockingQueue.take(LinkedBlockingQueue.java:433)
        at java.base@11-ea/java.util.concurrent.ThreadPoolExecutor.getTask(ThreadPoolExecutor.java:1054)
        at java.base@11-ea/java.util.concurrent.ThreadPoolExecutor.runWorker(ThreadPoolExecutor.java:1114)
        at java.base@11-ea/java.util.concurrent.ThreadPoolExecutor$Worker.run(ThreadPoolExecutor.java:628)
        at java.base@11-ea/java.lang.Thread.run(Thread.java:834)
   2) Thread[id=1147, name=Sh

[...truncated too long message...]

2> 	9	/solr/collections/collection1/terms/shard1
   [junit4]   2> 	9	/solr/collections/collection1/terms/shard2
   [junit4]   2> 	8	/solr/collections/collection1/state.json
   [junit4]   2> 	5	/solr/security.json
   [junit4]   2> 	5	/solr/configs/conf1
   [junit4]   2> 	5	/solr/collections/.system/terms/shard1
   [junit4]   2> 	2	/solr/configs/.system
   [junit4]   2> 	2	/solr/configs/.system/managed-schema
   [junit4]   2> 	2	/solr/collections/control_collection/terms/shard1
   [junit4]   2> 
   [junit4]   2> Maximum concurrent data watches above limit:
   [junit4]   2> 
   [junit4]   2> 	12	/solr/clusterprops.json
   [junit4]   2> 	12	/solr/clusterstate.json
   [junit4]   2> 	5	/solr/autoscaling.json
   [junit4]   2> 	2	/solr/collections/.system/state.json
   [junit4]   2> 
   [junit4]   2> Maximum concurrent children watches above limit:
   [junit4]   2> 
   [junit4]   2> 	12	/solr/live_nodes
   [junit4]   2> 	12	/solr/collections
   [junit4]   2> 	5	/solr/overseer/queue
   [junit4]   2> 	5	/solr/autoscaling/events/.scheduled_maintenance
   [junit4]   2> 	5	/solr/autoscaling/events/.auto_add_replicas
   [junit4]   2> 	5	/solr/overseer/collection-queue-work
   [junit4]   2> 	5	/solr/overseer/queue-work
   [junit4]   2> 
   [junit4]   2> NOTE: reproduce with: ant test  -Dtestcase=TestBlobHandler -Dtests.method=doBlobHandlerTest -Dtests.seed=CF23536430898C8 -Dtests.multiplier=3 -Dtests.slow=true -Dtests.badapples=true -Dtests.locale=ar-SY -Dtests.timezone=Asia/Istanbul -Dtests.asserts=true -Dtests.file.encoding=ISO-8859-1
   [junit4] ERROR   15.9s J1 | TestBlobHandler.doBlobHandlerTest <<<
   [junit4]    > Throwable #1: java.lang.NullPointerException
   [junit4]    > 	at __randomizedtesting.SeedInfo.seed([CF23536430898C8:EC331764F8E4EE3A]:0)
   [junit4]    > 	at java.base/sun.security.ssl.SSLSessionImpl.getLocalPrincipal(SSLSessionImpl.java:661)
   [junit4]    > 	at org.apache.http.impl.client.DefaultUserTokenHandler.getUserToken(DefaultUserTokenHandler.java:84)
   [junit4]    > 	at org.apache.http.impl.execchain.MainClientExec.execute(MainClientExec.java:328)
   [junit4]    > 	at org.apache.http.impl.execchain.ProtocolExec.execute(ProtocolExec.java:185)
   [junit4]    > 	at org.apache.http.impl.execchain.RetryExec.execute(RetryExec.java:89)
   [junit4]    > 	at org.apache.http.impl.execchain.RedirectExec.execute(RedirectExec.java:111)
   [junit4]    > 	at org.apache.http.impl.client.InternalHttpClient.doExecute(InternalHttpClient.java:185)
   [junit4]    > 	at org.apache.http.impl.client.CloseableHttpClient.execute(CloseableHttpClient.java:83)
   [junit4]    > 	at org.apache.http.impl.client.CloseableHttpClient.execute(CloseableHttpClient.java:108)
   [junit4]    > 	at org.apache.http.impl.client.CloseableHttpClient.execute(CloseableHttpClient.java:56)
   [junit4]    > 	at org.apache.solr.handler.TestSolrConfigHandlerConcurrent.getAsMap(TestSolrConfigHandlerConcurrent.java:187)
   [junit4]    > 	at org.apache.solr.handler.TestBlobHandler.doBlobHandlerTest(TestBlobHandler.java:74)
   [junit4]    > 	at java.base/jdk.internal.reflect.NativeMethodAccessorImpl.invoke0(Native Method)
   [junit4]    > 	at java.base/jdk.internal.reflect.NativeMethodAccessorImpl.invoke(NativeMethodAccessorImpl.java:62)
   [junit4]    > 	at java.base/jdk.internal.reflect.DelegatingMethodAccessorImpl.invoke(DelegatingMethodAccessorImpl.java:43)
   [junit4]    > 	at java.base/java.lang.reflect.Method.invoke(Method.java:566)
   [junit4]    > 	at org.apache.solr.BaseDistributedSearchTestCase$ShardsRepeatRule$ShardsFixedStatement.callStatement(BaseDistributedSearchTestCase.java:1008)
   [junit4]    > 	at org.apache.solr.BaseDistributedSearchTestCase$ShardsRepeatRule$ShardsStatement.evaluate(BaseDistributedSearchTestCase.java:983)
   [junit4]    > 	at java.base/java.lang.Thread.run(Thread.java:834)
   [junit4]   2> NOTE: leaving temporary files on disk at: /home/jenkins/workspace/Lucene-Solr-7.x-Linux/solr/build/solr-core/test/J1/temp/solr.handler.TestBlobHandler_CF23536430898C8-002
   [junit4]   2> NOTE: test params are: codec=Asserting(Lucene70): {}, docValues:{}, maxPointsInLeafNode=1700, maxMBSortInHeap=7.711867478808126, sim=RandomSimilarity(queryNorm=false): {}, locale=ar-SY, timezone=Asia/Istanbul
   [junit4]   2> NOTE: Linux 4.15.0-24-generic amd64/Oracle Corporation 11-ea (64-bit)/cpus=8,threads=1,free=157237272,total=463994880
   [junit4]   2> NOTE: All tests run in this JVM: [MetricTriggerIntegrationTest, SolrCloudReportersTest, DistributedMLTComponentTest, HttpSolrCallGetCoreTest, TestTlogReplica, DocValuesNotIndexedTest, BasicAuthStandaloneTest, BasicAuthStandaloneTest, TestSolrConfigHandlerCloud, BlobRepositoryCloudTest, MetricTriggerIntegrationTest, TestSystemCollAutoCreate, TestNamedUpdateProcessors, TestNamedUpdateProcessors, DistributedMLTComponentTest, SolrCloudReportersTest, SolrCloudReportersTest, TestSQLHandler, TestTlogReplica, TestMiniSolrCloudClusterSSL, TestMiniSolrCloudClusterSSL, HttpSolrCallGetCoreTest, DocValuesNotIndexedTest, DocValuesNotIndexedTest, SolrCloudExampleTest, SolrCloudExampleTest, TestSystemCollAutoCreate, TestBlobHandler, TestBlobHandler]
   [junit4] Completed [90/90 (73!)] on J1 in 15.88s, 1 test, 1 error <<< FAILURES!
   [junit4] 
   [junit4] 
   [junit4] Tests with failures [seed: CF23536430898C8] (first 10 out of 126):
   [junit4]   - org.apache.solr.servlet.CacheHeaderTest.testEtag
   [junit4]   - org.apache.solr.servlet.CacheHeaderTest.testCacheControl
   [junit4]   - org.apache.solr.servlet.CacheHeaderTest.testLastModified
   [junit4]   - org.apache.solr.servlet.CacheHeaderTest.testCacheVetoException
   [junit4]   - org.apache.solr.servlet.CacheHeaderTest.testCacheVetoHandler
   [junit4]   - org.apache.solr.security.BasicAuthStandaloneTest.testBasicAuth
   [junit4]   - org.apache.solr.handler.component.DistributedMLTComponentTest.test
   [junit4]   - org.apache.solr.handler.TestSystemCollAutoCreate.testAutoCreate
   [junit4]   - org.apache.solr.servlet.CacheHeaderTest.testEtag
   [junit4]   - org.apache.solr.servlet.CacheHeaderTest.testCacheControl
   [junit4] 
   [junit4] 
   [junit4] JVM J0:     0.92 ..   957.17 =   956.26s
   [junit4] JVM J1:     0.92 ..   958.02 =   957.09s
   [junit4] JVM J2:     0.95 ..   957.59 =   956.64s
   [junit4] Execution time total: 15 minutes 58 seconds
   [junit4] Tests summary: 90 suites, 207 tests, 12 suite-level errors, 97 errors, 17 failures

BUILD FAILED
/home/jenkins/workspace/Lucene-Solr-7.x-Linux/lucene/common-build.xml:1568: The following error occurred while executing this line:
/home/jenkins/workspace/Lucene-Solr-7.x-Linux/lucene/common-build.xml:1092: There were test failures: 90 suites, 207 tests, 12 suite-level errors, 97 errors, 17 failures [seed: CF23536430898C8]

Total time: 15 minutes 59 seconds

[repro] Setting last failure code to 256

[repro] Failures:
[repro]   0/5 failed: org.apache.solr.client.solrj.embedded.LargeVolumeBinaryJettyTest
[repro]   0/5 failed: org.apache.solr.client.solrj.embedded.LargeVolumeJettyTest
[repro]   0/5 failed: org.apache.solr.client.solrj.io.stream.MathExpressionTest
[repro]   1/5 failed: org.apache.solr.client.solrj.io.graph.GraphExpressionTest
[repro]   1/5 failed: org.apache.solr.metrics.reporters.solr.SolrCloudReportersTest
[repro]   1/5 failed: org.apache.solr.servlet.HttpSolrCallGetCoreTest
[repro]   2/5 failed: org.apache.solr.client.solrj.io.graph.GraphTest
[repro]   2/5 failed: org.apache.solr.cloud.autoscaling.MetricTriggerIntegrationTest
[repro]   3/5 failed: org.apache.solr.cloud.DocValuesNotIndexedTest
[repro]   3/5 failed: org.apache.solr.handler.TestSQLHandler
[repro]   4/5 failed: org.apache.solr.cloud.autoscaling.ScheduledTriggerIntegrationTest
[repro]   4/5 failed: org.apache.solr.handler.component.DistributedMLTComponentTest
[repro]   5/5 failed: org.apache.solr.cloud.SolrCloudExampleTest
[repro]   5/5 failed: org.apache.solr.cloud.TestMiniSolrCloudClusterSSL
[repro]   5/5 failed: org.apache.solr.cloud.TestTlogReplica
[repro]   5/5 failed: org.apache.solr.core.BlobRepositoryCloudTest
[repro]   5/5 failed: org.apache.solr.handler.TestBlobHandler
[repro]   5/5 failed: org.apache.solr.handler.TestSolrConfigHandlerCloud
[repro]   5/5 failed: org.apache.solr.handler.TestSystemCollAutoCreate
[repro]   5/5 failed: org.apache.solr.security.BasicAuthStandaloneTest
[repro]   5/5 failed: org.apache.solr.servlet.CacheHeaderTest
[repro]   5/5 failed: org.apache.solr.servlet.NoCacheHeaderTest
[repro]   5/5 failed: org.apache.solr.update.processor.TestNamedUpdateProcessors
[repro] Exiting with code 256
+ mv lucene/build lucene/build.repro
+ mv solr/build solr/build.repro
+ mv lucene/build.orig lucene/build
+ mv solr/build.orig solr/build
Archiving artifacts
Setting ANT_1_8_2_HOME=/var/lib/jenkins/tools/hudson.tasks.Ant_AntInstallation/ANT_1.8.2
[WARNINGS] Parsing warnings in console log with parser Java Compiler (javac)
Setting ANT_1_8_2_HOME=/var/lib/jenkins/tools/hudson.tasks.Ant_AntInstallation/ANT_1.8.2
Setting ANT_1_8_2_HOME=/var/lib/jenkins/tools/hudson.tasks.Ant_AntInstallation/ANT_1.8.2
<Git Blamer> Using GitBlamer to create author and commit information for all warnings.
<Git Blamer> GIT_COMMIT=9a6706ed32646e74fb64a8b2caa05fd6bc7e8a35, workspace=/var/lib/jenkins/workspace/Lucene-Solr-7.x-Linux
[WARNINGS] Computing warning deltas based on reference build #2275
Recording test results
Setting ANT_1_8_2_HOME=/var/lib/jenkins/tools/hudson.tasks.Ant_AntInstallation/ANT_1.8.2
Build step 'Publish JUnit test result report' changed build result to UNSTABLE
Email was triggered for: Unstable (Test Failures)
Sending email for trigger: Unstable (Test Failures)
Setting ANT_1_8_2_HOME=/var/lib/jenkins/tools/hudson.tasks.Ant_AntInstallation/ANT_1.8.2
Setting ANT_1_8_2_HOME=/var/lib/jenkins/tools/hudson.tasks.Ant_AntInstallation/ANT_1.8.2
Setting ANT_1_8_2_HOME=/var/lib/jenkins/tools/hudson.tasks.Ant_AntInstallation/ANT_1.8.2
Setting ANT_1_8_2_HOME=/var/lib/jenkins/tools/hudson.tasks.Ant_AntInstallation/ANT_1.8.2

Mime
View raw message