lucene-dev mailing list archives

Site index · List index
Message view « Date » · « Thread »
Top « Date » · « Thread »
From Policeman Jenkins Server <jenk...@thetaphi.de>
Subject [JENKINS-EA] Lucene-Solr-7.x-Linux (64bit/jdk-11-ea+21) - Build # 2301 - Unstable!
Date Wed, 11 Jul 2018 22:40:21 GMT
Build: https://jenkins.thetaphi.de/job/Lucene-Solr-7.x-Linux/2301/
Java: 64bit/jdk-11-ea+21 -XX:+UseCompressedOops -XX:+UseG1GC

121 tests failed.
FAILED:  junit.framework.TestSuite.org.apache.solr.cloud.TestConfigSetsAPI

Error Message:
4 threads leaked from SUITE scope at org.apache.solr.cloud.TestConfigSetsAPI:     1) Thread[id=6378, name=Connection evictor, state=TIMED_WAITING, group=TGRP-TestConfigSetsAPI]         at java.base@11-ea/java.lang.Thread.sleep(Native Method)         at app//org.apache.http.impl.client.IdleConnectionEvictor$1.run(IdleConnectionEvictor.java:66)         at java.base@11-ea/java.lang.Thread.run(Thread.java:834)    2) Thread[id=6380, name=TEST-TestConfigSetsAPI.testUploadErrors-seed#[82AC95FEBB5841A7]-SendThread(127.0.0.1:37979), state=TIMED_WAITING, group=TGRP-TestConfigSetsAPI]         at java.base@11-ea/java.lang.Thread.sleep(Native Method)         at app//org.apache.zookeeper.client.StaticHostProvider.next(StaticHostProvider.java:105)         at app//org.apache.zookeeper.ClientCnxn$SendThread.startConnect(ClientCnxn.java:1000)         at app//org.apache.zookeeper.ClientCnxn$SendThread.run(ClientCnxn.java:1063)    3) Thread[id=6382, name=zkConnectionManagerCallback-3739-thread-1, state=WAITING, group=TGRP-TestConfigSetsAPI]         at java.base@11-ea/jdk.internal.misc.Unsafe.park(Native Method)         at java.base@11-ea/java.util.concurrent.locks.LockSupport.park(LockSupport.java:194)         at java.base@11-ea/java.util.concurrent.locks.AbstractQueuedSynchronizer$ConditionObject.await(AbstractQueuedSynchronizer.java:2081)         at java.base@11-ea/java.util.concurrent.LinkedBlockingQueue.take(LinkedBlockingQueue.java:433)         at java.base@11-ea/java.util.concurrent.ThreadPoolExecutor.getTask(ThreadPoolExecutor.java:1054)         at java.base@11-ea/java.util.concurrent.ThreadPoolExecutor.runWorker(ThreadPoolExecutor.java:1114)         at java.base@11-ea/java.util.concurrent.ThreadPoolExecutor$Worker.run(ThreadPoolExecutor.java:628)         at java.base@11-ea/java.lang.Thread.run(Thread.java:834)    4) Thread[id=6381, name=TEST-TestConfigSetsAPI.testUploadErrors-seed#[82AC95FEBB5841A7]-EventThread, state=WAITING, group=TGRP-TestConfigSetsAPI]         at java.base@11-ea/jdk.internal.misc.Unsafe.park(Native Method)         at java.base@11-ea/java.util.concurrent.locks.LockSupport.park(LockSupport.java:194)         at java.base@11-ea/java.util.concurrent.locks.AbstractQueuedSynchronizer$ConditionObject.await(AbstractQueuedSynchronizer.java:2081)         at java.base@11-ea/java.util.concurrent.LinkedBlockingQueue.take(LinkedBlockingQueue.java:433)         at app//org.apache.zookeeper.ClientCnxn$EventThread.run(ClientCnxn.java:502)

Stack Trace:
com.carrotsearch.randomizedtesting.ThreadLeakError: 4 threads leaked from SUITE scope at org.apache.solr.cloud.TestConfigSetsAPI: 
   1) Thread[id=6378, name=Connection evictor, state=TIMED_WAITING, group=TGRP-TestConfigSetsAPI]
        at java.base@11-ea/java.lang.Thread.sleep(Native Method)
        at app//org.apache.http.impl.client.IdleConnectionEvictor$1.run(IdleConnectionEvictor.java:66)
        at java.base@11-ea/java.lang.Thread.run(Thread.java:834)
   2) Thread[id=6380, name=TEST-TestConfigSetsAPI.testUploadErrors-seed#[82AC95FEBB5841A7]-SendThread(127.0.0.1:37979), state=TIMED_WAITING, group=TGRP-TestConfigSetsAPI]
        at java.base@11-ea/java.lang.Thread.sleep(Native Method)
        at app//org.apache.zookeeper.client.StaticHostProvider.next(StaticHostProvider.java:105)
        at app//org.apache.zookeeper.ClientCnxn$SendThread.startConnect(ClientCnxn.java:1000)
        at app//org.apache.zookeeper.ClientCnxn$SendThread.run(ClientCnxn.java:1063)
   3) Thread[id=6382, name=zkConnectionManagerCallback-3739-thread-1, state=WAITING, group=TGRP-TestConfigSetsAPI]
        at java.base@11-ea/jdk.internal.misc.Unsafe.park(Native Method)
        at java.base@11-ea/java.util.concurrent.locks.LockSupport.park(LockSupport.java:194)
        at java.base@11-ea/java.util.concurrent.locks.AbstractQueuedSynchronizer$ConditionObject.await(AbstractQueuedSynchronizer.java:2081)
        at java.base@11-ea/java.util.concurrent.LinkedBlockingQueue.take(LinkedBlockingQueue.java:433)
        at java.base@11-ea/java.util.concurrent.ThreadPoolExecutor.getTask(ThreadPoolExecutor.java:1054)
        at java.base@11-ea/java.util.concurrent.ThreadPoolExecutor.runWorker(ThreadPoolExecutor.java:1114)
        at java.base@11-ea/java.util.concurrent.ThreadPoolExecutor$Worker.run(ThreadPoolExecutor.java:628)
        at java.base@11-ea/java.lang.Thread.run(Thread.java:834)
   4) Thread[id=6381, name=TEST-TestConfigSetsAPI.testUploadErrors-seed#[82AC95FEBB5841A7]-EventThread, state=WAITING, group=TGRP-TestConfigSetsAPI]
        at java.base@11-ea/jdk.internal.misc.Unsafe.park(Native Method)
        at java.base@11-ea/java.util.concurrent.locks.LockSupport.park(LockSupport.java:194)
        at java.base@11-ea/java.util.concurrent.locks.AbstractQueuedSynchronizer$ConditionObject.await(AbstractQueuedSynchronizer.java:2081)
        at java.base@11-ea/java.util.concurrent.LinkedBlockingQueue.take(LinkedBlockingQueue.java:433)
        at app//org.apache.zookeeper.ClientCnxn$EventThread.run(ClientCnxn.java:502)
	at __randomizedtesting.SeedInfo.seed([82AC95FEBB5841A7]:0)


FAILED:  junit.framework.TestSuite.org.apache.solr.cloud.TestConfigSetsAPI

Error Message:
There are still zombie threads that couldn't be terminated:    1) Thread[id=6380, name=TEST-TestConfigSetsAPI.testUploadErrors-seed#[82AC95FEBB5841A7]-SendThread(127.0.0.1:37979), state=TIMED_WAITING, group=TGRP-TestConfigSetsAPI]         at java.base@11-ea/java.lang.Thread.sleep(Native Method)         at app//org.apache.zookeeper.client.StaticHostProvider.next(StaticHostProvider.java:105)         at app//org.apache.zookeeper.ClientCnxn$SendThread.startConnect(ClientCnxn.java:1000)         at app//org.apache.zookeeper.ClientCnxn$SendThread.run(ClientCnxn.java:1063)    2) Thread[id=6382, name=zkConnectionManagerCallback-3739-thread-1, state=WAITING, group=TGRP-TestConfigSetsAPI]         at java.base@11-ea/jdk.internal.misc.Unsafe.park(Native Method)         at java.base@11-ea/java.util.concurrent.locks.LockSupport.park(LockSupport.java:194)         at java.base@11-ea/java.util.concurrent.locks.AbstractQueuedSynchronizer$ConditionObject.await(AbstractQueuedSynchronizer.java:2081)         at java.base@11-ea/java.util.concurrent.LinkedBlockingQueue.take(LinkedBlockingQueue.java:433)         at java.base@11-ea/java.util.concurrent.ThreadPoolExecutor.getTask(ThreadPoolExecutor.java:1054)         at java.base@11-ea/java.util.concurrent.ThreadPoolExecutor.runWorker(ThreadPoolExecutor.java:1114)         at java.base@11-ea/java.util.concurrent.ThreadPoolExecutor$Worker.run(ThreadPoolExecutor.java:628)         at java.base@11-ea/java.lang.Thread.run(Thread.java:834)

Stack Trace:
com.carrotsearch.randomizedtesting.ThreadLeakError: There are still zombie threads that couldn't be terminated:
   1) Thread[id=6380, name=TEST-TestConfigSetsAPI.testUploadErrors-seed#[82AC95FEBB5841A7]-SendThread(127.0.0.1:37979), state=TIMED_WAITING, group=TGRP-TestConfigSetsAPI]
        at java.base@11-ea/java.lang.Thread.sleep(Native Method)
        at app//org.apache.zookeeper.client.StaticHostProvider.next(StaticHostProvider.java:105)
        at app//org.apache.zookeeper.ClientCnxn$SendThread.startConnect(ClientCnxn.java:1000)
        at app//org.apache.zookeeper.ClientCnxn$SendThread.run(ClientCnxn.java:1063)
   2) Thread[id=6382, name=zkConnectionManagerCallback-3739-thread-1, state=WAITING, group=TGRP-TestConfigSetsAPI]
        at java.base@11-ea/jdk.internal.misc.Unsafe.park(Native Method)
        at java.base@11-ea/java.util.concurrent.locks.LockSupport.park(LockSupport.java:194)
        at java.base@11-ea/java.util.concurrent.locks.AbstractQueuedSynchronizer$ConditionObject.await(AbstractQueuedSynchronizer.java:2081)
        at java.base@11-ea/java.util.concurrent.LinkedBlockingQueue.take(LinkedBlockingQueue.java:433)
        at java.base@11-ea/java.util.concurrent.ThreadPoolExecutor.getTask(ThreadPoolExecutor.java:1054)
        at java.base@11-ea/java.util.concurrent.ThreadPoolExecutor.runWorker(ThreadPoolExecutor.java:1114)
        at java.base@11-ea/java.util.concurrent.ThreadPoolExecutor$Worker.run(ThreadPoolExecutor.java:628)
        at java.base@11-ea/java.lang.Thread.run(Thread.java:834)
	at __randomizedtesting.SeedInfo.seed([82AC95FEBB5841A7]:0)


FAILED:  junit.framework.TestSuite.org.apache.solr.cloud.TestConfigSetsAPI

Error Message:
4 threads leaked from SUITE scope at org.apache.solr.cloud.TestConfigSetsAPI:     1) Thread[id=3292, name=TEST-TestConfigSetsAPI.testUploadErrors-seed#[82AC95FEBB5841A7]-SendThread(127.0.0.1:37127), state=TIMED_WAITING, group=TGRP-TestConfigSetsAPI]         at java.base@11-ea/java.lang.Thread.sleep(Native Method)         at app//org.apache.zookeeper.ClientCnxn$SendThread.run(ClientCnxn.java:1054)    2) Thread[id=3290, name=Connection evictor, state=TIMED_WAITING, group=TGRP-TestConfigSetsAPI]         at java.base@11-ea/java.lang.Thread.sleep(Native Method)         at app//org.apache.http.impl.client.IdleConnectionEvictor$1.run(IdleConnectionEvictor.java:66)         at java.base@11-ea/java.lang.Thread.run(Thread.java:834)    3) Thread[id=3293, name=TEST-TestConfigSetsAPI.testUploadErrors-seed#[82AC95FEBB5841A7]-EventThread, state=WAITING, group=TGRP-TestConfigSetsAPI]         at java.base@11-ea/jdk.internal.misc.Unsafe.park(Native Method)         at java.base@11-ea/java.util.concurrent.locks.LockSupport.park(LockSupport.java:194)         at java.base@11-ea/java.util.concurrent.locks.AbstractQueuedSynchronizer$ConditionObject.await(AbstractQueuedSynchronizer.java:2081)         at java.base@11-ea/java.util.concurrent.LinkedBlockingQueue.take(LinkedBlockingQueue.java:433)         at app//org.apache.zookeeper.ClientCnxn$EventThread.run(ClientCnxn.java:502)    4) Thread[id=3294, name=zkConnectionManagerCallback-2820-thread-1, state=WAITING, group=TGRP-TestConfigSetsAPI]         at java.base@11-ea/jdk.internal.misc.Unsafe.park(Native Method)         at java.base@11-ea/java.util.concurrent.locks.LockSupport.park(LockSupport.java:194)         at java.base@11-ea/java.util.concurrent.locks.AbstractQueuedSynchronizer$ConditionObject.await(AbstractQueuedSynchronizer.java:2081)         at java.base@11-ea/java.util.concurrent.LinkedBlockingQueue.take(LinkedBlockingQueue.java:433)         at java.base@11-ea/java.util.concurrent.ThreadPoolExecutor.getTask(ThreadPoolExecutor.java:1054)         at java.base@11-ea/java.util.concurrent.ThreadPoolExecutor.runWorker(ThreadPoolExecutor.java:1114)         at java.base@11-ea/java.util.concurrent.ThreadPoolExecutor$Worker.run(ThreadPoolExecutor.java:628)         at java.base@11-ea/java.lang.Thread.run(Thread.java:834)

Stack Trace:
com.carrotsearch.randomizedtesting.ThreadLeakError: 4 threads leaked from SUITE scope at org.apache.solr.cloud.TestConfigSetsAPI: 
   1) Thread[id=3292, name=TEST-TestConfigSetsAPI.testUploadErrors-seed#[82AC95FEBB5841A7]-SendThread(127.0.0.1:37127), state=TIMED_WAITING, group=TGRP-TestConfigSetsAPI]
        at java.base@11-ea/java.lang.Thread.sleep(Native Method)
        at app//org.apache.zookeeper.ClientCnxn$SendThread.run(ClientCnxn.java:1054)
   2) Thread[id=3290, name=Connection evictor, state=TIMED_WAITING, group=TGRP-TestConfigSetsAPI]
        at java.base@11-ea/java.lang.Thread.sleep(Native Method)
        at app//org.apache.http.impl.client.IdleConnectionEvictor$1.run(IdleConnectionEvictor.java:66)
        at java.base@11-ea/java.lang.Thread.run(Thread.java:834)
   3) Thread[id=3293, name=TEST-TestConfigSetsAPI.testUploadErrors-seed#[82AC95FEBB5841A7]-EventThread, state=WAITING, group=TGRP-TestConfigSetsAPI]
        at java.base@11-ea/jdk.internal.misc.Unsafe.park(Native Method)
        at java.base@11-ea/java.util.concurrent.locks.LockSupport.park(LockSupport.java:194)
        at java.base@11-ea/java.util.concurrent.locks.AbstractQueuedSynchronizer$ConditionObject.await(AbstractQueuedSynchronizer.java:2081)
        at java.base@11-ea/java.util.concurrent.LinkedBlockingQueue.take(LinkedBlockingQueue.java:433)
        at app//org.apache.zookeeper.ClientCnxn$EventThread.run(ClientCnxn.java:502)
   4) Thread[id=3294, name=zkConnectionManagerCallback-2820-thread-1, state=WAITING, group=TGRP-TestConfigSetsAPI]
        at java.base@11-ea/jdk.internal.misc.Unsafe.park(Native Method)
        at java.base@11-ea/java.util.concurrent.locks.LockSupport.park(LockSupport.java:194)
        at java.base@11-ea/java.util.concurrent.locks.AbstractQueuedSynchronizer$ConditionObject.await(AbstractQueuedSynchronizer.java:2081)
        at java.base@11-ea/java.util.concurrent.LinkedBlockingQueue.take(LinkedBlockingQueue.java:433)
        at java.base@11-ea/java.util.concurrent.ThreadPoolExecutor.getTask(ThreadPoolExecutor.java:1054)
        at java.base@11-ea/java.util.concurrent.ThreadPoolExecutor.runWorker(ThreadPoolExecutor.java:1114)
        at java.base@11-ea/java.util.concurrent.ThreadPoolExecutor$Worker.run(ThreadPoolExecutor.java:628)
        at java.base@11-ea/java.lang.Thread.run(Thread.java:834)
	at __randomizedtesting.SeedInfo.seed([82AC95FEBB5841A7]:0)


FAILED:  junit.framework.TestSuite.org.apache.solr.cloud.TestConfigSetsAPI

Error Message:
There are still zombie threads that couldn't be terminated:    1) Thread[id=3292, name=TEST-TestConfigSetsAPI.testUploadErrors-seed#[82AC95FEBB5841A7]-SendThread(127.0.0.1:37127), state=TIMED_WAITING, group=TGRP-TestConfigSetsAPI]         at java.base@11-ea/java.lang.Thread.sleep(Native Method)         at app//org.apache.zookeeper.client.StaticHostProvider.next(StaticHostProvider.java:105)         at app//org.apache.zookeeper.ClientCnxn$SendThread.startConnect(ClientCnxn.java:1000)         at app//org.apache.zookeeper.ClientCnxn$SendThread.run(ClientCnxn.java:1063)    2) Thread[id=3294, name=zkConnectionManagerCallback-2820-thread-1, state=WAITING, group=TGRP-TestConfigSetsAPI]         at java.base@11-ea/jdk.internal.misc.Unsafe.park(Native Method)         at java.base@11-ea/java.util.concurrent.locks.LockSupport.park(LockSupport.java:194)         at java.base@11-ea/java.util.concurrent.locks.AbstractQueuedSynchronizer$ConditionObject.await(AbstractQueuedSynchronizer.java:2081)         at java.base@11-ea/java.util.concurrent.LinkedBlockingQueue.take(LinkedBlockingQueue.java:433)         at java.base@11-ea/java.util.concurrent.ThreadPoolExecutor.getTask(ThreadPoolExecutor.java:1054)         at java.base@11-ea/java.util.concurrent.ThreadPoolExecutor.runWorker(ThreadPoolExecutor.java:1114)         at java.base@11-ea/java.util.concurrent.ThreadPoolExecutor$Worker.run(ThreadPoolExecutor.java:628)         at java.base@11-ea/java.lang.Thread.run(Thread.java:834)

Stack Trace:
com.carrotsearch.randomizedtesting.ThreadLeakError: There are still zombie threads that couldn't be terminated:
   1) Thread[id=3292, name=TEST-TestConfigSetsAPI.testUploadErrors-seed#[82AC95FEBB5841A7]-SendThread(127.0.0.1:37127), state=TIMED_WAITING, group=TGRP-TestConfigSetsAPI]
        at java.base@11-ea/java.lang.Thread.sleep(Native Method)
        at app//org.apache.zookeeper.client.StaticHostProvider.next(StaticHostProvider.java:105)
        at app//org.apache.zookeeper.ClientCnxn$SendThread.startConnect(ClientCnxn.java:1000)
        at app//org.apache.zookeeper.ClientCnxn$SendThread.run(ClientCnxn.java:1063)
   2) Thread[id=3294, name=zkConnectionManagerCallback-2820-thread-1, state=WAITING, group=TGRP-TestConfigSetsAPI]
        at java.base@11-ea/jdk.internal.misc.Unsafe.park(Native Method)
        at java.base@11-ea/java.util.concurrent.locks.LockSupport.park(LockSupport.java:194)
        at java.base@11-ea/java.util.concurrent.locks.AbstractQueuedSynchronizer$ConditionObject.await(AbstractQueuedSynchronizer.java:2081)
        at java.base@11-ea/java.util.concurrent.LinkedBlockingQueue.take(LinkedBlockingQueue.java:433)
        at java.base@11-ea/java.util.concurrent.ThreadPoolExecutor.getTask(ThreadPoolExecutor.java:1054)
        at java.base@11-ea/java.util.concurrent.ThreadPoolExecutor.runWorker(ThreadPoolExecutor.java:1114)
        at java.base@11-ea/java.util.concurrent.ThreadPoolExecutor$Worker.run(ThreadPoolExecutor.java:628)
        at java.base@11-ea/java.lang.Thread.run(Thread.java:834)
	at __randomizedtesting.SeedInfo.seed([82AC95FEBB5841A7]:0)


FAILED:  junit.framework.TestSuite.org.apache.solr.cloud.TestConfigSetsAPI

Error Message:
4 threads leaked from SUITE scope at org.apache.solr.cloud.TestConfigSetsAPI:     1) Thread[id=27485, name=TEST-TestConfigSetsAPI.testUploadErrors-seed#[82AC95FEBB5841A7]-EventThread, state=WAITING, group=TGRP-TestConfigSetsAPI]         at java.base@11-ea/jdk.internal.misc.Unsafe.park(Native Method)         at java.base@11-ea/java.util.concurrent.locks.LockSupport.park(LockSupport.java:194)         at java.base@11-ea/java.util.concurrent.locks.AbstractQueuedSynchronizer$ConditionObject.await(AbstractQueuedSynchronizer.java:2081)         at java.base@11-ea/java.util.concurrent.LinkedBlockingQueue.take(LinkedBlockingQueue.java:433)         at app//org.apache.zookeeper.ClientCnxn$EventThread.run(ClientCnxn.java:502)    2) Thread[id=27482, name=Connection evictor, state=TIMED_WAITING, group=TGRP-TestConfigSetsAPI]         at java.base@11-ea/java.lang.Thread.sleep(Native Method)         at app//org.apache.http.impl.client.IdleConnectionEvictor$1.run(IdleConnectionEvictor.java:66)         at java.base@11-ea/java.lang.Thread.run(Thread.java:834)    3) Thread[id=27484, name=TEST-TestConfigSetsAPI.testUploadErrors-seed#[82AC95FEBB5841A7]-SendThread(127.0.0.1:45923), state=TIMED_WAITING, group=TGRP-TestConfigSetsAPI]         at java.base@11-ea/java.lang.Thread.sleep(Native Method)         at app//org.apache.zookeeper.client.StaticHostProvider.next(StaticHostProvider.java:105)         at app//org.apache.zookeeper.ClientCnxn$SendThread.startConnect(ClientCnxn.java:1000)         at app//org.apache.zookeeper.ClientCnxn$SendThread.run(ClientCnxn.java:1063)    4) Thread[id=27486, name=zkConnectionManagerCallback-8978-thread-1, state=WAITING, group=TGRP-TestConfigSetsAPI]         at java.base@11-ea/jdk.internal.misc.Unsafe.park(Native Method)         at java.base@11-ea/java.util.concurrent.locks.LockSupport.park(LockSupport.java:194)         at java.base@11-ea/java.util.concurrent.locks.AbstractQueuedSynchronizer$ConditionObject.await(AbstractQueuedSynchronizer.java:2081)         at java.base@11-ea/java.util.concurrent.LinkedBlockingQueue.take(LinkedBlockingQueue.java:433)         at java.base@11-ea/java.util.concurrent.ThreadPoolExecutor.getTask(ThreadPoolExecutor.java:1054)         at java.base@11-ea/java.util.concurrent.ThreadPoolExecutor.runWorker(ThreadPoolExecutor.java:1114)         at java.base@11-ea/java.util.concurrent.ThreadPoolExecutor$Worker.run(ThreadPoolExecutor.java:628)         at java.base@11-ea/java.lang.Thread.run(Thread.java:834)

Stack Trace:
com.carrotsearch.randomizedtesting.ThreadLeakError: 4 threads leaked from SUITE scope at org.apache.solr.cloud.TestConfigSetsAPI: 
   1) Thread[id=27485, name=TEST-TestConfigSetsAPI.testUploadErrors-seed#[82AC95FEBB5841A7]-EventThread, state=WAITING, group=TGRP-TestConfigSetsAPI]
        at java.base@11-ea/jdk.internal.misc.Unsafe.park(Native Method)
        at java.base@11-ea/java.util.concurrent.locks.LockSupport.park(LockSupport.java:194)
        at java.base@11-ea/java.util.concurrent.locks.AbstractQueuedSynchronizer$ConditionObject.await(AbstractQueuedSynchronizer.java:2081)
        at java.base@11-ea/java.util.concurrent.LinkedBlockingQueue.take(LinkedBlockingQueue.java:433)
        at app//org.apache.zookeeper.ClientCnxn$EventThread.run(ClientCnxn.java:502)
   2) Thread[id=27482, name=Connection evictor, state=TIMED_WAITING, group=TGRP-TestConfigSetsAPI]
        at java.base@11-ea/java.lang.Thread.sleep(Native Method)
        at app//org.apache.http.impl.client.IdleConnectionEvictor$1.run(IdleConnectionEvictor.java:66)
        at java.base@11-ea/java.lang.Thread.run(Thread.java:834)
   3) Thread[id=27484, name=TEST-TestConfigSetsAPI.testUploadErrors-seed#[82AC95FEBB5841A7]-SendThread(127.0.0.1:45923), state=TIMED_WAITING, group=TGRP-TestConfigSetsAPI]
        at java.base@11-ea/java.lang.Thread.sleep(Native Method)
        at app//org.apache.zookeeper.client.StaticHostProvider.next(StaticHostProvider.java:105)
        at app//org.apache.zookeeper.ClientCnxn$SendThread.startConnect(ClientCnxn.java:1000)
        at app//org.apache.zookeeper.ClientCnxn$SendThread.run(ClientCnxn.java:1063)
   4) Thread[id=27486, name=zkConnectionManagerCallback-8978-thread-1, state=WAITING, group=TGRP-TestConfigSetsAPI]
        at java.base@11-ea/jdk.internal.misc.Unsafe.park(Native Method)
        at java.base@11-ea/java.util.concurrent.locks.LockSupport.park(LockSupport.java:194)
        at java.base@11-ea/java.util.concurrent.locks.AbstractQueuedSynchronizer$ConditionObject.await(AbstractQueuedSynchronizer.java:2081)
        at java.base@11-ea/java.util.concurrent.LinkedBlockingQueue.take(LinkedBlockingQueue.java:433)
        at java.base@11-ea/java.util.concurrent.ThreadPoolExecutor.getTask(ThreadPoolExecutor.java:1054)
        at java.base@11-ea/java.util.concurrent.ThreadPoolExecutor.runWorker(ThreadPoolExecutor.java:1114)
        at java.base@11-ea/java.util.concurrent.ThreadPoolExecutor$Worker.run(ThreadPoolExecutor.java:628)
        at java.base@11-ea/java.lang.Thread.run(Thread.java:834)
	at __randomizedtesting.SeedInfo.seed([82AC95FEBB5841A7]:0)


FAILED:  junit.framework.TestSuite.org.apache.solr.cloud.TestConfigSetsAPI

Error Message:
There are still zombie threads that couldn't be terminated:    1) Thread[id=27484, name=TEST-TestConfigSetsAPI.testUploadErrors-seed#[82AC95FEBB5841A7]-SendThread(127.0.0.1:45923), state=TIMED_WAITING, group=TGRP-TestConfigSetsAPI]         at java.base@11-ea/java.lang.Thread.sleep(Native Method)         at app//org.apache.zookeeper.client.StaticHostProvider.next(StaticHostProvider.java:105)         at app//org.apache.zookeeper.ClientCnxn$SendThread.startConnect(ClientCnxn.java:1000)         at app//org.apache.zookeeper.ClientCnxn$SendThread.run(ClientCnxn.java:1063)    2) Thread[id=27486, name=zkConnectionManagerCallback-8978-thread-1, state=WAITING, group=TGRP-TestConfigSetsAPI]         at java.base@11-ea/jdk.internal.misc.Unsafe.park(Native Method)         at java.base@11-ea/java.util.concurrent.locks.LockSupport.park(LockSupport.java:194)         at java.base@11-ea/java.util.concurrent.locks.AbstractQueuedSynchronizer$ConditionObject.await(AbstractQueuedSynchronizer.java:2081)         at java.base@11-ea/java.util.concurrent.LinkedBlockingQueue.take(LinkedBlockingQueue.java:433)         at java.base@11-ea/java.util.concurrent.ThreadPoolExecutor.getTask(ThreadPoolExecutor.java:1054)         at java.base@11-ea/java.util.concurrent.ThreadPoolExecutor.runWorker(ThreadPoolExecutor.java:1114)         at java.base@11-ea/java.util.concurrent.ThreadPoolExecutor$Worker.run(ThreadPoolExecutor.java:628)         at java.base@11-ea/java.lang.Thread.run(Thread.java:834)

Stack Trace:
com.carrotsearch.randomizedtesting.ThreadLeakError: There are still zombie threads that couldn't be terminated:
   1) Thread[id=27484, name=TEST-TestConfigSetsAPI.testUploadErrors-seed#[82AC95FEBB5841A7]-SendThread(127.0.0.1:45923), state=TIMED_WAITING, group=TGRP-TestConfigSetsAPI]
        at java.base@11-ea/java.lang.Thread.sleep(Native Method)
        at app//org.apache.zookeeper.client.StaticHostProvider.next(StaticHostProvider.java:105)
        at app//org.apache.zookeeper.ClientCnxn$SendThread.startConnect(ClientCnxn.java:1000)
        at app//org.apache.zookeeper.ClientCnxn$SendThread.run(ClientCnxn.java:1063)
   2) Thread[id=27486, name=zkConnectionManagerCallback-8978-thread-1, state=WAITING, group=TGRP-TestConfigSetsAPI]
        at java.base@11-ea/jdk.internal.misc.Unsafe.park(Native Method)
        at java.base@11-ea/java.util.concurrent.locks.LockSupport.park(LockSupport.java:194)
        at java.base@11-ea/java.util.concurrent.locks.AbstractQueuedSynchronizer$ConditionObject.await(AbstractQueuedSynchronizer.java:2081)
        at java.base@11-ea/java.util.concurrent.LinkedBlockingQueue.take(LinkedBlockingQueue.java:433)
        at java.base@11-ea/java.util.concurrent.ThreadPoolExecutor.getTask(ThreadPoolExecutor.java:1054)
        at java.base@11-ea/java.util.concurrent.ThreadPoolExecutor.runWorker(ThreadPoolExecutor.java:1114)
        at java.base@11-ea/java.util.concurrent.ThreadPoolExecutor$Worker.run(ThreadPoolExecutor.java:628)
        at java.base@11-ea/java.lang.Thread.run(Thread.java:834)
	at __randomizedtesting.SeedInfo.seed([82AC95FEBB5841A7]:0)


FAILED:  junit.framework.TestSuite.org.apache.solr.core.BlobRepositoryCloudTest

Error Message:


Stack Trace:
java.lang.NullPointerException
	at __randomizedtesting.SeedInfo.seed([82AC95FEBB5841A7]:0)
	at java.base/sun.security.ssl.SSLSessionImpl.getLocalPrincipal(SSLSessionImpl.java:661)
	at org.apache.http.impl.client.DefaultUserTokenHandler.getUserToken(DefaultUserTokenHandler.java:84)
	at org.apache.http.impl.execchain.MainClientExec.execute(MainClientExec.java:328)
	at org.apache.http.impl.execchain.ProtocolExec.execute(ProtocolExec.java:185)
	at org.apache.http.impl.execchain.RetryExec.execute(RetryExec.java:89)
	at org.apache.http.impl.execchain.RedirectExec.execute(RedirectExec.java:111)
	at org.apache.http.impl.client.InternalHttpClient.doExecute(InternalHttpClient.java:185)
	at org.apache.http.impl.client.CloseableHttpClient.execute(CloseableHttpClient.java:83)
	at org.apache.http.impl.client.CloseableHttpClient.execute(CloseableHttpClient.java:108)
	at org.apache.http.impl.client.CloseableHttpClient.execute(CloseableHttpClient.java:56)
	at org.apache.solr.handler.TestBlobHandler.postData(TestBlobHandler.java:181)
	at org.apache.solr.core.BlobRepositoryCloudTest.setupCluster(BlobRepositoryCloudTest.java:53)
	at java.base/jdk.internal.reflect.NativeMethodAccessorImpl.invoke0(Native Method)
	at java.base/jdk.internal.reflect.NativeMethodAccessorImpl.invoke(NativeMethodAccessorImpl.java:62)
	at java.base/jdk.internal.reflect.DelegatingMethodAccessorImpl.invoke(DelegatingMethodAccessorImpl.java:43)
	at java.base/java.lang.reflect.Method.invoke(Method.java:566)
	at com.carrotsearch.randomizedtesting.RandomizedRunner.invoke(RandomizedRunner.java:1737)
	at com.carrotsearch.randomizedtesting.RandomizedRunner$6.evaluate(RandomizedRunner.java:874)
	at com.carrotsearch.randomizedtesting.RandomizedRunner$7.evaluate(RandomizedRunner.java:890)
	at com.carrotsearch.randomizedtesting.rules.StatementAdapter.evaluate(StatementAdapter.java:36)
	at com.carrotsearch.randomizedtesting.rules.SystemPropertiesRestoreRule$1.evaluate(SystemPropertiesRestoreRule.java:57)
	at org.apache.lucene.util.AbstractBeforeAfterRule$1.evaluate(AbstractBeforeAfterRule.java:45)
	at com.carrotsearch.randomizedtesting.rules.StatementAdapter.evaluate(StatementAdapter.java:36)
	at org.apache.lucene.util.TestRuleStoreClassName$1.evaluate(TestRuleStoreClassName.java:41)
	at com.carrotsearch.randomizedtesting.rules.NoShadowingOrOverridesOnMethodsRule$1.evaluate(NoShadowingOrOverridesOnMethodsRule.java:40)
	at com.carrotsearch.randomizedtesting.rules.NoShadowingOrOverridesOnMethodsRule$1.evaluate(NoShadowingOrOverridesOnMethodsRule.java:40)
	at com.carrotsearch.randomizedtesting.rules.StatementAdapter.evaluate(StatementAdapter.java:36)
	at com.carrotsearch.randomizedtesting.rules.StatementAdapter.evaluate(StatementAdapter.java:36)
	at org.apache.lucene.util.TestRuleAssertionsRequired$1.evaluate(TestRuleAssertionsRequired.java:53)
	at org.apache.lucene.util.TestRuleMarkFailure$1.evaluate(TestRuleMarkFailure.java:47)
	at org.apache.lucene.util.TestRuleIgnoreAfterMaxFailures$1.evaluate(TestRuleIgnoreAfterMaxFailures.java:64)
	at org.apache.lucene.util.TestRuleIgnoreTestSuites$1.evaluate(TestRuleIgnoreTestSuites.java:54)
	at com.carrotsearch.randomizedtesting.rules.StatementAdapter.evaluate(StatementAdapter.java:36)
	at com.carrotsearch.randomizedtesting.ThreadLeakControl$StatementRunner.run(ThreadLeakControl.java:368)
	at java.base/java.lang.Thread.run(Thread.java:834)


FAILED:  junit.framework.TestSuite.org.apache.solr.core.BlobRepositoryCloudTest

Error Message:


Stack Trace:
java.lang.NullPointerException
	at __randomizedtesting.SeedInfo.seed([82AC95FEBB5841A7]:0)
	at java.base/sun.security.ssl.SSLSessionImpl.getLocalPrincipal(SSLSessionImpl.java:661)
	at org.apache.http.impl.client.DefaultUserTokenHandler.getUserToken(DefaultUserTokenHandler.java:84)
	at org.apache.http.impl.execchain.MainClientExec.execute(MainClientExec.java:328)
	at org.apache.http.impl.execchain.ProtocolExec.execute(ProtocolExec.java:185)
	at org.apache.http.impl.execchain.RetryExec.execute(RetryExec.java:89)
	at org.apache.http.impl.execchain.RedirectExec.execute(RedirectExec.java:111)
	at org.apache.http.impl.client.InternalHttpClient.doExecute(InternalHttpClient.java:185)
	at org.apache.http.impl.client.CloseableHttpClient.execute(CloseableHttpClient.java:83)
	at org.apache.http.impl.client.CloseableHttpClient.execute(CloseableHttpClient.java:108)
	at org.apache.http.impl.client.CloseableHttpClient.execute(CloseableHttpClient.java:56)
	at org.apache.solr.handler.TestBlobHandler.postData(TestBlobHandler.java:181)
	at org.apache.solr.core.BlobRepositoryCloudTest.setupCluster(BlobRepositoryCloudTest.java:53)
	at java.base/jdk.internal.reflect.NativeMethodAccessorImpl.invoke0(Native Method)
	at java.base/jdk.internal.reflect.NativeMethodAccessorImpl.invoke(NativeMethodAccessorImpl.java:62)
	at java.base/jdk.internal.reflect.DelegatingMethodAccessorImpl.invoke(DelegatingMethodAccessorImpl.java:43)
	at java.base/java.lang.reflect.Method.invoke(Method.java:566)
	at com.carrotsearch.randomizedtesting.RandomizedRunner.invoke(RandomizedRunner.java:1737)
	at com.carrotsearch.randomizedtesting.RandomizedRunner$6.evaluate(RandomizedRunner.java:874)
	at com.carrotsearch.randomizedtesting.RandomizedRunner$7.evaluate(RandomizedRunner.java:890)
	at com.carrotsearch.randomizedtesting.rules.StatementAdapter.evaluate(StatementAdapter.java:36)
	at com.carrotsearch.randomizedtesting.rules.SystemPropertiesRestoreRule$1.evaluate(SystemPropertiesRestoreRule.java:57)
	at org.apache.lucene.util.AbstractBeforeAfterRule$1.evaluate(AbstractBeforeAfterRule.java:45)
	at com.carrotsearch.randomizedtesting.rules.StatementAdapter.evaluate(StatementAdapter.java:36)
	at org.apache.lucene.util.TestRuleStoreClassName$1.evaluate(TestRuleStoreClassName.java:41)
	at com.carrotsearch.randomizedtesting.rules.NoShadowingOrOverridesOnMethodsRule$1.evaluate(NoShadowingOrOverridesOnMethodsRule.java:40)
	at com.carrotsearch.randomizedtesting.rules.NoShadowingOrOverridesOnMethodsRule$1.evaluate(NoShadowingOrOverridesOnMethodsRule.java:40)
	at com.carrotsearch.randomizedtesting.rules.StatementAdapter.evaluate(StatementAdapter.java:36)
	at com.carrotsearch.randomizedtesting.rules.StatementAdapter.evaluate(StatementAdapter.java:36)
	at org.apache.lucene.util.TestRuleAssertionsRequired$1.evaluate(TestRuleAssertionsRequired.java:53)
	at org.apache.lucene.util.TestRuleMarkFailure$1.evaluate(TestRuleMarkFailure.java:47)
	at org.apache.lucene.util.TestRuleIgnoreAfterMaxFailures$1.evaluate(TestRuleIgnoreAfterMaxFailures.java:64)
	at org.apache.lucene.util.TestRuleIgnoreTestSuites$1.evaluate(TestRuleIgnoreTestSuites.java:54)
	at com.carrotsearch.randomizedtesting.rules.StatementAdapter.evaluate(StatementAdapter.java:36)
	at com.carrotsearch.randomizedtesting.ThreadLeakControl$StatementRunner.run(ThreadLeakControl.java:368)
	at java.base/java.lang.Thread.run(Thread.java:834)


FAILED:  junit.framework.TestSuite.org.apache.solr.core.BlobRepositoryCloudTest

Error Message:


Stack Trace:
java.lang.NullPointerException
	at __randomizedtesting.SeedInfo.seed([82AC95FEBB5841A7]:0)
	at java.base/sun.security.ssl.SSLSessionImpl.getLocalPrincipal(SSLSessionImpl.java:661)
	at org.apache.http.impl.client.DefaultUserTokenHandler.getUserToken(DefaultUserTokenHandler.java:84)
	at org.apache.http.impl.execchain.MainClientExec.execute(MainClientExec.java:328)
	at org.apache.http.impl.execchain.ProtocolExec.execute(ProtocolExec.java:185)
	at org.apache.http.impl.execchain.RetryExec.execute(RetryExec.java:89)
	at org.apache.http.impl.execchain.RedirectExec.execute(RedirectExec.java:111)
	at org.apache.http.impl.client.InternalHttpClient.doExecute(InternalHttpClient.java:185)
	at org.apache.http.impl.client.CloseableHttpClient.execute(CloseableHttpClient.java:83)
	at org.apache.http.impl.client.CloseableHttpClient.execute(CloseableHttpClient.java:108)
	at org.apache.http.impl.client.CloseableHttpClient.execute(CloseableHttpClient.java:56)
	at org.apache.solr.handler.TestBlobHandler.postData(TestBlobHandler.java:181)
	at org.apache.solr.core.BlobRepositoryCloudTest.setupCluster(BlobRepositoryCloudTest.java:53)
	at java.base/jdk.internal.reflect.NativeMethodAccessorImpl.invoke0(Native Method)
	at java.base/jdk.internal.reflect.NativeMethodAccessorImpl.invoke(NativeMethodAccessorImpl.java:62)
	at java.base/jdk.internal.reflect.DelegatingMethodAccessorImpl.invoke(DelegatingMethodAccessorImpl.java:43)
	at java.base/java.lang.reflect.Method.invoke(Method.java:566)
	at com.carrotsearch.randomizedtesting.RandomizedRunner.invoke(RandomizedRunner.java:1737)
	at com.carrotsearch.randomizedtesting.RandomizedRunner$6.evaluate(RandomizedRunner.java:874)
	at com.carrotsearch.randomizedtesting.RandomizedRunner$7.evaluate(RandomizedRunner.java:890)
	at com.carrotsearch.randomizedtesting.rules.StatementAdapter.evaluate(StatementAdapter.java:36)
	at com.carrotsearch.randomizedtesting.rules.SystemPropertiesRestoreRule$1.evaluate(SystemPropertiesRestoreRule.java:57)
	at org.apache.lucene.util.AbstractBeforeAfterRule$1.evaluate(AbstractBeforeAfterRule.java:45)
	at com.carrotsearch.randomizedtesting.rules.StatementAdapter.evaluate(StatementAdapter.java:36)
	at org.apache.lucene.util.TestRuleStoreClassName$1.evaluate(TestRuleStoreClassName.java:41)
	at com.carrotsearch.randomizedtesting.rules.NoShadowingOrOverridesOnMethodsRule$1.evaluate(NoShadowingOrOverridesOnMethodsRule.java:40)
	at com.carrotsearch.randomizedtesting.rules.NoShadowingOrOverridesOnMethodsRule$1.evaluate(NoShadowingOrOverridesOnMethodsRule.java:40)
	at com.carrotsearch.randomizedtesting.rules.StatementAdapter.evaluate(StatementAdapter.java:36)
	at com.carrotsearch.randomizedtesting.rules.StatementAdapter.evaluate(StatementAdapter.java:36)
	at org.apache.lucene.util.TestRuleAssertionsRequired$1.evaluate(TestRuleAssertionsRequired.java:53)
	at org.apache.lucene.util.TestRuleMarkFailure$1.evaluate(TestRuleMarkFailure.java:47)
	at org.apache.lucene.util.TestRuleIgnoreAfterMaxFailures$1.evaluate(TestRuleIgnoreAfterMaxFailures.java:64)
	at org.apache.lucene.util.TestRuleIgnoreTestSuites$1.evaluate(TestRuleIgnoreTestSuites.java:54)
	at com.carrotsearch.randomizedtesting.rules.StatementAdapter.evaluate(StatementAdapter.java:36)
	at com.carrotsearch.randomizedtesting.ThreadLeakControl$StatementRunner.run(ThreadLeakControl.java:368)
	at java.base/java.lang.Thread.run(Thread.java:834)


FAILED:  junit.framework.TestSuite.org.apache.solr.core.BlobRepositoryCloudTest

Error Message:


Stack Trace:
java.lang.NullPointerException
	at __randomizedtesting.SeedInfo.seed([82AC95FEBB5841A7]:0)
	at java.base/sun.security.ssl.SSLSessionImpl.getLocalPrincipal(SSLSessionImpl.java:661)
	at org.apache.http.impl.client.DefaultUserTokenHandler.getUserToken(DefaultUserTokenHandler.java:84)
	at org.apache.http.impl.execchain.MainClientExec.execute(MainClientExec.java:328)
	at org.apache.http.impl.execchain.ProtocolExec.execute(ProtocolExec.java:185)
	at org.apache.http.impl.execchain.RetryExec.execute(RetryExec.java:89)
	at org.apache.http.impl.execchain.RedirectExec.execute(RedirectExec.java:111)
	at org.apache.http.impl.client.InternalHttpClient.doExecute(InternalHttpClient.java:185)
	at org.apache.http.impl.client.CloseableHttpClient.execute(CloseableHttpClient.java:83)
	at org.apache.http.impl.client.CloseableHttpClient.execute(CloseableHttpClient.java:108)
	at org.apache.http.impl.client.CloseableHttpClient.execute(CloseableHttpClient.java:56)
	at org.apache.solr.handler.TestBlobHandler.postData(TestBlobHandler.java:181)
	at org.apache.solr.core.BlobRepositoryCloudTest.setupCluster(BlobRepositoryCloudTest.java:53)
	at java.base/jdk.internal.reflect.NativeMethodAccessorImpl.invoke0(Native Method)
	at java.base/jdk.internal.reflect.NativeMethodAccessorImpl.invoke(NativeMethodAccessorImpl.java:62)
	at java.base/jdk.internal.reflect.DelegatingMethodAccessorImpl.invoke(DelegatingMethodAccessorImpl.java:43)
	at java.base/java.lang.reflect.Method.invoke(Method.java:566)
	at com.carrotsearch.randomizedtesting.RandomizedRunner.invoke(RandomizedRunner.java:1737)
	at com.carrotsearch.randomizedtesting.RandomizedRunner$6.evaluate(RandomizedRunner.java:874)
	at com.carrotsearch.randomizedtesting.RandomizedRunner$7.evaluate(RandomizedRunner.java:890)
	at com.carrotsearch.randomizedtesting.rules.StatementAdapter.evaluate(StatementAdapter.java:36)
	at com.carrotsearch.randomizedtesting.rules.SystemPropertiesRestoreRule$1.evaluate(SystemPropertiesRestoreRule.java:57)
	at org.apache.lucene.util.AbstractBeforeAfterRule$1.evaluate(AbstractBeforeAfterRule.java:45)
	at com.carrotsearch.randomizedtesting.rules.StatementAdapter.evaluate(StatementAdapter.java:36)
	at org.apache.lucene.util.TestRuleStoreClassName$1.evaluate(TestRuleStoreClassName.java:41)
	at com.carrotsearch.randomizedtesting.rules.NoShadowingOrOverridesOnMethodsRule$1.evaluate(NoShadowingOrOverridesOnMethodsRule.java:40)
	at com.carrotsearch.randomizedtesting.rules.NoShadowingOrOverridesOnMethodsRule$1.evaluate(NoShadowingOrOverridesOnMethodsRule.java:40)
	at com.carrotsearch.randomizedtesting.rules.StatementAdapter.evaluate(StatementAdapter.java:36)
	at com.carrotsearch.randomizedtesting.rules.StatementAdapter.evaluate(StatementAdapter.java:36)
	at org.apache.lucene.util.TestRuleAssertionsRequired$1.evaluate(TestRuleAssertionsRequired.java:53)
	at org.apache.lucene.util.TestRuleMarkFailure$1.evaluate(TestRuleMarkFailure.java:47)
	at org.apache.lucene.util.TestRuleIgnoreAfterMaxFailures$1.evaluate(TestRuleIgnoreAfterMaxFailures.java:64)
	at org.apache.lucene.util.TestRuleIgnoreTestSuites$1.evaluate(TestRuleIgnoreTestSuites.java:54)
	at com.carrotsearch.randomizedtesting.rules.StatementAdapter.evaluate(StatementAdapter.java:36)
	at com.carrotsearch.randomizedtesting.ThreadLeakControl$StatementRunner.run(ThreadLeakControl.java:368)
	at java.base/java.lang.Thread.run(Thread.java:834)


FAILED:  junit.framework.TestSuite.org.apache.solr.handler.TestSQLHandler

Error Message:
1 thread leaked from SUITE scope at org.apache.solr.handler.TestSQLHandler:     1) Thread[id=3598, name=Connection evictor, state=TIMED_WAITING, group=TGRP-TestSQLHandler]         at java.base@11-ea/java.lang.Thread.sleep(Native Method)         at app//org.apache.http.impl.client.IdleConnectionEvictor$1.run(IdleConnectionEvictor.java:66)         at java.base@11-ea/java.lang.Thread.run(Thread.java:834)

Stack Trace:
com.carrotsearch.randomizedtesting.ThreadLeakError: 1 thread leaked from SUITE scope at org.apache.solr.handler.TestSQLHandler: 
   1) Thread[id=3598, name=Connection evictor, state=TIMED_WAITING, group=TGRP-TestSQLHandler]
        at java.base@11-ea/java.lang.Thread.sleep(Native Method)
        at app//org.apache.http.impl.client.IdleConnectionEvictor$1.run(IdleConnectionEvictor.java:66)
        at java.base@11-ea/java.lang.Thread.run(Thread.java:834)
	at __randomizedtesting.SeedInfo.seed([82AC95FEBB5841A7]:0)


FAILED:  junit.framework.TestSuite.org.apache.solr.handler.TestSQLHandler

Error Message:
1 thread leaked from SUITE scope at org.apache.solr.handler.TestSQLHandler:     1) Thread[id=4163, name=Connection evictor, state=TIMED_WAITING, group=TGRP-TestSQLHandler]         at java.base@11-ea/java.lang.Thread.sleep(Native Method)         at app//org.apache.http.impl.client.IdleConnectionEvictor$1.run(IdleConnectionEvictor.java:66)         at java.base@11-ea/java.lang.Thread.run(Thread.java:834)

Stack Trace:
com.carrotsearch.randomizedtesting.ThreadLeakError: 1 thread leaked from SUITE scope at org.apache.solr.handler.TestSQLHandler: 
   1) Thread[id=4163, name=Connection evictor, state=TIMED_WAITING, group=TGRP-TestSQLHandler]
        at java.base@11-ea/java.lang.Thread.sleep(Native Method)
        at app//org.apache.http.impl.client.IdleConnectionEvictor$1.run(IdleConnectionEvictor.java:66)
        at java.base@11-ea/java.lang.Thread.run(Thread.java:834)
	at __randomizedtesting.SeedInfo.seed([82AC95FEBB5841A7]:0)


FAILED:  junit.framework.TestSuite.org.apache.solr.handler.TestSQLHandler

Error Message:
1 thread leaked from SUITE scope at org.apache.solr.handler.TestSQLHandler:     1) Thread[id=11262, name=Connection evictor, state=TIMED_WAITING, group=TGRP-TestSQLHandler]         at java.base@11-ea/java.lang.Thread.sleep(Native Method)         at app//org.apache.http.impl.client.IdleConnectionEvictor$1.run(IdleConnectionEvictor.java:66)         at java.base@11-ea/java.lang.Thread.run(Thread.java:834)

Stack Trace:
com.carrotsearch.randomizedtesting.ThreadLeakError: 1 thread leaked from SUITE scope at org.apache.solr.handler.TestSQLHandler: 
   1) Thread[id=11262, name=Connection evictor, state=TIMED_WAITING, group=TGRP-TestSQLHandler]
        at java.base@11-ea/java.lang.Thread.sleep(Native Method)
        at app//org.apache.http.impl.client.IdleConnectionEvictor$1.run(IdleConnectionEvictor.java:66)
        at java.base@11-ea/java.lang.Thread.run(Thread.java:834)
	at __randomizedtesting.SeedInfo.seed([82AC95FEBB5841A7]:0)


FAILED:  junit.framework.TestSuite.org.apache.solr.schema.SchemaApiFailureTest

Error Message:


Stack Trace:
java.util.concurrent.TimeoutException
	at __randomizedtesting.SeedInfo.seed([82AC95FEBB5841A7]:0)
	at org.apache.solr.common.cloud.ZkStateReader.waitForState(ZkStateReader.java:1469)
	at org.apache.solr.client.solrj.impl.CloudSolrClient.waitForState(CloudSolrClient.java:450)
	at org.apache.solr.schema.SchemaApiFailureTest.setupCluster(SchemaApiFailureTest.java:43)
	at java.base/jdk.internal.reflect.NativeMethodAccessorImpl.invoke0(Native Method)
	at java.base/jdk.internal.reflect.NativeMethodAccessorImpl.invoke(NativeMethodAccessorImpl.java:62)
	at java.base/jdk.internal.reflect.DelegatingMethodAccessorImpl.invoke(DelegatingMethodAccessorImpl.java:43)
	at java.base/java.lang.reflect.Method.invoke(Method.java:566)
	at com.carrotsearch.randomizedtesting.RandomizedRunner.invoke(RandomizedRunner.java:1737)
	at com.carrotsearch.randomizedtesting.RandomizedRunner$6.evaluate(RandomizedRunner.java:874)
	at com.carrotsearch.randomizedtesting.RandomizedRunner$7.evaluate(RandomizedRunner.java:890)
	at com.carrotsearch.randomizedtesting.rules.StatementAdapter.evaluate(StatementAdapter.java:36)
	at com.carrotsearch.randomizedtesting.rules.SystemPropertiesRestoreRule$1.evaluate(SystemPropertiesRestoreRule.java:57)
	at org.apache.lucene.util.AbstractBeforeAfterRule$1.evaluate(AbstractBeforeAfterRule.java:45)
	at com.carrotsearch.randomizedtesting.rules.StatementAdapter.evaluate(StatementAdapter.java:36)
	at org.apache.lucene.util.TestRuleStoreClassName$1.evaluate(TestRuleStoreClassName.java:41)
	at com.carrotsearch.randomizedtesting.rules.NoShadowingOrOverridesOnMethodsRule$1.evaluate(NoShadowingOrOverridesOnMethodsRule.java:40)
	at com.carrotsearch.randomizedtesting.rules.NoShadowingOrOverridesOnMethodsRule$1.evaluate(NoShadowingOrOverridesOnMethodsRule.java:40)
	at com.carrotsearch.randomizedtesting.rules.StatementAdapter.evaluate(StatementAdapter.java:36)
	at com.carrotsearch.randomizedtesting.rules.StatementAdapter.evaluate(StatementAdapter.java:36)
	at org.apache.lucene.util.TestRuleAssertionsRequired$1.evaluate(TestRuleAssertionsRequired.java:53)
	at org.apache.lucene.util.TestRuleMarkFailure$1.evaluate(TestRuleMarkFailure.java:47)
	at org.apache.lucene.util.TestRuleIgnoreAfterMaxFailures$1.evaluate(TestRuleIgnoreAfterMaxFailures.java:64)
	at org.apache.lucene.util.TestRuleIgnoreTestSuites$1.evaluate(TestRuleIgnoreTestSuites.java:54)
	at com.carrotsearch.randomizedtesting.rules.StatementAdapter.evaluate(StatementAdapter.java:36)
	at com.carrotsearch.randomizedtesting.ThreadLeakControl$StatementRunner.run(ThreadLeakControl.java:368)
	at java.base/java.lang.Thread.run(Thread.java:834)


FAILED:  junit.framework.TestSuite.org.apache.solr.schema.SchemaApiFailureTest

Error Message:


Stack Trace:
java.util.concurrent.TimeoutException
	at __randomizedtesting.SeedInfo.seed([82AC95FEBB5841A7]:0)
	at org.apache.solr.common.cloud.ZkStateReader.waitForState(ZkStateReader.java:1469)
	at org.apache.solr.client.solrj.impl.CloudSolrClient.waitForState(CloudSolrClient.java:450)
	at org.apache.solr.schema.SchemaApiFailureTest.setupCluster(SchemaApiFailureTest.java:43)
	at java.base/jdk.internal.reflect.NativeMethodAccessorImpl.invoke0(Native Method)
	at java.base/jdk.internal.reflect.NativeMethodAccessorImpl.invoke(NativeMethodAccessorImpl.java:62)
	at java.base/jdk.internal.reflect.DelegatingMethodAccessorImpl.invoke(DelegatingMethodAccessorImpl.java:43)
	at java.base/java.lang.reflect.Method.invoke(Method.java:566)
	at com.carrotsearch.randomizedtesting.RandomizedRunner.invoke(RandomizedRunner.java:1737)
	at com.carrotsearch.randomizedtesting.RandomizedRunner$6.evaluate(RandomizedRunner.java:874)
	at com.carrotsearch.randomizedtesting.RandomizedRunner$7.evaluate(RandomizedRunner.java:890)
	at com.carrotsearch.randomizedtesting.rules.StatementAdapter.evaluate(StatementAdapter.java:36)
	at com.carrotsearch.randomizedtesting.rules.SystemPropertiesRestoreRule$1.evaluate(SystemPropertiesRestoreRule.java:57)
	at org.apache.lucene.util.AbstractBeforeAfterRule$1.evaluate(AbstractBeforeAfterRule.java:45)
	at com.carrotsearch.randomizedtesting.rules.StatementAdapter.evaluate(StatementAdapter.java:36)
	at org.apache.lucene.util.TestRuleStoreClassName$1.evaluate(TestRuleStoreClassName.java:41)
	at com.carrotsearch.randomizedtesting.rules.NoShadowingOrOverridesOnMethodsRule$1.evaluate(NoShadowingOrOverridesOnMethodsRule.java:40)
	at com.carrotsearch.randomizedtesting.rules.NoShadowingOrOverridesOnMethodsRule$1.evaluate(NoShadowingOrOverridesOnMethodsRule.java:40)
	at com.carrotsearch.randomizedtesting.rules.StatementAdapter.evaluate(StatementAdapter.java:36)
	at com.carrotsearch.randomizedtesting.rules.StatementAdapter.evaluate(StatementAdapter.java:36)
	at org.apache.lucene.util.TestRuleAssertionsRequired$1.evaluate(TestRuleAssertionsRequired.java:53)
	at org.apache.lucene.util.TestRuleMarkFailure$1.evaluate(TestRuleMarkFailure.java:47)
	at org.apache.lucene.util.TestRuleIgnoreAfterMaxFailures$1.evaluate(TestRuleIgnoreAfterMaxFailures.java:64)
	at org.apache.lucene.util.TestRuleIgnoreTestSuites$1.evaluate(TestRuleIgnoreTestSuites.java:54)
	at com.carrotsearch.randomizedtesting.rules.StatementAdapter.evaluate(StatementAdapter.java:36)
	at com.carrotsearch.randomizedtesting.ThreadLeakControl$StatementRunner.run(ThreadLeakControl.java:368)
	at java.base/java.lang.Thread.run(Thread.java:834)


FAILED:  junit.framework.TestSuite.org.apache.solr.client.solrj.io.stream.StreamDecoratorTest

Error Message:
23 threads leaked from SUITE scope at org.apache.solr.client.solrj.io.stream.StreamDecoratorTest:     1) Thread[id=372, name=TEST-StreamDecoratorTest.testParallelExecutorStream-seed#[254646338686024B]-SendThread(127.0.0.1:33825), state=TIMED_WAITING, group=TGRP-StreamDecoratorTest]         at java.base@11-ea/java.lang.Thread.sleep(Native Method)         at app//org.apache.zookeeper.client.StaticHostProvider.next(StaticHostProvider.java:105)         at app//org.apache.zookeeper.ClientCnxn$SendThread.startConnect(ClientCnxn.java:1000)         at app//org.apache.zookeeper.ClientCnxn$SendThread.run(ClientCnxn.java:1063)    2) Thread[id=1781, name=Connection evictor, state=TIMED_WAITING, group=TGRP-StreamDecoratorTest]         at java.base@11-ea/java.lang.Thread.sleep(Native Method)         at app//org.apache.http.impl.client.IdleConnectionEvictor$1.run(IdleConnectionEvictor.java:66)         at java.base@11-ea/java.lang.Thread.run(Thread.java:834)    3) Thread[id=274, name=Connection evictor, state=TIMED_WAITING, group=TGRP-StreamDecoratorTest]         at java.base@11-ea/java.lang.Thread.sleep(Native Method)         at app//org.apache.http.impl.client.IdleConnectionEvictor$1.run(IdleConnectionEvictor.java:66)         at java.base@11-ea/java.lang.Thread.run(Thread.java:834)    4) Thread[id=371, name=Connection evictor, state=TIMED_WAITING, group=TGRP-StreamDecoratorTest]         at java.base@11-ea/java.lang.Thread.sleep(Native Method)         at app//org.apache.http.impl.client.IdleConnectionEvictor$1.run(IdleConnectionEvictor.java:66)         at java.base@11-ea/java.lang.Thread.run(Thread.java:834)    5) Thread[id=2890, name=Thread-73-SendThread(127.0.0.1:33825), state=TIMED_WAITING, group=TGRP-StreamDecoratorTest]         at java.base@11-ea/java.lang.Thread.sleep(Native Method)         at app//org.apache.zookeeper.client.StaticHostProvider.next(StaticHostProvider.java:105)         at app//org.apache.zookeeper.ClientCnxn$SendThread.startConnect(ClientCnxn.java:1000)         at app//org.apache.zookeeper.ClientCnxn$SendThread.run(ClientCnxn.java:1063)    6) Thread[id=270, name=zkConnectionManagerCallback-119-thread-1, state=WAITING, group=TGRP-StreamDecoratorTest]         at java.base@11-ea/jdk.internal.misc.Unsafe.park(Native Method)         at java.base@11-ea/java.util.concurrent.locks.LockSupport.park(LockSupport.java:194)         at java.base@11-ea/java.util.concurrent.locks.AbstractQueuedSynchronizer$ConditionObject.await(AbstractQueuedSynchronizer.java:2081)         at java.base@11-ea/java.util.concurrent.LinkedBlockingQueue.take(LinkedBlockingQueue.java:433)         at java.base@11-ea/java.util.concurrent.ThreadPoolExecutor.getTask(ThreadPoolExecutor.java:1054)         at java.base@11-ea/java.util.concurrent.ThreadPoolExecutor.runWorker(ThreadPoolExecutor.java:1114)         at java.base@11-ea/java.util.concurrent.ThreadPoolExecutor$Worker.run(ThreadPoolExecutor.java:628)         at java.base@11-ea/java.lang.Thread.run(Thread.java:834)    7) Thread[id=1784, name=zkConnectionManagerCallback-856-thread-1, state=WAITING, group=TGRP-StreamDecoratorTest]         at java.base@11-ea/jdk.internal.misc.Unsafe.park(Native Method)         at java.base@11-ea/java.util.concurrent.locks.LockSupport.park(LockSupport.java:194)         at java.base@11-ea/java.util.concurrent.locks.AbstractQueuedSynchronizer$ConditionObject.await(AbstractQueuedSynchronizer.java:2081)         at java.base@11-ea/java.util.concurrent.LinkedBlockingQueue.take(LinkedBlockingQueue.java:433)         at java.base@11-ea/java.util.concurrent.ThreadPoolExecutor.getTask(ThreadPoolExecutor.java:1054)         at java.base@11-ea/java.util.concurrent.ThreadPoolExecutor.runWorker(ThreadPoolExecutor.java:1114)         at java.base@11-ea/java.util.concurrent.ThreadPoolExecutor$Worker.run(ThreadPoolExecutor.java:628)         at java.base@11-ea/java.lang.Thread.run(Thread.java:834)    8) Thread[id=378, name=Connection evictor, state=TIMED_WAITING, group=TGRP-StreamDecoratorTest]         at java.base@11-ea/java.lang.Thread.sleep(Native Method)         at app//org.apache.http.impl.client.IdleConnectionEvictor$1.run(IdleConnectionEvictor.java:66)         at java.base@11-ea/java.lang.Thread.run(Thread.java:834)    9) Thread[id=1782, name=TEST-StreamDecoratorTest.testExecutorStream-seed#[254646338686024B]-SendThread(127.0.0.1:33825), state=TIMED_WAITING, group=TGRP-StreamDecoratorTest]         at java.base@11-ea/java.lang.Thread.sleep(Native Method)         at app//org.apache.zookeeper.ClientCnxn$SendThread.run(ClientCnxn.java:1054)   10) Thread[id=374, name=zkConnectionManagerCallback-161-thread-1, state=WAITING, group=TGRP-StreamDecoratorTest]         at java.base@11-ea/jdk.internal.misc.Unsafe.park(Native Method)         at java.base@11-ea/java.util.concurrent.locks.LockSupport.park(LockSupport.java:194)         at java.base@11-ea/java.util.concurrent.locks.AbstractQueuedSynchronizer$ConditionObject.await(AbstractQueuedSynchronizer.java:2081)         at java.base@11-ea/java.util.concurrent.LinkedBlockingQueue.take(LinkedBlockingQueue.java:433)         at java.base@11-ea/java.util.concurrent.ThreadPoolExecutor.getTask(ThreadPoolExecutor.java:1054)         at java.base@11-ea/java.util.concurrent.ThreadPoolExecutor.runWorker(ThreadPoolExecutor.java:1114)         at java.base@11-ea/java.util.concurrent.ThreadPoolExecutor$Worker.run(ThreadPoolExecutor.java:628)         at java.base@11-ea/java.lang.Thread.run(Thread.java:834)   11) Thread[id=1787, name=Connection evictor, state=TIMED_WAITING, group=TGRP-StreamDecoratorTest]         at java.base@11-ea/java.lang.Thread.sleep(Native Method)         at app//org.apache.http.impl.client.IdleConnectionEvictor$1.run(IdleConnectionEvictor.java:66)         at java.base@11-ea/java.lang.Thread.run(Thread.java:834)   12) Thread[id=269, name=TEST-StreamDecoratorTest.testParallelHavingStream-seed#[254646338686024B]-EventThread, state=WAITING, group=TGRP-StreamDecoratorTest]         at java.base@11-ea/jdk.internal.misc.Unsafe.park(Native Method)         at java.base@11-ea/java.util.concurrent.locks.LockSupport.park(LockSupport.java:194)         at java.base@11-ea/java.util.concurrent.locks.AbstractQueuedSynchronizer$ConditionObject.await(AbstractQueuedSynchronizer.java:2081)         at java.base@11-ea/java.util.concurrent.LinkedBlockingQueue.take(LinkedBlockingQueue.java:433)         at app//org.apache.zookeeper.ClientCnxn$EventThread.run(ClientCnxn.java:502)   13) Thread[id=1783, name=TEST-StreamDecoratorTest.testExecutorStream-seed#[254646338686024B]-EventThread, state=WAITING, group=TGRP-StreamDecoratorTest]         at java.base@11-ea/jdk.internal.misc.Unsafe.park(Native Method)         at java.base@11-ea/java.util.concurrent.locks.LockSupport.park(LockSupport.java:194)         at java.base@11-ea/java.util.concurrent.locks.AbstractQueuedSynchronizer$ConditionObject.await(AbstractQueuedSynchronizer.java:2081)         at java.base@11-ea/java.util.concurrent.LinkedBlockingQueue.take(LinkedBlockingQueue.java:433)         at app//org.apache.zookeeper.ClientCnxn$EventThread.run(ClientCnxn.java:502)   14) Thread[id=273, name=Connection evictor, state=TIMED_WAITING, group=TGRP-StreamDecoratorTest]         at java.base@11-ea/java.lang.Thread.sleep(Native Method)         at app//org.apache.http.impl.client.IdleConnectionEvictor$1.run(IdleConnectionEvictor.java:66)         at java.base@11-ea/java.lang.Thread.run(Thread.java:834)   15) Thread[id=268, name=TEST-StreamDecoratorTest.testParallelHavingStream-seed#[254646338686024B]-SendThread(127.0.0.1:33825), state=TIMED_WAITING, group=TGRP-StreamDecoratorTest]         at java.base@11-ea/java.lang.Thread.sleep(Native Method)         at app//org.apache.zookeeper.client.StaticHostProvider.next(StaticHostProvider.java:105)         at app//org.apache.zookeeper.ClientCnxn$SendThread.startConnect(ClientCnxn.java:1000)         at app//org.apache.zookeeper.ClientCnxn$SendThread.run(ClientCnxn.java:1063)   16) Thread[id=373, name=TEST-StreamDecoratorTest.testParallelExecutorStream-seed#[254646338686024B]-EventThread, state=WAITING, group=TGRP-StreamDecoratorTest]         at java.base@11-ea/jdk.internal.misc.Unsafe.park(Native Method)         at java.base@11-ea/java.util.concurrent.locks.LockSupport.park(LockSupport.java:194)         at java.base@11-ea/java.util.concurrent.locks.AbstractQueuedSynchronizer$ConditionObject.await(AbstractQueuedSynchronizer.java:2081)         at java.base@11-ea/java.util.concurrent.LinkedBlockingQueue.take(LinkedBlockingQueue.java:433)         at app//org.apache.zookeeper.ClientCnxn$EventThread.run(ClientCnxn.java:502)   17) Thread[id=2892, name=zkConnectionManagerCallback-1409-thread-1, state=WAITING, group=TGRP-StreamDecoratorTest]         at java.base@11-ea/jdk.internal.misc.Unsafe.park(Native Method)         at java.base@11-ea/java.util.concurrent.locks.LockSupport.park(LockSupport.java:194)         at java.base@11-ea/java.util.concurrent.locks.AbstractQueuedSynchronizer$ConditionObject.await(AbstractQueuedSynchronizer.java:2081)         at java.base@11-ea/java.util.concurrent.LinkedBlockingQueue.take(LinkedBlockingQueue.java:433)         at java.base@11-ea/java.util.concurrent.ThreadPoolExecutor.getTask(ThreadPoolExecutor.java:1054)         at java.base@11-ea/java.util.concurrent.ThreadPoolExecutor.runWorker(ThreadPoolExecutor.java:1114)         at java.base@11-ea/java.util.concurrent.ThreadPoolExecutor$Worker.run(ThreadPoolExecutor.java:628)         at java.base@11-ea/java.lang.Thread.run(Thread.java:834)   18) Thread[id=1799, name=Connection evictor, state=TIMED_WAITING, group=TGRP-StreamDecoratorTest]         at java.base@11-ea/java.lang.Thread.sleep(Native Method)         at app//org.apache.http.impl.client.IdleConnectionEvictor$1.run(IdleConnectionEvictor.java:66)         at java.base@11-ea/java.lang.Thread.run(Thread.java:834)   19) Thread[id=267, name=Connection evictor, state=TIMED_WAITING, group=TGRP-StreamDecoratorTest]         at java.base@11-ea/java.lang.Thread.sleep(Native Method)         at app//org.apache.http.impl.client.IdleConnectionEvictor$1.run(IdleConnectionEvictor.java:66)         at java.base@11-ea/java.lang.Thread.run(Thread.java:834)   20) Thread[id=1796, name=Connection evictor, state=TIMED_WAITING, group=TGRP-StreamDecoratorTest]         at java.base@11-ea/java.lang.Thread.sleep(Native Method)         at app//org.apache.http.impl.client.IdleConnectionEvictor$1.run(IdleConnectionEvictor.java:66)         at java.base@11-ea/java.lang.Thread.run(Thread.java:834)   21) Thread[id=377, name=Connection evictor, state=TIMED_WAITING, group=TGRP-StreamDecoratorTest]         at java.base@11-ea/java.lang.Thread.sleep(Native Method)         at app//org.apache.http.impl.client.IdleConnectionEvictor$1.run(IdleConnectionEvictor.java:66)         at java.base@11-ea/java.lang.Thread.run(Thread.java:834)   22) Thread[id=2891, name=Thread-73-EventThread, state=WAITING, group=TGRP-StreamDecoratorTest]         at java.base@11-ea/jdk.internal.misc.Unsafe.park(Native Method)         at java.base@11-ea/java.util.concurrent.locks.LockSupport.park(LockSupport.java:194)         at java.base@11-ea/java.util.concurrent.locks.AbstractQueuedSynchronizer$ConditionObject.await(AbstractQueuedSynchronizer.java:2081)         at java.base@11-ea/java.util.concurrent.LinkedBlockingQueue.take(LinkedBlockingQueue.java:433)         at app//org.apache.zookeeper.ClientCnxn$EventThread.run(ClientCnxn.java:502)   23) Thread[id=1788, name=Connection evictor, state=TIMED_WAITING, group=TGRP-StreamDecoratorTest]         at java.base@11-ea/java.lang.Thread.sleep(Native Method)         at app//org.apache.http.impl.client.IdleConnectionEvictor$1.run(IdleConnectionEvictor.java:66)         at java.base@11-ea/java.lang.Thread.run(Thread.java:834)

Stack Trace:
com.carrotsearch.randomizedtesting.ThreadLeakError: 23 threads leaked from SUITE scope at org.apache.solr.client.solrj.io.stream.StreamDecoratorTest: 
   1) Thread[id=372, name=TEST-StreamDecoratorTest.testParallelExecutorStream-seed#[254646338686024B]-SendThread(127.0.0.1:33825), state=TIMED_WAITING, group=TGRP-StreamDecoratorTest]
        at java.base@11-ea/java.lang.Thread.sleep(Native Method)
        at app//org.apache.zookeeper.client.StaticHostProvider.next(StaticHostProvider.java:105)
        at app//org.apache.zookeeper.ClientCnxn$SendThread.startConnect(ClientCnxn.java:1000)
        at app//org.apache.zookeeper.ClientCnxn$SendThread.run(ClientCnxn.java:1063)
   2) Thread[id=1781, name=Connection evictor, state=TIMED_WAITING, group=TGRP-StreamDecoratorTest]
        at java.base@11-ea/java.lang.Thread.sleep(Native Method)
        at app//org.apache.http.impl.client.IdleConnectionEvictor$1.run(IdleConnectionEvictor.java:66)
        at java.base@11-ea/java.lang.Thread.run(Thread.java:834)
   3) Thread[id=274, name=Connection evictor, state=TIMED_WAITING, group=TGRP-StreamDecoratorTest]
        at java.base@11-ea/java.lang.Thread.sleep(Native Method)
        at app//org.apache.http.impl.client.IdleConnectionEvictor$1.run(IdleConnectionEvictor.java:66)
        at java.base@11-ea/java.lang.Thread.run(Thread.java:834)
   4) Thread[id=371, name=Connection evictor, state=TIMED_WAITING, group=TGRP-StreamDecoratorTest]
        at java.base@11-ea/java.lang.Thread.sleep(Native Method)
        at app//org.apache.http.impl.client.IdleConnectionEvictor$1.run(IdleConnectionEvictor.java:66)
        at java.base@11-ea/java.lang.Thread.run(Thread.java:834)
   5) Thread[id=2890, name=Thread-73-SendThread(127.0.0.1:33825), state=TIMED_WAITING, group=TGRP-StreamDecoratorTest]
        at java.base@11-ea/java.lang.Thread.sleep(Native Method)
        at app//org.apache.zookeeper.client.StaticHostProvider.next(StaticHostProvider.java:105)
        at app//org.apache.zookeeper.ClientCnxn$SendThread.startConnect(ClientCnxn.java:1000)
        at app//org.apache.zookeeper.ClientCnxn$SendThread.run(ClientCnxn.java:1063)
   6) Thread[id=270, name=zkConnectionManagerCallback-119-thread-1, state=WAITING, group=TGRP-StreamDecoratorTest]
        at java.base@11-ea/jdk.internal.misc.Unsafe.park(Native Method)
        at java.base@11-ea/java.util.concurrent.locks.LockSupport.park(LockSupport.java:194)
        at java.base@11-ea/java.util.concurrent.locks.AbstractQueuedSynchronizer$ConditionObject.await(AbstractQueuedSynchronizer.java:2081)
        at java.base@11-ea/java.util.concurrent.LinkedBlockingQueue.take(LinkedBlockingQueue.java:433)
        at java.base@11-ea/java.util.concurrent.ThreadPoolExecutor.getTask(ThreadPoolExecutor.java:1054)
        at java.base@11-ea/java.util.concurrent.ThreadPoolExecutor.runWorker(ThreadPoolExecutor.java:1114)
        at java.base@11-ea/java.util.concurrent.ThreadPoolExecutor$Worker.run(ThreadPoolExecutor.java:628)
        at java.base@11-ea/java.lang.Thread.run(Thread.java:834)
   7) Thread[id=1784, name=zkConnectionManagerCallback-856-thread-1, state=WAITING, group=TGRP-StreamDecoratorTest]
        at java.base@11-ea/jdk.internal.misc.Unsafe.park(Native Method)
        at java.base@11-ea/java.util.concurrent.locks.LockSupport.park(LockSupport.java:194)
        at java.base@11-ea/java.util.concurrent.locks.AbstractQueuedSynchronizer$ConditionObject.await(AbstractQueuedSynchronizer.java:2081)
        at java.base@11-ea/java.util.concurrent.LinkedBlockingQueue.take(LinkedBlockingQueue.java:433)
        at java.base@11-ea/java.util.concurrent.ThreadPoolExecutor.getTask(ThreadPoolExecutor.java:1054)
        at java.base@11-ea/java.util.concurrent.ThreadPoolExecutor.runWorker(ThreadPoolExecutor.java:1114)
        at java.base@11-ea/java.util.concurrent.ThreadPoolExecutor$Worker.run(ThreadPoolExecutor.java:628)
        at java.base@11-ea/java.lang.Thread.run(Thread.java:834)
   8) Thread[id=378, name=Connection evictor, state=TIMED_WAITING, group=TGRP-StreamDecoratorTest]
        at java.base@11-ea/java.lang.Thread.sleep(Native Method)
        at app//org.apache.http.impl.client.IdleConnectionEvictor$1.run(IdleConnectionEvictor.java:66)
        at java.base@11-ea/java.lang.Thread.run(Thread.java:834)
   9) Thread[id=1782, name=TEST-StreamDecoratorTest.testExecutorStream-seed#[254646338686024B]-SendThread(127.0.0.1:33825), state=TIMED_WAITING, group=TGRP-StreamDecoratorTest]
        at java.base@11-ea/java.lang.Thread.sleep(Native Method)
        at app//org.apache.zookeeper.ClientCnxn$SendThread.run(ClientCnxn.java:1054)
  10) Thread[id=374, name=zkConnectionManagerCallback-161-thread-1, state=WAITING, group=TGRP-StreamDecoratorTest]
        at java.base@11-ea/jdk.internal.misc.Unsafe.park(Native Method)
        at java.base@11-ea/java.util.concurrent.locks.LockSupport.park(LockSupport.java:194)
        at java.base@11-ea/java.util.concurrent.locks.AbstractQueuedSynchronizer$ConditionObject.await(AbstractQueuedSynchronizer.java:2081)
        at java.base@11-ea/java.util.concurrent.LinkedBlockingQueue.take(LinkedBlockingQueue.java:433)
        at java.base@11-ea/java.util.concurrent.ThreadPoolExecutor.getTask(ThreadPoolExecutor.java:1054)
        at java.base@11-ea/java.util.concurrent.ThreadPoolExecutor.runWorker(ThreadPoolExecutor.java:1114)
        at java.base@11-ea/java.util.concurrent.ThreadPoolExecutor$Worker.run(ThreadPoolExecutor.java:628)
        at java.base@11-ea/java.lang.Thread.run(Thread.java:834)
  11) Thread[id=1787, name=Connection evictor, state=TIMED_WAITING, group=TGRP-StreamDecoratorTest]
        at java.base@11-ea/java.lang.Thread.sleep(Native Method)
        at app//org.apache.http.impl.client.IdleConnectionEvictor$1.run(IdleConnectionEvictor.java:66)
        at java.base@11-ea/java.lang.Thread.run(Thread.java:834)
  12) Thread[id=269, name=TEST-StreamDecoratorTest.testParallelHavingStream-seed#[254646338686024B]-EventThread, state=WAITING, group=TGRP-StreamDecoratorTest]
        at java.base@11-ea/jdk.internal.misc.Unsafe.park(Native Method)
        at java.base@11-ea/java.util.concurrent.locks.LockSupport.park(LockSupport.java:194)
        at java.base@11-ea/java.util.concurrent.locks.AbstractQueuedSynchronizer$ConditionObject.await(AbstractQueuedSynchronizer.java:2081)
        at java.base@11-ea/java.util.concurrent.LinkedBlockingQueue.take(LinkedBlockingQueue.java:433)
        at app//org.apache.zookeeper.ClientCnxn$EventThread.run(ClientCnxn.java:502)
  13) Thread[id=1783, name=TEST-StreamDecoratorTest.testExecutorStream-seed#[254646338686024B]-EventThread, state=WAITING, group=TGRP-StreamDecoratorTest]
        at java.base@11-ea/jdk.internal.misc.Unsafe.park(Native Method)
        at java.base@11-ea/java.util.concurrent.locks.LockSupport.park(LockSupport.java:194)
        at java.base@11-ea/java.util.concurrent.locks.AbstractQueuedSynchronizer$ConditionObject.await(AbstractQueuedSynchronizer.java:2081)
        at java.base@11-ea/java.util.concurrent.LinkedBlockingQueue.take(LinkedBlockingQueue.java:433)
        at app//org.apache.zookeeper.ClientCnxn$EventThread.run(ClientCnxn.java:502)
  14) Thread[id=273, name=Connection evictor, state=TIMED_WAITING, group=TGRP-StreamDecoratorTest]
        at java.base@11-ea/java.lang.Thread.sleep(Native Method)
        at app//org.apache.http.impl.client.IdleConnectionEvictor$1.run(IdleConnectionEvictor.java:66)
        at java.base@11-ea/java.lang.Thread.run(Thread.java:834)
  15) Thread[id=268, name=TEST-StreamDecoratorTest.testParallelHavingStream-seed#[254646338686024B]-SendThread(127.0.0.1:33825), state=TIMED_WAITING, group=TGRP-StreamDecoratorTest]
        at java.base@11-ea/java.lang.Thread.sleep(Native Method)
        at app//org.apache.zookeeper.client.StaticHostProvider.next(StaticHostProvider.java:105)
        at app//org.apache.zookeeper.ClientCnxn$SendThread.startConnect(ClientCnxn.java:1000)
        at app//org.apache.zookeeper.ClientCnxn$SendThread.run(ClientCnxn.java:1063)
  16) Thread[id=373, name=TEST-StreamDecoratorTest.testParallelExecutorStream-seed#[254646338686024B]-EventThread, state=WAITING, group=TGRP-StreamDecoratorTest]
        at java.base@11-ea/jdk.internal.misc.Unsafe.park(Native Method)
        at java.base@11-ea/java.util.concurrent.locks.LockSupport.park(LockSupport.java:194)
        at java.base@11-ea/java.util.concurrent.locks.AbstractQueuedSynchronizer$ConditionObject.await(AbstractQueuedSynchronizer.java:2081)
        at java.base@11-ea/java.util.concurrent.LinkedBlockingQueue.take(LinkedBlockingQueue.java:433)
        at app//org.apache.zookeeper.ClientCnxn$EventThread.run(ClientCnxn.java:502)
  17) Thread[id=2892, name=zkConnectionManagerCallback-1409-thread-1, state=WAITING, group=TGRP-StreamDecoratorTest]
        at java.base@11-ea/jdk.internal.misc.Unsafe.park(Native Method)
        at java.base@11-ea/java.util.concurrent.locks.LockSupport.park(LockSupport.java:194)
        at java.base@11-ea/java.util.concurrent.locks.AbstractQueuedSynchronizer$ConditionObject.await(AbstractQueuedSynchronizer.java:2081)
        at java.base@11-ea/java.util.concurrent.LinkedBlockingQueue.take(LinkedBlockingQueue.java:433)
        at java.base@11-ea/java.util.concurrent.ThreadPoolExecutor.getTask(ThreadPoolExecutor.java:1054)
        at java.base@11-ea/java.util.concurrent.ThreadPoolExecutor.runWorker(ThreadPoolExecutor.java:1114)
        at java.base@11-ea/java.util.concurrent.ThreadPoolExecutor$Worker.run(ThreadPoolExecutor.java:628)
        at java.base@11-ea/java.lang.Thread.run(Thread.java:834)
  18) Thread[id=1799, name=Connection evictor, state=TIMED_WAITING, group=TGRP-StreamDecoratorTest]
        at java.base@11-ea/java.lang.Thread.sleep(Native Method)
        at app//org.apache.http.impl.client.IdleConnectionEvictor$1.run(IdleConnectionEvictor.java:66)
        at java.base@11-ea/java.lang.Thread.run(Thread.java:834)
  19) Thread[id=267, name=Connection evictor, state=TIMED_WAITING, group=TGRP-StreamDecoratorTest]
        at java.base@11-ea/java.lang.Thread.sleep(Native Method)
        at app//org.apache.http.impl.client.IdleConnectionEvictor$1.run(IdleConnectionEvictor.java:66)
        at java.base@11-ea/java.lang.Thread.run(Thread.java:834)
  20) Thread[id=1796, name=Connection evictor, state=TIMED_WAITING, group=TGRP-StreamDecoratorTest]
        at java.base@11-ea/java.lang.Thread.sleep(Native Method)
        at app//org.apache.http.impl.client.IdleConnectionEvictor$1.run(IdleConnectionEvictor.java:66)
        at java.base@11-ea/java.lang.Thread.run(Thread.java:834)
  21) Thread[id=377, name=Connection evictor, state=TIMED_WAITING, group=TGRP-StreamDecoratorTest]
        at java.base@11-ea/java.lang.Thread.sleep(Native Method)
        at app//org.apache.http.impl.client.IdleConnectionEvictor$1.run(IdleConnectionEvictor.java:66)
        at java.base@11-ea/java.lang.Thread.run(Thread.java:834)
  22) Thread[id=2891, name=Thread-73-EventThread, state=WAITING, group=TGRP-StreamDecoratorTest]
        at java.base@11-ea/jdk.internal.misc.Unsafe.park(Native Method)
        at java.base@11-ea/java.util.concurrent.locks.LockSupport.park(LockSupport.java:194)
        at java.base@11-ea/java.util.concurrent.locks.AbstractQueuedSynchronizer$ConditionObject.await(AbstractQueuedSynchronizer.java:2081)
        at java.base@11-ea/java.util.concurrent.LinkedBlockingQueue.take(LinkedBlockingQueue.java:433)
        at app//org.apache.zookeeper.ClientCnxn$EventThread.run(ClientCnxn.java:502)
  23) Thread[id=1788, name=Connection evictor, state=TIMED_WAITING, group=TGRP-StreamDecoratorTest]
        at java.base@11-ea/java.lang.Thread.sleep(Native Method)
        at app//org.apache.http.impl.client.IdleConnectionEvictor$1.run(IdleConnectionEvictor.java:66)
        at java.base@11-ea/java.lang.Thread.run(Thread.java:834)
	at __randomizedtesting.SeedInfo.seed([254646338686024B]:0)


FAILED:  junit.framework.TestSuite.org.apache.solr.client.solrj.io.stream.StreamDecoratorTest

Error Message:
There are still zombie threads that couldn't be terminated:    1) Thread[id=372, name=TEST-StreamDecoratorTest.testParallelExecutorStream-seed#[254646338686024B]-SendThread(127.0.0.1:33825), state=TIMED_WAITING, group=TGRP-StreamDecoratorTest]         at java.base@11-ea/java.lang.Thread.sleep(Native Method)         at app//org.apache.zookeeper.ClientCnxn$SendThread.run(ClientCnxn.java:1054)    2) Thread[id=268, name=TEST-StreamDecoratorTest.testParallelHavingStream-seed#[254646338686024B]-SendThread(127.0.0.1:33825), state=TIMED_WAITING, group=TGRP-StreamDecoratorTest]         at java.base@11-ea/java.lang.Thread.sleep(Native Method)         at app//org.apache.zookeeper.ClientCnxn$SendThread.run(ClientCnxn.java:1054)    3) Thread[id=2890, name=Thread-73-SendThread(127.0.0.1:33825), state=TIMED_WAITING, group=TGRP-StreamDecoratorTest]         at java.base@11-ea/java.lang.Thread.sleep(Native Method)         at app//org.apache.zookeeper.client.StaticHostProvider.next(StaticHostProvider.java:105)         at app//org.apache.zookeeper.ClientCnxn$SendThread.startConnect(ClientCnxn.java:1000)         at app//org.apache.zookeeper.ClientCnxn$SendThread.run(ClientCnxn.java:1063)    4) Thread[id=270, name=zkConnectionManagerCallback-119-thread-1, state=WAITING, group=TGRP-StreamDecoratorTest]         at java.base@11-ea/jdk.internal.misc.Unsafe.park(Native Method)         at java.base@11-ea/java.util.concurrent.locks.LockSupport.park(LockSupport.java:194)         at java.base@11-ea/java.util.concurrent.locks.AbstractQueuedSynchronizer$ConditionObject.await(AbstractQueuedSynchronizer.java:2081)         at java.base@11-ea/java.util.concurrent.LinkedBlockingQueue.take(LinkedBlockingQueue.java:433)         at java.base@11-ea/java.util.concurrent.ThreadPoolExecutor.getTask(ThreadPoolExecutor.java:1054)         at java.base@11-ea/java.util.concurrent.ThreadPoolExecutor.runWorker(ThreadPoolExecutor.java:1114)         at java.base@11-ea/java.util.concurrent.ThreadPoolExecutor$Worker.run(ThreadPoolExecutor.java:628)         at java.base@11-ea/java.lang.Thread.run(Thread.java:834)    5) Thread[id=2892, name=zkConnectionManagerCallback-1409-thread-1, state=WAITING, group=TGRP-StreamDecoratorTest]         at java.base@11-ea/jdk.internal.misc.Unsafe.park(Native Method)         at java.base@11-ea/java.util.concurrent.locks.LockSupport.park(LockSupport.java:194)         at java.base@11-ea/java.util.concurrent.locks.AbstractQueuedSynchronizer$ConditionObject.await(AbstractQueuedSynchronizer.java:2081)         at java.base@11-ea/java.util.concurrent.LinkedBlockingQueue.take(LinkedBlockingQueue.java:433)         at java.base@11-ea/java.util.concurrent.ThreadPoolExecutor.getTask(ThreadPoolExecutor.java:1054)         at java.base@11-ea/java.util.concurrent.ThreadPoolExecutor.runWorker(ThreadPoolExecutor.java:1114)         at java.base@11-ea/java.util.concurrent.ThreadPoolExecutor$Worker.run(ThreadPoolExecutor.java:628)         at java.base@11-ea/java.lang.Thread.run(Thread.java:834)    6) Thread[id=1784, name=zkConnectionManagerCallback-856-thread-1, state=WAITING, group=TGRP-StreamDecoratorTest]         at java.base@11-ea/jdk.internal.misc.Unsafe.park(Native Method)         at java.base@11-ea/java.util.concurrent.locks.LockSupport.park(LockSupport.java:194)         at java.base@11-ea/java.util.concurrent.locks.AbstractQueuedSynchronizer$ConditionObject.await(AbstractQueuedSynchronizer.java:2081)         at java.base@11-ea/java.util.concurrent.LinkedBlockingQueue.take(LinkedBlockingQueue.java:433)         at java.base@11-ea/java.util.concurrent.ThreadPoolExecutor.getTask(ThreadPoolExecutor.java:1054)         at java.base@11-ea/java.util.concurrent.ThreadPoolExecutor.runWorker(ThreadPoolExecutor.java:1114)         at java.base@11-ea/java.util.concurrent.ThreadPoolExecutor$Worker.run(ThreadPoolExecutor.java:628)         at java.base@11-ea/java.lang.Thread.run(Thread.java:834)    7) Thread[id=1782, name=TEST-StreamDecoratorTest.testExecutorStream-seed#[254646338686024B]-SendThread(127.0.0.1:33825), state=TIMED_WAITING, group=TGRP-StreamDecoratorTest]         at java.base@11-ea/java.lang.Thread.sleep(Native Method)         at app//org.apache.zookeeper.client.StaticHostProvider.next(StaticHostProvider.java:105)         at app//org.apache.zookeeper.ClientCnxn$SendThread.startConnect(ClientCnxn.java:1000)         at app//org.apache.zookeeper.ClientCnxn$SendThread.run(ClientCnxn.java:1063)    8) Thread[id=374, name=zkConnectionManagerCallback-161-thread-1, state=WAITING, group=TGRP-StreamDecoratorTest]         at java.base@11-ea/jdk.internal.misc.Unsafe.park(Native Method)         at java.base@11-ea/java.util.concurrent.locks.LockSupport.park(LockSupport.java:194)         at java.base@11-ea/java.util.concurrent.locks.AbstractQueuedSynchronizer$ConditionObject.await(AbstractQueuedSynchronizer.java:2081)         at java.base@11-ea/java.util.concurrent.LinkedBlockingQueue.take(LinkedBlockingQueue.java:433)         at java.base@11-ea/java.util.concurrent.ThreadPoolExecutor.getTask(ThreadPoolExecutor.java:1054)         at java.base@11-ea/java.util.concurrent.ThreadPoolExecutor.runWorker(ThreadPoolExecutor.java:1114)         at java.base@11-ea/java.util.concurrent.ThreadPoolExecutor$Worker.run(ThreadPoolExecutor.java:628)         at java.base@11-ea/java.lang.Thread.run(Thread.java:834)

Stack Trace:
com.carrotsearch.randomizedtesting.ThreadLeakError: There are still zombie threads that couldn't be terminated:
   1) Thread[id=372, name=TEST-StreamDecoratorTest.testParallelExecutorStream-seed#[254646338686024B]-SendThread(127.0.0.1:33825), state=TIMED_WAITING, group=TGRP-StreamDecoratorTest]
        at java.base@11-ea/java.lang.Thread.sleep(Native Method)
        at app//org.apache.zookeeper.ClientCnxn$SendThread.run(ClientCnxn.java:1054)
   2) Thread[id=268, name=TEST-StreamDecoratorTest.testParallelHavingStream-seed#[254646338686024B]-SendThread(127.0.0.1:33825), state=TIMED_WAITING, group=TGRP-StreamDecoratorTest]
        at java.base@11-ea/java.lang.Thread.sleep(Native Method)
        at app//org.apache.zookeeper.ClientCnxn$SendThread.run(ClientCnxn.java:1054)
   3) Thread[id=2890, name=Thread-73-SendThread(127.0.0.1:33825), state=TIMED_WAITING, group=TGRP-StreamDecoratorTest]
        at java.base@11-ea/java.lang.Thread.sleep(Native Method)
        at app//org.apache.zookeeper.client.StaticHostProvider.next(StaticHostProvider.java:105)
        at app//org.apache.zookeeper.ClientCnxn$SendThread.startConnect(ClientCnxn.java:1000)
        at app//org.apache.zookeeper.ClientCnxn$SendThread.run(ClientCnxn.java:1063)
   4) Thread[id=270, name=zkConnectionManagerCallback-119-thread-1, state=WAITING, group=TGRP-StreamDecoratorTest]
        at java.base@11-ea/jdk.internal.misc.Unsafe.park(Native Method)
        at java.base@11-ea/java.util.concurrent.locks.LockSupport.park(LockSupport.java:194)
        at java.base@11-ea/java.util.concurrent.locks.AbstractQueuedSynchronizer$ConditionObject.await(AbstractQueuedSynchronizer.java:2081)
        at java.base@11-ea/java.util.concurrent.LinkedBlockingQueue.take(LinkedBlockingQueue.java:433)
        at java.base@11-ea/java.util.concurrent.ThreadPoolExecutor.getTask(ThreadPoolExecutor.java:1054)
        at java.base@11-ea/java.util.concurrent.ThreadPoolExecutor.runWorker(ThreadPoolExecutor.java:1114)
        at java.base@11-ea/java.util.concurrent.ThreadPoolExecutor$Worker.run(ThreadPoolExecutor.java:628)
        at java.base@11-ea/java.lang.Thread.run(Thread.java:834)
   5) Thread[id=2892, name=zkConnectionManagerCallback-1409-thread-1, state=WAITING, group=TGRP-StreamDecoratorTest]
        at java.base@11-ea/jdk.internal.misc.Unsafe.park(Native Method)
        at java.base@11-ea/java.util.concurrent.locks.LockSupport.park(LockSupport.java:194)
        at java.base@11-ea/java.util.concurrent.locks.AbstractQueuedSynchronizer$ConditionObject.await(AbstractQueuedSynchronizer.java:2081)
        at java.base@11-ea/java.util.concurrent.LinkedBlockingQueue.take(LinkedBlockingQueue.java:433)
        at java.base@11-ea/java.util.concurrent.ThreadPoolExecutor.getTask(ThreadPoolExecutor.java:1054)
        at java.base@11-ea/java.util.concurrent.ThreadPoolExecutor.runWorker(ThreadPoolExecutor.java:1114)
        at java.base@11-ea/java.util.concurrent.ThreadPoolExecutor$Worker.run(ThreadPoolExecutor.java:628)
        at java.base@11-ea/java.lang.Thread.run(Thread.java:834)
   6) Thread[id=1784, name=zkConnectionManagerCallback-856-thread-1, state=WAITING, group=TGRP-StreamDecoratorTest]
        at java.base@11-ea/jdk.internal.misc.Unsafe.park(Native Method)
        at java.base@11-ea/java.util.concurrent.locks.LockSupport.park(LockSupport.java:194)
        at java.base@11-ea/java.util.concurrent.locks.AbstractQueuedSynchronizer$ConditionObject.await(AbstractQueuedSynchronizer.java:2081)
        at java.base@11-ea/java.util.concurrent.LinkedBlockingQueue.take(LinkedBlockingQueue.java:433)
        at java.base@11-ea/java.util.concurrent.ThreadPoolExecutor.getTask(ThreadPoolExecutor.java:1054)
        at java.base@11-ea/java.util.concurrent.ThreadPoolExecutor.runWorker(ThreadPoolExecutor.java:1114)
        at java.base@11-ea/java.util.concurrent.ThreadPoolExecutor$Worker.run(ThreadPoolExecutor.java:628)
        at java.base@11-ea/java.lang.Thread.run(Thread.java:834)
   7) Thread[id=1782, name=TEST-StreamDecoratorTest.testExecutorStream-seed#[254646338686024B]-SendThread(127.0.0.1:33825), state=TIMED_WAITING, group=TGRP-StreamDecoratorTest]
        at java.base@11-ea/java.lang.Thread.sleep(Native Method)
        at app//org.apache.zookeeper.client.StaticHostProvider.next(StaticHostProvider.java:105)
        at app//org.apache.zookeeper.ClientCnxn$SendThread.startConnect(ClientCnxn.java:1000)
        at app//org.apache.zookeeper.ClientCnxn$SendThread.run(ClientCnxn.java:1063)
   8) Thread[id=374, name=zkConnectionManagerCallback-161-thread-1, state=WAITING, group=TGRP-StreamDecoratorTest]
        at java.base@11-ea/jdk.internal.misc.Unsafe.park(Native Method)
        at java.base@11-ea/java.util.concurrent.locks.LockSupport.park(LockSupport.java:194)
        at java.base@11-ea/java.util.concurrent.locks.AbstractQueuedSynchronizer$ConditionObject.await(AbstractQueuedSynchronizer.java:2081)
        at java.base@11-ea/java.util.concurrent.LinkedBlockingQueue.take(LinkedBlockingQueue.java:433)
        at java.base@11-ea/java.util.concurrent.ThreadPoolExecutor.getTask(ThreadPoolExecutor.java:1054)
        at java.base@11-ea/java.util.concurrent.ThreadPoolExecutor.runWorker(ThreadPoolExecutor.java:1114)
        at java.base@11-ea/java.util.concurrent.ThreadPoolExecutor$Worker.run(ThreadPoolExecutor.java:628)
        at java.base@11-ea/java.lang.Thread.run(Thread.java:834)
	at __randomizedtesting.SeedInfo.seed([254646338686024B]:0)


FAILED:  junit.framework.TestSuite.org.apache.solr.client.solrj.io.stream.StreamDecoratorTest

Error Message:
20 threads leaked from SUITE scope at org.apache.solr.client.solrj.io.stream.StreamDecoratorTest:     1) Thread[id=1586, name=TEST-StreamDecoratorTest.testParallelHavingStream-seed#[254646338686024B]-SendThread(127.0.0.1:33987), state=TIMED_WAITING, group=TGRP-StreamDecoratorTest]         at java.base@11-ea/java.lang.Thread.sleep(Native Method)         at app//org.apache.zookeeper.client.StaticHostProvider.next(StaticHostProvider.java:105)         at app//org.apache.zookeeper.ClientCnxn$SendThread.startConnect(ClientCnxn.java:1000)         at app//org.apache.zookeeper.ClientCnxn$SendThread.run(ClientCnxn.java:1063)    2) Thread[id=1587, name=TEST-StreamDecoratorTest.testParallelHavingStream-seed#[254646338686024B]-EventThread, state=WAITING, group=TGRP-StreamDecoratorTest]         at java.base@11-ea/jdk.internal.misc.Unsafe.park(Native Method)         at java.base@11-ea/java.util.concurrent.locks.LockSupport.park(LockSupport.java:194)         at java.base@11-ea/java.util.concurrent.locks.AbstractQueuedSynchronizer$ConditionObject.await(AbstractQueuedSynchronizer.java:2081)         at java.base@11-ea/java.util.concurrent.LinkedBlockingQueue.take(LinkedBlockingQueue.java:433)         at app//org.apache.zookeeper.ClientCnxn$EventThread.run(ClientCnxn.java:502)    3) Thread[id=1585, name=Connection evictor, state=TIMED_WAITING, group=TGRP-StreamDecoratorTest]         at java.base@11-ea/java.lang.Thread.sleep(Native Method)         at app//org.apache.http.impl.client.IdleConnectionEvictor$1.run(IdleConnectionEvictor.java:66)         at java.base@11-ea/java.lang.Thread.run(Thread.java:834)    4) Thread[id=3068, name=TEST-StreamDecoratorTest.testExecutorStream-seed#[254646338686024B]-SendThread(127.0.0.1:33987), state=TIMED_WAITING, group=TGRP-StreamDecoratorTest]         at java.base@11-ea/java.lang.Thread.sleep(Native Method)         at app//org.apache.zookeeper.client.StaticHostProvider.next(StaticHostProvider.java:105)         at app//org.apache.zookeeper.ClientCnxn$SendThread.startConnect(ClientCnxn.java:1000)         at app//org.apache.zookeeper.ClientCnxn$SendThread.run(ClientCnxn.java:1063)    5) Thread[id=1588, name=zkConnectionManagerCallback-398-thread-1, state=WAITING, group=TGRP-StreamDecoratorTest]         at java.base@11-ea/jdk.internal.misc.Unsafe.park(Native Method)         at java.base@11-ea/java.util.concurrent.locks.LockSupport.park(LockSupport.java:194)         at java.base@11-ea/java.util.concurrent.locks.AbstractQueuedSynchronizer$ConditionObject.await(AbstractQueuedSynchronizer.java:2081)         at java.base@11-ea/java.util.concurrent.LinkedBlockingQueue.take(LinkedBlockingQueue.java:433)         at java.base@11-ea/java.util.concurrent.ThreadPoolExecutor.getTask(ThreadPoolExecutor.java:1054)         at java.base@11-ea/java.util.concurrent.ThreadPoolExecutor.runWorker(ThreadPoolExecutor.java:1114)         at java.base@11-ea/java.util.concurrent.ThreadPoolExecutor$Worker.run(ThreadPoolExecutor.java:628)         at java.base@11-ea/java.lang.Thread.run(Thread.java:834)    6) Thread[id=3082, name=Connection evictor, state=TIMED_WAITING, group=TGRP-StreamDecoratorTest]         at java.base@11-ea/java.lang.Thread.sleep(Native Method)         at app//org.apache.http.impl.client.IdleConnectionEvictor$1.run(IdleConnectionEvictor.java:66)         at java.base@11-ea/java.lang.Thread.run(Thread.java:834)    7) Thread[id=1663, name=TEST-StreamDecoratorTest.testParallelExecutorStream-seed#[254646338686024B]-SendThread(127.0.0.1:33987), state=TIMED_WAITING, group=TGRP-StreamDecoratorTest]         at java.base@11-ea/java.lang.Thread.sleep(Native Method)         at app//org.apache.zookeeper.client.StaticHostProvider.next(StaticHostProvider.java:105)         at app//org.apache.zookeeper.ClientCnxn$SendThread.startConnect(ClientCnxn.java:1000)         at app//org.apache.zookeeper.ClientCnxn$SendThread.run(ClientCnxn.java:1063)    8) Thread[id=1665, name=zkConnectionManagerCallback-428-thread-1, state=WAITING, group=TGRP-StreamDecoratorTest]         at java.base@11-ea/jdk.internal.misc.Unsafe.park(Native Method)         at java.base@11-ea/java.util.concurrent.locks.LockSupport.park(LockSupport.java:194)         at java.base@11-ea/java.util.concurrent.locks.AbstractQueuedSynchronizer$ConditionObject.await(AbstractQueuedSynchronizer.java:2081)         at java.base@11-ea/java.util.concurrent.LinkedBlockingQueue.take(LinkedBlockingQueue.java:433)         at java.base@11-ea/java.util.concurrent.ThreadPoolExecutor.getTask(ThreadPoolExecutor.java:1054)         at java.base@11-ea/java.util.concurrent.ThreadPoolExecutor.runWorker(ThreadPoolExecutor.java:1114)         at java.base@11-ea/java.util.concurrent.ThreadPoolExecutor$Worker.run(ThreadPoolExecutor.java:628)         at java.base@11-ea/java.lang.Thread.run(Thread.java:834)    9) Thread[id=3069, name=TEST-StreamDecoratorTest.testExecutorStream-seed#[254646338686024B]-EventThread, state=WAITING, group=TGRP-StreamDecoratorTest]         at java.base@11-ea/jdk.internal.misc.Unsafe.park(Native Method)         at java.base@11-ea/java.util.concurrent.locks.LockSupport.park(LockSupport.java:194)         at java.base@11-ea/java.util.concurrent.locks.AbstractQueuedSynchronizer$ConditionObject.await(AbstractQueuedSynchronizer.java:2081)         at java.base@11-ea/java.util.concurrent.LinkedBlockingQueue.take(LinkedBlockingQueue.java:433)         at app//org.apache.zookeeper.ClientCnxn$EventThread.run(ClientCnxn.java:502)   10) Thread[id=3074, name=Connection evictor, state=TIMED_WAITING, group=TGRP-StreamDecoratorTest]         at java.base@11-ea/java.lang.Thread.sleep(Native Method)         at app//org.apache.http.impl.client.IdleConnectionEvictor$1.run(IdleConnectionEvictor.java:66)         at java.base@11-ea/java.lang.Thread.run(Thread.java:834)   11) Thread[id=1662, name=Connection evictor, state=TIMED_WAITING, group=TGRP-StreamDecoratorTest]         at java.base@11-ea/java.lang.Thread.sleep(Native Method)         at app//org.apache.http.impl.client.IdleConnectionEvictor$1.run(IdleConnectionEvictor.java:66)         at java.base@11-ea/java.lang.Thread.run(Thread.java:834)   12) Thread[id=1669, name=Connection evictor, state=TIMED_WAITING, group=TGRP-StreamDecoratorTest]         at java.base@11-ea/java.lang.Thread.sleep(Native Method)         at app//org.apache.http.impl.client.IdleConnectionEvictor$1.run(IdleConnectionEvictor.java:66)         at java.base@11-ea/java.lang.Thread.run(Thread.java:834)   13) Thread[id=1592, name=Connection evictor, state=TIMED_WAITING, group=TGRP-StreamDecoratorTest]         at java.base@11-ea/java.lang.Thread.sleep(Native Method)         at app//org.apache.http.impl.client.IdleConnectionEvictor$1.run(IdleConnectionEvictor.java:66)         at java.base@11-ea/java.lang.Thread.run(Thread.java:834)   14) Thread[id=3070, name=zkConnectionManagerCallback-1123-thread-1, state=WAITING, group=TGRP-StreamDecoratorTest]         at java.base@11-ea/jdk.internal.misc.Unsafe.park(Native Method)         at java.base@11-ea/java.util.concurrent.locks.LockSupport.park(LockSupport.java:194)         at java.base@11-ea/java.util.concurrent.locks.AbstractQueuedSynchronizer$ConditionObject.await(AbstractQueuedSynchronizer.java:2081)         at java.base@11-ea/java.util.concurrent.LinkedBlockingQueue.take(LinkedBlockingQueue.java:433)         at java.base@11-ea/java.util.concurrent.ThreadPoolExecutor.getTask(ThreadPoolExecutor.java:1054)         at java.base@11-ea/java.util.concurrent.ThreadPoolExecutor.runWorker(ThreadPoolExecutor.java:1114)         at java.base@11-ea/java.util.concurrent.ThreadPoolExecutor$Worker.run(ThreadPoolExecutor.java:628)         at java.base@11-ea/java.lang.Thread.run(Thread.java:834)   15) Thread[id=3085, name=Connection evictor, state=TIMED_WAITING, group=TGRP-StreamDecoratorTest]         at java.base@11-ea/java.lang.Thread.sle

[...truncated too long message...]

d[id=3073, name=Connection evictor, state=TIMED_WAITING, group=TGRP-StreamDecoratorTest]
   [junit4]    >         at java.base@11-ea/java.lang.Thread.sleep(Native Method)
   [junit4]    >         at app//org.apache.http.impl.client.IdleConnectionEvictor$1.run(IdleConnectionEvictor.java:66)
   [junit4]    >         at java.base@11-ea/java.lang.Thread.run(Thread.java:834)
   [junit4]    > 	at __randomizedtesting.SeedInfo.seed([254646338686024B]:0)Throwable #2: com.carrotsearch.randomizedtesting.ThreadLeakError: There are still zombie threads that couldn't be terminated:
   [junit4]    >    1) Thread[id=1586, name=TEST-StreamDecoratorTest.testParallelHavingStream-seed#[254646338686024B]-SendThread(127.0.0.1:33987), state=TIMED_WAITING, group=TGRP-StreamDecoratorTest]
   [junit4]    >         at java.base@11-ea/java.lang.Thread.sleep(Native Method)
   [junit4]    >         at app//org.apache.zookeeper.ClientCnxn$SendThread.run(ClientCnxn.java:1054)
   [junit4]    >    2) Thread[id=3070, name=zkConnectionManagerCallback-1123-thread-1, state=WAITING, group=TGRP-StreamDecoratorTest]
   [junit4]    >         at java.base@11-ea/jdk.internal.misc.Unsafe.park(Native Method)
   [junit4]    >         at java.base@11-ea/java.util.concurrent.locks.LockSupport.park(LockSupport.java:194)
   [junit4]    >         at java.base@11-ea/java.util.concurrent.locks.AbstractQueuedSynchronizer$ConditionObject.await(AbstractQueuedSynchronizer.java:2081)
   [junit4]    >         at java.base@11-ea/java.util.concurrent.LinkedBlockingQueue.take(LinkedBlockingQueue.java:433)
   [junit4]    >         at java.base@11-ea/java.util.concurrent.ThreadPoolExecutor.getTask(ThreadPoolExecutor.java:1054)
   [junit4]    >         at java.base@11-ea/java.util.concurrent.ThreadPoolExecutor.runWorker(ThreadPoolExecutor.java:1114)
   [junit4]    >         at java.base@11-ea/java.util.concurrent.ThreadPoolExecutor$Worker.run(ThreadPoolExecutor.java:628)
   [junit4]    >         at java.base@11-ea/java.lang.Thread.run(Thread.java:834)
   [junit4]    >    3) Thread[id=3068, name=TEST-StreamDecoratorTest.testExecutorStream-seed#[254646338686024B]-SendThread(127.0.0.1:33987), state=TIMED_WAITING, group=TGRP-StreamDecoratorTest]
   [junit4]    >         at java.base@11-ea/java.lang.Thread.sleep(Native Method)
   [junit4]    >         at app//org.apache.zookeeper.client.StaticHostProvider.next(StaticHostProvider.java:105)
   [junit4]    >         at app//org.apache.zookeeper.ClientCnxn$SendThread.startConnect(ClientCnxn.java:1000)
   [junit4]    >         at app//org.apache.zookeeper.ClientCnxn$SendThread.run(ClientCnxn.java:1063)
   [junit4]    >    4) Thread[id=1588, name=zkConnectionManagerCallback-398-thread-1, state=WAITING, group=TGRP-StreamDecoratorTest]
   [junit4]    >         at java.base@11-ea/jdk.internal.misc.Unsafe.park(Native Method)
   [junit4]    >         at java.base@11-ea/java.util.concurrent.locks.LockSupport.park(LockSupport.java:194)
   [junit4]    >         at java.base@11-ea/java.util.concurrent.locks.AbstractQueuedSynchronizer$ConditionObject.await(AbstractQueuedSynchronizer.java:2081)
   [junit4]    >         at java.base@11-ea/java.util.concurrent.LinkedBlockingQueue.take(LinkedBlockingQueue.java:433)
   [junit4]    >         at java.base@11-ea/java.util.concurrent.ThreadPoolExecutor.getTask(ThreadPoolExecutor.java:1054)
   [junit4]    >         at java.base@11-ea/java.util.concurrent.ThreadPoolExecutor.runWorker(ThreadPoolExecutor.java:1114)
   [junit4]    >         at java.base@11-ea/java.util.concurrent.ThreadPoolExecutor$Worker.run(ThreadPoolExecutor.java:628)
   [junit4]    >         at java.base@11-ea/java.lang.Thread.run(Thread.java:834)
   [junit4]    >    5) Thread[id=1663, name=TEST-StreamDecoratorTest.testParallelExecutorStream-seed#[254646338686024B]-SendThread(127.0.0.1:33987), state=TIMED_WAITING, group=TGRP-StreamDecoratorTest]
   [junit4]    >         at java.base@11-ea/java.lang.Thread.sleep(Native Method)
   [junit4]    >         at app//org.apache.zookeeper.ClientCnxn$SendThread.run(ClientCnxn.java:1054)
   [junit4]    >    6) Thread[id=1665, name=zkConnectionManagerCallback-428-thread-1, state=WAITING, group=TGRP-StreamDecoratorTest]
   [junit4]    >         at java.base@11-ea/jdk.internal.misc.Unsafe.park(Native Method)
   [junit4]    >         at java.base@11-ea/java.util.concurrent.locks.LockSupport.park(LockSupport.java:194)
   [junit4]    >         at java.base@11-ea/java.util.concurrent.locks.AbstractQueuedSynchronizer$ConditionObject.await(AbstractQueuedSynchronizer.java:2081)
   [junit4]    >         at java.base@11-ea/java.util.concurrent.LinkedBlockingQueue.take(LinkedBlockingQueue.java:433)
   [junit4]    >         at java.base@11-ea/java.util.concurrent.ThreadPoolExecutor.getTask(ThreadPoolExecutor.java:1054)
   [junit4]    >         at java.base@11-ea/java.util.concurrent.ThreadPoolExecutor.runWorker(ThreadPoolExecutor.java:1114)
   [junit4]    >         at java.base@11-ea/java.util.concurrent.ThreadPoolExecutor$Worker.run(ThreadPoolExecutor.java:628)
   [junit4]    >         at java.base@11-ea/java.lang.Thread.run(Thread.java:834)
   [junit4]    > 	at __randomizedtesting.SeedInfo.seed([254646338686024B]:0)
   [junit4] Completed [10/10 (6!)] on J2 in 180.20s, 46 tests, 2 failures, 5 errors <<< FAILURES!
   [junit4] 
   [junit4] 
   [junit4] Tests with failures [seed: 254646338686024B] (first 10 out of 25):
   [junit4]   - org.apache.solr.client.solrj.io.stream.StreamDecoratorTest.testParallelCommitStream
   [junit4]   - org.apache.solr.client.solrj.io.stream.StreamDecoratorTest.testParallelHavingStream
   [junit4]   - org.apache.solr.client.solrj.impl.CloudSolrClientTest.preferReplicaTypesTest
   [junit4]   - org.apache.solr.client.solrj.io.stream.StreamDecoratorTest.testParallelExecutorStream
   [junit4]   - org.apache.solr.client.solrj.io.stream.StreamDecoratorTest.testParallelExecutorStream
   [junit4]   - org.apache.solr.client.solrj.impl.CloudSolrClientTest.preferLocalShardsTest
   [junit4]   - org.apache.solr.client.solrj.io.stream.StreamDecoratorTest.testExecutorStream
   [junit4]   - org.apache.solr.client.solrj.impl.CloudSolrClientTest.preferReplicaTypesTest
   [junit4]   - org.apache.solr.client.solrj.io.stream.StreamDecoratorTest.testExecutorStream
   [junit4]   - org.apache.solr.client.solrj.io.stream.StreamDecoratorTest.testParallelReducerStream
   [junit4] 
   [junit4] 
   [junit4] JVM J0:     0.98 ..   208.12 =   207.14s
   [junit4] JVM J1:     0.98 ..   203.69 =   202.71s
   [junit4] JVM J2:     1.01 ..   315.07 =   314.06s
   [junit4] Execution time total: 5 minutes 15 seconds
   [junit4] Tests summary: 10 suites, 310 tests, 6 suite-level errors, 12 errors, 10 failures, 124 ignored

BUILD FAILED
/home/jenkins/workspace/Lucene-Solr-7.x-Linux/lucene/common-build.xml:1568: The following error occurred while executing this line:
/home/jenkins/workspace/Lucene-Solr-7.x-Linux/lucene/common-build.xml:1092: There were test failures: 10 suites, 310 tests, 6 suite-level errors, 12 errors, 10 failures, 124 ignored [seed: 254646338686024B]

Total time: 5 minutes 16 seconds

[repro] Setting last failure code to 256

[repro] Failures:
[repro]   0/5 failed: org.apache.solr.cloud.TestCloudRecovery
[repro]   0/5 failed: org.apache.solr.handler.TestSolrConfigHandlerCloud
[repro]   0/5 failed: org.apache.solr.handler.component.DistributedDebugComponentTest
[repro]   1/5 failed: org.apache.solr.cloud.AliasIntegrationTest
[repro]   1/5 failed: org.apache.solr.cloud.TestCryptoKeys
[repro]   1/5 failed: org.apache.solr.cloud.TestTlogReplica
[repro]   1/5 failed: org.apache.solr.cloud.cdcr.CdcrBidirectionalTest
[repro]   1/5 failed: org.apache.solr.cloud.cdcr.CdcrBootstrapTest
[repro]   1/5 failed: org.apache.solr.schema.SchemaApiFailureTest
[repro]   2/5 failed: org.apache.solr.cloud.TestConfigSetsAPI
[repro]   2/5 failed: org.apache.solr.cloud.TestMiniSolrCloudClusterSSL
[repro]   2/5 failed: org.apache.solr.cloud.TestPullReplica
[repro]   2/5 failed: org.apache.solr.handler.TestSQLHandler
[repro]   2/5 failed: org.apache.solr.update.processor.TestNamedUpdateProcessors
[repro]   3/5 failed: org.apache.solr.client.solrj.impl.CloudSolrClientTest
[repro]   3/5 failed: org.apache.solr.client.solrj.io.stream.StreamDecoratorTest
[repro]   3/5 failed: org.apache.solr.cloud.SolrCloudExampleTest
[repro]   3/5 failed: org.apache.solr.core.BlobRepositoryCloudTest
[repro]   4/5 failed: org.apache.solr.handler.TestBlobHandler
[repro]   4/5 failed: org.apache.solr.servlet.NoCacheHeaderTest
[repro] Exiting with code 256
+ mv lucene/build lucene/build.repro
+ mv solr/build solr/build.repro
+ mv lucene/build.orig lucene/build
+ mv solr/build.orig solr/build
Archiving artifacts
Setting ANT_1_8_2_HOME=/var/lib/jenkins/tools/hudson.tasks.Ant_AntInstallation/ANT_1.8.2
[WARNINGS] Parsing warnings in console log with parser Java Compiler (javac)
Setting ANT_1_8_2_HOME=/var/lib/jenkins/tools/hudson.tasks.Ant_AntInstallation/ANT_1.8.2
Setting ANT_1_8_2_HOME=/var/lib/jenkins/tools/hudson.tasks.Ant_AntInstallation/ANT_1.8.2
<Git Blamer> Using GitBlamer to create author and commit information for all warnings.
<Git Blamer> GIT_COMMIT=f3e8180bd71cdc3e51a72e9e529a8e69251bdda5, workspace=/var/lib/jenkins/workspace/Lucene-Solr-7.x-Linux
[WARNINGS] Computing warning deltas based on reference build #2300
Recording test results
Setting ANT_1_8_2_HOME=/var/lib/jenkins/tools/hudson.tasks.Ant_AntInstallation/ANT_1.8.2
Build step 'Publish JUnit test result report' changed build result to UNSTABLE
Email was triggered for: Unstable (Test Failures)
Sending email for trigger: Unstable (Test Failures)
Setting ANT_1_8_2_HOME=/var/lib/jenkins/tools/hudson.tasks.Ant_AntInstallation/ANT_1.8.2
Setting ANT_1_8_2_HOME=/var/lib/jenkins/tools/hudson.tasks.Ant_AntInstallation/ANT_1.8.2
Setting ANT_1_8_2_HOME=/var/lib/jenkins/tools/hudson.tasks.Ant_AntInstallation/ANT_1.8.2
Setting ANT_1_8_2_HOME=/var/lib/jenkins/tools/hudson.tasks.Ant_AntInstallation/ANT_1.8.2

Mime
View raw message